##TITLE=31Pdec_SR167_k2Ogm
 DMSO, 24 sc
 21.2.2023
##JCAMPDX= 6.0         $$ Bruker NMR JCAMP-DX V2.0
##DATA TYPE= NMR SPECTRUM
##DATA CLASS= NTUPLES
##ORIGIN= UXNMR, Bruker Analytische Messtechnik GmbH
##OWNER= root
$$ XWIN-NMR		Version 3.5
$$ Tue Feb 21 18:29:22 2023 Russian Standard Time (UT+4h)  she@DPX200
##.OBSERVE FREQUENCY= 81.013821
##.OBSERVE NUCLEUS= ^31P
##.ACQUISITION MODE= SIMULTANEOUS
##.ACQUISITION SCHEME= undefined
##.AVERAGES= 24
##.DIGITISER RES= 16
##SPECTROMETER/DATA SYSTEM= spect
##.PULSE SEQUENCE= zgpg30
##.SOLVENT NAME= CDCl3
##.SHIFT REFERENCE= (INTERNAL, CDCl3, 0, 248.564)
##AUDIT TRAIL= $$ (NUMBER, WHEN, WHO, WHERE, WHAT)
$$ ##TITLE= Audit trail, XWIN-NMR		Version 3.5
$$ ##JCAMPDX= 5.01
$$ ##ORIGIN= Bruker BioSpin GmbH
$$ ##OWNER= she
$$ F:/spectra/data/she/nmr/P31/1/pdata/1/auditp.txt
$$ ##AUDIT TRAIL=  $$ (NUMBER, WHEN, WHO, WHERE, WHAT)
(   1,<2023-02-21 18:28:27.98 +0400>,<she>,<DPX200>,
      <created by zg, POWCHK disabled, PULCHK disabled
       configuration hash MD5:
       00 E9 B6 7A A2 85 ED C7 34 08 36 98 17 FE 4E 26
       data hash MD5: 32K
       5D C1 F1 1D 8C EB DA 44 A7 91 C4 98 6E 80 37 A0>)
(   2,<2023-02-21 18:28:30.31 +0400>,<she>,<DPX200>,
      <Start of raw data processing
       efp BC_mod = 2 LB = 1 FT_mod = 6 PKNL = 1 PHC0 = -11026.27 PHC1 = 177.0102 SI = 64K 
       data hash MD5: 64K
       5C 67 AB 24 44 75 BA 82 52 82 35 83 72 27 C8 E8>)
(   3,<2023-02-21 18:28:44.35 +0400>,<she>,<DPX200>,
      <pk PHC0 = -0.6738968 PHC1 = 0 
       data hash MD5: 64K
       44 AD C7 F3 5F BD B4 83 50 15 5D 70 C0 A1 E0 49>)
(   4,<2023-02-21 18:28:50.50 +0400>,<she>,<DPX200>,
      <abs ABSG = 5 
       data hash MD5: 64K
       7C AD 93 DB 86 43 B2 6D 73 77 62 15 10 38 18 3F>)
$$ ##END=
$$ 
$$ hash MD5
$$ 12 53 CF 0B 5E CF 1A E6 0D B7 C8 B8 E5 DD DA 44
##$RELAX= 
##$RELAX= 
##$RELAX= 
##$RELAX= 
##$RELAX= 
##$RELAX= 
##$RELAX= 
##$RELAX= 
##$RELAX= 
$$ Bruker specific parameters
$$ --------------------------
##$DU= <F:/spectra>
##$EXPNO= 1
##$NAME= <P31>
##$PROCNO= 1
##$TYPE= <nmr>
##$USER= <she>
##$AMP= (0..31)
100 100 100 100 100 100 100 100 100 100 100 100 100 100 100 100 100 100 
100 100 100 100 100 100 100 100 100 100 100 100 100 100 
##$AQSEQ= 0
##$AQ_mod= 1
##$AUNM= <au_zg>
##$AUTOPOS= <>
##$BF1= 81.014009
##$BF2= 200.13
##$BF3= 200.13
##$BF4= 200.13
##$BF5= 200.13
##$BF6= 200.13
##$BF7= 200.13
##$BF8= 200.13
##$BYTORDA= 1
##$CFDGTYP= 0
##$CFRGTYP= 5
##$CHEMSTR= <none>
##$CNST= (0..31)
1 1 145 1 1 1 1 1 1 1 1 1 1 1 1 1 1 1 1 1 1 1 1 1 1 1 1 1 1 1 1 1 
##$CPDPRG= <waltz16>
##$CPDPRG1= <>
##$CPDPRG2= <waltz16>
##$CPDPRG3= <>
##$CPDPRG4= <mlev>
##$CPDPRG5= <mlev>
##$CPDPRG6= <mlev>
##$CPDPRG7= <mlev>
##$CPDPRG8= <mlev>
##$CPDPRGB= <>
##$CPDPRGT= <>
##$D= (0..31)
0 1 0 0 0 0 0 0 0 0 0 0.03 2e-05 3e-06 0 0 0 0 0 0 0 0 0 0 0 0 0 0 0 0 
0 0 
##$DATE= 1676989707
##$DBL= (0..7)
120 120 120 11 120 120 24 19 
##$DBP= (0..7)
150 150 150 150 150 150 150 150 
##$DBP07= 0
##$DBPNAM0= <>
##$DBPNAM1= <>
$$ [...]
##$SUBNAM3= <"">
##$SUBNAM4= <"">
##$SUBNAM5= <"">
##$SUBNAM6= <"">
##$SUBNAM7= <"">
##$SUBNAM8= <"">
##$SUBNAM9= <"">
##$SW= 501.771253377433
##$SWIBOX= (0..15)
0 1 3 0 0 0 0 0 0 0 0 0 0 0 0 0 
##$SW_h= 40650.406504065
##$TD= 32768
##$TD0= 1
##$TE= 0
##$TE2= 300
##$TE3= 300
##$TEG= 300
##$TL= (0..7)
0 120 53 12 22 120 120 120 
##$TP= (0..7)
150 150 150 150 150 150 150 150 
##$TP07= 0
##$TPNAME0= <>
##$TPNAME1= <>
##$TPNAME2= <>
##$TPNAME3= <>
##$TPNAME4= <>
##$TPNAME5= <>
##$TPNAME6= <>
##$TPNAME7= <>
##$TPOAL= (0..7)
0.5 0.5 0.5 0.5 0.5 0.5 0.5 0.5 
##$TPOFFS= (0..7)
0 0 0 0 0 0 0 0 
##$TUNHIN= 0
##$TUNHOUT= 0
##$TUNXOUT= 0
##$USERA1= <user>
##$USERA2= <user>
##$USERA3= <user>
##$USERA4= <user>
##$USERA5= <user>
##$V9= 5
##$VALIST= <valist>
##$VCLIST= <CCCCCCCCCCCCCCC>
##$VD= 0
##$VDLIST= <DDDDDDDDDDDDDDD>
##$VPLIST= <PPPPPPPPPPPPPPP>
##$VTLIST= <TTTTTTTTTTTTTTT>
##$WBST= 1024
##$WBSW= 4
##$XGAIN= (0..3)
0 0 0 0 
##$XL= 0
##$YL= 0
##$YMAX_a= 1255
##$YMIN_a= -1140
##$ZGOPTNS= <>
##$ZL1= 120
##$ZL2= 120
##$ZL3= 120
##$ZL4= 120
##$ABSF1= 248.5645
##$ABSF2= -253.2056
##$ABSG= 5
##$ABSL= 3
##$ALPHA= 0
##$AQORDER= 0
##$ASSFAC= 0
##$ASSFACI= 0
##$ASSFACX= 0
##$ASSWID= 0
##$AUNMP= <proc_1d>
##$AZFE= 0.1
##$AZFW= 0.5
##$BCFW= 0
##$BC_mod= 2
##$BYTORDP= 0
##$COROFFS= 0
##$CY= -3
##$DATMOD= 1
##$DC= 0
##$DFILT= <>
##$DTYPP= 0
##$F1P= 0
##$F2P= 0
##$FCOR= 1
##$FTSIZE= 65536
##$FT_mod= 6
##$GAMMA= 0
##$GB= 0
##$INTBC= 1
##$INTSCL= 6.047779e-11
##$ISEN= 30
##$LB= 1
##$LEV0= 0
##$LPBIN= 0
##$MAXI= 10000
##$MC2= 0
##$MEAN= 0
##$ME_mod= 0
##$MI= 50
##$NCOEF= 0
##$NC_proc= -9
##$NLEV= 6
##$NOISF1= 182.463
##$NOISF2= 159.3651
##$NSP= 0
##$NTH_PI= 0
##$NZP= 0
##$OFFSET= 248.5645
##$PC= 4
##$PHC0= -11026.94
##$PHC1= 177.0102
##$PH_mod= 1
##$PKNL= yes
##$PPARMOD= 0
##$PSCAL= 0
##$PSIGN= 0
##$REVERSE= no
##$SF= 81.0140089999694
##$SI= 65536
##$SIGF1= 159.3651
##$SIGF2= -187.1042
##$SINO= 113.3802
##$SIOLD= 16384
##$SREGLST= <1H.CDCl3>
##$SSB= 0
##$STSI= 65536
##$STSR= 0
##$SW_p= 40650.406504065
##$SYMM= 0
##$S_DEV= 0
##$TDeff= 32768
##$TDoff= 0
##$TI= <>
##$TILT= no
##$TM1= 0
##$TM2= 0
##$TOPLEV= 0
##$USERP1= <user>
##$USERP2= <user>
##$USERP3= <user>
##$USERP4= <user>
##$USERP5= <user>
##$WDW= 1
##$XDIM= 65536
##$YMAX_p= 451485163
##$YMIN_p= -90724440
$$ End of Bruker specific parameters
$$ ---------------------------------
##NTUPLES= NMR SPECTRUM
##VAR_NAME=  FREQUENCY,     SPECTRUM/REAL,   SPECTRUM/IMAG
##SYMBOL=    X,             R,               I
##VAR_TYPE=  INDEPENDENT,   DEPENDENT,       DEPENDENT
##VAR_FORM=  AFFN,          ASDF,            ASDF
##VAR_DIM=   65536,         65536,           65536
##UNITS=     HZ,            ARBITRARY UNITS, ARBITRARY UNITS
##FACTOR=    0.620285442955139, 1,           1
##FIRST=     20137.2065510682, 0,            0
##LAST=      -20513.1999529968, 0,           0
##MIN=       -20513.1999529968, -90724440,   0
##MAX=       20137.2065510682, 451485163,    0
$$ Real data points
##PAGE= N=1
##DATA TABLE= (X++(R..R)), XYDATA
$$ [...]
$$ plain form
42417 -4886399 -1403561 714647 2825980 2016509 -2517092 -6111254 -4493336 1214745
42409 1214745 7070583 10534163 11025706 9299784 7394854 7061910 7630797 6960586 4271429
42400 4271429 519234 -3220471 -5983340 -6533365 -4587476 -1530088 1316669 3565795
42392 3565795 4032470 932306 -4689280 -9028369 -10717067 -11771597 -11437502 -5155883
42384 -5155883 6342255 13552894 10040035 1737141 -2817966 -4892235 -8649223 -8806041
42376 -8806041 1054627 12139452 9049673 -5509903 -12148036 -4275549 1868113 -5747274
42368 -5747274 -15452564 -12012839 -1584753 -71954 -6604214 -6915270 1888208 7907935
42360 7907935 4916736 38187 -918945 -1608690 -4920594 -6838915 -5391032 -5234844 -7696659
$$ packed form
42417d886399L482838K118208K111333q09471m533601l594162J617918N708081
42409A214745N855838L463580M91543j725922j904930l32944N68887o70211k689157
42400D271429l752195l739705k762869n50025J945889L057388K846757K249126
42392C565795M66675l100164n621586m339089j688698j054530L34095O281619
42384e155883J1498138P210639l512859q302894m555107k074269l756988j56818
42376h806041R860668J1084825l089779j4559576o638133P872487O143662p615387
42368e747274r705290L439725J0428086J512799o532260l11056Q803478O019727
42360G907935k991199m878549r57132o89745l311904j918321J447883J56188k461815
$$ plain form
42351 -7696659 -5492196 5668670 17367572 18179538 8992579 1668332 4048248 11412193
42343 11412193 12833687 3613461 -8693584 -11090430 210146 13715507 15502143 6409157
42335 6409157 -274938 2241261 6589516 4978161 991855 1360083 3551676 445002
42327 445002 -6792026 -9652603 -5007914 1049114 2726220 1314767 635260 955791 296316
42318 296316 -1518642 -2934453 -3100072 -2208479 -484461 1467521 1785666 -1521362 -7810671
42309 -7810671 -12817696 -11768967 -4125258 5555990 12050379 13519731 10461706 3328008
42301 3328008 -5970450 -12518529 -12944012 -10569956 -10996130 -12951200 -9774892 -891136
42293 -891136 5617571 5209461 4208240 8841103 13171511 6921070 -7509210 -15645218
$$ packed form
42351g696659K204463J1160866J1698902Q11966r186959p324247K379916P363945
42343A1412193J421494r220226j2307045k396846J1300576J3505361J786636r092986
42335F409157o684095K516199M348255j611355l986306L68228K191593l106674
42327D45002p237028k860577M644689O057028J677106j411453o79507L20531o59475
42318B96316j814958j415811j65619Q91593J724018J951982L18145l307028o289309
42309g810671n007025J048729P643709R681248O494389J469352l058025p133698
42301C328008r298458o548079m25483K374056m26174j955070L176308Q883756
42293h91136O508707m08110j001221M632863M330408o250441j4430280q136008
$$ plain form
42285 -15645218 -9753816 907709 2228182 -7531640 -16813319 -14552215 -1596506 10860303
42277 10860303 12471339 3478027 -6490512 -9397216 -6858378 -5603972 -7450320 -8087019
42269 -8087019 -5055455 -1796467 -2302613 -5700569 -8281498 -8211908 -6649585 -6536876 -10784993
42260 -10784993 -18027629 -19774329 -7881808 12069466 21675300 10751398 -7595679
42253 -7595679 -12302780 -2051747 4257109 -3939384 -13241214 -6770038 10775546 21028094
42245 21028094 18567846 14711320 15891994 14063074 3591441 -5806535 -2647781 8577263
42237 8577263 13997425 9590506 3381182 1247663 952478 140138 867211 3956691 5694154
42228 5694154 2819567 -3465321 -9568137 -12169093 -9625134 -4697216 -3743813 -8167496
$$ packed form
42285a5645218N891402J0661525J320473r759822r281679K261104J2955709J2456809
42277A0860303J611036q993312r968539k906704K538838J254406j846348o36699
42269h087019L031564L258988n06146l397956k580929O9590J562323J12709m248117
42260a0784993p242636j746700J1892521J9951274R605834j0923902j8347077
42253g595679m707101J0251033O308856q196493r301830O471176J7545584J0252548
42245B1028094k460248l856526J180674j828920j0471633r397976L158754J1225044
42237H577263N420162m406919o209324k133519k95185q12340P27073L089480J737463
42228E694154k874587o284888o102816k600956K543959M927918R53403m423683
$$ plain form
42220 -8167496 -10196916 -4497286 256831 -7547043 -22252469 -25761030 -13588498 -1176851
42212 -1176851 -61029 -3127944 -1114091 1458870 -1774111 -4571935 -28027 3730581
42204 3730581 -3892169 -15725985 -16795222 -9030614 -7220278 -12964614 -12636775 -2543438
42196 -2543438 3589393 -2495330 -10695696 -10007613 -3590700 2063944 8693094 16703324
42188 16703324 16950469 4570205 -8896612 -10222331 -3963599 -4579316 -14853982 -24706483
42180 -24706483 -27389191 -24799394 -19498276 -12901887 -9367908 -11128045 -10967046 -1124848
42172 -1124848 12002007 14275711 4816472 -2458428 -331657 2111808 -3493585 -10629850
42164 -10629850 -9275223 -2286846 -577949 -7479213 -16960890 -23904115 -27688283 -27316115
$$ packed form
42220h167496k029420N699630M754117p803874j4705426l508561J2172532J2411647
42212a176851J115822l066915K013853K572961l232981k797824M543908L758608
42204C730581p622750j1833816j069237P764608J810336n744336L27839J0093337
42196b543438O132831o084723q200366O88083O416913N654644O629150Q010230
42188A6703324K47145j2380264j3466817j325719O258732o15717j0274666r852501
42180b4706483k682708K589797N301118O596389L533979j760137J60999R842198
42172a124848J3126855K273704r459239p274900K126771K443465n605393p136265
42164a0629850J354627O988377J708897o901264r481677o943225l784168L72168
$$ plain form
42156 -27316115 -20734581 -9417878 1758641 9712079 14496665 16055968 13764576 9290006
42148 9290006 6314298 6649646 8657005 9261995 5806975 -2711475 -13447737 -19791317
42140 -19791317 -17017264 -7893026 -127605 1519487 -1808600 -7114865 -12834992 -17544650
42132 -17544650 -18894759 -15759308 -9642943 -2698633 4113786 9989608 13263800 13046084
42124 13046084 10914375 9644436 10574828 12619669 13046833 9072851 424292 -8588919
42116 -8588919 -11286777 -5225582 3772801 6381039 -821513 -12072150 -19059894 -19220280
42108 -19220280 -16251292 -14063326 -12920835 -11452411 -9442122 -7028830 -3362563 1503964
42100 1503964 4833162 4264662 1880626 1755065 3521374 2552382 -2240457 -5322714 -2253625
$$ packed form
42156b7316115O581534J1316703J1176519P953438M784586J559303k291392m474570
42148I290006k975708L35348K007359O04990l455020q518450j0736262o343580
42140a9791317K774053R124238P765421J647092l328087n306265n720127m709658
42132a7544650j350109L135451O116365O944310O812419N875822L274192k17716
42124A3046084k131709j269939R30392K044841M27164l973982q648559r013211
42116h588919k697858O061195Q998383K608238p202552j1250637o987744j60386
42108a9220280K968988K187966J142491J468424K010289K413292L666267M866527
42100A503964L329198n68500k384036j25561J766309r68992m792839l082257L069089
$$ plain form
42091 -2253625 3412922 5331471 3515505 2664048 2926769 -865507 -9782430 -16909154
42083 -16909154 -15930226 -9072530 -3095905 -977405 -1167529 -1942203 -2210426 -61922 5147077
42074 5147077 10210592 11075980 7521329 1968928 -4430072 -10661384 -12896353 -8115854
42066 -8115854 62803 4930851 6125535 9257116 15075132 16285514 8763750 -544469
42058 -544469 -2548467 1798945 4630906 3385513 2848658 6005298 9533021 9342589 5649214
42049 5649214 1437688 -291609 2529379 8652237 11907656 6934569 -2573993 -6659341
42041 -6659341 -1970847 3636491 2384634 -2976030 -4481367 79094 7374038 15759542
42033 15759542 24557702 27903119 18450711 -613851 -14795444 -14040329 -4437376 365979
$$ packed form
42091b253625N666547J918549j815966q51457K62721l792276q916923p126724
42083a6909154R78928O857696N976625K118500j90124p74674k68223K148504N208999
42074E147077N063515Q65388l554651n552401o399000o231312k234969M780499
42066h115854Q178657M868048J194684L131581N818016J210382p521764r308219
42058e44469k003998M347412K831961j245393n36855L156640L527723j90432l693375
42049E649214m211526j729297K820988O122858L255419m973087r508562m085348
42041f659341M688494N607338j251857n360664j505337M560461P294944Q385504
42033A5759542Q798160L345417r452408j9064562j4181593P55115R602953M803355
$$ plain form
42025 365979 -4428867 -12264199 -16448273 -17278445 -17697181 -17709761 -15890899 -12966359 -10612329
42016 -10612329 -8203748 -3635659 2778679 7362742 6904501 2603644 -935268 -1138030
42008 -1138030 -1024087 -5346738 -12717642 -14703007 -6049760 6157549 8909822 -504338
42000 -504338 -10318830 -9387385 -1341258 1948434 -2246272 -4471957 2023714 10750087
41992 10750087 10615609 1093554 -6468913 -2320341 10272728 18386168 13529029 1287979
41984 1287979 -4705965 1116573 9447783 8716974 1143527 -870659 6376889 12035107
41976 12035107 7342836 -925660 -1248112 5174552 7941704 4721005 3269033 6381012
41968 6381012 6880271 1260048 -2530298 2164035 8519711 5756876 -4482422 -10997466
$$ packed form
42025C65979m794846p835332m184074q30172m18736j2580J818862K924540K354030
42016a0612329K408581M568089O414338M584063m58241m300857l538912k02762
42008a138030J13943m322651p370904j985365Q653247J2207309K752273r414160
42000e04338r814492R31445Q046127L289692m194706k225685O495671Q726373
41992A0750087j34478r522055p562467M148572J2593069Q113440m857139j2241050
41984A287979n993944N822538Q331210p30809p573447k014186P247548N658218
41976A2035107m692271q268496l22452O422664K767152l220699j451972L111979
41968F381012M99259n620223l790346M694333O355676k762835j0239298o515044
$$ plain form
41960 -10997466 -9709436 -7630661 -10026366 -12999409 -11874972 -9300088 -9926618 -12130996
41952 -12130996 -10714754 -5115677 265726 2639776 3229513 3676708 4178350 5145244 6602728
41943 6602728 5443656 -2078701 -13055917 -17636607 -10296550 1332954 4198959 -4305154
41935 -4305154 -13586907 -13862388 -7352911 -2362426 -1054326 1056210 5493372 7394939
41927 7394939 3054946 -4052874 -7573386 -5536817 -649915 4214131 7627403 8250935
41919 8250935 5508881 1622505 -2533 794746 357012 -3835756 -9452621 -12148347
41911 -12148347 -11013790 -9302793 -9875663 -11719676 -11913222 -9996673 -8762554 -10378742
41903 -10378742 -13023169 -12743798 -8344550 -2681291 1592479 5659822 11636671 17039212
$$ packed form
41960a0997466J288030K078775k395705k973043J124437K574884o26530k204378
41952a2130996J416242N599077N381403K374050N89737M47195N01642R66894J457484
41943F602728j159072p522357j0977216m580690P340057J1629504K866005q504113
41935d305154r281753k75481O509477M990485J308100K110536M437162J901567
41927G394939m339993p107820l520512K036569M886902M864046L413272O23532
41919H250935k742054l886376j625038P97279m37734m192768n616865k695726
41911a2148347J134557J710997n72870j844013j93546J916549J234119j616188
41903a0378742k644427K79371M399248N663259M273770M067343N976849N402541
$$ plain form
41895 17039212 16025496 7781682 211045 1365015 8955293 13446452 11502744 10101114
41887 10101114 14509131 18468697 12763808 -171804 -8411438 -6626156 -1703434 -713298
41879 -713298 -1720137 -939123 -1368321 -6849132 -12431974 -9539264 771112 7890967
41871 7890967 5686802 -485684 -2659906 -255224 1793144 574786 -2499971 -4471014
41863 -4471014 -3572924 -1079941 -1463618 -7935374 -16569334 -18258917 -8993538 4398932
41855 4398932 11525583 9547708 4174446 949074 -769552 -4290999 -8719706 -8660695
41847 -8660695 -1762627 5607605 4057845 -6639804 -15324407 -12874330 -4404136 -2582315
41839 -2582315 -10637272 -18786791 -18069428 -11084818 -6384568 -7327614 -9874994 -8203328
$$ packed form
41895A7039212j013716q243814p570637J153970P590278M491159j943708j401630
41887A0101114M408017L959566n704889j2935612q239634J785282M922722R90136
41879g13298j006839P81014m29198n480811n582842K892710J0310376P119855
41871G890967k204165o172486k174222K404682K048368j218358l074757j971043
41863d471014Q98090K492983l83677o471756q633960j689583R265379J3392470
41855D398932P126651j977875n373262l225372j718626l521447m428707N9011
41847h660695O898068P370232j549760j0697649q684603K450077Q470194J821821
41839b582315q054957q149519P17363O984610M700250r43046k547380J671666
$$ plain form
41831 -8203328 -209079 9824002 13304365 6076618 -4616627 -7663821 -3422268 -3724730
41823 -3724730 -13562984 -21844650 -17115511 -4712887 1178552 -2548863 -6281752 -3134951
41815 -3134951 4388102 12033282 17448531 15610796 1659249 -18145893 -27845086 -19688846
41807 -19688846 -3652896 5955515 6479664 3537907 -1140654 -9012709 -15541571 -12522547
41799 -12522547 -744281 8140733 5802416 -2708438 -7127344 -5423294 -3645483 -5135157
41791 -5135157 -6581239 -5344902 -4700458 -8456198 -14196676 -16254646 -13444980 -9356086
41783 -9356086 -5949751 -1908860 2365097 3536821 1152398 -136261 2681442 5976070
41775 5976070 4938226 650379 -2492423 -3605156 -4933734 -6762869 -7367967 -6459072
$$ packed form
41831h203328P994249J0033081L480363p227747j0693245l047194M241553l02462
41823c724730r838254q281666M729139J2402624N891439l727415l732889L146801
41815c134951P523053P645180N415249j837735j3951547j9805142r699193Q156240
41807a9688846J6035950R608411N24149k941757m678561p872055o528862L019024
41799a2522547J1778266Q885014k338317q510854m418906J704050J777811j489674
41791e135157j446082J236337O44444l755740n740478k057970K809666M088894
41783i356086L406335M040891M273957J171724k384423j288659K817703L294628
41775E976070j037844m287847l142802j112733j328578j829135o05098R08895
$$ plain form
41767 -6459072 -4367702 108182 6095297 7413329 -213135 -10002312 -10276992 -541883
41759 -541883 7029616 5146151 2169244 9332525 23290181 29736699 22552350 11675858
41751 11675858 10295581 19260484 27427426 25297956 14817407 5136894 1528789 1644743
41743 1644743 1727941 1408236 407147 -3815271 -9958535 -9339830 3200063 17163206
41735 17163206 15317273 -4030801 -23339348 -27637363 -20566546 -13378140 -7593345 1938699
41727 1938699 13103559 17149998 11665905 3370088 -2107649 -4916575 -4800512 1141733
41719 1141733 11363714 17561568 14264145 6330115 2353529 3779223 5298429 4161046
41711 4161046 3760182 7191146 11422609 10903803 5499228 1349721 2735123 5841325
$$ packed form
41767f459072K091370M475884N987115J318032p626464r789177k74680R735109
41759e41883P571499j883465k976907P163281J3957656O446518p184349j0876492
41751A1675858j380277Q964903Q166942k129470j0480549r680513l608105J15954
41743A644743Q3198l19705j001089m222418o143264O18705J2539893J3963143
41735A7163206j845933j9348074j9308547m298015P070817P188406N784795R532044
41727A938699J1164860M046439n484093q295817n477737k808926J16063N942245
41719A141733J0221981O197854l297423p934030l976586J425694J519206j137383
41711D161046m00864L430964M231463n18806n404575m149507J385402L106202
$$ plain form
41703 5841325 3794772 -3301832 -7854621 -5173955 544316 3802785 6760425 14654405
41695 14654405 24670418 27092210 18795775 8575946 4972045 4168650 -3513734 -17552059
41687 -17552059 -25566306 -19701326 -8166302 -4929556 -11195778 -14369212 -5911380 7146721
41679 7146721 12781468 10211282 8094602 9402908 7729107 222644 -5133088 -870652
41671 -870652 7931091 10488521 5171405 -728881 -3940780 -8370070 -14211278 -13461381
41663 -13461381 -1463389 13823207 20915940 19033110 15849589 13619080 6832083 -5034398
41655 -5034398 -12019623 -7200165 783959 -2006603 -14304419 -19688220 -9212251 5591538
41647 5591538 8294294 -1117242 -8945668 -7234765 -559332 4983729 8894091 10800659
$$ packed form
41703E841325k046553p096604m552789K680666N718271L258469K957640P893980
41695A4654405J0016013K421792q296435j0219829l603901q03395p682384j4038325
41687a7552059q014247N864980J1535024L236746o266222l173434Q457832J3058101
41679G146721N634747k570186k116680J308306j673801p506463n355732M262436
41671h70652Q801743K557430n317116n900286l211899m429290n841208P49897
41663a3461381J1997992J5286596P092733j882830l183521k230509o786997j1866481
41655e034398o985225M819458P984124k790562j2297816n383801J0475969J4803789
41647E591538K702756r411536p828426J710903O675433N543061L910362J906568
$$ plain form
41639 10800659 7928040 2200636 1247865 6610330 8496921 -390659 -11957577 -12524843
41631 -12524843 -1798498 7184961 5591418 -2363720 -8155528 -8597379 -5188257 -271660
41623 -271660 3852552 6232458 8622635 12039960 13295698 10209149 8151890 13414319
41615 13414319 20966320 19024448 7425058 86094 4403410 9771367 5168706 -2181839
41607 -2181839 1682683 14092259 18864218 10722050 1499018 48071 470469 -3650572
41599 -3650572 -6073139 911666 10777100 10383648 -415054 -8052552 -3698206 7129861
41591 7129861 14664554 16163964 14146062 10398888 6237699 3975562 3535614 707726
41583 707726 -6978777 -14715095 -14788317 -5809357 5284913 10181626 6525854 -904433
$$ packed form
41639A0800659k872619n727404r52771N362465J886591q887580j1566918n67266
41631a2524843J0726345Q983459j593543p955138n791808m41851L409122M916597
41623b71660M124212K379906K390177L417325J255738l086549k057259N262429
41615A3414319P552001j941872j1599390p338964M317316N367957m602661p350545
41607b181839L864522J2409576M771959q142168r223032j450947M22398m121041
41599c650572k422567O984805R865434l93452j0798702p637498M354346J0828067
41591G129861P534693J499410k017902l747174m161189k262137m39948k827888
41583G07726p686503p736318p3222Q978960J1094270M896713l655772p430287
$$ plain form
41575 -904433 -5127810 -3929643 -2064719 -4450465 -7753296 -3728672 7377870 13005793
41567 13005793 3276618 -14305916 -22195455 -13605525 342611 4502320 -4493290 -17117177
41559 -17117177 -21420874 -13653565 -1403782 3653802 -1846580 -9629848 -11384658 -9464896
41551 -9464896 -10399070 -12328388 -8527179 -1645910 -2847874 -14471332 -24109071 -20732691
41543 -20732691 -8253850 2066894 5009603 1729911 -5669391 -12999729 -13572724 -6228243
41535 -6228243 738761 -32798 -5089531 -6447616 -2748731 2039043 5844283 7683026
41527 7683026 4912900 -1408350 -3841653 760198 3776191 -2397651 -9882071 -5630870
41519 -5630870 7793891 15224007 11051182 4608907 3021038 2686990 670885 1128809
$$ packed form
41575i04433m223377J198167J864924k385746l302831M024624J1106542N627923
41567A3005793r729175j7582534p889539Q589930J3948136M159709q995610j2623887
41559a7117177m303697P767309J2249783N057584n500382p783268j754810J919762
41551i464896r34174j929318L801209O881269j201964j1623458r637739L376380
41543b0732691J2478841J0320744K942709l279692p399302p330338n72995P344481
41535f228243O967004p71559n056733j358085L698885M787774L805240J838743
41527G683026k770126o321250k433303M601851L015993o173842p484420M251201
41519e630870J3424761P430116m172825o442275j587869l34048k016105M57924
$$ plain form
41511 1128809 5148980 5806152 -305616 -6457654 -7021393 -5991155 -7406494 -6437405 1314471
41502 1314471 9243688 8392630 1476517 -1484894 2034065 6200692 8430582 11832983
41494 11832983 15962181 14653472 6130643 -1816901 -1203165 5926957 10985595 9914418
41486 9914418 6158183 3273404 -585283 -8450660 -17835636 -22257523 -18846077 -10595607
41478 -10595607 -964166 9144422 17856118 21295686 18967911 14783589 9248597 -2539446
41470 -2539446 -19308080 -27752435 -18237853 -1122463 4505292 -4153143 -12154823 -9456878
41462 -9456878 -1765689 2848016 4989451 7252349 7955562 7167427 9488672 15411832
41454 15411832 18353981 15087994 10870176 9931902 9580975 7897869 7883139 9540947 7965839
$$ packed form
41511A128809M020171O57172o111768o152038n63739J030238j415339R69089P751876
41502A314471P929217q51058o916113k961411L518959M166627K229890L402401
41494A1832983M129198j308709q522829p947544O13736P130122N058638j071177
41486I914418l756235k884779l858687p865377r384976m421887L411446Q250470
41478a0595607R631441J0108588Q711696L439568k327775m184322n534992j1788043
41470b539446j6768634q444355R514582J7115390N627755q658435q001680K697945
41462i456878P691189M613705K141435K262898P03213p88135K321245N923160
41454A5411832K942149l265987m217818r38274l50927j683106j4730J657808j575108
$$ plain form
41445 7965839 4114216 6366166 15717556 21562415 19106820 17655290 22630243 23683549
41437 23683549 13015143 1867203 3323762 10406092 8850065 1946722 3160825 11225219
41429 11225219 13445801 9443413 10090952 14485340 10070286 -2722181 -7782508 -161085
41421 -161085 4920704 -2389672 -10811172 -8033389 -211031 1145387 -1431636 1051255
41413 1051255 6351115 4665322 -5078665 -14001482 -15745834 -12114075 -8516344 -9218967
41405 -9218967 -14181506 -17340694 -12781628 -4767824 -4192382 -12153106 -16779371 -11493475
41397 -11493475 -5512393 -8023562 -12624358 -9110354 -2052501 -3192641 -10397086 -9881631
41389 -9881631 1265057 9669220 5863177 -2820245 -5359593 -2988320 -3939084 -8637099
$$ packed form
41445G965839l851623K251950R351390N844859k455595j451530M974953J053306
41437B3683549j0668406j1147940J456559P082330j556027o903343J214103Q064394
41429A1225219K220582m002388O47539M394388m415054j2792467n060327P621423
41421a61085N081789p310376q421500K777783P822358J356418k577023K482891
41413A051255N299860j685793r743987q922817j744352L631759L597731p02623
41405i218967m962539l159188M559066Q013804N75442p960724m626265N285896
41397a1493475N981082k511169m600796L514004P057853j140140p204445N15455
41389i881631J1146688Q404163l806043q683422k539348K371273r50764m698015
$$ plain form
41381 -8637099 -9431363 -3578206 1291219 -2992915 -14060885 -21406823 -19023218 -12242577
41373 -12242577 -10027014 -12547876 -10838726 44185 11963635 12525426 1763588 -5543627
41365 -5543627 3074777 21875164 32953114 27735061 16485537 13168492 16542448 14098861
41357 14098861 2184663 -8702097 -11023726 -11473921 -18246277 -26356920 -25891115 -18617161
41349 -18617161 -14803996 -16996225 -18618851 -17059372 -16608367 -18571423 -19352354 -18699911
41341 -18699911 -19253819 -17810668 -8685481 3509904 7138792 1454601 -2120772 607763
41333 607763 847146 -4620952 -5373289 3290310 8263526 -1534408 -15678324 -17021977
41325 -17021977 -6830506 -396892 -3836586 -9345697 -9620527 -4514073 3763957 11378583
$$ packed form
41381h637099p94264N853157M869425m284134j1067970p345938K383605O780641
41373a2242577K215563k520862J709150J0882911J1919450N61791j0761838p307215
41365e543627Q618404J8800387J1077950n218053j1249524l317045L373956k443587
41357A4098861j1914198j0886760k321629m50195o772356q110643M65805P273954
41349a8617161L813165k192229j622626J559479M51005j963056p80931O52443
41341a8699911n53908J443151R125187J2195385L628888n684191l575373K728535
41333F07763K39383n468098p52337Q663599M973216r797934j4143916j343653
41325a7021977J0191471O433614l439694n509111k74830N106454Q278030P614626
$$ plain form
41317 11378583 11966379 4532562 -1909277 -689463 1537372 -3271805 -8800187 -4276366
41309 -4276366 5683057 7168512 -255319 -3776997 192672 864710 -7124720 -14623818
41301 -14623818 -13534997 -7885653 -3702508 270721 5570214 7911310 4444562 -734555
41293 -734555 -3002202 -2134440 1512171 7338979 9517586 1988735 -9581921 -12774435
41285 -12774435 -8142431 -9809792 -21037746 -25225385 -11586629 4881790 3783204 -11215973
41277 -11215973 -20047139 -16307979 -11816979 -13904332 -15933934 -12484729 -8630623 -8798683
41269 -8798683 -8262413 -2467474 3758075 3245080 -2979361 -8115093 -8389956 -4606348 1194133
41260 1194133 5584535 3592015 -5436373 -13419178 -11063845 -202635 6945768 3063578
$$ packed form
41317A1378583N87796p433817o441839J219814K226835m809177n528382M523821
41309d276366R959423J485455p423831l521678L969669O72038p989430p499098
41301a4623818J088821N649344M183145L973229N299493K341096l466748n179117
41293g34555k267647Q67762L646611N826808K178607p528851j1570656l192514
41285a2774435M632004j667361j1227954m187639J3638756J6468419j098586j4999177
41277a1215973q831166L739160M491000k087353k029602L449205L854106j68060
41269h798683N36270N794939O225549n12995o224441n135732k74863L783608N800481
41260A194133M390402j992520r028388p982805K355333J0861210P148403l882190
$$ plain form
41252 3063578 -4504383 -3549577 6715471 15544859 16364251 14964679 18386445 22375597
41244 22375597 17717539 6029571 -269979 4831920 12234108 10790599 2734917 -711311
41236 -711311 4256567 9778492 8759140 4654418 5183865 10391373 12491646 7175115
41228 7175115 -295525 -3002433 -2361063 -4965518 -11274237 -14365013 -11045688 -6848117
41220 -6848117 -6073986 -3831746 5263770 15700881 17188847 9767409 3846151 5337722
41212 5337722 9005855 7924782 2373764 -2901192 -4672321 -2562512 1217750 2853194
41204 2853194 1776406 3319507 11011806 18415232 16316558 6251779 -2380209 -7020655
41196 -7020655 -12077792 -14989959 -7297794 6814624 9101007 -7322193 -25181552 -26504478
$$ packed form
41252C063578p567961R54806J0265048Q829388Q19392j399572L421766L989152
41244B2375597m658058j1687968o299550N101899P402188j443509q055682l446228
41236g11311M967878N521925j019352m104722N29447N207508K100273n316531
41228G175115p470640k706908O41370k604455o308719l090776L319325M197571
41220f848117P74131K242240R095516J0437111J487966p421438n921258J491571
41212E337722L668133j081073n551018n274956j771129K109809L780262J635444
41204B853194j076788J543101P692299P403426k098674j0064779q631988m640446
41196g020655n057137k912167P692165J4112418K286383j6423200j7859359j322926
$$ plain form
41188 -26504478 -16593348 -11778210 -14070376 -13601588 -8735833 -6731843 -7915028 -5408455
41180 -5408455 162764 522500 -4881905 -6924933 -2214461 1978109 1026857 -303629
41172 -303629 1965290 4529914 4586962 4827609 6635921 6887794 5157836 5393823 6789659
41163 6789659 2482766 -7892820 -14067845 -9953348 -3569832 -4394248 -8868538 -7792954
41155 -7792954 -1754462 1115324 -1451114 -5061084 -8828361 -15939272 -24364835 -26792607
41147 -26792607 -21738962 -16653349 -16885130 -18063116 -13402911 -3852046 3589271 5274872
41139 5274872 4673972 6953322 11909521 13178969 5200124 -8538299 -16279380 -10053110
41131 -10053110 3948015 11080681 4936469 -5863252 -9513144 -5340444 -1839806 -3077351
$$ packed form
41188b6504478R911130M815138k292166M68788M865755K003990j183185K506573
41180e408455N571219L59736n404405k043028M710472M192570r51252j330486
41172c03629K268919K564624N7048K40647J808312K51873j729958K35987J395836
41163F789659m306893j0375586o175025M114497O383516q24416m474290J075584
41155g792954O038492K869786k566438l609970l767277p110911q425563k427772
41147b6792607N053645N085613k31781j177986M660205R550865P441317J685601
41139E274872o00900K279350M956199J269448p978845j3738423p741081O226270
41131a0053110J4001125P132666o144212j0799721l649892M172700L500638j237545
$$ plain form
41123 -3077351 -3726821 1055358 6889689 6076448 -1082252 -6918350 -7500071 -6609075 -7410235
41114 -7410235 -7054883 -3437867 -886262 -2613453 -2706038 5177540 13866513 8885212 -9864298
41105 -9864298 -23875184 -19007145 -3614229 4009134 -753617 -7504120 -8736982 -7616757
41097 -7616757 -7686848 -5276678 3408478 13934075 17444542 10347148 -2537029 -12700940
41089 -12700940 -14635216 -10015476 -6049516 -7591530 -11216718 -10320388 -5326061 -3446217
41081 -3446217 -7389832 -10754096 -8203620 -4392400 -6785678 -13516186 -15874745 -11712775
41073 -11712775 -8640531 -12137845 -16969899 -14423481 -4013945 6496075 10523706 7856355
41065 7856355 1801110 -3882252 -4619523 3363039 17517107 27674834 24818240 11298620
$$ packed form
41123c077351o49470M782179N834331q13241p158700n836098n81721Q90996q01160
41114g410235L55352L617016K551605j727191r2585P883578Q688973m981301j8749510
41105i864298j4010886M868039J5392916P623363m762751o750503j232862J120225
41097g616757p0091K410170Q685156J0525597L510467p097394j2884177j0163911
41089a2700940j934276M619740L965960j542014l625188Q96330M994327J879844
41081c446217l943615l364264K550476L811220k393278o730508k358559M161970
41073a1712775L072244l497314m832054K546418J0409536J0510020M027631k667351
41065G856355o055245n683362p37271P982562J4154068J0157727k856594j3519620
$$ plain form
41057 11298620 -1117746 -4216584 -1043276 819234 -461671 -1501965 -1630463 -4062442
41049 -4062442 -9221349 -13148981 -14496346 -17148862 -22299341 -23591560 -16012078 -5430299
41041 -5430299 -1819048 -5033835 -5460778 1200194 8127195 8415966 4002861 -550608
41033 -550608 -6131353 -14528421 -20481266 -15794512 -291173 16769594 25906919 24462181
41025 24462181 15932981 6589413 2024095 3033617 4834649 2886675 -1536000 -4010911
41017 -4010911 -3128158 -722112 1774186 3283583 1786762 -2258244 -3553733 1467836
41009 1467836 7868464 8399671 4452985 2884270 3080511 -2751380 -14643107 -20588822
41001 -20588822 -12342226 2718690 11837597 12559404 11558085 13293589 17244338 22456942
$$ packed form
41057A1298620j2416366l098838L173308J862510j280905j040294j28498k431979
41049d062442n158907l927632j347365k652516n150479j292219P579482J0581779
41041e430299L611251l214787m26943O660972O927001K88771m413105m553469
41033e50608n580745q397068n952845M686754J5503339J7060767R137325j444738
41025B4462181q529200r343568m565318J009522J801032j947974m422675k474911
41017d010911Q82753K406046K496298J509397j496821m045006j295489N021569
41009A467836O400628N31207l946686j568715J96241n831891j1891727n945715
41001b0588822Q246596J5060916R118907P21807j001319J735504L950749N212604
$$ plain form
40993 22456942 27180924 26455407 17526473 6494346 2669796 6567963 9792204 7164041
40985 7164041 2856967 2959484 7195249 10713923 10659947 8189955 5679600 4038164 2570938
40976 2570938 882396 442994 2894953 6543180 7094653 3388204 -429474 -850771 -200690
40967 -200690 -2428485 -6298520 -7314140 -4909588 -2771432 -2349575 -994085 2492735
40959 2492735 4790013 2786650 -1394336 -2792043 -163480 2019501 -1025744 -7836487
40951 -7836487 -11651420 -9001421 -4615028 -4183052 -4791800 663446 9847682 10825482 -770084
40942 -770084 -12949034 -12494242 -2138151 5578913 6063347 4322552 2485084 -2842655
40934 -2842655 -10932289 -15292644 -13849069 -12069339 -13259226 -13531265 -9737615 -5495889
$$ packed form
40993B2456942M723982p25517q928934j1032127l824550L898167L224241k628163
40985G164041m307074J02517M235765L518674n3976k469992k510355j641436j467226
40976B570938j688542m39402K451959L648227N51473l706449l817678m21297O50081
40967b00690k227795l870035j015620K404552K138156M21857J355490L486820
40959B492735K297278k003363m180986j397707K628563K182981l045245o810743
40951g836487l814933K649999M386393M31976o08748N455246R184236R77800j1595566
40942g70084j2178950M54792J0356091P717064M84434j740795j837468n327739
40934b842655q089634m360355J443575J779730j189887k72039L793650M241726
$$ plain form
40926 -5495889 -5318659 -8195464 -10749557 -12245031 -13171824 -12848682 -11353006 -10459712 -10603031
40917 -10603031 -10219187 -9193498 -8935256 -8400300 -5120470 -997673 -939066 -4118952 -3491814
40908 -3491814 3101791 8431393 6772884 2562392 2420993 4387899 2259781 -3346363
40900 -3346363 -5901298 -3070504 879221 2198404 1472789 288264 -1085059 -2084739
40892 -2084739 -1548547 564364 3756039 8585387 14349484 15843741 7163028 -9398388
40884 -9398388 -21740362 -19069748 -4270934 8078948 7710695 166557 -1273070 6478705
40876 6478705 12996403 10500863 5146850 5906616 9330340 5796601 -3145671 -6535021
40868 -6535021 -2656623 -2043851 -8278081 -9376531 3849389 21704542 27926196 20598612
$$ packed form
40926e495889J77230k876805k554093j495474r26793L23142J495676Q93294j43319
40917a0603031L83844J025689K58242N34956L279830M122797N8607l179886O27138
40908c491814O593605N329602j658509m210492j41399J966906k128118n606144
40900c346363k554935K830794L949725J319183p25615j184525j373323r99680
40892b084739N36192K112911L191675M829348N764097J494257q680713j6561416
40884i398388j2341974K670614J4798814J2349882l68253p544138j439627P751775
40876F478705O517698k495540n354013P59766L423724l533739q942272l389350
40868f535021L878398O12772o234230j098450J3225920J7855153O221654p327584
$$ plain form
40860 20598612 10762745 5823384 4497858 4315061 3940030 26646 -8981412 -16764046
40852 -16764046 -15148407 -6139457 -568869 -4209174 -11481340 -13759763 -8857684 -1571144
40844 -1571144 1516579 -1994553 -6943816 -5368101 2571512 6591060 -286256 -11267575
40836 -11267575 -15387999 -12974792 -12849202 -17062210 -18338469 -12535829 -4813784 -1997220
40828 -1997220 -5323264 -11331005 -14369101 -9161547 2880864 11420134 8178718 -1674096
40820 -1674096 -6598205 -4316560 -941105 2557618 10444138 19352053 19480003 11301145
40812 11301145 7219682 11672774 13141963 3264411 -8855233 -11233293 -7052561 -6495439
40804 -6495439 -8990134 -6563483 287948 2875610 -1602253 -7116564 -9225364 -9339237
$$ packed form
40860B0598612r835867m939361j325526j82797l75031l913384r008058p782634
40852a6764046J615639R008950N570588l640305p272166k278423M902079P286540
40844a571144L087723l511132m949263J575715P939613M019548o877316j0981319
40836a1267575m120424K413207J25590m213008j276259N802640P722045K816564
40828a997220l326044o007741l038096N207554J2042411Q539270l241416r852814
40820a674096m924109K281645L375455L498723P886520Q907915J27950q178858
40812A1301145m081463M453092J469189r877552j2119644k378060M180732N57122
40804f495439k494695K426651O851431K587662m477863n514311k108800j13873
$$ plain form
40796 -9339237 -8878664 -7067202 -4568883 -2866164 -697449 3018991 4509109 68062
40788 68062 -6135984 -6672039 -2194325 -379858 -3856697 -7331270 -7539032 -7752557 -9826470
40779 -9826470 -9233994 -2332276 6739424 11125639 10201097 9539850 13213235 18603867 18899381
40770 18899381 10590726 -1299636 -7246751 -3796828 2780878 5682630 5895305 6709162
40762 6709162 5167836 -2645896 -10975459 -9666122 -184187 4323137 -2421087 -11281152
40754 -11281152 -12149375 -7426091 -4475641 -2738954 2892917 10959790 14530331 11003405
40746 11003405 3694371 -4425673 -12190136 -17229206 -17773584 -16281582 -15743188 -14081718
40738 -14081718 -8227692 -1849913 -1563041 -5904002 -6075291 935080 7439435 5987645
$$ packed form
40796i339237M60573J811462K498319J702719K168715L716440J490118m441047
40788F8062o204046n36055M477714J814467l476839l474573k07762k13525k073913
40779i826470N92476O901718R071700M386215r24542o61247L673385N390632K95514
40770A8899381q308655j1890362n947115L449923O577706K901752K12675Q13857
40762F709162j541326p813732q329563J309337R481935M507324o744224q860065
40754a1281152q68223M723284K950450J736687N631871Q066873L570541l526926
40746A1003405p309034q120044p764463n039070n44378J492002N38394J661470
40738a4081718N854026O377779K86872m340961j71289P010371O504355j451790
$$ plain form
40730 5987645 -1404451 -8621238 -14001953 -18439689 -19571388 -14326638 -5612411 -966789
40722 -966789 -4289839 -12241979 -18732407 -20119601 -16111336 -8587289 -748057 4089995
40714 4089995 4193943 278025 -4903565 -8018596 -7572508 -5393053 -4453051 -4820969 -3586381
40705 -3586381 390653 3918725 3428954 -320255 -3712006 -5133485 -5859089 -6762943 -6796281
40696 -6796281 -4989147 -1925979 1375302 4602554 7551744 9525923 10083980 9652022
40688 9652022 8537528 5704371 -218741 -7994484 -12887590 -10817552 -3748234 1454942
40680 1454942 1021286 -1308088 -361560 2530421 1921020 -2905277 -6650822 -5491306 -746568
40671 -746568 5222307 11096873 13710177 9749251 2690010 1123207 6509987 9593092
$$ packed form
40730E987645p392096p216787n380715m437736j131699N244750Q714227M645622
40722i66789l323050p952140o490428j387194M008265P524047P839232M838052
40714D089995J03948l915918n181590l115031M46088K179455R40002l67918J234588
40705c586381L977034L528072m89771l749209l391751j421479p25604r03854l3338
40696f796281J807134L063168L301281L227252K949190J974179N58057m31958
40688I652022j114494k833157n923112p775743m893106K070038P069318N203176
40680A454942m33656k329374R46528K891981o09401m826297l745545J159516M744738
40671g46568N968875N874566K613304l960926p059241j566803N386780L083105
$$ plain form
40663 9593092 3920547 -4230121 -6085720 -3724314 -4726344 -9269425 -12404516 -14484764
40655 -14484764 -18148765 -18511973 -9271874 2915827 4157044 -5565525 -11130387 -5215012
40647 -5215012 1928803 1159154 -1658006 710283 2725174 -2230350 -6814832 -1050611
40639 -1050611 8524209 6821597 -5976882 -14051841 -9606310 -2672944 -3955228 -9864457
40631 -9864457 -10593008 -4804744 297519 -789205 -6344755 -10038469 -6952692 1212828
40623 1212828 6978847 5661620 1663424 2236951 6904319 8729982 4882464 -683947
40615 -683947 -4769191 -8021143 -9820164 -7540398 -2996584 -2569839 -7687700 -11362964
40607 -11362964 -8023751 -1437246 1258816 -1269804 -5638599 -9685546 -12258769 -10279149
$$ packed form
40663I593092n672545q150668j855599K361406j002030m543081l135091k080248
40655a4484764l664001l63208R240099J2187701J241217r722569n564862N915375
40647e215012P143815p69649k817160K368289K014891m955524m584482N764221
40639a050611R574820j702612j2798479q074959M445531O933366j282284n909229
40631i864457p28551N788264N102263j086724n555550l693714L085777Q165520
40623A212828N766019j317227l998196N73527M667368J825663l847518n566411
40615f83947m085244l251952j799021K279766M543814M26745n117861l675264
40607a1362964L339213O586505K696062k528620m368795m046947k573223J979620
$$ plain form
40599 -10279149 -1845458 8507423 12372168 6376400 -3575569 -7812916 -2401027 6729770
40591 6729770 9934755 5045925 228729 2891546 8729095 7607829 -1357683 -8749355
40583 -8749355 -9740773 -10859355 -17630931 -23959929 -21266411 -12380530 -7484865 -9034254
40575 -9034254 -9434913 -3481825 4446584 7165126 3161886 -3407604 -7087573 -4356173
40567 -4356173 3470898 9165734 5176015 -7682696 -19791586 -22585406 -16554234 -8476687
40559 -8476687 -3851869 -3894845 -6775836 -8684989 -5851462 991850 5628173 3598211
40551 3598211 -815927 152066 5604337 5680848 -3764772 -12977960 -11302247 -3480476 -3465597
40542 -3465597 -13297526 -19001660 -10499903 4250762 11121291 8014479 3361559 2245388
$$ packed form
40599a0279149Q433691J0352881L864745n995768r951969m237347N411889R130797
40591F729770L204985m888830m817196K662817N837549j121266q965512p391672
40583h749355r91418j118582o771576o328998K693518Q885881M895665j549389
40575i034254m00659N953088P928409K718542m003240o569490l679969K731400
40567d356173P827071N694836l989719j2858711j2108890k793820O031172Q077547
40559h476687M624818m2976k880991j909153K833527O843312M636323k029962
40551C598211m414138R67993N452271P6511r445620r213188J675713P821771J4879
40542c465597r831929n704134Q501757J4750665O870529l106812m652920j116171
$$ plain form
40534 2245388 3038436 4240104 5430446 3343413 -4144108 -11232068 -10183570 -3370577
40526 -3370577 -201006 -2574355 -3984905 -3581863 -8222940 -16574988 -14717628 3599469
40518 3599469 23071043 24752364 10920096 -40101 470977 2906391 -3396830 -15914065
40510 -15914065 -24288785 -22435081 -12600848 -2550182 -246978 -6882124 -14397998 -14077620
40502 -14077620 -7364565 -3132696 -4576313 -5447624 -799245 5371496 7006964 5214547
40494 5214547 5457922 8562883 9785952 6045128 26816 -3141109 -666104 6384656
40486 6384656 13759855 15986529 10353055 255583 -7187635 -8331251 -6569815 -7354319
40478 -7354319 -11203427 -13994406 -13071282 -9780766 -6076379 -2370471 340078 133900
$$ packed form
40534B245388P93048J201668J190342k087033p487521p087960J048498O812993
40526c370577L169571k373349j410550M03042m641077q352048J857360J8317097
40518C599469J9471574J681321j3832268j0960197N11078K435414o303221j2517235
40510a5914065q374720J853704R834233J0050666K303204o635146p515874L20378
40502a4077620O713055M231869j443617q71311M648379O170741J635468j792417
40494E214547K43375L104961J223069l740824o018312l167925K475005P050760
40486F384656P375199K226674n633474j0097472p443218j143616J761436p84504
40478g354319l849108k790979R23124L290516L704387L705908K710549k06178
$$ plain form
40470 133900 -2313120 -3834757 -4529183 -8479072 -15164556 -15924325 -5423972 7869496
40462 7869496 11023211 3877762 -2141011 -1438501 -665499 -6600338 -17046680 -26570948
40454 -26570948 -32924834 -34420441 -28731586 -18223060 -9730934 -5929731 -3765285 -3142882
40446 -3142882 -7517652 -12815343 -7818920 7796087 17772055 11291805 -54554 628797
40438 628797 10837195 15673873 12558668 11885332 15857318 14247899 3144097 -7371682
40430 -7371682 -8758430 -4830050 -1939972 799845 5360900 7679606 3434185 -5045077
40422 -5045077 -12849211 -18449321 -21746913 -21465447 -18245556 -15447723 -13574365 -8865875
40414 -8865875 -649753 5151068 3757276 -1651070 -4732868 -3894060 -1897472 -815567
$$ packed form
40470A33900k447020j521637o94426l949889o685484p59769J0500353J3293468
40462G869496L153715p145449o018773P02510P73002n934839j0446342r524268
40454b6570948o353886j495607N688855J0508526Q492126L801203K164446O22403
40446c142882m374770n297691M996423J5615007R975968o480250j1346359O83351
40438F28797J0208398M836678l115205o73336L971986j609419j1103802j0515779
40430g371682j386748L928380K890078K739817M561055K318706m245421q479262
40422e045077p804134n600110l297592K81466L219891K797833J873358M708490
40414h865875Q216122N800821j393792n408346l081798Q38808J996588J081905
$$ plain form
40406 -815567 -509256 461256 4382195 11761465 17836783 15876465 5907086 -4148676
40398 -4148676 -8390641 -9728586 -13936198 -20821440 -24690200 -21124011 -11111606 -722569
40390 -722569 2629868 -2803719 -9311952 -7662650 413418 3731014 -2581182 -10046237
40382 -10046237 -9621893 -4592862 -4261487 -9640099 -12827999 -8372382 1148334 9675375
40374 9675375 12329957 6587406 -5378795 -14994405 -13020143 588441 14936958 18333620
40366 18333620 9726100 -693587 -2456522 3822863 7510782 1526357 -7843490 -8777954
40358 -8777954 153378 8175225 6970534 290721 -3765357 -3450365 -1747710 400629
40350 400629 3318163 4921540 3943570 4079413 8823694 14252463 13553241 8021313 6795866
$$ packed form
40406h15567L06311R70512L920939P379270O075318j960318r969379j0055762
40398d148676m241965j337945m207612o885242l868760L566189J0012405J0389037
40390g22569L352437n433587o508233J649302Q076068L317596o312196p465055
40382a0046237M24344N029031L31375n378612l187900M455617R520716Q527041
40374I675375K654582n742551j1966201r615610J974262J3608584J4348517L396662
40366A8333620q607520j0419687j762935O279385L687919n984425r369847r34464
40358h777954Q931332Q021847j204691o679813m056078L14992J702655K148339
40350D00629K917534J603377r77970J35843M744281N428769o99222n531928j225447
$$ plain form
40341 6795866 14313802 23480667 24040530 14539173 3451152 -124508 4657692 10356903
40333 10356903 9789582 4507422 3217691 10850280 21438161 24113045 14616833 -1337728
40325 -1337728 -14404123 -18694068 -14416341 -6981140 -2801901 -3205351 -3450247 -326392
40317 -326392 1513092 -4445113 -15155178 -18749942 -8916294 6126745 12821107 7865501
40309 7865501 470966 -199863 4419781 6010605 738129 -6764320 -10762530 -11979187
40301 -11979187 -14931956 -19826880 -21628804 -17694556 -11965930 -9164985 -8321285 -5791107
40293 -5791107 -2321096 -2222917 -6010168 -8941807 -8389644 -8223071 -12603226 -18447155 -18646687
40284 -18646687 -11965950 -5058184 -3451483 -4532195 -2208638 4357830 10379640 12115028
$$ packed form
40341F795866P517936R166865N59863r501357j1088021l575660M782200N699211
40333A0356903n67321n282160j289731P632589J0587881K674884r496212j5954561
40325a337728j3066395m289945M277727P435201M179239m03450k44896L123855
40317c26392J839484n958205j0710065l594764R833648J5043039O694362m955606
40309G865501p394535o70829M619644J590824n272476p502449l998210j216657
40301a1979187k952769m894924j801924L934248N728626K800945Q43700K530178
40293e791107L470011R8179l787251k931639N52163J66573m380155n843929j99532
40284a8646687O680737O907766J606701j080712K323557O566468O021810J735388
$$ plain form
40276 12115028 9786432 4567727 -2665997 -8897950 -9768229 -4744984 1763752 5817043
40268 5817043 6946566 4898496 -1433421 -9420516 -12617306 -9254743 -5815750 -7554872
40260 -7554872 -10618774 -9291379 -5828295 -5705226 -7529002 -6305555 -3291987 -2972784
40252 -2972784 -2761285 3355930 11845388 12272525 4301925 -54749 4993320 9656697
40244 9656697 4046924 -6599708 -10108257 -3897635 4520142 8674696 7481416 1810121
40236 1810121 -6624980 -14199255 -17422498 -15407139 -9431088 -2982788 -1852938 -8293369
40228 -8293369 -14507920 -9555139 5118976 15203898 11938622 2574086 -2023152 -1461725
40220 -1461725 -1377350 -2939499 -4171054 -5285910 -5762924 -2148010 4774477 7220548 1622347
$$ packed form
40276A2115028k328596n218705p233724o231953q70279N023245O508736M053291
40268E817043J129523k048070o331917p987095l196790L362563L438993j739122
40260g554872l063902J327395L463084J23069j823776J223447L013568L19203
40252b972784K11499O117215Q489458M27137p970600m356674N048069M663377
40244I656697n609773j0646632l508549O210622Q417777M154554j193280n671295
40236A810121q435101p574275l223243K015359N976051O448300J129850o440431
40228h293369o214551M952781J4674115J0084922l265276r364536m597238N61427
40220a461725Q4375j562149j231555j114856m77014L614914O922487K446071n598201
$$ plain form
40211 1622347 -4345441 -3327176 424583 -374316 -3579903 -3291743 -1149951 -1638248 -2365638
40202 -2365638 225221 1703249 -2177196 -4454037 2679404 12141759 11562254 4382334
40194 4382334 4824280 13787058 17294907 9931435 2617301 3482685 7017038 7764892 10233300
40185 10233300 17886088 24459315 23960732 19557249 15990874 12276399 7823074 6797815
40177 6797815 10380237 12806079 10325918 6210962 2881929 -1905560 -7272419 -7953124
40169 -7953124 -5009547 -6293043 -11405476 -9574577 826374 5867851 -744799 -4020962
40161 -4020962 7915176 20271590 12294636 -8720695 -17079441 -7469091 21908 -5629208
40153 -5629208 -10826156 -3243512 7770357 8746251 3879962 4499132 8026100 3762334
$$ packed form
40211A622347n967788J018265L751759p98899l205587K88160K141792m88297p27390
40202b365638K590859J478028l880445k276841P133441R462355n79505p179920
40194D382334M41946Q962778L507849p363472p314134Q65384L534353P47854K468408
40185A0233300P652788O573227m98583m403483l566375l714475m453325j025259
40177F797815L582422K425842k480161m114956l329033m787489n366859o80705
40169g953124K943577j283496n112433J830899J0400951N041477o612650l276163
40161d020962J1936138J2356414p976954k1015331q358746R610350P490999n651116
40153e629208n196948P582644J1013869R75894m866289O19170L526968m263766
$$ plain form
40145 3762334 -6268980 -8558622 273971 7165364 1643400 -9484456 -12912168 -7474517
40137 -7474517 -4050663 -9316668 -17349825 -19102692 -14577396 -11235286 -13050962 -16461819
40129 -16461819 -17152885 -15743231 -14609842 -13204224 -10069617 -6831922 -6256777 -7809280
40121 -7809280 -8695680 -8155930 -7253333 -5633732 -2602162 -708125 -3511538 -9310775 -11718094
40112 -11718094 -7917999 -2227432 420119 367719 -170146 -2374671 -8227551 -15038210
40104 -15038210 -17549909 -14956423 -11600227 -10705417 -11379309 -12060372 -12597136 -11939949 -8384222
40095 -8384222 -3926929 -3436696 -6607250 -6245639 633999 5570532 -83666 -10940065
40087 -10940065 -14239007 -8424283 -3603632 -3335463 679991 11509082 18125342 12390321
$$ packed form
40145C762334j0031314k289642Q832593O891393n521964j1127856l427712N437651
40137g474517L423854n266005q033157j752867M525296L342110j815676l410857
40129a6461819o91066J409654J133389J405618L134607L237695N75145j552503
40121g809280q86400N39750R02597J619601L031570J894037k803413n799237k407319
40112a1718094L800095N690567K647551n2400n37865k204525n852880o810659
40104a5038210k511699K593486L356196Q94810o73892o81063n36764O57187L555727
40095h384222M457293M90233l170554L61611O879638M936533n654198j0856399
40087a0940065l298942N814724M820651K68169M015454J0829091O616260n735021
$$ plain form
40079 12390321 3495009 3600644 7778966 2470093 -11330720 -18700845 -13244887 -4404178
40071 -4404178 -1028916 -990163 -426667 -1172554 -3740006 -2890790 3791955 10470212 11232694
40062 11232694 7260347 2195491 -2621654 -4879741 -968703 6982020 11208874 9493019
40054 9493019 8376530 11110370 11577791 6085292 1725515 4766942 8918532 5011827
40046 5011827 -3768359 -6699495 -1565899 3929905 4409205 1753190 -797265 -2181364
40038 -2181364 -2191099 -1968684 -3599943 -5030562 -256014 9956243 14120051 5030861 -7454660
40029 -7454660 -8982011 -954151 3967022 3142751 6441719 17230466 25088973 21679307
40021 21679307 12530814 7430954 7774830 9108291 9428859 9549139 10156239 12588746 18200540
$$ packed form
40079A2390321q895312J05635M178322n308873j3800813p370125N455958Q840709
40071d404178L375262L8753N63496p45887k567452Q49216O682745O678257P62482
40062A1232694l972347n064856m817145k258087L911038P950723M226854j715855
40054I493019j116489K733840M67421n492499m359777L041427M151590l906705
40046E011827q780186k931136N133596N495804M79300k656015k550455j384099
40038b181364r735K22415j631259j430619M774548J0212257M163808r089190j2485521
40029g454660j527351Q027860M921173q24271L298968J0788747P858507l409666
40021B1679307r148493n099860L43876J333461L20568J20280O07100K432507N611794
$$ plain form
40012 18200540 24112457 24419094 18397011 12635589 12139039 14121872 13779652 11602616
40004 11602616 11104918 12650881 13177518 10094354 3295901 -4811832 -10200279 -10417034
39996 -10417034 -7455844 -5140115 -4245364 -3478410 -3940522 -7420895 -10509719 -6332269
39988 -6332269 6399492 20614811 28261548 26792343 18935167 11039560 10764921 19972352
39980 19972352 30057545 31156373 25699595 24691848 30367080 32699562 25767947 17275900
39972 17275900 17017324 25149385 37440766 52991665 69969730 82550837 90408660 103310299
39964 103310299 126801420 150140816 158749413 152765229 142177329 129092076 108413231
39957 108413231 83339072 65295311 57047825 48960399 35374178 23040589 18509341
$$ packed form
40012A8200540N911917L06637o022083n761422m96550J982833l42220k177036
40004A1602616m97698J545963N26637l083164o798453q107733n388447k16755
39996a0417034K961190K315729Q94751P66954m62112l480373l088824M177450
39988f332269J2731761J4215319P646737j469205p857176p895607k74639R207431
39980A9972352J0085193J098828n456778j007747N675232K332482o931615q492047
39972A7275900k58576Q132061J2291381J5550899J6978065J2581107P857823J2901639
39964A03310299K3491121K3339396Q608597n984184j0587900j3085253k0678845
39957A08413231k5074159j8043761q247486q087426j3586221j2333589m531248
$$ plain form
39950 18509341 17704520 14652248 12026596 15184346 21641110 24411252 22445310 20939253
39942 20939253 23094843 27036676 29917618 30930929 30860809 31341494 33463404 35381757
39934 35381757 33471299 27556537 21991650 19451287 17410999 13940836 13011564 19220285
39926 19220285 29765375 36652189 35593584 28737072 20359531 14210554 13196528 16485839
39918 16485839 18214937 14566080 10990323 15860793 27138416 32811150 26173354 13410819
39910 13410819 3502857 -1562165 -2247415 4398097 18187132 29371017 28434088 19554785
39902 19554785 15307781 19618666 25156119 26771632 27025424 26970806 22431249 13724862
39894 13724862 9088298 12057325 14156605 8051539 367175 1741635 10024962 14499291
$$ packed form
39950A8509341q04821l052272k625652L157750O456764K770142j965942j506057
39942B0939253K155590L941833K880942J013311p0120M80685K121910J918353
39934C5381757j910458n914762n564887k540363k040288l470163r29272O208721
39926A9220285J0545090O886814j058605o856512q377541o148977j014026L289311
39918A6485839J729098l648857l575757M870470J1277623N672734o637796j2762535
39910A3410819r907962n065022o85250O645512J3789035J1183885r36929q879303
39902A9554785m247004M310885N537453J615513K53792n4618m539557q706387
39894A3724862m636564K969027K099280o105066p684364J374460Q283327M474329
$$ plain form
39886 14499291 13016522 12779084 15453937 14297243 7766670 3992725 7623364 12620905
39878 12620905 13245837 12532084 13561927 11719257 4303571 324563 10276265 30449246
39870 30449246 47141080 53797930 55318839 58060894 64747252 77094754 93324566 103827171
39862 103827171 99913102 87710622 82824741 89077342 93171026 83983975 66398143 50587423
39854 50587423 38189793 26989570 20065981 20220284 21764104 17789589 10549240 5295673
39846 5295673 -383459 -9824542 -15148229 -6015831 11580431 20280997 15869134 11654693
39838 11654693 15160433 16327765 6410324 -5809616 -7890329 -2808755 -1511820 -4605705
39830 -4605705 -5084925 -3731033 -7373812 -14226596 -15024526 -9097614 -6214478 -9902073
$$ packed form
39886A4499291j482769k37438K674853j156694o530573l773945L630639M997541
39878A2620905O24932p13753J029843j842670p415686l979008R951702K0172981
39870C0449246J6691834O656850J520909K742055O686358J2347502J6229812J0502605
39862A03827171l914069j2202480m885881O252601M093684r187051j7585832j5810720
39854E0587423j2397630j1200223o923589J54303J543820l974515p240349n253567
39846E295673n679132r441083n323687R132398J7596262Q700566m411863m214441
39838A1654693L505740J167332r917441j2219940k080713N081574J296935l093885
39830d605705m79220J353892l642779o852784p97930N926912K883136l687595
$$ plain form
39822 -9902073 -10972247 -2528573 8656645 12367948 9194696 7392770 10197261 13223273
39814 13223273 12514231 9473628 7454741 6635994 3730553 -3142300 -9949154 -9913099 -2954059
39805 -2954059 1915539 -2074690 -9465237 -10294704 -4729893 -1640257 -4223237 -6719019
39797 -6719019 -5548583 -3401587 -636315 6319543 14473379 13747405 3121838 -3524568
39789 -3524568 3849552 16302324 19616398 15042978 14014202 17585892 15291481 3818223
39781 3818223 -5897560 -3338650 8677434 19421434 22623136 20210104 17594256 17889313
39773 17889313 19436456 18623337 15184294 11991049 8964921 2624599 -5631220 -7613767
39765 -7613767 151384 9857849 14082250 16674172 22885496 25988328 16524605 300120
$$ packed form
39822i902073j070174Q443674J1185218L711303l173252j801926K804491L026012
39814A3223273p09042l040603k018887q18747k905441o872853o806854L6055O959040
39805b954059M869598l990229p390547q29467N564811L089636k582980k495782
39797f719019J170436K146996K765272O955858Q153836p25974j0625567o646406
39789c524568P374120J2452772L314074m573420j028776L571690k294411j1473258
39781C818223r715783K558910J2016084J0744000L201702k413032k615848K95057
39773A7889313J547143q13119l439043l193245l026128o340322q255819j982547
39765g613767P765151R706465M224401K591922O211324L102832r463723j6224485
$$ plain form
39757 300120 -7278804 -3273743 657657 -1842271 -4667037 -3809351 -3564909 -3785713 3472263
39748 3472263 17220997 22201353 10386404 -5218705 -10219021 -10056869 -16420753 -22587126
39740 -22587126 -12025707 12246060 27347600 22274612 12323431 15041994 26342491
39733 26342491 30702920 24583032 17209152 13381772 7993978 -2437592 -12529139 -15290514
39725 -15290514 -10882143 -5171234 -2884821 -4144606 -5320503 -2172010 5448206 11549506
39717 11549506 10049474 3689250 2208065 9015438 14874461 10097128 -1144829 -6195006
39709 -6195006 -1475515 4305284 4984736 5214620 10068114 15225049 14223721 9208365
39701 9208365 7068792 9352277 13160248 18047946 24169171 26617537 20063681 7550783
$$ packed form
39757C00120p578924M005061L931400k499928k824766Q57686K44442k20804P257976
39748C472263J3748734M980356j1814949j5605109n000316J62152o363884o166373
39740b2587126J0561419K4271767J5101540n072988r951181K718563J1300497
39733B6342491M360429o119888p373880l827380n387794j0431570j0091547k761375
39725a5290514M408371N710909K286413j259785j175897L148493P620216O101300
39717A1549506j500032o360224j481185O807373N859023m777333j1241957n050177
39709f195006M719491N780799O79452K29884M853494N156935j001328n015356
39701I208365k139573K283485L807971M887698O121225K448366o553856j2512898
$$ plain form
39693 7550783 -2869662 -8592021 -11919982 -11592191 -4700883 3860243 4867065 -1083519
39685 -1083519 -3785056 -332144 -357692 -9408965 -18169745 -16065923 -6640483 -179801
39677 -179801 1895094 4923840 8224948 5804889 -1669611 -6108490 -4359165 -2679978
39669 -2679978 -6118692 -10156035 -6895868 4502499 17146666 23897235 23044322 18195304
39661 18195304 14613456 14713184 15735404 12695917 4705139 -2992423 -5381152 -5129343
39653 -5129343 -9808276 -20189122 -25782200 -17129046 65203 10625639 9940313 9360474
39645 9360474 17953777 28037953 26530285 13704305 1030930 -4726969 -4675825 1215815
39637 1215815 13837755 26379565 28297315 19410180 9500867 2907520 -4827376 -13294914
$$ packed form
39693G550783j0420445n722359l327961L27791O891308Q561126J006822n950584
39685a083519k701537L452912k5548r051273q760780K103822R425440O460682
39677a79801K074895L028746L301108k420059p474500m438879J749325J679187
39669b679978l438714m037343L260167J1398367J2644167O750569q52913m849018
39661A8195304l581848R9728J022220l039487p990778p697562k388729K51809
39653e129343m678933j0380846n593078Q653154J7194249J0560436o85326n79839
39645I360474Q593303J0084176j507668j2825980j2673375n757899N1144N891640
39637A215815J2621940J2541810J917750q887135r909313o593347p734896q467538
$$ plain form
39629 -13294914 -13877838 -5101276 1465963 -2144719 -8996228 -10466329 -9774879 -12641818
39621 -12641818 -14390654 -7950331 2839617 9653442 13176500 18236868 20964014 14261020
39613 14261020 2972359 -393055 5064738 6787187 -1431752 -9471849 -5736566 6627857
39605 6627857 14535224 11128052 1872668 -3476266 -1507871 2312597 922039 -5476291
39597 -5476291 -10156621 -9413635 -6683372 -5345734 -3404809 527232 1981164 -2422619
39589 -2422619 -7769152 -7785929 -4865618 -5259379 -7645096 -5391048 1560440 6085523 5004132
39580 5004132 2648593 2614495 3322779 3195776 3851191 6235257 8480556 9058647 8253838
39571 8253838 6103172 2523586 -646105 -1230311 -16491 185320 -2451069 -8408257
$$ packed form
39629a3294914n82924Q776562O567239l610682o851509j470101O91450k866939
39621a2641818j748836O440323J0789948O813825L523058N060368K727146o702994
39613A4261020j1288661l365414N457793J722449q218939q040097L735283J2364423
39605F627857P907367l407172r255384n348934J968395L820468j390558o398330
39597e476291m680330P42986K730263J337638J940925L932041J453932m403783
39589b422619n346533j6777K920311l93761k385717K254048O951488M525083j081391
39580E004132k355539l4098P08284j27003O55415K384066K245299N78091q04809
39571H253838k150666l579586l169691n84206J213820K01811k636389n957188
$$ plain form
39563 -8408257 -16020224 -18913029 -10167745 6628004 17364364 15004923 10003127 14270707
39555 14270707 22034293 19029774 5679521 -3619036 -2704415 -145598 -2265107 -4194863
39547 -4194863 -2017663 -1002172 -5421604 -10011229 -7991970 -410866 7085986 10076332
39539 10076332 5071026 -8525628 -22893539 -26775971 -19898632 -14061014 -16096160 -19158873
39531 -19158873 -15888682 -10116692 -8247035 -8099564 -5133835 -2275130 -3955599 -6278908
39523 -6278908 -3036625 2916973 4265130 1984511 3365181 8999379 11919460 9870934
39515 9870934 8804385 12154718 15266068 14074663 11988147 12986809 13585224 8416195
39507 8416195 675652 -763404 5101321 8183578 1291167 -8488176 -8940599 -317189
$$ packed form
39563h408257p611967k892805Q745284J6795749J0736360k359441n001796M267580
39555A4270707P763586l004519j3350253r298557R14621K558817k119509j929756
39547d194863K177200J015491m419432m589625K019259P581104P496852K990346
39539A0076332n005306j3596654j4367911l882432O877339N837618k035146l062713
39531a9158873L270191N771990J869657J47471K965729K858705j680469k323309
39523f278908L242283N953598J348157k280619J380670N634198K920081k048526
39515I870934j066549L350333L111350j191405k086516R98662N98415n169029
39507H416195p740543j439056N864725L082257o892411r779343m52423Q623410
$$ plain form
39499 -317189 4352042 -3073103 -15766704 -22198388 -19263947 -11275914 -2960106 1318084
39491 1318084 -1588534 -6968806 -3664580 9801414 18191954 9438058 -5658127 -7622800
39483 -7622800 3177878 9331747 5521312 5255793 15418101 23564622 18947805 9665616
39475 9665616 7583550 9477583 6094839 -133193 -218431 4945518 6102084 210540
39467 210540 -6874854 -9956504 -8506790 -3678150 1706483 2980207 -632909 -3511486
39459 -3511486 -1747198 1204517 1992736 3883558 9290055 12836062 10031951 6352482
39451 6352482 8439518 12113744 9269516 1784486 -2050389 -947497 145061 362135
39443 362135 1230657 -1609112 -12053284 -21095407 -15098289 2713138 13038871 6235771
$$ packed form
39499c17189M669231p425145j2693601o431684K934441P988033Q315808M278190
39491A318084k906618n380272L304226J3465994Q390540q753896j5096185j964673
39483g622800J0800678O153869l810435k65519J0162308Q146521m616817r282189
39475I665616k082066J894033l382744o228032q5238N163949J156566n891544
39467B10540p085394l081650J449714M828640N384633J273724l613116k878577
39459c511486J764288K951715P88219J890822N406497L546007k804111l679469
39451F352482K087036L674226k844228p485030l834875J102892J092558K17074
39443C62135Q68522k839769j0444172r042123N997118J7811427J0325733o803100
$$ plain form
39435 6235771 -5260646 -5519977 4587325 12378438 10503606 2146854 -5486012 -7191395
39427 -7191395 -2995640 1147244 -378897 -4333003 -1960988 7431522 13569594 9633228
39419 9633228 2496905 2943273 11272950 19129084 21584786 20435733 17587327 12065798
39411 12065798 4035702 -3136057 -6303456 -5453081 -2416689 1599015 6507666 11921208
39403 11921208 15405850 13030892 3650231 -7374075 -11689683 -6760071 1086087 4297511
39395 4297511 2841769 2883516 8051986 14990449 17679655 13804346 6084878 -698955
39387 -698955 -2561795 1938819 9643367 12573545 3880201 -13060256 -24077471 -17286963
39379 -17286963 3295119 20847646 22912113 12328248 1042784 -2649011 729095
$$ packed form
39435F235771j1496417k59331J0107302P791113j874832q356752p632866j705383
39427g191395M195755M142884j526141l954106K372015R392510O138072l936366
39419I633228p136323M46368Q329677P856134K455702j149053k848406n521529
39411A2065798q030096p171759l167399Q50375L036392M015704M908651N413542
39403A1921208L484642k374958r380661j1024306m315608M929612P846158L211424
39395D297511j455742M1747N168470O938463K689206l875309p719468o783833
39387f98955j862840M500614P704548K930178q693344j6940457j1017215O790508
39379a7286963K0582082J7552527K064467j0583865j1285464l691795L378106
$$ plain form
39372 729095 5343131 6065005 3091854 1689787 5203056 9050094 6089484 -2543550
39364 -2543550 -8384257 -8183126 -7650008 -10040370 -9823539 -3079636 4068411 4915525 3136322
39355 3136322 5650206 10435446 11209606 9432285 10650394 12155119 6345819 -4548996
39347 -4548996 -9163254 -3600735 3758924 6392012 7807771 11613472 13273140 7763844
39339 7763844 -1650278 -7867085 -7849829 -2256716 6781343 13588262 11311578 1599986
39331 1599986 -3986028 1859703 11667372 13166718 5450826 -1918230 -2978628 -976100
39323 -976100 -845878 -3059593 -5946047 -8836687 -10948391 -10410224 -6313031 -527925 2931824
39314 2931824 50781 -9810825 -20875240 -23621226 -14090815 380116 8337171 6948385
$$ packed form
39372G29095M614036P21874k973151j402067L513269L847038k960610q633034
39364b543550n840707K01131N33118k390362K16831O743903P148047Q47114j779203
39355C136322K513884M785240P74160j777321J218109J504725n809300j0894815
39347d548996m614258N562519P359659K633088J415759L805701J659668n509296
39339G763844r414122o216807J7256N593113R038059O806919k276684r711592
39331A599986n586014N845731R807669J499346p715892p369056j060398K002528
39323i76100J30222k213715k886454k890640k111704N38167M097193N785106L459749
39314B931824k881043r861606j1064415k745986R530411J4470931P957055j388786
$$ plain form
39306 6948385 3921228 6115462 10333363 8240361 -1991454 -12808882 -15986045 -11022633
39298 -11022633 -3565464 1919983 5094212 6664465 6249361 4285330 2889877 2764391
39290 2764391 1614774 -1871028 -4592058 -2866806 1687687 3933571 2345460 150573
39282 150573 -1119153 -4422387 -11003339 -15436025 -11602617 -2097815 3571857 1235037
39274 1235037 -2052430 2473464 13124703 20087536 18684113 14163176 11867179 9076342
39266 9076342 1167613 -9020264 -14314391 -12831155 -8020703 -1481169 6719425 12075214
39258 12075214 9115428 1555017 -112393 6682035 13104402 12880524 10157156 9255669
39250 9255669 6908376 1354276 -674736 5012967 10502109 7643481 2495474 6240037
$$ packed form
39306F948385l027157K194234M217901k093002j0231815j0817428l177163M963412
39298a1022633P457169N485447L174229J570253m15104j964031j395453j25486
39290B764391j149617l485802k721030J725252M554493K245884j588111k194887
39282A50573j269726l303234o580952m432686L833408R504802N669672k336820
39274A235037l287467M525894J0651239O962833j403423m520937k295997k790837
39266I076342p908729j0187877n294127J483236M810452O539534Q200594N355789
39258A2075214k959786p560411j667410O794428O422367k23878k723368r01487
39250I255669k347293n554100k029012N687703N489142k858628n148007L744563
$$ plain form
39242 6240037 16852232 22230774 18479319 12817477 9919570 7239551 3410731 -22054
39234 -22054 -5108340 -14439587 -21657152 -17470852 -6524220 -4879351 -16792357 -27114547
39226 -27114547 -23344122 -13275038 -11510203 -17953363 -20951929 -16043992 -10010316 -8053916
39218 -8053916 -6989549 -2702927 2605536 3798061 1997 -4524396 -6099294 -6192572
39210 -6192572 -8765208 -13653424 -15942744 -13384031 -10136747 -9473455 -7476788 -287508
39202 -287508 6428986 4185112 -3930920 -5621212 3019255 12027815 12493716 8099439
39194 8099439 7520992 12681582 19360288 23565289 22777581 15996023 6858175 2324326
39186 2324326 4414285 7074554 4290177 -2550680 -7818383 -7980105 -2636214 6208952
$$ packed form
39242F240037J0612195N378542l751455n661842k897907k680019l828820l432785
39234b2054n086286r331247p217565M186300J0946632J644869j1913006j0322190
39226b7114547L770425J0069084J764835o443160k998566M907937O033676J956400
39218h053916J064367M286622N308463J192525l796064m526393j574898r3278
39210f192572k572636m888216k289320K558713L247284O63292J996667P189280
39202b87508O716494k243874q116032j690292Q640467R008560M65901m394277
39194H099439n78447N160590O678706M205001p87708o781558r137848m533849
39186B324326K089959K660269k784377o840857n267703j61722N343891Q845166
$$ plain form
39178 6208952 13636345 15014858 11657591 8790207 6851105 932585 -9096833 -14770615
39170 -14770615 -9334353 3241643 13312799 15562054 11409615 5928005 4769771 9809996
39162 9809996 15876038 15936181 10219509 5179614 3780388 3704280 4888512 9951777 16217085
39153 16217085 17250898 14414749 16130951 22527265 22926715 14092981 8518493 16237138
39145 16237138 29602906 36289750 37515382 41418094 46203008 43261460 32674179 23351199
39137 23351199 19975894 19928699 21021026 23013896 23413099 20158363 16339354 14702703
39129 14702703 11015156 1444840 -7373817 -5934793 3149651 8785735 8708650 11386869
39121 11386869 19729660 24701203 19380309 10056832 7454262 12938558 18965184 19469719
$$ packed form
39178F208952P427393J378513l357267k867384j939102n918520j0029418n673782
39170a4770615N436262J2575996J0071156K249255m152439n481610j158234N040225
39162I809996O066042O0143n716672n039895j399226p6108J184232N063265O265308
39153A6217085J033813k836149J716202O396314L99450q833734n574488P718645
39145A6237138J3365768O686844J225632L902712M784914k941548j0587281r322980
39137B3351199l375305m7195J092327J992870L99203l254736l819009j636651
39129A4702703l687547r570316q818657J439024R084444N636084p7085K678219
39121A1386869Q342791M971543n320894r323477k602570N484296O026626N04535
$$ plain form
39113 19469719 15053564 9797479 6725549 6232234 6922121 7338428 7234072 7845460 11334379
39104 11334379 18559023 25799903 25887392 16085659 2917939 -5238454 -7605046 -7065399
39096 -7065399 -1276406 11574069 21141793 14256492 -2723841 -7671007 5703931 17206101
39088 17206101 10497360 -2879214 -3416805 7543285 15883107 19076991 23042067 24099206
39080 24099206 15242251 4482462 5501898 13328915 10961856 -958706 -3700926 8204181
39072 8204181 17785213 13894891 7479483 9979452 14203628 9521275 1321106 1123755
39064 1123755 7895391 12974905 16005092 22629355 30798723 31573838 22534542 11395406
39056 11395406 5937139 6286987 7727278 7582396 8442416 14593001 24302489 28365957
$$ packed form
39113A9469719m416155n256085l071930m93315O89887M16307j04356O11388L488919
39104A1334379P224644P240880Q7489r801733j3167720q156393k366592N39647
39096g065399N788993J2850475R567724o885301j6980333m947166J3374938J1502170
39088A7206101o708741j3376574n37591J0960090Q339822L193884L965076J057139
39080B4099206q856955j0759789J019436P827017k367059j1920562k742220J1905107
39072H204181R581032l890322o415408K499969M224176m682353q200169j97351
39064A123755O771636N079514L030187O624263Q169368P75115r039296j1139136
39056A1395406n458267L49848J440291j44882Q60020O150585R709488M063468
$$ plain form
39048 28365957 21085052 10192288 8268567 15373116 19429595 14400068 7574473 5829781
39040 5829781 5225513 50136 -6459078 -7628846 -3666262 3598 439886 -1871699
39032 -1871699 -5883659 -9485436 -9672417 -6656787 -4464068 -5164818 -6494258 -6864457 -7814491
39023 -7814491 -9559529 -9306230 -6194918 -3145806 -2284599 -3393204 -7116574 -13258039
39015 -13258039 -15912996 -8893689 2573365 5193643 -4060560 -12559299 -9801648 -1312895
39007 -1312895 1844963 -647439 -794538 4441865 10180434 10887191 4912660 -5360595
38999 -5360595 -13683264 -13762644 -6682488 -771492 -961482 -2797721 -274396 5393663 8754752
38990 8754752 7543997 3548828 -156236 -365954 3733220 7714463 6605395 3109717
$$ packed form
39048B8365957p280905j0892764j923721P104549M056479n029527o825595j744692
39040E829781o04268n175377o509214j169768L962584L669860M36288k311585
39032a871699m011960l601777j86981L015630K192719p00750j329440l70199r50034
39023g814491j745038K53299L111312L049112Q61207j108605l723370o141465
39015a3258039k654957P019307J1467054K620278r254203q498739K757651Q488753
39007a312895L157858k492402j47099N236403N738569P06757n974531j0273255
38999e360595q322669p9380P080156N910996j89990j836239K523325N668059L361089
38990H754752j210755l995169l705064k09718M099174L981243j109068l495678
$$ plain form
38982 3109717 4487377 10448970 12509167 7280827 1238632 -550638 -484516 600399
38974 600399 7581268 20169647 28098501 24456460 14936754 7147769 606128 -4978967
38966 -4978967 -2503007 10643762 22679052 21641692 12687213 9370574 13640848 16685837
38958 16685837 14947038 12929560 12982339 13302653 13668366 13643284 8831109 -1248881 -6484593
38949 -6484593 853595 10933734 8031474 -4994801 -8865132 4753556 22181455 27192102
38941 27192102 19303690 8323927 1315771 449606 5340338 11573485 12525852 7149298
38933 7149298 1811466 1797606 5227684 7394722 7094188 6804854 9348220 14720188 18160534
38924 18160534 13480926 1605634 -7623761 -6968694 -1214333 889431 -445467 970813
$$ packed form
38982C109717J377660N961593K060197n228340o042195j789270O6122J084915
38974F00399O980869J2588379P928854l642041r519706p788985o541641n585095
38966d978967K475960J3146769J2035290j037360q954479l316639M270274L044989
38958A6685837j738799k017478N2779L20314L65713k5082m812175j0079990n235712
38949f484593P338188J0080139k902260j3026275l870331J3618688J7427899N010647
38941B7192102p888412j0979763p008156q66165M890732O233147R52367n376554
38933G149298n337832j3860L430078K167038l00534k89334K543366N371968L440346
38924A8160534m679608j1875292r229395O55067N754361K103764j334898J416280
$$ plain form
38916 970813 5668223 9471685 12791798 18077420 20161403 11419766 -3381259 -9721307
38908 -9721307 -2889480 6291963 8023630 5006726 3885043 5646516 9075027 14376711
38900 14376711 18557805 15705460 6453660 -840543 -2072248 -1680355 -1562411 3215167
38892 3215167 11936835 13356744 2347780 -8921040 -7578213 718368 1918695 -3539138
38884 -3539138 -2633403 8253589 17935299 17903176 12331183 7724849 4014253 615308
38876 615308 1423966 7285314 11038578 7152822 671212 -553601 2317975 3367202
38868 3367202 4447882 12840452 25933189 29154194 14650575 -5660889 -13405272 -5802547
38860 -5802547 3656344 4413901 -106529 -1454711 2101048 6327465 7590836 4682400
$$ packed form
38916I70813M697410L803462L320113N285622K083983q741637j4801025o340048
38908i721307O831827R181443J731667l016904j121683J761473L428511N301684
38900A4376711M181094k852345r251800p294203j231705L91893J17944M777578
38892C215167Q721668J419909j1008964j1268820J342827Q296581J200327n457833
38884c539138R05735J0886992R681710l2123n571993m606334l710596l398945
38876F15308Q08658N861348L753264l885756o481610j224813K871576J049227
38868C367202J080680Q392570J3092737L221005j4503619k0311464p744383P602725
38860e802547R458891P57557m520430j348182L555759M226417J263371k908436
$$ plain form
38852 4682400 -1399677 -5841954 -2505743 8020137 16780217 16790755 10883422 5015745
38844 5015745 -1117803 -10290025 -18583233 -18372132 -9510879 -431065 2037131 -1773168
38836 -1773168 -8368333 -14283128 -15193069 -8664992 375523 2552558 -4934967 -14111571
38828 -14111571 -15273839 -7351948 2347252 6439222 4316522 1933372 4609256 9539269
38820 9539269 8103214 -2533995 -14199363 -17895664 -14801921 -11422664 -8180046 -1230489
38812 -1230489 6768391 7641558 345399 -5940693 -3712779 4612990 12187488 14848497
38804 14848497 10897085 764700 -10070639 -13998456 -10534169 -7437547 -9584103 -12187600
38796 -12187600 -8798835 -936893 4966107 6637538 7350196 10346330 15514380 20176830
$$ packed form
38852D682400o082077m442277L336211J0525880Q760080J0538n907333n867677
38844E015745o133548r172222q293208K11101Q861253R079814K468196l810299
38836a773168o595165n914795r09941O528077R040515K177035p487525r176604
38828a4111571j162268P921891R699200M091970k122700k383150K675884M930013
38820I539269j436055j0637209j1665368l696301L093743L379257L242618O949557
38812a230489P998880Q73167p296159o286092K227914Q325769P574498K661009
38804A4848497l951412j0132385j0835339l927817L464287L096622k146556k603497
38796a2187600L388765P861942N903000J671431P12658K996134N168050M662450
$$ plain form
38788 20176830 20536065 13821821 1591871 -9709995 -13460836 -8852787 -2313939 -2230055
38780 -2230055 -10144219 -17288745 -13933311 -3323934 68700 -9604899 -18808050 -12105502
38772 -12105502 5148315 13164140 4658436 -7240043 -9654148 -6346117 -7957016 -15093398
38764 -15093398 -18864938 -13877214 -4450943 1061359 -458681 -2935077 2499218 15145789
38756 15145789 22426932 15010447 269192 -7030206 -4095987 -365442 -552396 784893
38748 784893 7086285 13587747 15686823 13781608 8083648 -1440830 -8830013 -7114260
38740 -7114260 -1174122 -3202158 -12919966 -16146345 -7107145 2775138 4725270 5924952
38732 5924952 13778592 21309853 20132913 15758026 16736238 18486696 11654116 -1035101
$$ packed form
38788B0176830L59235o714244j2229950j1301866l750841M608049O538848Q3884
38780b230055p914164p144526L355434J0609377L392634r673599r203151O702548
38772a2105502J7253817Q015825q505704j1898479k414105L308031j610899p136382
38764a5093398l771540M987724R426271N512302j520040k476396N434295J2646571
38756A5145789P281143p416485j4741255p299398K934219L730545j86954J337289
38748G84893O301392O501462K099076j905215n697960r524478p389183J715753
38740g114260N940138k028036r717808l226379R039200R882283J950132J199682
38732E924952P853640P531261j176940m374887R78212J750458o832580j2689217
$$ plain form
38724 -1035101 -9241776 -10090985 -7160137 -940386 7933660 12248178 7152174 139046
38716 139046 674770 5584364 6122319 2906782 1076840 -2550516 -12572935 -20762291
38708 -20762291 -15267039 -1140051 4780266 -1555876 -8002324 -7634484 -7313859 -11950237
38700 -11950237 -15027255 -10191657 -1204920 4386924 3234533 -4129574 -13307687 -15653595
38692 -15653595 -7244259 2525142 1903314 -5090798 -4315613 5446436 10354010 4490858
38684 4490858 -905792 3503098 11376853 13262638 10534242 8786412 7801033 5830749
38676 5830749 4727946 4086923 -517439 -7194945 -5731717 6881451 18905428 19761921
38668 19761921 13591372 8452255 2874862 -5616940 -8779565 873907 13506282 12792205
$$ packed form
38724a035101q206675q49209K930848O219751Q874046M314518n096004p013128
38716A39046N35724M909594N37955l215537j829942l627356j0022419q189356
38708b0762291N495252J4126988N920317o336142o446448L67840L20625m636378
38700a1950237l077018M835598Q986737N591844j152391p364107r178113k345908
38692a5653595Q409336R769401o21828o994112P75185R762049M907574n863152
38684D490858n396650M408890P873755J885785k728396j747830r85379j970284
38676E830749j102803o41023m604362o677506J463228J2613168J2023977Q56493
38668A9761921o170549n139117n577393q491802l162625R653472J2632375p14077
$$ plain form
38660 12792205 629371 -4580975 4717423 14083876 8266965 -7575675 -15589949 -8127349
38652 -8127349 4693386 8893900 2702163 -3073471 1072838 12025386 18607370 15501528
38644 15501528 7974457 2724684 263163 -827792 1789651 10038128 19244623 22090641
38636 22090641 17462534 11150495 8761832 10957070 14229350 13921504 8319916 1604175
38628 1604175 48735 3750010 5993909 2720943 -2349840 -4667785 -4928652 -4318283
38620 -4318283 -565310 5174591 4393778 -6890806 -17526946 -13597525 702292 6188700
38612 6188700 -6161655 -23689412 -29065401 -19999132 -7267724 -460546 -1727087 -8416349
38604 -8416349 -15147367 -15797745 -9172573 -1693864 -348164 -4218076 -6909236 -5841909
$$ packed form
38660A2792205j2162834n210346R298398R366453n816911j5842640q014274P462600
38652h127349J2820735M200514o191737n775634M146309J0952548O581984l105842
38644A5501528p527071n249773k461521j090955K617443Q248477R206495K846018
38636B2090641m628107o312039k388663K195238L272280l07846n601588o715741
38628A604175j555440L701275K243899l272966n070783k317945k60867O10369
38620d318283L752973N739901p80813j1284584j0636140L929421J4299817N486408
38612F188700j2350355j7527757n375989R066269J2731408O807178j266541o689262
38604h416349o731018o50378O625172P478709J345700l869912k691160J067327
$$ plain form
38596 -5841909 -4157645 -3848607 -2854452 -785771 -1986630 -8679195 -14961543 -13395985
38588 -13395985 -5726206 -570911 -572109 751265 6883633 10680537 4738291 -6227756
38580 -6227756 -11174944 -7684776 -2709300 95609 4401267 11356418 14610938 9115569
38572 9115569 -1367386 -9344310 -11256393 -7327038 688684 8285373 10152613 7008179
38564 7008179 5407840 7529155 7423301 1677345 -3422324 -1851731 1747898 67886
38556 67886 -3935657 -2196426 3943885 5545044 1191207 -1056800 2279547 5468673
38548 5468673 6204142 11717253 25799213 38647681 38308183 26646079 15362483 9977265
38540 9977265 6810770 3851202 4548869 9162665 11046359 5945134 -994873 -2441514
$$ packed form
38596e841909J684264L09038R94155K068681j200859o692565o282348J565558
38588a3395985P669779N155295j198J323374O132368L796904n942246j0966047
38580f227756m947188L490168M975476K804909M305658O955151L254520n495369
38572I115569j0482955p976924j912083L929355Q015722P596689J867240l144434
38564G008179j600339K121315j05854n745956n099669J570593L599629j680012
38556F7886m003543J739231O140311J601159m353837k248007L336347L189126
38548E468673P35469N513111J4081960J2848468l39498j1662104j1283596n385218
38540I977265l166495k959568O97667M613796J883694n101225o940007j446641
$$ plain form
38532 -2441514 1300200 4882496 6553960 7657648 5983564 -1919084 -11067645 -9388838
38524 -9388838 6748951 24605595 28601191 17812706 4248120 -2842327 -4143593 -3892592
38516 -3892592 -3782481 -3405489 -935289 6512819 17733366 23918558 17640614 4842457
38508 4842457 -1029072 2086287 2003149 -8198551 -18624216 -17652567 -9330180 -5731445
38500 -5731445 -8224302 -7658338 -420218 6622058 7359859 3605938 -383744 -3168530
38492 -3168530 -3972893 -1410270 3266741 6194508 6068350 5685982 7258370 9678117 11277928
38483 11277928 11998907 12077597 11269463 9337494 4862940 -4851870 -18734370 -28522371
38475 -28522371 -26102231 -14111374 -3668931 -1278911 -3724197 -6204869 -8181025 -8894248
$$ packed form
38532b441514L741714L582296J671464J103688j674084p902648r148561J678807
38524i388838J6137789J7856644L995596j0788485j3564586p090447j301266K51001
38516c892592J10111L76992K470200P448108J1220547O185192o277944j2798157
38508D842457n871529L115359q3138j0201700j0425665R71649Q322387L598735
38500e731445k492857N65964P238120P042276P37801l753921l989682k784786
38492c168530q04363K562623M677011K927767j26158l82368J572388K419747J599811
38483A1277928P20979P8690q08134j931969m474554r714810j3882500r788001
38475b8522371K420140J1990857J0442443K390020k445286k480672j976156p13223
$$ plain form
38467 -8894248 -4854867 3277577 7599234 3140951 -3479112 -2831832 3067776 3710293
38459 3710293 -3493686 -8717854 -4094497 5164039 8961331 5920800 2281981 727652
38451 727652 -1969166 -6757197 -9323912 -7209092 -3649126 -1395446 1532234 5896578
38443 5896578 6674078 285173 -8084797 -11351026 -11212235 -14027607 -18850561 -19267221 -16002480
38434 -16002480 -16536118 -20919743 -19885483 -11021040 -4813802 -7677819 -10194805 -2112887
38426 -2112887 10349127 14347915 10579122 9703739 12597359 9235199 -2560115 -11449813
38418 -11449813 -9413049 -2785736 -1078404 -3674809 -3884183 92359 4495314 6733346
38410 6733346 7976537 10561191 14825353 17126943 11893616 -679037 -10602167 -7946039
$$ packed form
38467h894248M039381Q132444M321657m458283o620063O47280N899608O42517
38459C710293p203979n224168M623357R258536L797292l040531l638819j554329
38451G27652k696818m788031k566715K114820L559966K253680K927680M364344
38443E896578P77500o388905q369970l266229J38791k815372m822954m16660L264741
38434a6002480n33638m383625J034260Q864443O207238k864017k516986Q081918
38426b112887J2462014L998788l768793q75383K893620l362160j1795314q889698
38418a1449813K036764O627313J707332k596405k09374L976542M402955K238032
38410F733346J243191K584654M264162K301590n233327j2572653r923130K656128
$$ plain form
38402 -7946039 3624138 10264322 5747625 -1644891 -1986502 4217723 10260482 12677486
38394 12677486 12142529 10316493 9499871 10656697 9710494 2305269 -5739732 -1927465
38386 -1927465 14259369 26199446 21757997 11207580 12583741 25720239 33943276 28460098
38378 28460098 17468513 10664343 7263648 2599002 -3575035 -9496298 -14164640 -14529063
38370 -14529063 -7757500 866154 1230447 -6521693 -9937795 -2989210 3653623 -50577
38362 -50577 -6069493 -1231058 9922056 11853149 4641221 5235157 19277165 29913549
38354 29913549 23360365 10307936 9050380 18498854 23060322 17383856 10274682 6885778
38346 6885778 2587219 -4692285 -9623564 -9511660 -7677620 -4479127 3610471 13194572
$$ packed form
38402g946039J1570177O640184m516697p392516l41611O204225O042759K417004
38394A2677486n34957j826036q16622J156826r46203p405225q045001L812267
38386a927465J6186834J1940077m441449j0550417J376161J3136498Q223037n483178
38378B8460098j0991585o804170l400695m664646o174037n921263m668342l64423
38370a4529063O771563Q623654L64293p752140l416102O948585O642833l704200
38362e0577o018916M838435J1153114J931093p211928N93936J4042008J0636384
38354B9913549o553184j3052429j257556R448474M561468n676466p109174l388904
38346F885778m298559p279504m931279J11904J834040L198493Q089598R584101
$$ plain form
38338 13194572 14343402 6099242 -393316 431099 395817 -5676345 -8427981 -102755
38330 -102755 9444721 6647181 -4356495 -8671614 -2886704 4097047 7669692 9912707
38322 9912707 8688686 161650 -8720562 -5853209 6830084 14361476 10850162 6214359
38314 6214359 7916365 10613646 8878267 6302112 5483511 1756242 -5662998 -8255084
38306 -8255084 -2453480 1613181 -4797970 -14774200 -16790064 -11830670 -8728331 -9094090
38298 -9094090 -8019780 -4971283 -3208400 -1530872 3467838 8784248 7375949 -1595185
38290 -1595185 -11467601 -15951080 -13571293 -7029348 -2599741 -6037442 -14249633 -16288242
38282 -16288242 -8188730 -321549 -2573283 -9040249 -7337202 2377757 9193302 8832494
$$ packed form
38338A3194572J148830q244160o492558Q24415l5282o072162k751636Q325226
38330a02755R547476k797540j1003676m315119N784910O983751L572645K243015
38322I912707j224021q527036q882212K867353J2683293P531392l511314m635803
38314F214359J702006K697281j735379k576155q18601l727269p419240k592086
38306h255084N801604M066661o411151r976230k015864M959394L102339l65759
38298i094090J074310L048497J762883J677528M998710N316410j408299q971134
38290a595185r872416m483479K379787O541945M429607l437701q212191k038609
38282a6288242Q099512P867181k251734o466966J703047R714959O815545l60808
$$ plain form
38274 8832494 7259689 8193880 8547618 6734849 5162739 3429019 -1298501 -5834786
38266 -5834786 -2638191 7597174 13982039 9645129 424757 -4404113 -3710729 -2784567
38258 -2784567 -4813662 -7838638 -7661806 -2284184 4727879 6712274 2886380 1410275
38250 1410275 7903745 15182601 13118031 5238065 3975547 10550462 12840157 5222661
38242 5222661 -2943731 -3531462 -1855142 -5695518 -13093104 -19215348 -25400575 -32040622
38234 -32040622 -31674434 -20357039 -8586285 -8637744 -16287048 -17854172 -11675679 -8653282
38226 -8653282 -12458417 -13588106 -5939728 3270482 5529664 3160201 3078608 5770391
38218 5770391 7016811 5509737 3024703 804596 296927 3766987 10153804 14278264
$$ packed form
38274H832494j572805R34191L53738j812769j572110j733720m727520m536285
38266e834786L196595J0235365O384865m336910r220372m828870O93384R26162
38258b784567k029095l024976J76832N377622P012063J984395l825894j476105
38250A410275O493470P278856k064570p879966j262518O574915K289695p617496
38242E222661q166392n87731J676320l840376p397586o122244o185227o640047
38234c2040622L66188J1317395J1770754n1459p649304j567124O178493L022397
38226h653282l805135j129689P648378R210210K259182k369463q1593K691783
38218E770391J246420j507074k485034k220107n07669L470060O386817M124460
$$ plain form
38210 14278264 14120551 14360795 18125848 20389217 15891811 8880138 6734906 7213405
38202 7213405 1781972 -9435834 -16442916 -14385443 -9669087 -8046890 -6699941 -3284408
38194 -3284408 -2957939 -8568585 -12274611 -6794455 1522297 2053785 -2492757 -522817
38186 -522817 8846292 14371204 11508441 9090624 13668807 19514094 19799186 17100927
38178 17100927 16169968 15403247 12375960 9568153 7867970 2929308 -4730060 -5440476
38170 -5440476 4399007 11990233 5083705 -8131322 -9988106 792815 9136292 7197038
38162 7197038 2789185 3836531 8605520 13763925 19259739 21886154 16010012 4705512
38154 4705512 -1051977 1668016 4003909 1745871 2531352 9744548 12552025 2708499
$$ packed form
38210A4278264j57713K40244L765053K263369m497406p011673k145232M78499
38202G213405n431433j1217806p007082K057473M716356J622197J346949L415533
38194c284408L26469n610646l706026N480156Q316752N31488m546542J969940
38186e22817R369109N524912k862763k417817M578183N845287K85092k698259
38178A7100927r30959p66721l027287k807807j700183m938662p659368p10416
38170e440476R839483P591226o906528j3215027j856784J0780921Q343477j939254
38162G197038m407853J047346M768989N158405N495814K626415n876142j1304500
38154D705512n757489K719993K335893k258038P85481P213196K807477r843526
$$ plain form
38146 2708499 -9803900 -11071973 -4815852 -4810562 -10997147 -9510258 4044359 17003322
38138 17003322 18989315 15583196 16083728 18193310 14229483 6173485 4189196 11875519
38130 11875519 21794285 26768398 28365276 30702739 31353364 24447841 10904249 -753869
38122 -753869 -4946108 -5292784 -7711833 -11722339 -12838401 -10253238 -6677499 -2499625
38114 -2499625 3660806 9087427 8448352 2638078 -184462 4365488 9899932 7661432
38106 7661432 -1416478 -7758508 -4966340 3186156 7664881 3961023 -3457004 -6008351
38098 -6008351 -421604 7453174 9325017 3445375 -5346885 -12566705 -16995348 -17860405
38090 -17860405 -14422689 -8942611 -5419490 -4565933 -4243700 -4878575 -8877907 -13986652
$$ packed form
38146B708499j2512399j268073O256121N290o186585J486889J3554617J2958963
38138A7003322J985993l406119N00532K109582l963827q055998j984289P686323
38130A1875519R918766M974113J596878K337463O50625o905523j3543592j1658118
38122g53869m192239l46676k419049m010506j116062K585163L575739M177874
38114b499625O160431N426621o39075n810274k822540M549950N534444k238500
38106G661432r077910o342030K792168Q152496M478725l703858p418027k551347
38098f008351N586747P874778J871843n879642q792260p219820m428643q65057
38090a7860405L437716N480078L523121Q53557L22233o34875l999332n108745
$$ plain form
38082 -13986652 -13785252 -7153905 -1194869 -1648693 -5900558 -8712125 -9275410 -8800290 -6677226
38073 -6677226 -3495551 -2655891 -4252022 -2696328 4105161 8657514 3831945 -5542145
38065 -5542145 -8713519 -3305147 4390835 10598021 16299125 19360444 14582992 3817151
38057 3817151 -2645814 986366 7976082 8513817 2343591 -3069847 -3668610 -2666733
38049 -2666733 -4294145 -8112919 -10230624 -7694652 -1103399 5698639 8495127 6711720
38041 6711720 4550453 6545300 11961796 15836545 16220339 17084787 21252899 23756954
38033 23756954 18024635 7454513 3013250 7364691 9873111 2787722 -5560578 -2643004
38025 -2643004 8886336 14898565 10192253 3258868 950002 758387 525553 3358594
$$ packed form
38082a3986652K01400O631347N959036m53824m251865k811567n63285M75120K123064
38073f677226L181675Q39660j596131J555694O801489M552353m825569r374090
38065e542145l171374N408372P695982O207186N701104L061319m777452j0765841
38057C817151o462965L632180O989716N37735o170226n413438n98763J001877
38049b666733j627412l818774k117705K535972O591253O802038K796488j783407
38041F711720k161267J994847N416496L874749L83794Q64448M168112K504055
38033B3756954n732319j0570122m441263M351441K508420p085389q348300K917574
38025b643004J1529340O012229m706312o933385k308866j91615k32834K833041
$$ plain form
38017 3358594 7910180 5208822 -7416018 -18421790 -16201271 -3860478 7805761 14815506
38009 14815506 18637145 16877014 6271675 -7940886 -15267876 -11821396 -2460373 6576009
38001 6576009 10905384 7344742 -2347390 -9599711 -8422306 -4333204 -6286407 -12370111
37993 -12370111 -12744306 -5566795 173119 -990585 -3302974 -59557 6019281 7905044
37985 7905044 5002503 3303341 6525615 11346822 12018146 7476746 2079712 -371895
37977 -371895 -540477 228735 3740659 10002921 12006930 4038918 -6313668 -5555552 5280318
37968 5280318 10475740 3720165 -2240683 2253899 7445110 2894710 -1314351 9868292
37960 9868292 29061503 34934080 23672217 11876292 9082467 7325555 782455 -2864424
$$ packed form
38017C358594M551586k701358j2624840j1005772K220519J2340793J1666239P009745
38009A4815506L821639j760131j0605339j4212561p326990L446480R361023R036382
38001F576009M329375l560642r692132p252321J177405M089102j953203o083704
37993a2370111l74195P177511N739914j163704k312389L243417O078838J885763
37985G905044k902541j699162L222274M821207O71324m541400n397034k451607
37977c71895j68582P69212L511924O262262K004009p968012j0352586P58116J0835870
37968E280318N195422o755575n960848M494582N191211m550400m209061J1182643
37960I868292J9193211N872577j1261863j1795925k793825j756912o543100l646879
$$ plain form
37952 -2864424 2629851 10303484 10730077 4148368 -3545417 -7895157 -5757980 2360446
37944 2360446 7702718 1596822 -9806515 -11152689 -578842 6657705 1181542 -8010491
37936 -8010491 -10106980 -7665943 -7064098 -6269455 -1802886 2354933 2191484 1093015 1648624
37927 1648624 -601184 -6978448 -9286977 -2965327 3355238 1842472 -930409 3494692
37919 3494692 8517505 2433545 -11271640 -18617192 -16107484 -12465383 -11678788 -8714412
37911 -8714412 -2207962 1809829 940829 174137 1983850 1914255 -3106190 -9597779 -13171482
37902 -13171482 -13235819 -10610550 -6125326 -2520586 -2409673 -3812091 -2512313 1530760
37894 1530760 5071486 7640673 10925830 13284541 11359497 6614748 3934472 4333225
$$ packed form
37952b864424N494275P673633M26593o581709p693785m349740K137177Q118426
37944B360446N342272o105896j1403337j346174J0573847P236547n476163r192033
37936h010491k096489K441037O01845P94643M466569M157819j63449j098469N55609
37927A648624k249808o377264k308529O321650O320565j512766k772881M425101
37919C494692N022813o083960j3705185p345552K509708L642101P86595K964376
37911h714412O506450M017791q69000p66692J809713o9595n020445o491589l573703
37902a3171482o4337K625269M485224L604740J10913j402418J299778M043073
37894A530760L540726K569187L285157K358711j925044m744749k680276L98753
$$ plain form
37886 4333225 5612595 9201229 18082667 27524218 27105819 15152455 3136882 907954
37878 907954 4043692 1963618 -6158987 -11074877 -7392816 -383349 2974661 3906671
37870 3906671 8008544 14450586 15831756 9964873 4950350 7504172 11724830 7663687
37862 7663687 -2072707 -4884530 2458131 8448303 4358996 -3870982 -7306424 -7206132
37854 -7206132 -8028207 -6454324 1457770 8734332 5449971 -5426097 -12074933 -11646047
37846 -11646047 -12072475 -16378048 -17218946 -9682968 530445 5816298 6022887 5105101
37838 5105101 4297238 2511952 -433531 -3792946 -6347602 -5810747 -629870 7343169
37830 7343169 14659626 19927896 22746330 21062962 13974076 5600634 1643338 3177423
$$ packed form
37886D333225J279370L588634Q881438R441551m18399j1953364j2015573k228928
37878I07954L135738k080074q122605m915890L682061P009467L358010R32010
37870C906671M101873O442042J381170n866883n014523K553822M220658m061143
37862G663687r736394k811823P342661N990172m089307q229978l435442J00292
37854g206132q22075J573883P912094P276562l284361j0876068o648836M28886
37846a1646047m26428m305573q40898P535978J0213413N285853K06589r17786
37838E105101q07863j785286k945483l359415k554656N36855N180877P973039
37830G343169P316457N268270K818434j683368p088886q373442l957296J534085
$$ plain form
37822 3177423 7232417 10735793 10029853 1079203 -13734647 -23585832 -21727122 -15951203
37814 -15951203 -17422236 -22816749 -19093622 -4614983 7078468 6268496 -1648348 -7328312
37806 -7328312 -9723147 -12173776 -14429408 -14223700 -11545076 -7357054 -2125829 2549714
37798 2549714 5289184 8261291 13729158 17943351 15622014 9901068 9047055 12912512
37790 12912512 12415585 4116867 -4776550 -8684622 -10849945 -14616165 -17438678 -18098284
37782 -18098284 -20334376 -24259256 -23423602 -15713892 -7787626 -3147501 3817327 14784400
37774 14784400 19321620 9772581 -4378015 -8221423 -1277529 5156152 5552086 4263839
37766 4263839 5227801 7364677 8765184 8258833 5052564 2137973 5304973 13067426
$$ packed form
37822C177423M054994L503376p05940q950650j4813850r851185J858710N775919
37814a5951203j471033n394513L723127J4478639J1693451q09972p916844n679964
37806g328312k394835k450629k255632K05708K678624M188022N231225M675543
37798B549714K739470K972107N467867M214193k321337n720946q54013L865457
37790A2912512m96927q298718q893417l908072k165323l766220k822513o59606
37782a8098284k236092l924880Q35654P709710P926266M640125O964828J0967073
37774A4784400M537220r549039j4150596l843408O943894O433681L95934j288247
37766D263839R63962K136876J400507n06351l206269k914591L167000P762453
$$ plain form
37758 13067426 14694972 6203416 57763 7693442 19787825 18363711 3748162 -6811748
37750 -6811748 -5824124 -3680586 -7964857 -11429910 -7078043 -1130547 -1670691 -4636470
37742 -4636470 -1230414 7466465 12861427 11881840 9392609 9498539 10922246 10380421 6056710
37733 6056710 -1784159 -10518288 -16117953 -16592011 -13992278 -12060859 -12748552 -14896518
37725 -14896518 -14772654 -8971894 607242 6435098 4073864 -676004 897945 7431004
37717 7431004 9479761 4469114 387629 2029903 3263423 -1412085 -6306839 -3784292
37709 -3784292 2376782 2672708 -2799567 -5096736 -1540131 152065 -5230537 -12247640
37701 -12247640 -13743921 -10973027 -9072808 -7309492 -1101902 7804097 10648236 3490018
$$ packed form
37758A3067426J627546q491556o145653P635679J2094383j424114j4615549j0559910
37750f811748R87624K143538m284271l465053M351867N947496n40144k965779
37742d636470L406056Q696879N394962r79587k489231J05930J423707n41825m323711
37733F056710p840869q734129n599665m74058K599733J931419o87693k147966
37725a4896518J23864N800760R579136N827856k361234m749868J573949O533059
37717G431004K048757n010647m081485J642274J233520m675508m894754K522547
37709c784292O161074K95926n472275k297169L556605J692196n382602p017103
37701a2247640j496281K770894J900219J763316O207590Q905999K844139p158218
$$ plain form
37693 3490018 -5458746 -5018787 4480278 11133706 6604954 -3559009 -8097595 -4873514
37685 -4873514 -1732853 -3320011 -3830782 3924004 16971105 24840478 22090680 13460983
37677 13460983 6485167 3143925 671794 -2094559 -2412415 2065260 8654989 11265667
37669 11265667 7087978 279947 -2556270 10756 3082628 1958446 -2242683 -4342033
37661 -4342033 -1132687 4985145 7534594 1680991 -9648883 -16189477 -10222031 4011040
37653 4011040 14700933 16390948 14054204 12188828 7685643 -1475996 -7939226 -4219782
37645 -4219782 4395495 6586922 2407166 2393944 9013261 11797598 5141508 -1486468
37637 -1486468 860303 5341861 933978 -8219855 -8710828 229087 4936817 -1818522
$$ packed form
37693C490018q948764M39959R499065O653428m528752j0163963m538586L224081
37685d873514L140661j587158n10771P754786J3047101P869373k749798q629697
37677A3460983o975816l341242k472131k766353l17856M477675O589729K610678
37669A1265667m177689o808031k836217K567026L071872j124182m201129k099350
37661d342033L209346O117832K549449n853603j1329874o540594N967446J4233071
37653D011040J0689893J690015k336744j865376m503185r161639o463230L719444
37645d219782Q615277K191427m179756j3222O619317K784337o656090o627976
37637a486468K346771M481558m407883r153833m90973Q939915M707730o755339
$$ plain form
37629 -1818522 -11408838 -14667996 -14707679 -17375301 -18531118 -10906517 1586162 7027277
37621 7027277 2156198 -3038498 433117 8155210 8491492 -1534504 -11118652 -7799957
37613 -7799957 7243246 19185860 16071384 2411523 -7243512 -6217668 -1484930 -1611738
37605 -1611738 -5906202 -8705283 -8604153 -8255761 -8553148 -8194504 -7041515 -5666249 -3321326
37596 -3321326 -187369 241830 -4905501 -12821719 -17417877 -15618234 -8644626 558257
37588 558257 7818025 8457863 1972063 -5852737 -9212115 -8233772 -5244895 443886 8401333
37579 8401333 12501382 8693498 3838852 6973499 14033030 12976412 3832161 -44006
37571 -44006 6103906 9843546 2665613 -4015382 3096896 15254329 12740127 -4317588
$$ packed form
37629a818522r590316l259158l9683k667622j155817P624601J2492679N441115
37621G027277m871079n194696L471615P722093L36282j0025996r584148L318695
37613g799957J5043203J1942614l114476j3659861r655035J025844M732738j26808
37605a611738m294464k799081J01130L48392k97387L58644J152989J375266K344923
37596c321326L133957M29199n147331p916218m596158J799643O973608R202883
37588E58257P259768O39838o485800p824800l359378R78343K988877N688781P957447
37579H401333M100049l807884m854646L134647P059531j056618r144251l876167
37571d4006O147912L739640p177933o680995P112278J2157433k514202j7057715
$$ plain form
37563 -4317588 -14372920 -5835933 6730385 5383355 -5813598 -10178537 -4313437 206711
37555 206711 -1887845 -1836933 6504829 15246928 15019988 9417870 7392531 8047895 4436507
37546 4436507 -1432479 -539804 6399595 7758533 150059 -4189454 3838935 15364539
37538 15364539 17014702 9888954 3809639 338581 -5137102 -9748188 -6663679 -228382
37530 -228382 -2284324 -12546019 -17500059 -11877650 -6503782 -9153042 -11823018 -5966874
37522 -5966874 1827269 971176 -5304092 -6164735 -1758577 -2584449 -12200034 -22179982 -24935246
37513 -24935246 -21918704 -17142188 -10792250 -2972491 2070267 146308 -6878393 -12483575
$$ packed form
37563d317588j0055332Q536987J2566318j347030j1196953m364939N865100M520148
37555B06711k094556N0912Q341762Q742099k26940n602118k025339O55364l611388
37546D436507n868986Q92675O939399J358938p608474m339513Q028389J1525604
37538A5364539J650163p125748o079315l471058n475683m611086L084509O435297
37530b28382k055942j0261695m954040N622409N373868k649260k669976N856144
37522e966874P794143q56093o275268q60643M406158q25872r615585r979948k755264
37513b4935246L016542M776516O349938P819759N042758j923959p024701n605182
$$ [...]
##END NTUPLES=NMR SPECTRUM
##END=
