##TITLE=1H_SR167R
 CDCl3
 8 sc, 
 13.4.2023
##JCAMPDX= 6.0         $$ Bruker NMR JCAMP-DX V2.0
##DATA TYPE= NMR FID
##DATA CLASS= NTUPLES
##ORIGIN= UXNMR, Bruker Analytische Messtechnik GmbH
##OWNER= root
$$ XWIN-NMR		Version 3.5
$$ Thu Apr 13 16:21:02 2023 Russian Standard Time (UT+4h)  she@DPX200
##.OBSERVE FREQUENCY= 200.13135
##.OBSERVE NUCLEUS= ^1H
##.DELAY= (6, 6)
##.ACQUISITION MODE= SIMULTANEOUS
##.ACQUISITION SCHEME= undefined
##.AVERAGES= 12
##.DIGITISER RES= 18
##SPECTROMETER/DATA SYSTEM= spect
##.PULSE SEQUENCE= zg30
##.SOLVENT NAME= D2O
##.SHIFT REFERENCE= (INTERNAL, D2O, 0, 15.7039)
##AUDIT TRAIL= $$ (NUMBER, WHEN, WHO, WHERE, WHAT)
$$ ##TITLE= Audit trail, XWIN-NMR		Version 3.5
$$ ##JCAMPDX= 5.01
$$ ##ORIGIN= Bruker BioSpin GmbH
$$ ##OWNER= she
$$ F:/spectra/data/she/nmr/H-F/1/audita.txt
$$ ##AUDIT TRAIL=  $$ (NUMBER, WHEN, WHO, WHERE, WHAT)
(   1,<2023-04-13 16:20:11.04 +0400>,<she>,<DPX200>,
      <created by zg, POWCHK disabled, PULCHK disabled
       terminated by command 'halt'
       configuration hash MD5:
       00 E9 B6 7A A2 85 ED C7 34 08 36 98 17 FE 4E 26
       data hash MD5: 16K
       4B DE B1 AD 3B 5A 5E 0E 4B 22 11 A2 B7 F3 B5 E8>)
$$ ##END=
$$ 
$$ hash MD5
$$ 2B FA FF AF 45 6B F9 63 E7 9A 7E CE 6F 85 D1 34
##$RELAX= 
##$RELAX= 
##$RELAX= 
##$RELAX= 
##$RELAX= 
##$RELAX= 
$$ Bruker specific parameters
$$ --------------------------
##$DU= <F:/spectra>
##$EXPNO= 1
##$NAME= <H-F>
##$PROCNO= 1
##$TYPE= <nmr>
##$USER= <she>
##$AMP= (0..31)
100 100 100 100 100 100 100 100 100 100 100 100 100 100 100 100 100 100 
100 100 100 100 100 100 100 100 100 100 100 100 100 100 
##$AQSEQ= 0
##$AQ_mod= 1
##$AUNM= <au_zg>
##$AUTOPOS= <>
##$BF1= 200.13
##$BF2= 200.13
##$BF3= 200.13
##$BF4= 200.13
##$BF5= 200.13
##$BF6= 200.13
##$BF7= 200.13
##$BF8= 200.13
##$BYTORDA= 1
##$CFDGTYP= 0
##$CFRGTYP= 5
##$CHEMSTR= <none>
##$CNST= (0..31)
1 1 145 1 1 1 1 1 1 1 1 1 1 1 1 1 1 1 1 1 1 1 1 1 1 1 1 1 1 1 1 1 
##$CPDPRG= <>
##$CPDPRG1= <>
##$CPDPRG2= <>
##$CPDPRG3= <>
##$CPDPRG4= <mlev>
##$CPDPRG5= <mlev>
##$CPDPRG6= <mlev>
##$CPDPRG7= <mlev>
##$CPDPRG8= <mlev>
##$CPDPRGB= <>
##$CPDPRGT= <>
##$D= (0..31)
0 1.2 0 0 0 0 0 0 0 0.06 0 0.03 0 0 0 0 0.0002 0 0 0 0 0 0 0 0 0 0 0 0 
0 0 0 
##$DATE= 1681388410
##$DBL= (0..7)
120 120 120 120 120 120 120 120 
##$DBP= (0..7)
150 150 150 150 150 150 150 150 
##$DBP07= 0
##$DBPNAM0= <>
##$DBPNAM1= <>
##$DBPNAM2= <>
##$DBPNAM3= <>
##$DBPNAM4= <>
##$DBPNAM5= <>
##$DBPNAM6= <>
##$DBPNAM7= <>
##$DBPOAL= (0..7)
0.5 0.5 0.5 0.5 0.5 0.5 0.5 0.5 
##$DBPOFFS= (0..7)
0 0 0 0 0 0 0 0 
##$DE= 6
##$DECBNUC= <off>
##$DECIM= 32
##$DECNUC= <off>
##$DECSTAT= 4
##$DIGMOD= 1
##$DIGTYP= 9
##$DL= (0..7)
0 120 120 120 120 120 120 120 
##$DP= (0..7)
150 150 150 150 150 150 150 150 
##$DP07= 0
##$DPNAME0= <>
##$DPNAME1= <>
##$DPNAME2= <>
##$DPNAME3= <>
##$DPNAME4= <>
##$DPNAME5= <>
##$DPNAME6= <>
##$DPNAME7= <>
##$DPOAL= (0..7)
0.5 0.5 0.5 0.5 0.5 0.5 0.5 0.5 
##$DPOFFS= (0..7)
0 0 0 0 0 0 0 0 
##$DQDMODE= 0
##$DR= 18
##$DS= 0
$$ [...]
##$SUBNAM2= <"">
##$SUBNAM3= <"">
##$SUBNAM4= <"">
##$SUBNAM5= <"">
##$SUBNAM6= <"">
##$SUBNAM7= <"">
##$SUBNAM8= <"">
##$SUBNAM9= <"">
##$SW= 18.05172834244
##$SWIBOX= (0..15)
0 0 2 0 0 0 0 0 0 0 0 0 0 0 0 0 
##$SW_h= 3612.71676300578
##$TD= 16384
##$TD0= 1
##$TE= 0
##$TE2= 300
##$TE3= 300
##$TEG= 300
##$TL= (0..7)
0 120 120 120 120 120 120 120 
##$TP= (0..7)
150 150 150 150 150 150 150 150 
##$TP07= 0
##$TPNAME0= <>
##$TPNAME1= <>
##$TPNAME2= <>
##$TPNAME3= <>
##$TPNAME4= <>
##$TPNAME5= <>
##$TPNAME6= <>
##$TPNAME7= <>
##$TPOAL= (0..7)
0.5 0.5 0.5 0.5 0.5 0.5 0.5 0.5 
##$TPOFFS= (0..7)
0 0 0 0 0 0 0 0 
##$TUNHIN= 0
##$TUNHOUT= 0
##$TUNXOUT= 0
##$USERA1= <user>
##$USERA2= <user>
##$USERA3= <user>
##$USERA4= <user>
##$USERA5= <user>
##$V9= 5
##$VALIST= <valist>
##$VCLIST= <CCCCCCCCCCCCCCC>
##$VD= 0
##$VDLIST= <DDDDDDDDDDDDDDD>
##$VPLIST= <PPPPPPPPPPPPPPP>
##$VTLIST= <TTTTTTTTTTTTTTT>
##$WBST= 1024
##$WBSW= 4
##$XGAIN= (0..3)
0 0 0 0 
##$XL= 0
##$YL= 0
##$YMAX_a= 184684
##$YMIN_a= -207700
##$ZGOPTNS= <>
##$ZL1= 120
##$ZL2= 120
##$ZL3= 120
##$ZL4= 120
##$ABSF1= 10
##$ABSF2= 0
##$ABSG= 5
##$ABSL= 3
##$ALPHA= 0
##$AQORDER= 0
##$ASSFAC= 0
##$ASSFACI= 0
##$ASSFACX= 0
##$ASSWID= 0
##$AUNMP= <proc_1d>
##$AZFE= 0.1
##$AZFW= 0.1
##$BCFW= 1
##$BC_mod= 2
##$BYTORDP= 1
##$COROFFS= 0
##$CY= 11.3945322036743
##$DATMOD= 1
##$DC= 2
##$DFILT= <>
##$DTYPP= 0
##$F1P= 15.7292609196834
##$F2P= 12.9074282941183
##$FCOR= 0.5
##$FTSIZE= 0
##$FT_mod= 4
##$GAMMA= 1
##$GB= 0.15
##$INTBC= 1
##$INTSCL= 1
##$ISEN= 128
##$LB= 0.24
##$LEV0= 0
##$LPBIN= 0
##$MAXI= 10000
##$MC2= 0
##$MEAN= 0
##$ME_mod= 0
##$MI= 1.114404
##$NCOEF= 0
##$NC_proc= 0
##$NLEV= 6
##$NOISF1= 3.799351
##$NOISF2= 2.8
##$NSP= 1
##$NTH_PI= 0
##$NZP= 0
##$OFFSET= 15.70392
##$PC= 1
##$PHC0= -19828.94
##$PHC1= 8.00081
##$PH_mod= 1
##$PKNL= yes
##$PPARMOD= 0
##$PSCAL= 0
##$PSIGN= 0
##$REVERSE= no
##$SF= 200.130013532006
##$SI= 16384
##$SIGF1= 3
##$SIGF2= 2
##$SINO= 400
##$SIOLD= 16384
##$SREGLST= <1H.CDCl3>
##$SSB= 0
##$STSI= 0
##$STSR= 0
##$SW_p= 3612.71676300578
##$SYMM= 0
##$S_DEV= 0
##$TDeff= 0
##$TDoff= 0
##$TI= <>
##$TILT= no
##$TM1= 0
##$TM2= 0
##$TOPLEV= 0
##$USERP1= <user>
##$USERP2= <user>
##$USERP3= <user>
##$USERP4= <user>
##$USERP5= <user>
##$WDW= 1
##$XDIM= 8192
##$YMAX_p= 0
##$YMIN_p= 0
$$ End of Bruker specific parameters
$$ ---------------------------------
##NTUPLES= NMR FID
##VAR_NAME=  TIME,          FID/REAL,        FID/IMAG
##SYMBOL=    X,             R,               I
##VAR_TYPE=  INDEPENDENT,   DEPENDENT,       DEPENDENT
##VAR_FORM=  AFFN,          ASDF,            ASDF
##VAR_DIM=   8192,          8192,            8192
##UNITS=     SECONDS,       ARBITRARY UNITS, ARBITRARY UNITS
##FACTOR=    0.0002768,     1,               1
##FIRST=     0,             0,               0
##LAST=      2.2672688,     0,               0
##MIN=       0,             -207700,         0
##MAX=       2.2672688,     184684,          0
$$ Real data points
##PAGE= N=1
##DATA TABLE= (X++(R..R)), XYDATA
0@%%%%%%%%%%%%j2K4k4K4k4L6m8N4o6Q4r6J08j32J56j80K04k39K76l13L60m09
$$ 0 0 0 0 0 0 0 0 0 0 0 0 0 -12 12 -12 12 -12 24 -24 30 -36 48 -48 60 -72 84 -96 108 -131 145 -168 192 -217
33b17M62n23N92o65P45q35R33j040J157j285J426j577J740j922K123k341K578
$$ -217 245 -278 314 -351 394 -441 492 -548 609 -676 750 -827 913 -1009 1114 -1227 1351
50A351k839L127l448L805m197M641n145N719o381P155q077R191j0575J2346j4706
$$ 1351 -1488 1639 -1809 1996 -2201 2440 -2705 3014 -3367 3788 -4289 4902 -5673 6673 -8033
65h033J8026k3075L1803n1128J77461m8997j15433K04060j30893m9320J07673
$$ -8033 9993 -13082 18721 -32407 145054 96057 -19376 184684 53791 4471 112144
76A12144o5476r3506J26705m7097r5094P5686q030j14569N6421L365q6578N8338
$$ 112144 46668 -46838 79867 32770 -62324 13362 5332 -109237 -52816 -49451 -136029 -77691
88g7691O8804o4949K0129M8471l0375K0660L9409m2610J3466L8312k7468J5435
$$ -77691 -8887 -73836 -53707 -5236 -35611 -14951 24458 -18152 -4686 33626 6158 21593
100B1593M5019l0719K119K9857m1279j2087K6604m8561j3897M7112l8683l2365
$$ 21593 66612 35893 38012 67869 26590 14503 41107 -7454 -21351 25761 -12922 -45287
112d5287N9558j1408m5112M1500j500m8112L7908J5777m9220L0135L9243l6117
$$ -45287 14271 2863 -42249 -749 -2249 -50361 -12453 3324 -45896 -15761 23482 -12635
124a2635J3393L8869l3694n401L5779k7123k1073L1043q159k1603K0177o17j6402
$$ -12635 758 39627 5933 532 36311 9188 -11885 19158 10999 -10604 9573 8956 -7446
137g446J2639k169j7629O427N58j0224O559J504l028J2853K947n645J0612O15
$$ -7446 5193 3024 -14605 -8178 -7620 -17844 -11285 -9781 -12809 44 2991 -2654 7958 8573
151H573r265R029J908j2178P712O394j2423N547Q726j4042j860Q932j2376n684
$$ 8573 -692 8337 10245 -1933 5779 12173 -250 5297 14023 -19 -1879 7053 -5323 -11007
165a1007R718o700n949J0184p6o109Q810L413o038L564L972l512J826L825r25
$$ -11007 -1289 -7989 -13938 -3754 -3830 -9939 -1129 2284 -3754 -190 3782 270 2096 5921 4996
180D996n6J963N26j147k590M64p4o254k09K422n823j704N668m175l980P650j003
$$ 4996 4940 6903 7429 6282 3692 4156 4082 -2172 -2381 41 -5782 -7486 -1818 -5993 -9973 -2323 -3326
197c326n979P514K069o202N925N334n515K836P054n954l00O980m457l448M934
$$ -3326 -9305 -1791 278 -5924 1 5335 -180 2656 9710 3756 3456 10436 5979 2531 7465
212G465k931m562L027k032m616J509r06l107J650j87j913K011K36j339L033L67
$$ 7465 4534 -28 2999 967 -3649 -2140 -3046 -6153 -4503 -4690 -6603 -4592 -4356 -5695 -2662 -2295
228b295j145M054N25j144M111J454k725L152J819n006R16K657n988R7L095m856
$$ -2295 -3440 614 1139 -5 4106 5560 2835 5987 7806 2800 3716 6373 385 482 3577 -1279
244a279j478M106l964k820L925j935l944L794O98l781L901K883k324K082L592
$$ -1279 -2757 1349 -2615 -5435 -1510 -3445 -7389 -3595 -2897 -6678 -2777 106 -2218 -136 3456
259C456k063N80K588j477p71J832q42r87J039J38j604l0r37j327j278q43p14n89
$$ 3456 1393 1973 4561 3084 2313 4145 3303 2316 3355 3493 1889 1859 922 -405 -1683 -2526 -3240 -3829
277c829o49Q45J084r54Q41J861q68j41K446p85n62K464R02j386K266J077j509
$$ -3829 -4478 -3633 -2549 -3503 -2662 -801 -1669 -1810 636 -149 -711 1753 2655 1269 3535 4612 3103
294C103M1J444k798j043O27j370j676J044p5j503P00M87j470l15O61p35m58J441
$$ 3103 3144 4588 1790 747 1374 4 -1672 -628 -703 -2206 -1506 -1019 -2489 -2804 -2143 -2878 -3336 -1895
312a895N79j99J206J541j31M66Q49m83p25O47Nj191P91P34j152O4P77j327r98
$$ -1895 -1316 -1515 -309 1232 1101 1567 2416 1933 1208 1855 1860 669 1460 2194 1042 1106 1883 556 -442
331d42J45p06j446O9M69l03N52J139N4k89O18J29m91K56K91m11N10J101j09J70
$$ -442 -297 -1003 -2449 -2380 -1911 -2214 -1662 -523 -469 -758 -140 -11 -502 -246 45 -366 144 1245 1136 1306
351A306P12j43r02m27M70j067m75N95n28j22P77j51m00OL01r82m1L71m89N27N01
$$ 1306 2018 1875 973 546 1016 -51 -526 69 -459 -581 196 45 -355 -349 -48 -1030 -1071 -700 -1189 -662 -161
372a61N9J17P15q3m37K08J83q67J03J52j76J5K84N12k98p0q3jo31K16L36q79L53
$$ -161 -102 15 730 647 210 418 601 -266 -163 -11 -187 -172 112 624 326 256 173 172 -459 -243 93 -786 -433
395d33N46L0K63P01m90o82K86k05n77K53Q1l82M30M77l75k62O61o18k07M39l15
$$ -433 113 143 406 1107 617 -65 221 16 -561 -308 -227 -609 -179 298 -77 -339 322 -296 -503 -64 -379
416c79k65J06N96K96R3J61k96K3J32R0n39j45N36l5m37L85J15Qn33N7k45k44j62
$$ -379 -644 -538 58 354 447 608 312 335 467 557 18 -127 409 374 -63 322 437 445 -88 -31 -276 -520 -682
439f82k59j01R4O67o52Q46J79l89L05L01n39j10N51q9m06J137j46k35L86r8l61
$$ -682 -941 -1042 -948 -281 -933 -87 92 -297 8 309 -230 -340 211 122 -284 853 707 472 858 760 399
460C99J63k37p56L63l29KJ21J37n9r8R2l67j69K99k53K72J55p5O8N97J75J55K0
$$ 399 562 325 -431 -68 -397 -395 -274 -137 -196 -294 -202 -569 -738 -439 -692 -420 -265 -340 -272 325 500 655 675
483F75l68k40K24R4j85J7J29l16R1J35k41J89n68j35J82l18j46N21R4l54J02N00
$$ 675 307 67 291 385 200 217 346 30 121 256 15 204 -364 -499 -317 -635 -781 -260 -166 -520 -418 82
505H2m46K6P14n42l9L64k7K7K35M5k37N84qm10J72l63m71M02J1m41J46K33O1j8
$$ 82 -364 -338 376 -166 -205 159 132 159 394 439 202 786 778 368 540 177 -294 108 119 -322 -176 57 118 100
529A00l32O4l44L75m34K1N16n71N02K54J76m68O29n65OM75j62j11J9J26m33N91
$$ 100 -232 -168 -512 -137 -571 -550 -34 -605 -103 151 327 -141 488 -77 -71 404 242 131 150 276 -157 434
551D34R3m88K6Q6k15P0Q1n23L98k12j68N23K10m55J9L16l24k36M51l13P9L58k32
$$ 434 527 39 65 151 -64 6 87 -436 -38 -250 -418 105 315 -140 -121 195 -129 -365 86 -227 -148 210 -22
574b2P6K9J8N0pJ7j31N2k7l66L13K50l25M65O0p64M32k39k80j8N33n83L22M89
$$ -22 54 83 101 151 144 161 30 82 55 -311 2 252 -73 392 452 -312 120 -119 -399 -417 116 -467 -145 344
598C44l50k20M02k96J44K30m30J17J08k25kP19o1p75K84R9j6O9l84O3L29K12o82
$$ 344 -6 -226 176 -120 24 254 -176 -59 49 -176 -178 541 480 -295 -11 88 72 141 -243 -180 149 361 -321
621c21M7N46k69J32j46l06J31L68j45o30M99K52l19K49j13l9K19K1l97J67P4j02
$$ -321 -274 272 3 135 -11 -317 -186 182 37 -593 -94 158 -161 88 -25 -64 155 176 -221 -54 20 -82
643h2O01k22l07j01L84j77k07L60k35P7K8j43o1R0j70n0J9J52mj98L0N0L75l60
$$ -82 519 297 -10 -111 273 96 -111 249 14 91 119 -24 -85 5 -165 -215 -196 -44 -48 -246 -216 -166 209 -151
667a51J66N7L37k75J18J21m88L40Jj14o8J93k43r6M02j70k20K51k08J12k01j5
$$ -151 15 72 409 134 252 373 -115 225 226 112 44 237 -6 -102 300 130 -90 161 -47 65 -136 -151
689a51n2K97j54j73J81N5j90J25j67J42m4oK49J25J0j94K3K63m79N00o23j21M86
$$ -151 -203 94 -60 -233 -52 3 -187 -62 -229 -87 -131 -137 112 237 247 53 76 339 -140 360 -263 -384 102
712A02J08k21rj71K67j02K82l61J96M9o15K56J82k79L76l32L10k13J57j85K80
$$ 102 210 -11 -20 -191 76 -26 256 -105 91 140 -475 -219 -37 -316 60 -272 38 -175 -18 -203 77
733G7l1O6l14K96N6n4K68k34j16K02q1J4Lk56L29l41K23l05K45O5j82k95K15q8
$$ 77 46 112 -202 94 150 96 364 130 14 216 135 149 152 -104 225 -116 107 -198 47 112 -70 -365 -150 -238
757b38L91M3K8j91Q3j40K21n2mj98J85k20K22n8K11l49L60K7m60KK9k8J72n2o5
$$ -238 153 196 224 33 116 -24 197 145 141 -57 128 -92 130 72 283 -66 294 321 -139 -137 -108 -136 36 -16 -81
782h1K4J26k24K56j21R5j56M6j89K69K02j77j58K49l25K22l4J9q9R8NJ14k48n8
$$ -81 -57 69 -155 101 -20 75 -81 -35 -224 45 247 70 -88 161 -164 58 24 43 -46 52 57 171 -77 -135
806a35k6L69j29K86k65l20J90l07K21lK9j33M33j92P4L65o30O7J05J12J38j55
$$ -135 -161 208 79 365 100 -220 -30 -337 -116 -119 -90 -223 210 18 92 457 -173 -106 -1 111 249 94
828I4k51lrJ14J5j06K01r6J54k88N42m28O7j47K20m12L8K96n5K79n65M52J1ok66
$$ 94 -157 -160 -169 -55 -40 -146 55 -41 113 -175 367 -61 6 -141 79 -333 -295 1 -54 225 -340 112 123 117 -149
853a49J07J20k01p4K91R4M3k64N1j58N9J90j45Q0J72k41j23J50K04l35K59k18
$$ -149 -42 78 -123 -197 94 188 231 -33 18 -140 -81 109 -36 44 216 -25 -148 2 206 -129 130 -88
875h8K22l54K81r4r5K06k30l8J53J53j70K30M8l06J67J13j43j95J85k26Q4K3K91
$$ -88 134 -220 61 -33 -128 78 -152 -190 -37 116 -54 176 224 -82 85 198 55 -140 45 -181 -97 -74 217
898B17k20j93J17J30O2m70N67l95N86l68J4j63N1k23M67k59J44M3Q4n13K69l7
$$ 217 -3 -196 -79 51 113 -357 210 -185 401 33 47 -116 -65 -288 179 -80 64 107 191 -322 -53 -90
920i0k8k61J71M56l41J94q3j8J47J7q8q4L63m93Q3J36J5o7j75K34l78N57m00J84
$$ -90 -118 -379 -208 248 -93 101 18 0 147 164 76 -8 355 -138 -55 81 96 29 -146 88 -290 267 -133 51
944E1k7Q9M4j25l38N43r7J29m27K67j38j15J90j11J79k14K34J3o9m4j2p5J28M0
$$ 51 24 113 157 32 -306 237 140 269 -158 109 -29 -144 46 -65 114 -100 134 147 78 34 22 -53 75 115
968A15J84l22L30l73J2J45k35J15K18K62o11J53J19k10J80K3Nk23N5O6j26j07
$$ 115 299 -23 307 -66 -54 91 -144 -29 189 451 -160 -7 112 -98 82 105 110 -113 -58 8 -118 -225
990b25L68m59L58L06k04k66j4n6L75l22J37J26m39N80j82J52j40k1q4j9j23j37
$$ -225 143 -316 42 348 144 -122 -136 -192 183 -139 -2 124 -315 265 83 235 95 74 -10 -29 -152 -289
1012b89L55jK37m51K83K6M4l53n1J16J95l34J34J89NO8k06j19q6O52m66J49q8
$$ -289 66 65 302 -149 134 160 204 -149 -200 -84 111 -223 -89 100 105 173 -33 -152 -238 414 -52 97 9
1035In0J95r1Nk41K87k50L4K64j00l4j37N1j49M40Ol28M0J49J03k88o0J48l6J99
$$ 9 -41 154 63 68 -173 114 -136 -102 162 62 28 -109 -58 -207 233 239 -89 -49 100 203 -85 -145 3 -33 166
1060A66j70P8n5lJ03j57j45J51k12J47R8j83J90j77PP7Q2L13n65J96p3K23j87
$$ 166 -4 74 19 16 119 -38 -183 -32 -244 -97 1 -182 8 -169 -162 -85 -3 310 -255 -59 -132 91 -96
1083i6J13P3k09O4j55L92j43j86L60j76R8r5J27l11L70k92J41j0p5O1m7k6j94
$$ -96 17 90 -119 -55 -210 182 39 -147 213 37 135 40 167 -144 226 -66 75 65 -10 51 4 -22 -216
1106b16M67l42j82J36N94m05o0Q0o7N9P1k45J91k9K28k99m8QJ49k46K11l27J32
$$ -216 251 -91 -273 -137 457 52 -8 72 5 64 135 -110 81 52 280 -19 -67 -59 90 -156 55 -272 -140
1129a40R6J14k11N8r1K4J72J41j71J57q3J21j85K31l47K89k35J52l73M32j06l9
$$ -140 -44 70 -141 -83 -174 -150 22 163 -8 149 66 187 2 233 -114 175 -60 92 -281 151 45 6
1151Fj46J55Q3k6J73o7j92L74l87L8K43j99q9O3m6k69K68k05J55J81J4j02k46
$$ 6 -140 15 98 72 245 178 -14 360 -27 11 254 55 -34 29 -17 -286 -18 -223 -68 113 127 25 -221
1174b21K74j20K64n01L34L6k23J04K24l8k6J51n79O05n45L71j51j05L23m23J64
$$ -221 53 -67 197 -304 30 66 -157 -53 171 133 107 258 -321 284 -261 110 -41 -146 177 -246 -82
1195h2J68j83N8m4N2K38l02m2K26k21R6j90J42L46l84J18j87K39l47N11k48L34
$$ -82 86 -97 -39 -83 -31 207 -95 -137 89 -132 -36 -226 -84 262 -122 -4 -191 48 -299 212 -36 298
1217B98l87O6j04p0K38P9p0l2j94R0O4j52k8K38k20K27L3j57j03J31J51k53L51
$$ 298 -89 -23 -127 -197 41 120 50 18 -176 -86 -22 -174 -202 36 -184 43 76 -81 -184 -53 98 -155 196
1240A96k89J87M7lp42O21K45l65R5j79J17J00K52m35N3J23O9o8N2j12J89j35K92
$$ 196 -93 94 141 138 -604 17 262 -103 -8 -187 -70 30 282 -153 -100 23 92 24 76 -36 153 18 310
1263C10j17k27Q0Rj00J42J5j78n9K77n8k9l04P3M41m10K4K64l15J88R2j75n2Q4
$$ 310 193 -34 46 55 -45 97 112 -66 -125 152 94 65 -239 -166 275 -135 -111 153 -162 26 118 -57 -109 -25
1287b5J84l98K27m9K23k04k2k20K86J06J59m52j73M99n3j34K25j29J0K67l66J80
$$ -25 159 -239 -12 -61 162 -42 -64 -284 2 108 267 -185 -358 141 88 -46 179 50 60 327 -39 141
1309A41l42K05K2L45m4m23J34J22k93N2q2J06j09L31j98O4j91K44j08m4j35PJ31
$$ 141 -201 4 26 371 327 -96 38 160 -133 -81 -163 -57 -166 165 -33 31 -160 84 -24 -68 -203 -196 -65
1332f5J64j13Q5q7n1K12j12l1j61L29j21jj83M75j33l69K43q6l8m%M47o54N33
$$ -65 99 -14 71 -16 -67 145 33 2 -159 170 49 48 -135 340 207 -162 81 -5 -43 -47 -47 400 -254 279
1356B79N6m19K39j72J42l49L55m43J77K80R5l7J1q0p9J4kq2j12K61j84M04m15
$$ 279 335 -84 155 -17 125 -224 131 -312 -135 145 240 203 214 134 55 69 67 -15 -127 134 -50 354 -61
1379f1M47k42j47J55j03k5K92l29k43M69j14K09k23k04K03k71J50j48L37j56j48
$$ -61 386 144 -3 152 49 24 316 -13 -256 213 99 308 85 -119 84 -187 -37 -185 152 -4 -152
1400a52L24k29j70L21K6j62J69k5r8j89o4M11k52j9o0K2J1mL40m74N8L13l5j4
$$ -152 172 -57 -227 94 120 -42 127 102 4 -185 -249 162 -90 -109 -169 -147 -136 -140 200 -274 -216 97 62 48
1424D8K2r4Q6j2N0k62K18l42K91oN4J40o9k53p7M43m22M45l45l1p3M41k06J60
$$ 48 70 -24 62 50 100 -162 56 -286 5 -1 53 193 124 -129 -206 237 -185 260 -85 -116 -189 252 46 206
1448B06n54M90O4k20R3J00n71J66L69n9j40l3L5jn7j45J04J18j90J03m9K67p2
$$ 206 -348 142 206 -14 79 179 -392 -226 143 84 -56 -89 -54 -55 -112 -257 -153 -35 -225 -122 -171 96 24
1471B4j61J86o5k70O36k43K0o5k35J02j72PP3L68m05L15j36l13M39k23K2K29k09
$$ 24 -137 49 -16 -286 350 107 127 62 -173 -71 -243 -236 -163 205 -200 115 -21 -334 105 -118 -96 133 -76
1494g6K09k31J39j27K98j71j36J32Q0k4J28r0K5J60j44K3k54j63J77K4J43k16
$$ -76 133 -98 41 -86 212 41 -95 37 117 93 221 131 156 316 172 195 -59 -222 -45 -21 122 -94
1516i4J23K23n79N7O05l55j44J14j54M75l17j14J43lJ17J29m64J47J51k5J61j25
$$ -94 29 252 -327 -270 335 -20 -164 -50 -204 271 -46 -160 -17 -20 97 226 -238 -91 60 35 196 71
1538G1k0j80j04M62j83j34m8L68j46l22M61J2n55M21j05j2J07jJ9r6Q2j3l6k28
$$ 71 51 -129 -233 229 46 -88 -136 232 86 -236 225 237 -318 103 -2 -14 93 92 111 15 97 84 48 -180
1562a80K02j0o9l1J09J14q7m3J23j17K30j56j12k2O9J73m28J27k7J95J8K8j81
$$ -180 22 12 -57 -88 21 135 48 5 128 11 241 85 -27 -49 20 193 -235 -108 -135 60 78 106 -75
1585g5J54k2q8j24K43J01j89n4K55n46M93J1r5j04R0j23L9j21J58O2j82J59l8
$$ -75 79 57 -31 -155 88 189 0 -54 201 -345 148 159 64 -40 50 -73 -34 -155 3 65 -117 42 4
1608DR8J39k1j66k60L15k59R1K02k99K11o2m3K07J07N8m46j9q4K62K22J30m73
$$ 4 102 241 220 54 -206 109 -150 -59 143 -156 55 -7 -50 157 264 322 -124 -143 -227 35 257 387 -86
1631h6R6N04l47m9K9j23J82q5j93L4j71K85l11L82j44k38L94l92N04l49l07O40
$$ -86 10 514 167 118 147 24 206 121 -72 -38 -209 76 -235 147 3 -235 159 -233 271 -78 -385 255
1653B55m86K98J31Mj29jJ08m2k32L17j07j33Q6j21J43j85P2p5r6L16N3M3m0l11
$$ 255 -231 67 198 202 73 72 180 138 -94 223 116 -17 69 -52 91 -94 -22 -97 -193 123 176 219 179 -132
1677a32J45k32K15j56L3R4J29j25K79n8j26j67k1k33M38K13p1l61J14J11Rm6J17
$$ -132 13 -219 -4 -160 -127 -33 96 -29 250 192 66 -101 -122 -355 83 296 225 -136 -22 89 98 52 169
1700A69k22J29j08r0lN2m5rN6j04J00K10r4J15P7j05j45m5j76L94k94J31J4j40
$$ 169 -53 76 -32 -122 -125 -73 -118 -127 -71 -175 -75 135 41 156 233 128 -17 -62 -238 156 -138 -7 7 -133
1724a33K39K11m20P0M00l46J29k54j53L68l86K52J11k88K31j4j26J31P1N0qm64
$$ -133 106 317 -103 -33 367 21 150 -104 -257 111 -275 -23 88 -200 31 17 -109 22 93 143 135 -329
1746c29L86j33j2J90k01L20k72M2l9l6j81J72lj59L3K94j49p6M30m78J81j9j95
$$ -329 57 -76 -88 102 -99 221 -51 -9 -48 -84 -265 -93 -96 -255 -222 72 -77 -153 277 -201 -20 -39 -234
1769b34K56l0l8k4j19J05K88l20K1K83j56J05j75J91r5m1o0j72M35m11M3J88Q0
$$ -234 22 -8 -46 -70 -189 -84 204 -116 -95 188 32 137 -38 153 58 17 -43 -215 220 -191 -148 40 120
1792A20Kl39k27M27Q2k79L01j50o0K45o5r7p3j45L10L4j89J90l60L37J11M8k15
$$ 120 122 -217 -444 -17 65 -214 87 -63 -123 122 57 -40 -113 -258 52 86 -103 87 -273 64 175 223 8
1815HJ46j79r5K76kJ04o63M57M9j72j91L9oL57j57K30l02J03J09K53j86m14L61
$$ 8 154 -25 -120 156 154 258 -405 52 101 -71 -262 -223 -229 128 -29 201 -101 2 111 364 178 -236 125
1838A25k09R8K18j62j41p7K10J84k66K85l72R2r2L9o6J61j52J64j04n5K23L1l96
$$ 125 -84 14 232 70 -71 -148 62 246 -20 265 -107 -15 -107 -68 -134 27 -125 39 -65 -120 103 134 -262
1861b62M12l85J10R7J22J17k14K40j60n6j03J63k2l03J69OJ32M5q6k7L26L5m90
$$ -262 150 -235 -125 -28 94 211 -3 237 77 21 -82 81 59 -244 -75 -69 63 108 22 -5 321 356 -134
1884a34J41Op4L4O9j50J18o1j55J66k28N98l32m5R1j74K08K5k43K62j04Q1l21
$$ -134 7 13 -61 -27 42 -108 10 -51 -206 -40 -268 330 -2 -47 44 -130 78 103 -140 122 18 99 -222
1907b22M1J40J07l34K71K32k02Q7J88p91N24l0k6K91pl59k99K19JL81l14j3L72
$$ -222 -181 -41 66 -268 3 235 33 120 308 -483 41 11 -15 276 269 -90 -389 -170 -169 212 -102 -115 257
1930B57j70o9j48n0K79j71K47J08k84K29m00k3P1J1J47j5k5R2k78M43j00j75M
$$ 257 87 18 -130 -180 99 -72 175 283 -1 228 -172 -195 -124 -113 34 19 -6 86 -192 251 151 -24 -20
1953b0J20j55N7r2J60k56r1M99k72J15k2K35l03j20P1J25K46l60j80J12J65n2
$$ -20 100 -55 2 -90 70 -186 -277 222 -50 65 43 278 -25 -145 -74 51 297 -63 -243 -131 34 -18
1975a8nL8R2k24k6L81Rn8%l05K46L7k21q4K00j36P9LQ9j40j68M22k64jK39J5j37
$$ -18 -23 15 107 -117 -143 238 247 189 189 -116 130 167 -54 -138 62 -74 5 8 97 -43 -211 211 -53 -54 185 200 63
2002F3m5j16j39K65O6n4j43J10r8j70L33p0J3K21l28j02M23l42K41k24J79n7k8
$$ 63 18 -98 -237 28 94 40 -103 7 -91 -261 72 2 15 236 -92 -194 229 -113 128 -96 83 26 -2
2025bK75l96K66k90P2M14m72K22k68R5J09J01K14j18L27m82lr3J54k10L7p8Rj13
$$ -2 273 -123 143 -147 -75 339 -133 89 -179 -84 25 126 340 222 549 67 64 -29 125 -85 -48 -126 -117 -230
2049b30K61j36J31k4K4o3J79j05q3q4L08Q3n72N60j47O5l83K68R0m45J89j57K70
$$ -230 31 -105 26 2 26 -37 142 37 -46 -130 178 261 -311 249 102 167 -216 52 142 -303 -114 -271 -1
2072ak67N40k06k64J63o4J89q2k22J86j03K40J24l65L34m25K31J76r2K24k27j33
$$ -1 -268 272 66 -198 -35 -99 90 8 -214 -28 -131 109 233 -132 202 -223 8 184 92 316 89 -44
2094d4K43l35J64r1lJ65k50Q0K0k37n9M12J18k15P3l19J92J6J43op4mk31L48o4
$$ -44 199 -136 28 -63 -66 99 -151 -71 -51 -288 -347 65 183 -32 41 -278 -86 -70 73 67 -7 -11 -242 106 42
2119D2%L62m20J2p2n4J52j90K68K24m58L6m3j40N08k42J86k07r8K92j95j63K15
$$ 42 42 404 -16 -4 -76 -130 22 -168 100 324 -134 -98 -141 -281 227 -15 171 -36 -134 158 -37 -200 15
2142A5L47j94j10J82k2j72j69k15O69n31J98p7K55j70j6L0j55K74j0k6l24L79
$$ 15 362 168 58 240 218 46 -123 -338 331 -200 -2 -79 176 6 -10 20 -135 139 129 103 -221 158
2164A58j81j76K89nj05M6O2l42L36o7k82M21l84L43k35K28p7j07L77k69P8r7n9
$$ 158 -23 -199 90 85 -20 26 88 -254 82 15 -267 154 -230 113 -122 106 29 -78 299 30 108 11 -48
2187d8K03l47L57k67J14n6L5l05L18o4l1k90M8M45m74L42J38l2k16p8M78k69P7
$$ -48 155 -192 165 -102 12 -44 -9 -314 4 -60 -91 -381 -333 112 -362 -20 118 86 -130 -208 270 1 78
2210G8n7k11K70l5P6N8j21r1p3r7L26p3m06N44M2j40k08J76M2j37M42n18J80L48
$$ 78 21 -190 80 45 121 179 58 -33 -106 -203 123 50 -356 188 230 90 -118 58 100 -37 405 -113 67 415
2234D15m09K56j79K32L0l65k98j29L51p3L86k39J38oq4j12K10j07J19n4k76K29
$$ 415 6 262 83 315 345 -20 -318 -447 -96 -169 217 -22 116 110 26 -86 124 17 136 82 -194 35
2256C5j11J18J7m5k9M6j62J18j07M5j7Mk52L56j79P1K52P7n22L39j17l9j56l0
$$ 35 -76 42 59 14 -15 31 -131 -13 -120 -75 -92 -88 -340 16 -163 -92 160 237 -285 54 -63 -102 -258 -288
2280b88R9L81k76K4K13K74m50K06j80nk01j0N90l20r0q2j59M38J9j75k05J07L88
$$ -288 -189 192 -84 -60 153 427 -23 183 3 -2 -203 -213 377 57 -33 -115 -274 164 183 8 -197 -90 298
2303B98k72L35k87L3j36J60qk42N66l11k00K74p7j72o8K2J82l70J09j20J90J96
$$ 298 26 361 74 107 -29 131 123 -119 447 136 -64 210 133 -39 -107 -85 97 -273 -164 -284 -94 102
2325A02q8n6J51k59K55N8j09j07J53J02k63J69M0n8j65R9M9p6k11M33l68K15n9
$$ 102 14 -42 109 -150 105 163 54 -53 100 202 -61 108 148 90 -75 24 73 -3 -214 219 -149 66 7
2348Gk18L1J48j42J44K29k06r5R8J78m94K71J6o0L1Q8r0l15K71J63J16j81j80
$$ 7 -211 -180 -32 -174 -30 199 -7 -102 -4 174 -320 -49 -33 -93 -62 26 -64 -379 -108 55 171 -10 -190
2371a90J33J21l6Pj21Q6o1P5j45J91J22k18r4J77k5j97J31K68k57n9r4J90J3l0
$$ -190 -57 64 28 35 -86 0 -61 14 -131 60 182 -36 -130 47 22 -175 -44 224 -33 -92 -186 4 17 -13
2395a3k03L64j19l25L72j69n8k9L56k55Kj00K6J15k87R5K47m1R5J78l46J59j25
$$ -13 -216 148 29 -296 76 -93 -151 -180 176 -79 -77 -177 -151 -36 -323 -228 19 -22 73 251 -95 64 -61
2418f1L8M8m3J25j39L4O8k45L30j6k53O9K29m49O10n45J9k03M99j0k26K81l34
$$ -61 -23 25 -18 107 -32 2 70 -175 155 139 -114 -45 184 -265 345 -200 -181 -384 115 105 -121 160 -174
2441a74L91k56K47k63J00j59k1J03k20P9mL53l07N45n39M93l71L20l83O7m6J46
$$ -174 217 -39 208 -55 45 -114 -135 -32 -252 -173 -177 176 -131 414 -125 368 -3 317 -66 1 -45 101
2463A01k27M23k71J21j89k63N26k9q6l80L39L1m17O7K22j16O2k8K24k39J19j03
$$ 101 -126 297 26 147 -42 -305 221 192 106 -274 65 96 -321 -254 -32 -148 -86 -114 110 -129 -10 -113
2485a13k20L72k52N21k46j10m6L0j43L75m89J83J14j21n2M67j63J70j13j63rR9
$$ -113 -333 39 -213 308 62 -48 -94 -64 -207 168 -321 -138 -24 -145 -197 270 107 277 164 1 -8 91
2507I1R0k8K01j59k77J00K14k00k9l9L1k4J17p3j10j09J07J7L20k15k86J75o3
$$ 91 181 153 354 195 -82 18 232 32 3 -36 -5 -29 88 15 -95 -204 -97 -80 240 25 -261 -86 -149
2530a49L0L26k29p2L48m36K68L5M0j14R6j36pM0q6p4J17J6K8R3j19o9k09O9Q8
$$ -149 -119 207 -22 -94 254 -182 86 121 161 47 143 7 0 40 -46 -120 -3 13 41 134 15 -54 -263 -194 -106
2555a06j00J57L58m97K8R1K81k88q7j05M25m33J86J07L3l4j08K50j45J05k35K06
$$ -106 -206 -49 309 -188 -160 -69 212 -76 -163 -268 157 -276 -90 17 50 16 -92 158 13 118 -117 89
2577H9k2j96RJ7n9k2J47K6L1J78O5J6l9m68J22K81l47K26O1k36J77j08J80l0J76
$$ 89 67 -129 -120 -103 -162 -184 -37 -11 20 198 263 279 240 -228 -106 175 -172 54 115 -121 56 -52 128 98 274
2602B74J93m06J62j20pJ31j18j33J5L9j01j01JK79m03N40l44M9%K01l23M23k49
$$ 274 467 61 223 103 96 227 109 -24 -9 30 -71 -172 -171 108 -295 245 -99 -50 -50 151 -172 251 2
2625BJ05J14J4m38J14K86j90J05m40J74N5k8L3J23K05l84P8J08J16k36R6l5M9
$$ 2 107 221 235 -203 -89 197 7 112 -328 -154 -99 -127 -94 29 234 -150 -72 36 152 -84 12 -23 26
2648B6K3o1K2j41K93j23j44m3K7L99n06J49K55K3o4k06L4j85J98K42j10k16K08
$$ 26 49 -12 10 -131 162 39 -105 -148 -121 278 -228 -79 176 199 135 -71 -37 -222 -24 218 108 -108 100
2671A00r3J35j98k11R1R2O5K49l59j09J29N5J67j74P9M8j3j54J33Q0q5P5l56L01
$$ 100 7 142 -56 -267 -176 -84 -19 230 -129 -238 -109 -54 113 -61 18 66 53 -101 32 112 27 102 -254 47
2695D7k02N00k32K7k54K02r4K78o15M5J41K18j28q0p6K14j02LP6O3p9m0J93o5
$$ 47 -155 345 113 140 -114 88 -6 272 -343 -298 -157 61 -67 -147 -223 -9 -111 -108 -32 31 -48 -88 105 40
2719D0n8j3Q6j62K48J5l29L12j33J3l56J55R9q6K09k54N9K93j66P5Q3m6j37J85
$$ 40 -18 -31 55 -107 141 156 -173 139 6 19 -337 -182 -83 -169 40 -214 -155 138 -28 47 130 84 -53 132
2743A32l3m02L08p5k20M56o3J56l02O1l1K67k43q3j48L00l59L1M61j1j58K76j42
$$ 132 99 -303 5 -70 -290 166 103 259 -43 18 -13 254 11 -72 -220 80 -279 -248 213 202 44 320 178
2766A78p3M6p9J55k78K42J5l65J50J5K3k01o4K71L10k74j2k16j10M55n4O9j95
$$ 178 105 151 72 227 -51 191 206 -159 -9 6 29 -172 -236 35 345 71 59 -157 -267 188 134 203 8
2789Hn3n1L77k49n3J86l3j5j29j74K05P0p7j59J3L12j91M3o7l24L98J82n31J77
$$ 8 -45 -96 281 32 -21 165 132 117 -12 -186 19 89 12 -147 -134 178 -13 30 -37 -361 37 219 -312 -135
2813a35J15J62j87M7p4M8k03M86r7l55K65j31n0J3R5P4k32o7J25J35kk36L03j00
$$ -135 -20 142 -45 2 -72 -24 -227 259 162 -193 72 -59 -109 -96 -1 73 -159 -226 -101 34 32 -204 99 -1
2837am6K85p9k34j36jJ59K44l23J59L1r3j0j16K60j48K68j49K66k25j12l38N28
$$ -1 -47 238 159 -75 -211 -212 -53 191 -132 27 58 -35 -45 -161 99 -49 219 70 336 111 -1 -339 189
2860A89l40q4q9K59m8j77K75k03O9K16k4J09j50j17q7K18P2j13J03k91N06m05
$$ 189 -151 -235 -324 -65 -113 -290 -15 -218 -149 67 43 152 2 -115 -202 16 88 -25 78 -213 293 -112
2882a12r6K93j31m6K4Nk2Q1J39j90J55M6L1m04L78r3r0J51K19j34k79J89n1j12
$$ -112 -208 85 -46 -92 -68 -63 -85 -4 135 -55 100 146 177 -227 151 58 -32 119 338 204 -75 114 63 -49
2906d9K48j33n5n7k73K92J84q7J44o6l54L25k43r5q1K74J03O2k17J97j15P3nM2
$$ -49 199 66 11 -46 -319 -27 157 70 214 148 -206 119 -124 -219 -300 -26 77 139 -78 119 4 77 72 114
2930A14Q0j31p0j49J14n1R4J6P4j15r5L12K1n01K22L43l61L21m56J28j26K23J40
$$ 114 194 63 -7 -156 -42 -93 1 17 91 -24 -119 193 214 -287 -65 278 -83 238 -218 -90 -216 7 147
2953A47K5l17L20Q1k97K88k67p0L02J3l36oJ32j70L26k19k34O02j64L7k41L8K85
$$ 147 172 -145 175 256 -41 247 -20 -90 212 225 -111 -117 15 -155 171 -48 -282 320 156 193 -48 -10 275
2976B75j48l03K22Rj18K08k69K33J88k01N0j99O6R4k70L04k4k82L24m92M04m3
$$ 275 127 -176 46 55 -63 145 -124 109 297 96 146 -53 13 107 -163 141 117 -165 159 -333 71 28
2998B8k6o5M02l74J53k24j40J56K6J29J96j00j02K40l50q0p1M6K8pj6K68P5m34
$$ 28 2 -63 339 -35 118 -106 -246 -90 -64 65 261 161 59 299 -51 -131 -202 -156 -128 -135 -151 117 192 -242
3022b42K59m3L7j17L16k8m23K46M9j82J82q0n5j33K74L9k94L10q5j8P9N7j2k42
$$ -242 17 -26 11 -106 210 182 -241 5 54 -128 54 -26 -81 -214 60 99 -195 115 30 12 91 148 136 -106
3046a06Pj49L12K9j55J47l6j04J56k67O7L51m59J05M2J14r5K87k12J63J27j41
$$ -106 -99 -248 64 93 -62 85 49 -55 101 -166 -99 252 -207 -102 -60 54 -41 246 34 197 324 183
3068A83l68J29%J3J79K5K12k69j2j16k06K85L2p4n2j69M17k72k26J41N6M60m8
$$ 183 -185 -56 -56 -43 136 161 373 104 92 -24 -230 55 87 13 -39 -208 209 -63 -289 -148 -92 368 320
3091C20l19L2n6j4J20k34M10k92J73k39n6J89k29L6O0Q0j22K28L46k36k76N8j54
$$ 320 1 33 -23 -37 83 -151 259 -33 140 -99 -155 34 -195 -159 -99 -19 -141 87 433 197 -79 -21 -175
3114a75K27j42M6k5q9Q6K24l16L92k93k00N28l87O67k00j53l90L61R9l57J88q4
$$ -175 52 -90 -44 -69 -158 -72 152 -164 228 -65 -265 263 -124 543 343 190 -200 161 260 -97 91 7
3136Gj94K50j03J36R0l08L19n59M94r1J74L9l98J36L19N3m59J81k36L8k3K19k51
$$ 7 -187 63 -40 96 186 -122 197 -362 132 41 215 254 -144 -8 311 364 -95 86 -150 -112 -135 84 -167
3159a67L74j57k32L96j62m4J90J8k93K7K30p9Mm36L24J23j26l90K72j08Q9m1J50
$$ -167 207 50 -182 214 52 8 198 216 -77 -50 180 101 105 -331 -7 116 -10 -400 -128 -236 -147 -188 -38
3182c8N4K05l00K2J83j88M09j70k4M1j78Q4j77j83J57P5K5j67K62J31k2l10J71
$$ -38 16 221 -79 -57 126 -62 347 177 153 194 16 100 -77 -260 -103 -28 -3 -170 92 223 201 -109 62
3205F2j34K28lJ38l25l6j1J74lJ19k88M9J20l66L00O9M0j60J19k64J75k4j20J37
$$ 62 -72 156 153 291 -34 -70 -81 93 90 209 -79 -30 90 -276 24 93 133 -27 92 -172 3 -21 -141 -4
3229dP9l84M59J97m01l2j67L0L6K57j72L03O6j9k30N1j77K96k71k49K54L30k93
$$ -4 75 -309 150 347 -54 -86 -253 -223 -187 70 -102 201 267 248 18 69 -108 188 -83 -332 -78 252 -41
3252d1K23j11k16qL66m12K47o2j26J38mk74L88J54l35J33K76m05K36m32K84j3
$$ -41 182 71 -145 -153 213 -199 48 -14 -140 -2 -6 -280 108 262 -73 60 336 -69 167 -265 19 6
3274Fk09M5K70k09L96j02m95N48l28QJ21k25J69o9K26k04N5N0J59k22j73Q2K27
$$ 6 -203 -158 112 -97 299 197 -298 250 -78 -70 51 -174 -5 -74 152 -52 3 53 212 -10 -183 -101 126
3297A26j0j70m81O97k92J96p5k89M64k56l2J34l8rj48K2J12LP2l18L59l23N69
$$ 126 116 -54 -535 162 -130 66 -9 -298 166 -90 -122 12 -26 -35 -183 -161 -49 -46 26 -292 67 -256 313
3320C13n36J80K86m17J62n5n5M21k59R3n13M45J56j42m2o8Q7k67J48o1K7k62M36
$$ 313 -223 -43 243 -174 -12 -67 -122 299 40 133 -380 65 221 79 37 -31 56 -211 -63 -124 -97 -359 77
3343G7j86J63J00j97K11n00n4M69j55Q4K0j3L23n11l7K09L9J02k29Q1K06j14j79
$$ 77 -109 54 154 -43 168 -332 -386 83 -72 12 32 19 342 -169 -206 3 42 144 -85 -4 202 88 -91
3366i1O4Jn%KM8R1k03L15p1p0M1k11L30j60r5n9j3J11k47K73P9J64k87k98L62
$$ -91 -27 -26 -31 -31 -29 19 110 -93 222 151 81 122 -89 241 81 -14 -73 -86 25 -222 51 130 294 7 -291 71
3392G1P4k79j66L63J33l92L48m1k11J56l62L33p0N3M6n03N63qj38R7kn6L4K82
$$ 71 145 -134 -300 63 196 -196 152 111 -100 56 -306 27 -43 10 56 -447 116 108 -30 67 65 9 43 325
3416C25n32K15P2M0k64R1P0R2r2P9p1j83J20L20n64K25M6k00L09j8j32n5K90k30
$$ 325 -207 8 80 120 -144 -53 17 109 17 96 25 -158 -38 282 -282 -57 -11 -211 98 80 -52 -107 183 -47
3440d7j28K07j62j64k9L85m5J27r5N6j14Q3k32M21l79L04k90L08J0m9k60K41k97
$$ -47 -175 32 -130 -294 -323 62 17 144 49 105 -9 74 -158 263 -116 188 -102 206 216 167 -93 148 -149
3463a49L41Q9k01J29l35r8J87k0k35K00j5P3Q0R5L4k46R9N5p5J06k23J72L07k31
$$ -149 192 281 80 209 -126 -224 -37 -57 -292 -92 -107 -34 46 141 175 -71 28 83 8 114 -109 63 370 139
3487A39j26n4K35q2j92j03L27J4k15K47j54M6k64K33r8J59Q7k90j3P5j13J75N4
$$ 139 13 -41 194 112 -80 -183 144 158 -57 190 36 82 -182 51 -47 112 199 -91 -104 -29 -142 33 87
3510H7l72K32J47k33Q4j25K70n1k69K84P6j67J89j05J70l26j00K34JJ32j31o9
$$ 87 -285 -53 94 -139 -55 -180 90 39 -230 54 130 -37 152 47 217 -109 -209 25 26 158 27 -42
3532d2O5kP6J31k87l27M55O4M0k9n32M08K15k82N2l7k56n2L20K9J33k2k21J27
$$ -42 23 21 97 228 -59 -386 69 133 173 144 -388 20 235 -47 5 -32 -288 -340 -20 9 142 120 -101 26
3556B6l7M0J69K8M9j62l21K80q6J14oj01J49O6j96M9K8j64J66K0j18J10m23K21
$$ 26 -11 29 198 226 275 113 -208 72 -14 100 94 -7 142 208 12 61 89 -75 91 111 -7 103 -320 -99
3580i9Q5M5j59J56K4l12L98l73O6J94q0n6K03k21N1o6Q3P9N8J72q5o8j19K59j98
$$ -99 -14 31 -128 28 52 -260 138 -235 -169 25 -55 -111 92 -129 -78 -144 -61 18 76 248 163 95 -24 235 37
3605C7J84p6l10K52J79l01L67m90M15k26k44K02j33R8j32R4J25j81J59q3J13p1
$$ 37 221 145 -165 87 266 -35 332 -158 257 31 -213 -11 -144 -46 -178 -84 41 -140 19 -64 49 -22
3627b2j20j3K12j6L6J5j44Q9q6Ro0M60o07J35J02M3j97k04J58K0K85RJ36M2k72
$$ -22 -142 -155 57 41 77 92 -52 37 -49 -40 -100 360 -247 -112 -10 33 -164 -368 -210 -190 95 104 240 282 10
3652A0n5J25k60p7L56j0O4l3K8j02m5j09k03N10j11j93J42L8L3m0P2O0j95J44
$$ 10 -45 80 -180 -257 99 89 153 120 148 46 1 -108 -311 199 88 -105 37 75 108 68 140 200 5 149
3676A49O5j44n6o4n1L29k90K94l36m5J59J10n13M04O3J1q6K05n2o3k2o6o0j81
$$ 149 214 70 14 -50 -101 228 -62 232 -104 -149 10 120 -393 11 74 85 -1 204 152 89 67 1 -59 -240
3700b40k2L51j7k38j50L59j67J54Q3K3N6k50N8L56k56l59K04L52m66R4J03l3N9
$$ -240 -262 89 72 -166 -316 43 -124 30 113 136 192 -58 0 356 100 -259 -55 297 -169 -75 28 -5 54
3723E4L6k09L58l96o2k2K24J15k74K19L1j83K75j29k77n3L05o3j11r6L05l15R0
$$ 54 90 -119 239 -157 -219 -241 -17 98 -176 43 74 -109 166 37 -240 -293 12 -51 -162 -258 47 -268 -178
3746a78J79r7L68k67n0j02K17j94J84n1n0L0Qj7om4j88L39j16J88j70k7J27J49
$$ -178 1 -96 272 5 -45 -147 70 -124 60 9 -41 -11 -3 -20 -26 -70 -258 81 -35 153 -17 -44 83 232
3770B32j61J79l4m11K01k7K76o86J04M64k89M0K86K09p7j80r9o1L10j51p3J91
$$ 232 71 250 216 -195 6 -21 255 -431 -327 137 -152 -112 174 383 306 126 27 -34 276 125 52 243
3792B43m60K54P4K4j48K54n28L11k9Jp5J80j22P7O2k40N7P1k08L42l2k29L60p2
$$ 243 -217 37 111 135 -13 241 -287 24 -5 -4 -79 101 -21 56 118 -122 -65 6 -202 140 108 -121 239 167
3816A67k18m1K6k02K66o7N53k57k09J41m6K9j93J52j19N8j33Q0L53n37J88J51
$$ 167 -51 -92 -66 -268 -2 -69 484 227 18 159 113 142 -51 101 -18 40 -93 -13 340 -197 -9 142
3838A42j8l4j25K08k09j93K89K15k36l44L19K8P2j37p5J56k01K7l8Q4m1J27L29
$$ 142 124 90 -35 173 -36 -229 60 275 39 -305 14 42 114 -23 -98 58 -143 -116 -154 -70 -111 16 345
3861C45q0l39j52m9J61K17m9P1j3j69P0p7K4R6l0o3J29k96J46J09j07l6K46k46
$$ 345 265 -74 -226 -275 -114 103 54 125 112 -57 13 -64 -40 56 26 -37 92 -204 -58 51 -56 -92 154 -92
3885i2K62n60M33O6k04J27K11J93m66q9O3K6J84o6l8k08L53j40j62K68l8K11l34
$$ -92 170 -390 43 109 -95 32 243 436 -30 -119 -56 -30 154 88 50 -158 195 55 -107 161 123 334 0
3908@j43K1K70k6j24L0j21LK57j70k8K7m1M4j16K18Q9m01K94J7r4J50j30J28J14
$$ 0 -143 -122 148 122 -2 28 -93 -90 167 -3 -31 -4 -45 -1 -117 101 190 -211 83 100 6 156 26 154 268
3933B68j56j4J6oK94M6k08l30j10Q4K77l55M33K38l69k06K91j35n0K90m14J85
$$ 268 112 98 114 108 402 448 240 -90 -200 -116 161 -194 239 477 108 -98 193 58 8 298 -116 69
3955F9m3L2J42k97PJ93j19j49K48k58l8nM76l47K62j7K12k96J46l12N4J77k26
$$ 69 26 58 200 -97 -90 103 -16 -165 83 -175 -213 -218 258 -89 173 156 368 72 218 -94 -40 137 -89
3978h9j08M02k39Q7l0l9k24J85L59Qk74P2j18J31k62m5J73J34j08k64J34J49m7
$$ -89 -197 205 -34 53 23 -16 -240 -55 304 312 38 110 -8 123 -139 -184 -11 123 15 -249 -115 34 -13
4001a3L8N5J14l2m10P0Q7K49Nj54l02K88M5K33m94J26J61r0k17K7J80J97l27P3
$$ -13 25 80 194 162 -248 -178 -91 158 163 9 -293 -5 40 273 -221 -95 66 -24 -241 -214 -34 163 -164 -91
4025i1k67J72k01M91k1k31J58k09J23P7n7J56j12J56Q2J4n2m7q6k77K16L89k27
$$ -91 -358 -186 -387 104 83 -148 10 -199 -76 1 -56 100 -12 144 226 240 188 141 55 -222 -6 383 156
4048A56J40k75J4o3n9R8L36j86q1L0l35N2K09Q7j4J43k02J07l89L56p3J93k1l07
$$ 156 296 21 35 -28 -87 11 347 161 80 110 -225 -173 36 123 109 252 50 157 -232 124 51 244 223 -84
4072h4K40k08o6L18k60M2M23l90J7q8k39L49qK2l50R9J02J28J49k49O7k8J83j68
$$ -84 156 -52 -118 200 -60 -18 405 15 32 -56 -295 54 46 68 -282 -183 -81 47 196 -53 14 -14 169 1
4096AJ86m65Q8K31J1J9k92L19M3j25K10j45l75M66P9l79k21K3M29j63J8KJ7QL4
$$ 1 187 -278 -190 41 52 71 -221 98 141 16 226 81 -294 172 251 -128 -349 -326 103 -60 -42 -40 -23 -15 19
4121A9q1J68m1l25M83k42N7k29J69q4m8J52K89n74K38%L7J33J51m43K81j84N1
$$ 19 -62 106 65 -260 223 -19 38 -191 -22 -106 -154 -2 287 -287 -49 -49 -12 121 272 -171 110 -74 -23
4144b3K21l43M76j92p5j56J65j3j04R3J04K41p18N42P3l03J93p3l11O87m32j43
$$ -23 198 -145 331 139 64 -92 73 60 -44 49 153 394 -324 218 291 -12 181 108 -203 484 52 -91
4166i1P7j43J89j90J43j37K54l0k05K53j1N0k68K3J26O8j17M64m57r7j22K40m2
$$ -91 -14 -157 32 -158 -15 -152 102 72 -133 120 109 159 -109 -86 40 108 -9 455 -2 -99 -221 19 -23
4189b3k57L07J34k50P5OK17j19l74J00L78j9j58J81k16j28P3M9P6j96J02j45K09
$$ -23 -280 27 161 -89 -14 -8 209 90 -284 -184 194 175 17 198 -18 -146 -73 -24 52 -144 -42 -187 22
4212B2q8J12P5k69L90j97j94j07L13k73M20j53J71mk85j19Q5j58K60k16J71P3
$$ 22 -66 46 121 -148 242 45 -149 -256 57 -216 204 51 222 218 -67 -186 -101 -259 1 -215 -44 29
4234B9k43K74r3R1q1J0j41L45k42L7j70K68j28O3L1K26j47r9l87K24K12Kn7r3
$$ 29 -214 60 -33 58 -23 -13 -154 191 -51 -14 -184 84 -44 19 50 276 129 30 -357 -133 79 81 24 -69
4258f9M51l17k30R2J8o6j21j82L11M18l64J47o24N35K25n01L21K8k7n4J35j17
$$ -69 382 65 -165 -73 -55 -121 -242 -424 -113 305 -59 88 -536 -1 224 -277 44 72 45 -9 126 9
4280IJ60k20K46j35p1j01Q5L2J65l47L07k23N4k74M16m1r2j26J57k5P1N5j56K19
$$ 9 169 -51 195 60 -11 -112 -27 5 170 -177 130 -93 -39 -313 103 62 -30 -156 1 -24 47 102 -54 165
4304A65k45Q0k48mK93k05L31l87J36L6k01K26k44M17j85j08K40p4N2l3j15m1M40
$$ 165 -80 0 -248 -252 41 -164 167 -220 -84 -48 -249 -23 -267 150 -35 -143 97 23 75 42 -73 -114 326
4327C26j22l85K68P4l09L11m1K58n97L30j87J75k14K50j70k30K65j89M28o5K6
$$ 326 204 -181 87 161 -148 163 122 380 -217 113 -74 101 -113 137 -33 -263 2 -187 241 176 202
4348B02k92L7K48j26J08k24J14l10J62m2K07j19Q5j17K25p3K44m12J19Q6j03K0
$$ 202 -90 -53 195 69 177 -47 67 -243 -81 -123 84 -35 50 -67 158 85 329 -83 36 122 19 39
4370C9j29p4n7K81k69R4o3L18k52J92k6l7J39l95K73k07J20L71q9j79N6kk5o1
$$ 39 -90 -164 -221 60 -209 -115 -178 140 -112 80 54 17 156 -239 34 -173 -53 318 229 50 106 104 79 18
4394A8k4J6J26k64L90j70k70m7J74j41M84m78N8K09j66k55N02L51l89J84n81M35
$$ 18 -6 10 136 -128 262 92 -178 -225 -51 -192 292 -186 -128 81 -85 -340 162 513 124 308 -273 162
4416A62j62N2k44K21J52j64K38k17L72l57m4J42l07N08k61M0k53J02K53Qk91K31
$$ 162 0 52 -192 29 181 17 255 38 410 53 9 151 -156 352 91 131 -122 -20 233 241 -50 181
4438A81o5k45J2J54o3L27j3l14J24l01K38K91k74J40j25k3j4j70L8q4K78j56Q1
$$ 181 116 -129 -117 37 -26 301 288 -26 98 -203 35 326 52 192 67 44 30 -140 -102 -186 92 -64 17
4461A7m8J25k86O6Q1j18K61K0J54m96L33k91M00j67K79m42Q0k09J91M07l09KM8
$$ 17 -31 94 -192 -126 -45 -163 98 118 272 -224 109 -182 218 51 330 -112 -32 -241 -50 357 48 50 98
4484I8R4j51j90J42JK58k72q9J87k32J42l13N75K0r2k31J81n2M3r7J75k38N4k42
$$ 98 192 41 -149 -7 -6 252 -20 -109 78 -154 -12 -325 250 270 178 -53 128 76 119 22 197 -41 13 -229
4508b29L68k0Ll3k27K7J29l45O18k73j29k29K03K93l69K26j53M14n96L81k20L00
$$ -229 139 119 122 89 -138 -111 18 -327 291 18 -111 -340 -137 156 -213 13 -140 274 -322 59 -161 139
4530A39J22k64p1L81n40J23k17K88K91k65k16N0Q8J44K11l33L0K7k51K97J28k64
$$ 139 261 -3 -74 307 -233 -110 -327 -39 252 -13 -229 -179 -91 53 264 -69 -39 -12 -263 34 162 -102
4552a02K51m36L41J3p9j77L1J21k6o8J54k86L09j05K9j11k45O01l67N0j71J03
$$ -102 149 -287 54 67 -12 -189 -158 -37 -63 -131 23 -263 46 -59 -30 -141 -386 215 -152 -102 -273 -170
4574a70n7R3L06l68L06j54J65l5R0l54J05j8L10j49k1k3K78m19J26r4k8L47k34
$$ -170 -227 -134 172 -196 110 -44 121 86 176 -178 -73 -91 219 70 49 26 304 -115 11 -83 -111 236 2
4597Bk43L46j20K19q2J81o8p5m56K15K25o42K61M20k96k43M53K97m08K21K3k27
$$ 2 -241 105 -15 204 122 303 235 160 -296 -81 144 -498 -237 183 -113 -356 97 394 -14 207 230 3
4619Cj02O4R0K66l15j5R0p9j10J87j17j30N6J20J05oj28j56K09j8j17J96J72l49
$$ 3 -99 -35 55 321 6 -9 81 2 -108 79 -38 -168 -112 8 113 107 -21 -177 32 14 -103 93 265 -84
4643h4O8K02Nj39k81P9J69k94L84k51J56j65j25L15K5k48j87N13k74O5j01J03
$$ -84 -16 186 191 52 -229 -150 19 -275 109 -142 14 -151 -276 39 64 -184 -371 142 -132 -67 -168 -65
4665f5k2J09J92j49k82N27k12m2q3op6R3J10J51k91M8j05J97K1r9p8m9K54J52
$$ -65 -87 22 214 65 -217 310 98 56 -27 -33 -109 -16 94 245 -46 2 -103 94 115 16 -62 -111 143 295
4689B95j17l71K36j12Q8o8j88J29J9j11N73p7k19q4lP0k73j28K50J73J65j89j90
$$ 295 178 -193 43 -69 19 -49 -237 -108 -89 -200 373 296 77 -7 -10 60 -213 -341 -91 82 247 58 -132
4712a32k8om0J66J48j47M32m05P9o5N0K43n26N41j42m01L14O4k71M39k84j7M81
$$ -132 -160 -166 -206 -40 108 -39 393 -12 67 2 52 295 -231 310 168 -233 81 145 -126 313 29 12 493
4735D93o87L85k46nj13L34k34r8L74J21k48k50L37r0l60L12K0j71L64j30n1j01
$$ 493 -194 191 -55 -60 -173 161 -73 -171 203 324 76 -174 163 73 -287 25 45 -126 238 108 57 -44
4757d4J74j31K30j80j31J07l65L43P9j41K42j32p6r0K13J80m32L97l70N0L84l16
$$ -44 130 -1 229 49 -82 25 -340 3 82 -59 183 51 -25 -115 98 278 -154 243 -127 -77 307 -9
4779iK87l47J39o6q3P9L2J92n25M15j50J45r6J84p3o0l36p9K53M7P5K05k34R5
$$ -9 278 -69 70 4 -79 0 32 224 -301 114 -36 109 13 197 124 64 -272 -351 -98 -51 24 229 -5 90
4803I0k22L2J20K3j41P5rj77J02q0L26k18n5L11k32K4K83l72K55r9J3P4J00l41
$$ 90 -132 -100 20 43 -98 -23 -32 -209 -107 -187 139 -79 -134 177 -55 -31 252 -120 135 36 49 123 223 -118
4827a18K6J89j1J15j86P6K53o98P1K18j69K04j6M5o0R5J38j41lJ4q2j7O3j61K02
$$ -118 -92 97 86 201 15 91 344 -354 -283 -65 -234 -30 -46 -1 -61 34 172 31 28 42 -40 -57 6 -155 47
4852D7o4J03l26L26j38K40k90M8N4j2k83L99L6j4j06rJ57n03L92J0R5J4m3Jj10
$$ 47 -17 86 -240 86 -52 188 -102 -54 0 -12 -295 104 140 126 20 11 168 -335 57 67 162 176 133 134 24
4877B4J4mJ63o0l9j68J11l92M60k00k3L83n83M71l98K54J42j6k53M07l79J56j30
$$ 24 38 34 197 137 98 -70 41 -351 109 -91 -114 269 -314 157 -241 13 155 139 -114 293 -86 70 -60
4900f0jk5K63l18m9J95l27M37n8k9PK93l93j03K12J30k17R5K5k85J92J12P8l30
$$ -60 -61 -86 177 -141 -190 5 -322 115 57 28 35 328 -65 -168 44 174 -43 52 77 -208 -16 96 174 -156
4924a56J35K87k95p7j45J51%J63j24M43j58L2m12j4M32m07L5J21k29L59K8k72
$$ -156 -21 266 -29 -106 -251 -100 -100 63 -61 382 224 256 -156 -170 262 -145 -110 11 -218 141 169 -103
4946a03K59n1K86o75K92L7L1j31nQ9M1j74K29k29nL32q8k61j25M94j69K2N9j75
$$ -103 156 105 391 -284 8 45 76 -55 -60 29 70 -104 125 -104 -109 223 135 -126 -251 243 74 96 155 -20
4970b0q4j66N53n49K39N1l0o1J62k07K45k07Q4K22k77k49K58J55K14j43m15M06
$$ -20 -104 -270 283 -266 -27 24 -6 -67 95 -112 133 -74 10 232 -45 -294 -36 119 333 190 -225 181
4992A81l7j6l45M29k31jJ21j09K00m2n7p0j79j5J48K60p6l70J98j20L6J67M9l0
$$ 181 144 128 -217 212 -19 -20 101 -8 192 150 93 23 -156 -171 -23 237 161 -209 -11 -131 -95 72 121 91
5016I1k34K70k1O2k49J00J01l37K23k3J10J86k41J41o2qn4k34K53k13J50K45l74
$$ 91 -143 127 106 168 -81 19 120 -217 6 -17 93 279 38 179 117 109 55 -179 74 -139 11 256 -118
5039a18j08J52J96J20m00j63L47j40R6o8J80j06J16k56L59j71P4l4l01M2J4K07
$$ -118 -226 -74 122 242 -158 -321 26 -114 -18 -86 94 -12 104 -152 207 36 110 76 -225 -183 -169 38
5061C8k56J99R3j22j96M47k84K77p7P3k53l2n9J78q6R6n0K65k20k5nk10J83r0
$$ 38 -218 -19 74 -48 -244 203 -81 196 119 192 -61 -93 -152 26 -60 36 -14 251 31 6 1 -209 -26 -116
5085a16m7l1K69j05l2k40L31M68o31K19k24L83j25j34j39K92k57K40k56K25l82
$$ -116 -163 -194 75 -30 -62 -302 29 497 -134 85 -139 244 119 -15 -154 138 -119 121 -135 90 -292
5106b92J87J32L24o28K83R4O3q7m1K25j52J55n40L37m0J64P6m58L05K1L33j59
$$ -292 -105 27 351 -277 6 100 163 76 35 260 108 263 -277 60 20 184 260 -198 107 128 461 302
5128C02j45j99R7k76K22j01O8K30k24m3p5L37j14j80J59N3J16j15p3p7j36J85
$$ 302 157 -42 55 -221 1 -100 -32 198 -26 -69 -144 193 79 -101 58 111 227 112 39 -38 -174 11
5150A1P8l2K29l88K57j25l37M27m0o6lM8j64K56l34J95k6J52Rk34J56j06k3Q5
$$ 11 89 57 286 -102 155 30 -307 120 80 14 11 59 -105 151 -183 12 -14 138 147 -87 69 -37 -60 25
5174B5o2O3j2J05l48N54k47j80J99P9O9k03m9q3J04J78j48K32m16K6O5J13j5k32
$$ 25 -37 26 14 119 -229 325 78 -102 97 176 245 42 -7 -90 14 192 44 276 -140 -114 -49 64 49 -183
5198a83R4K55J59n09M04l85K25j59J61m40L33l2J91j92k8J58k94p1P6M11l04j13
$$ -183 -89 166 325 -184 220 -165 60 -99 62 -378 -45 -77 114 -78 -106 52 -242 -313 -237 174 -130 -243
5220b43L42j93Q1Q1r6j5K48O7m12M43k88Q6j4k63J92k1N2J43l64K87j44k33K33
$$ -243 99 -94 -13 68 -28 -43 205 272 -140 303 15 101 87 -176 16 -5 47 190 -174 113 -31 -264 -31
5243c1J72o2l1j68R2L26l35J40J35l19j15K0Q9K0J16j7K94k87qk3J7lJ71o02M19
$$ -31 141 79 48 -120 -28 298 -37 103 238 -81 -196 -176 -87 -67 49 32 326 39 31 8 25 22 193 -409 10
5268A0R8j01L6J41j22J0l4j30P6K12k19J05k14J2M10l79j49N27k20J11q4n3k95
$$ 10 108 7 43 184 62 72 38 -92 -16 196 -23 82 -132 -120 290 -89 -238 289 69 180 96 43 -252
5291b52L69k85J47J89j08j14r8n3L29J13l78K06j99j24J41R9J46q2N7k5o2j42
$$ -252 117 -168 -21 168 60 -54 -152 -205 124 237 -141 65 -134 -258 -117 -18 128 46 103 78 16 -126
5313a26J61n2O9L63m36K43k15r6K51k21J99j93pK62k91J3J99L3m40K25J30k21
$$ -126 35 -17 52 415 -21 222 7 -89 162 -59 140 -53 -60 202 -89 -76 123 156 -284 -59 71 -150
5335a50P7J68R7l56K62n82M86o5Q2oJ0O6m42L43J92j01J65n03K42j70J96J25k02
$$ -150 -73 95 192 -164 98 -484 2 -63 19 13 23 89 -353 -10 182 81 246 -257 -15 -185 11 136 -66
5358f6K97n15O40l30j89J29m4Q2R5l38L53K6k06L42j19o5j6k90J30J49j08N6K19
$$ -66 231 -284 356 26 -163 -34 -78 4 99 -239 114 140 -66 276 157 92 76 -214 -84 65 -43 13 232
5381B32l61Q3R8l3j90J37j62J91J64J89k90k44J26J38p4k10J23K10k29J37Nk75
$$ 232 -129 -46 52 19 -171 -34 -196 -5 159 348 58 -186 -60 78 4 -206 -83 127 -102 35 40 -235
5403b35J91J07m7o9J87k81o3J76J83L9k19Q5J48l08L28k49m57L34J35J14p5k29
$$ -235 -44 63 16 -53 134 -147 -210 -34 149 188 -31 54 202 -106 222 -27 -484 -150 -15 99 24 -205
5425b05J99J63q3J85j39p7rJ6q8PQJ95Rq1k99K83l29K35L0j49r8L62J65l50L1
$$ -205 -6 157 74 259 120 43 34 50 -38 -31 -23 172 181 100 -199 84 -245 -10 20 -129 -227 135 300 -50 -19
5450a9J6l4L24m70J84j05O5J44j14m9J6O5k56K37j83J41J44j43J7J31k48K29k58
$$ -19 -3 -37 287 -183 1 -104 -39 105 -9 -58 -42 23 -233 4 -179 -38 106 -37 -20 111 -137 92 -166
5473a66J47K4k12K91K53n78M3J01J3J60Lq7N8l71O80m44j11J40L9J13p6J29J52
$$ -166 -19 5 -207 84 337 -241 -198 -97 -84 76 79 -8 50 -321 359 -85 -196 -56 -17 96 20 149 301
5496C01j54k96p1M55k98K33j94j12K33k29J96j39R5j2J38O5m80N05k52O9k3K15
$$ 301 147 -149 -220 235 -63 170 -24 -136 97 -132 64 -75 20 8 146 211 -269 236 -16 53 30 245
5518B45j7j59k33K48n4l0N3k46L47j14Mj81J94j86L37j00K1k72RO5M62j65j13
$$ 245 228 69 -164 84 30 0 53 -193 154 40 44 -137 57 -129 208 108 129 -143 -134 -69 393 228 115
5541A15j48O2MJ88n27L35pj19j07k18N31k98K87L9j88K15k91K47J10m75L67M0
$$ 115 -33 29 33 221 -306 29 22 -97 -204 -422 109 -189 98 137 -51 164 -127 120 230 -245 122 162
5563A62o7k85K87l3J40ml50K1J89j23J94Jp1n3M5j64j8L06j62l15M15J0p5l13
$$ 162 95 -190 97 64 204 200 -150 -129 60 -63 131 132 61 8 53 -111 -129 177 15 -300 115 125 50 -263
5587b63J90L8J1J51o0n8J3L1o4j75m1K07q0R2k00O1K18l4J25m30L48o3j44k56
$$ -263 -73 -35 -24 127 67 9 22 53 -11 -186 -227 -20 -100 -8 -208 -147 71 37 162 -268 80 17 -127 -383
5611c83L64rj0L1N9j05q6L84j87Qj40n5K80k08j50K91p6q7K46j17J90m15K00j13
$$ -383 -19 -28 -38 -7 52 -53 -139 245 58 66 -74 -129 151 -57 -207 84 8 -79 167 50 240 -175 25 -88
5635h8J53J16j54l4l49J97K24k2k26L25j56J35r1p0O2k65K26k07K15J99j13r2
$$ -88 65 181 27 -7 -356 -159 65 43 -183 142 -14 121 30 -40 22 -243 -17 -224 -9 190 77 -15
5657a5R5j77J10j21L79l38r9J87m9n4L18j09K4j82q0O4m45M84j87J51M1o8J33
$$ -15 80 -97 13 -108 271 -67 -166 21 -28 -82 236 127 151 -31 -111 -47 -492 -8 -195 -44 -3 -71 62
5680F2J24l35L9J61K42l70K55j45J26k18j05L3r9J04R6L73m2l64K44o6n7j89r5
$$ 62 186 -149 -110 51 293 -77 178 33 159 -59 -164 -131 -230 -126 -30 343 301 -63 181 115 58 -131 -226
5703b26K17J67j01J02q2Q4k42O4J06o6Q9K8k1o3n9k8j77j07M12J8k19q3J00K4
$$ -226 -9 158 57 159 77 161 -81 -17 89 23 112 140 119 56 -3 -31 -208 -315 97 115 -104 -187 -87 -63
5727f3M28m42K17m44J99L58l70j99O79k58kj39j49K99K15m59J43j34J66n6l3L7
$$ -63 365 -77 140 -304 -105 253 -117 -316 363 105 103 -36 -185 114 329 -130 13 -121 45 -11 -44 -7
5749gJ29k86O7J98M6k71L74k95K52J03l81K90k01j0l87K37L88j02l21L7M75n20
$$ -7 122 -164 -97 101 147 -124 250 -45 207 310 -71 219 18 8 -379 -142 246 144 -177 -140 335 -185
5771a85K01r1l8K75Nj33l54M78K69l61n0J94l44M31n50M73j84L7o6N6M6q3J59
$$ -185 16 -75 -113 162 167 34 -320 158 427 66 16 210 -134 297 -253 220 36 73 7 63 109 26 185
5794A85l52K2L26o5k18k79M40m3j2K1n6j64L0J93k00L18K64m12K4L3l0l55M85
$$ 185 -167 -145 181 116 -102 -381 59 16 4 25 -31 -195 -165 28 -172 146 410 -2 22 55 25 -330 155
5817A55j40q3J81rj34J41R4k29o3K8M57p93K82J86q0J33k22L86k52J08j00J27
$$ 155 15 -68 113 104 -30 111 205 -24 -87 -59 398 -395 -113 73 -7 126 -96 290 38 146 46 173
5839A73l67L02J02l68J09m0K53p6l63lJ57K61l75K12J39l17L05J23k66L63m37
$$ 173 -194 108 210 -158 -49 -89 164 88 -275 -278 -121 140 -235 -23 116 -201 104 227 -39 324 -113
5860a13L17l3L1k27J69q1j65j1j48L19O2l94K09J26n7k61N6J24k17K53L3k3Pj23
$$ -113 204 171 202 -25 144 63 -102 -113 -261 58 120 -274 -65 61 4 -257 -201 -77 -294 -41 -8 -31 -24 -147
5884a47K22p3P7j04K47P8j74N9j22N1j68k9J06r3Rl18O47o23M69p1M2J01k08J41
$$ -147 75 2 79 -25 222 300 126 185 63 114 -54 -83 23 -70 -61 -379 268 -355 114 43 85 186 -22 119
5908A19j24j97J8m1Q4J25j2jo4O9J27L6j71k05M96m66M58l25j50L07K25j44j2
$$ 119 -5 -202 -184 -225 -141 -16 -28 -29 -93 -24 103 139 -32 -237 259 -207 251 -74 -224 83 308 164 152
5931A52J2K26j63n07K68J19l1J42l65L07J04m15K06p2j14L33L6l07q4N28k23K0
$$ 152 164 390 227 -280 -12 107 76 218 -147 160 264 -151 55 -17 -131 202 238 -69 -153 375 152 172
5953A72n8j77K49l13K30%n1l6j32k3L7J41k07J78j30J2M26m36M00l65J99L17n98
$$ 172 114 -63 186 -127 103 103 52 16 -116 -139 -102 39 -168 10 -120 -108 318 -118 282 -83 116 433 -165
5976a65N9J70M6j73J94q2K36j83l27J38P6k52N2L43k97K87k79L50j77j55J78J74
$$ -165 -106 64 110 -63 131 49 285 102 -225 -87 -11 -263 -211 132 -165 122 -157 193 16 -139 39 213
5998B13m2m68K49K32j98j66l2l15M70K74k08J16j90M5j63P1K49J43q8k68l4J55
$$ 213 171 -297 -48 184 -14 -180 -212 -527 -57 217 9 125 -65 -20 -183 -112 137 280 192 -76 -110 45
6020D5K9l0K59l95Q7J31l53K08nL24m1j12j44J34m0j51n8J94m15L01L2J77j02
$$ 45 74 44 303 -92 -5 126 -227 -19 -24 300 259 147 3 137 97 -54 -112 82 -333 -32 0 177 75
6043G5K45p2j96Lk4J8J19j27o6L09k27J85l00N6p1pk84M68k62K10O7K86m60N1
$$ 75 320 248 52 55 31 49 168 41 -25 284 57 242 -58 -2 -73 -80 -364 104 -158 52 119 405 -55 -4
6067dj51m0J32M7q1J94J63m93K69j69J62j6L34k31J21j56J18n34K77J17j54K31
$$ -4 -155 -195 -63 -16 -97 97 260 -233 36 -133 29 13 347 116 237 81 199 -335 -58 59 -95 136
6089A36j92J97P9k39J38l1k3M8n8J4m5J18j20j42n0R4k4J58J39k94p2J6N7K03
$$ 136 -56 141 220 -19 119 88 65 113 55 69 24 142 22 -120 -170 -76 -100 58 197 -97 -169 -153 -96 107
6113A07J3Kj95J68j2Q0N9j72k74K10kO3m32L65R8p3j14J71p3J2k52L97o3l23K18
$$ 107 120 122 -73 95 83 163 222 50 -224 -14 -16 47 -385 -20 78 5 -109 62 -11 1 -251 146 83 -240 -22
6138b2q7P3L67l18j72n7J18L13m4m8j42J24l24J19J46k12J42k58L71j43M5J72
$$ -22 -109 -36 331 13 -159 -216 -98 215 171 123 -19 105 -219 -100 46 -166 -24 -282 89 -54 -9 163
6160A63n1r7l7kq4o0J67N3k72J72L94k87j77K69j27K3l3L00l47m04M85j56O1P7
$$ 163 112 15 -22 -24 -108 -168 -1 52 -220 -48 346 59 -118 151 24 47 14 314 -33 -437 48 -108 -47 30
6184C0Q5l00K45q4K12k4j75k78J61K05k52j60L11J36k12J53q7K9lk16J29J96p8
$$ 30 115 -185 60 -24 188 164 -11 -289 -128 77 -175 -335 -24 112 -100 53 -34 -5 -8 -224 -95 101 23
6207B3j79L31o36N27k03Q5j5N0j71J82K29l85L68p5J13j45l63K99q0J6k82K72
$$ 23 -156 175 -461 66 -137 -52 -67 -17 -188 -6 223 -162 206 131 244 99 -264 35 -45 -29 -311 -39
6229c9KL65m13lK64j69j46l5m9J31P6j49J02m8M64j86j00k41L15j2l65J43J3J04
$$ -39 -37 328 -85 -88 176 7 -139 -174 -223 -92 -16 -165 -63 -111 353 167 67 -174 141 129 -236 -93 -80 24
6253B4J84k20J74l20k1K6J78r0N8j12o7J24j23K96O6l10L08j27j58L82l43L9k36
$$ 24 208 -12 162 -158 -179 -153 25 -65 -7 -119 -186 -62 -185 111 177 -133 175 48 -110 272 -71 -32 -268
6276b68L49j32j10J96J72k6l18J54N7j51k84L22j7P6J61l99j09L65k60O00m07
$$ -268 81 -51 -161 35 207 181 -137 17 74 -77 -361 -39 -56 20 181 -218 -327 38 -222 378 -29
6297b9N9J07j21j39K54k07Q7l1j5n9M00k51j29q9J60K56n69L95l46K31J37J79
$$ -29 30 137 16 -123 131 -76 11 -20 -35 -94 306 55 -74 -163 -3 253 -316 79 -267 -36 101 280
6319B80l52J8J05lj64M58j43m66M38k45K35K25m52L11o21K95J72J62m03L79k53
$$ 280 -72 -54 51 48 -116 342 199 -267 171 -74 161 386 -66 245 -376 -81 91 253 -150 229 -24
6340b4mJ44o6k39J53L8J6q2J42j33j84N56j38k29J42q0J8k3k11M87l11j12J09
$$ -24 -28 116 50 -189 -36 2 18 -64 78 -55 -239 317 179 -50 92 12 30 7 -204 283 -28 -140 -31
6363c1l3j92N14j12k51J0k31J82K04J49j36l39N27l74n7O24m61l1N1O9q1K49j71
$$ -31 -64 -256 258 146 -105 -95 -326 -144 60 209 73 -266 261 -113 -170 454 -7 -38 13 82 1 250 79
6386G9j76J12L8j66L41q6o5L8j26j35K08K3j47Q6o3J81K1q4N0Q0k68j1J47P5k09
$$ 79 -97 15 53 -113 228 142 77 115 -11 -146 62 85 -62 24 -39 142 163 79 129 209 -59 -70 77 152 -57
6411e7J13J06q5m1n7M23k85n24jrM17%nj85K70K0O9j20j8j52K35k89L12q0l2J55
$$ -57 56 162 77 36 -21 402 117 -407 -408 -417 0 0 -5 -190 80 100 169 49 31 -121 114 -175 137 57 25 180
6437A80L5n18L8J57O0K02k26L33q5j71J35k13K39j50J40k88K92k17k30L12j66
$$ 180 215 -303 -265 -108 -48 154 -72 261 176 5 140 -73 166 16 156 -132 160 -57 -287 25 -141
6458a41K7J75L2l38K01j17J59o7J27j70J55O7k42K85Po4j89L12l35j83K55K78
$$ -141 -114 61 93 -245 -44 -161 -2 -69 58 -112 43 110 -132 153 160 96 -93 219 -116 -299 -44 234
6480B34n19K73j3q0Q2K29j97J43n1j36K64k23l6j38N20k61r3r6O5N3j6j49R6N7
$$ 234 -285 -12 -25 -105 -23 206 9 152 101 -35 229 6 -30 -168 352 91 -2 -98 -33 20 4 -145 -49 8
6504HJ2j10j67K44J57j39J88m30J51J65J98k35j33K92l07N2K0j84N00k61L3j58
$$ 8 20 -90 -257 -13 144 5 193 -237 -86 79 277 42 -91 201 -106 -54 -34 -218 282 21 54 -104
6526a04k5N5j29L65P3k82K62m70L01J07k67O9n6M71o45J63N9L19l94O3K3j25O6
$$ -104 -129 -74 -203 162 235 -47 215 -255 46 153 -114 -45 -101 370 -275 -112 -53 266 -128 -65 -42 -167 -101
6549a01o5j11K64O38j055K93J26J38k98L59l93K73l0J37l04L69k13p5J03k49M46
$$ -101 -166 -277 -13 625 -430 -137 -11 127 -171 188 -205 68 38 175 -129 240 27 -48 55 -194 252
6570B52k42M7l66M20l8r0J54k14j42L26k38L57o1no1l8O3n49P02n75J29P3M4r9
$$ 252 10 57 -309 111 73 -17 137 -77 -219 107 -131 226 165 160 99 61 124 -425 277 -298 -169 -96 -52 -151
6594a51qM5L64l19N3J28k83J85k89J26Q7K77j26j23M4k19J06j0J81j16J56o7k08
$$ -151 -159 -114 250 -69 -16 112 -171 14 -275 -149 -62 215 89 -34 10 -209 -103 -113 68 -48 108 41 -167
6617a67J86l3l6j23M6n9M10L2r7l06k3J49j86J51rJ9j87K88k98K83l6k5J06l32
$$ -167 19 -14 -50 -173 -127 -186 224 256 159 -147 -170 -21 -207 -56 -65 -46 -233 55 -243 40 4 -21 85 -247
6641b47L96lj3j15rK0J89j37Ok89J5J43m9J71j01K77k63P4k90L44n3J0j87j45
$$ -247 149 146 133 18 9 29 218 81 87 -202 -187 -44 -93 78 -23 254 -9 65 -225 119 66 76 -111 -256
6665b56M14k37P1r5J78k36j9L65J1J46l26M0l3j73L4K98m2k63L60k68L33n27J71
$$ -256 158 -79 -8 -103 75 -161 -180 185 196 342 16 56 23 -150 -116 182 140 -123 237 -31 302 -225 -54
6688e4K2k13J01J37o3J56K28k75K53j21j76k18M29l35p3J75J03k83L88j54J20
$$ -54 -32 -245 -144 -7 -70 86 314 39 292 171 -5 -223 206 -129 -202 -27 76 -207 181 27 147
6709A47M4k15P8j62K63j97L01m70M01p3l39J7M46j0l80N6J24K48n12K24R4rn9
$$ 147 191 -24 54 -108 155 -42 259 -211 190 117 -222 -205 241 231 -149 -93 31 279 -233 -9 85 76 17
6732A7J81k14P2j13n4N00l05k47K60P2k25j13K35M3j14p7j10J88J0J47m84L02
$$ 17 198 -16 56 -57 -111 389 84 -163 97 169 -56 -169 66 109 -5 -82 -192 -4 6 153 -331 -29
6754b9j83L56Lj00k16J79J72Kj46k4k65n8K83o4J21J61k40O5M6r0J83l51M01j99
$$ -29 -212 144 147 47 -169 10 182 184 38 14 -251 -309 -26 -90 31 192 -48 17 63 -27 156 -195 206 7
6778Gj24J69J26j55j45Q1R9j41P7N2K07k14K6l2j28N7PJ17j51jJ27J00l91K67
$$ 7 -117 52 178 23 -122 -41 58 -83 -6 46 253 39 65 33 -95 -38 -31 86 -65 -66 61 161 -230 37
6802C7K12m3nl65J8j39L98j32J54l20j57N43k90L65l25K41m15J14K95q9j23lL8
$$ 37 249 206 201 -164 -146 -285 113 -19 135 -185 -342 201 -89 276 -49 192 -223 -109 186 97 -26 -29 9
6825IQ8o1O7J00n63L79m5J0K99p4l45K03J50n7k13J3J9J01k40K71j12K36l65J79
$$ 9 97 36 103 203 -360 19 -26 -16 283 209 -136 67 217 160 -53 -40 -21 80 -160 111 -1 235 -130 49
6849D9k80L59j90q0L17l51QJ48r9J66n4j0j24K57k08K21k56P7K53K8k27lj25j11
$$ 49 -231 128 -62 -142 175 -176 -168 -20 -119 47 -7 -17 -141 116 -92 129 -127 -50 203 231 4 1 -124 -235
6873b35J42M18k81L95n72J49lp6J54j99K85No5j63j06L63o9l7k68R1m4J15n4k7
$$ -235 -93 325 44 439 -133 16 13 -63 91 -108 177 182 117 -46 -152 211 142 105 -163 -72 -116 -1 -55 -82
6897h2K28M8j80M4O0j98q4J70K44k76L33k88K03M1p3o42L03k2L00l3j27J70k74
$$ -82 146 194 14 58 118 -80 -164 6 250 -26 307 19 222 263 190 -452 -149 -171 129 96 -31 139 -135
6920a35O7j12K36l65K24K5k6K29m51J35L63m0j6k07n9M48n03K10J7J59k53N0m9
$$ -135 -68 -180 56 -309 -85 -60 -86 143 -308 -173 190 150 134 -73 -132 316 -187 23 40 199 -54 -4 -53
6943e3P6r3K46l9q6J72p9q3J2j61L1P5j00m5K17J37k04J28k46J95l40mP0J14O0
$$ -53 23 -70 176 137 51 223 144 61 73 -88 -57 18 -82 -127 90 227 23 151 -95 100 -240 -244 -174 -60 0
6968@n1J26o7p0p2m0J40o4J25j01j01K26k19J80m4MN7K16j80j07j17O8J68l89
$$ 0 -51 75 8 -62 -134 -174 -34 -98 27 -74 -175 51 -168 12 -32 -28 29 245 65 -42 -159 -91 77 -312
6992c12L21K27q4p5l37L85k57J96J14j03l34n7J84P7R5j9l2J09j79j00L18J5j69
$$ -312 9 236 152 77 -260 125 -132 64 178 75 -259 -316 -132 -55 40 21 -11 98 -81 -181 137 152 -17
7015a7K69j7r1j52J07q9l09K40R6l72J37K85K67q0m45N37k27J76j12j66j15N3
$$ -17 252 235 144 -8 99 10 -299 -59 37 -335 -198 87 354 274 -171 366 139 315 203 37 -78 -25
7037b5L01j41j44P9J39j46N2j06K39l66K55r7j95R7j19L11j45j99K58N3K5j89
$$ -25 276 135 -9 70 209 63 115 9 248 -118 137 40 -155 -58 -177 134 -11 -210 48 101 126 -63
7059f3k4n7K39p0L7K1n0K24j58R7j27P9k27K19l99J88J73k01J63J15k14l48M08
$$ -63 -87 -144 95 25 62 83 33 257 99 196 69 148 -79 140 -259 -71 102 -99 64 179 -35 -383 25
7082B5o9M4j39J18m6L1L7j39K72N8l16O4L00r2j14p3K19o9Q0j88M2J83j68l7K46
$$ 25 -44 0 -139 -21 -67 -36 1 -138 134 192 -124 -60 240 148 34 -39 180 111 191 3 45 228 60 23 269
7107B69l66J95J5j75P7p1k47K06J92j32J38J8J64k04k52J08r5J06J30n0N9kl00
$$ 269 -97 98 113 -62 15 -56 -303 -97 95 -37 101 119 283 79 -173 -65 -160 -54 76 26 85 83 -217
7130b17J58J2M3k42K30K72l38J07o3j72J44Q1J65j25j05j90J65N9J44M8j62J58
$$ -217 -59 -47 -4 -246 -16 256 -82 25 -38 -210 -66 15 180 55 -50 -240 -75 -16 128 176 14 172
7152A72j67n9j80L50k01K9r9J77j1p2j38J9J60j6O3J81l15k0nj2J70p5j09J85
$$ 172 5 -54 -234 116 -85 -56 -155 22 11 -61 -199 -180 -20 -36 27 208 -107 -127 -132 -144 26 -49 -158 27
7176B7k3n2j83M84l39M6J41r9J18j82L86k27N8k31K81j04k97K45J22j16O3J21
$$ 27 4 -48 -231 253 -86 -40 101 2 120 -62 324 97 155 -76 205 101 -196 49 171 55 118 239
7198B39k43j92L26l77K37k25L27k19j2L46j47K2M1j4j03l6J54j25mL32q6j75K85
$$ 239 -4 -196 130 -247 -10 -235 92 -127 -139 207 60 82 123 109 6 -30 124 -1 -5 327 241 66 351
7221C51l42P8j14r7N2J06j24M4J1q2j67L27l8J52j13j25N4L7J1L24m24j06J08
$$ 351 9 87 -27 -124 -72 34 -90 -46 -35 -117 -284 43 5 157 44 -81 -27 10 21 345 -79 -185 -77
7244g7L0q1O6Nl0J73j04j30r4K55P5K98k66j13n1J86l88L78j48mk04L86j73Q3
$$ -77 -47 -128 -62 -57 -87 86 -18 -148 -242 13 88 386 120 7 -44 142 -246 132 -16 -20 -224 162 -11 72
7268G2o2K26l42K67j30j09L06k14j04J41n6l28J06L00K6L4k51J52J39k10K68l96
$$ 72 10 236 -106 161 31 -78 228 14 -90 51 -5 -333 -227 73 99 133 -118 34 173 -37 231 -165
7290a65L70q2j51k23K03j43K93k49J97j40J34p2j74K45K8Mj06J20n02K81K50O8
$$ -165 205 123 -28 -251 -48 -191 102 -147 50 -90 44 -28 -202 43 71 75 -31 89 -413 -132 118 186
7312A86n14M52M2P3j23m02J88K24o4p4J61l72R0L4m1J63l10J06P7J79j18K19N0
$$ 186 -328 124 166 239 116 -286 -98 126 62 -12 149 -223 -133 -99 -140 23 -287 -181 -104 75 -43 176 226
7335B26n56L19p2j26M72j96K4k08N07q25M72j77K87j7j05L02n28j02M17k27l1
$$ 226 -330 -11 -83 -209 263 67 91 -117 390 -435 37 -140 147 130 25 327 -201 -303 114 -113 -144
7356a44N5K02k36J36k31K70j96N13o54L78l0j27J52j91L13m87K52o3n5o7K77j74
$$ -144 -89 113 -123 13 -218 52 -144 369 -285 93 63 -64 88 -103 210 -277 -25 -88 -143 -210 67 -107
7378a07L8N9NQ9Q2k51K73j82r8L1q4J81L1j68M4k1J48j26q0J38O7j3l03L90k68
$$ -107 -69 -10 -5 84 166 -85 188 6 -92 -61 -145 36 67 -101 -57 -78 70 -56 -136 2 69 56 -247 143 -125
7403a25O6%K35m7j57j59J43R3j3L6j2m9k2l7R0j22j23K20k22L1l0L14R6M7N7l89
$$ -125 -59 -59 176 129 -28 -187 -44 49 36 72 60 11 -11 -48 42 -80 -203 17 -205 -174 -204 110 206 253 310 -79
7429g9K69m12r1M70Q4J50j04m65J59K60k12K95q4j31k1J13j97j05J77K7j21K41
$$ -79 190 -222 -313 157 241 391 287 -178 -19 241 29 324 240 109 88 201 4 -101 76 103 -18 223
7451B23k91r8k2M06j10j96M0L73l89m25N77j75J17lk1J08m24J61M87k91J04Q7
$$ 223 -68 -166 -188 218 108 -88 -48 325 -64 -489 88 -87 30 27 6 114 -310 -149 338 47 151 238
7473B38j80j48L8J05j30Q2K5j81L07k21J97k11K47l66M50j39q9K25N2n77l8L43
$$ 238 58 -90 -52 53 -77 5 30 -151 156 -65 132 -79 168 -198 252 113 24 249 301 -276 -314 29
7495B9j05K12j70KJ07L2N3o0N2J9k95L99j70j14K05k04j22k1J34K8P5j46K01o6
$$ 29 -76 136 -34 -32 75 107 160 100 152 171 -124 275 105 -9 196 -8 -130 -151 -17 11 86 -60 141 75
7519G5p1j20m8k1K05J98k16P1k77K48l76L17j37J62k43L13P4l03L06k23K76j97
$$ 75 4 -116 -164 -185 20 218 2 73 -204 44 -332 -15 -152 10 -233 80 154 -149 157 -66 210 13
7541A3j12n8M9J37k57K79r2K53m90J82K22m9Q0j20J1j20K97j03j71K21l97J79
$$ 13 -99 -157 -108 29 -228 51 -41 212 -278 -96 126 77 157 37 48 -72 225 122 -49 172 -225 -46
7563d6R8L55p48L26R6m4r4M2P4k4j06P0k56K49R1p0m5K26l89j33M86j02m9K25
$$ -46 52 407 -341 -15 81 37 -57 -15 59 35 -71 -1 -257 -8 83 13 -32 194 -195 -328 158 56 7 232
7587B32n1m6m42J38K03k12L85m43L55k16n2L76k44K93l7j83j01Mk37L13k39K36
$$ 232 181 135 -307 -169 34 -178 207 -236 119 -97 -149 227 -17 276 239 56 -45 -41 -278 35 -204 32
7609C2J4k8K09k54J68n5J81j07j97L8n5J27K2k98L39l22R7m6N5n3K1R6j57J22
$$ 32 46 18 227 -27 141 86 267 160 -37 1 -54 73 95 -203 136 -186 -89 -135 -80 -133 -112 -16 -173 -51
7633e1J74j91O1J16j0J4N2j84o8J05l8Q5k08K93k24r8K88K7k63q3M3r1J22M23
$$ -51 123 -68 -7 109 99 113 165 -19 -87 18 -20 65 -143 150 -74 -172 116 143 -120 -203 -160 -251 -129 294
7657B94l61J09l20L00L6Q2j09K6j03j10M26m42J59J48k52mj11o7K03P2L34J0k49
$$ 294 -67 42 -278 22 58 140 31 57 -46 -156 270 -172 -13 135 -117 -121 -232 -299 -96 -24 310 320 71
7680G1j02M7j12J12K48m2m83K39P8o2K18m76K49J23j60j62M42l28k66P38k82k44
$$ 71 -31 16 -96 16 264 222 -261 -22 56 -6 212 -264 -15 108 -52 -214 228 -100 -366 372 90 -154
7702a54J88j01j8j88M35j32K9m1O4l3j16q5K15O9N5m16L92k40K78l15K27q5M1
$$ -154 34 -67 -85 -273 162 30 59 18 82 49 -67 -152 63 132 187 -229 163 -77 201 -114 113 28 69
7725F9j8r0J45k82K11k41J69J64j33l1k5K2J57R9j89k09K63P9l96K22j78K18j33
$$ 69 51 -39 106 -176 35 -206 -37 127 -6 -37 -62 -40 117 216 27 -182 81 160 -236 -14 -192 26 -107
7748a07L48l15j37K60J11j05k67J6K11k15N9J23J3j41JN9j20K01J23l0m69K76
$$ -107 241 -74 -211 49 160 55 -212 -196 15 -200 -141 -18 -5 -146 -145 -86 -206 -5 118 88 -381 -105
7770a05J27m7j1q6k5K03l30L33k10j8J22J43o0l31K80lM8J43l68J69J77k62M61
$$ -105 22 -25 -36 -122 -147 56 -274 59 -151 -169 -47 96 36 -295 -15 -18 30 173 -195 -26 151 -111 350
7793C50m03j63M68j00J14l81p2J35J53N3p7M4J41l6j53l8K6j46P5O0J79l83J6
$$ 350 -53 -216 252 152 266 -115 -187 -52 101 154 77 121 262 226 73 35 61 -85 -10 50 229 -154 -138
7816a38K52L13m15j06j97L84nj11L38p20M16j82J54J61K06m11M3L1j3J66j91j36
$$ -138 114 427 12 -94 -291 93 88 -23 315 -405 11 -171 -17 144 350 -61 -18 13 0 166 -25 -161
7838a61L34k83J27J50j49j12p7j87N09j19k72O76m44O0n2R6L3j42J57l92K86J29
$$ -161 173 -110 17 167 18 -94 -171 -358 151 32 -240 436 -8 52 0 96 129 -13 144 -248 38 167
7860A67n28L94l04K73J43j6k39K68k48Q9j64K32j94J14K43K1l7k3j86J65j71J09
$$ 167 -361 33 -271 2 145 129 -110 158 -90 -1 -165 67 -127 -13 230 251 214 191 5 170 -1 108
7882A08l08NJ42J06J9k66M3K67q9k44L67j46J46l98O6M16m62n7M03j43J21m71
$$ 108 -200 -195 -53 53 72 -194 -151 116 27 -217 150 4 150 -248 -182 234 -228 -285 118 -25 96 -375
7904c75J30J46K20j36P7Q7j41j47J22M42j79k57Q1Q3k48J77J2l2J07l38L49j80
$$ -375 -245 -99 121 -15 62 149 8 -139 -17 425 246 -11 70 153 -95 82 94 62 169 -169 180 0
7926@k9J13k4k7p0j06J68j63O4J57%L7j99J93l16K56q2q1j12L8J90m32K31J26
$$ 0 -29 84 60 33 -37 -143 25 -138 -74 83 83 120 -79 114 -202 54 -28 -109 -221 -183 7 -425 -194 -68
7950f8m7M62p6j0l24j88K81J32k08N3J81k78K13K61m54N9l6J96j45l70O38k66
$$ -68 -115 347 271 261 -63 -251 30 162 -46 7 188 -90 123 384 -70 -11 -47 149 4 -366 272 6
7972Fp2N0K10k25j25K15LP0N8p9j71J01mJ55l5j30M1R3K08n41J79J43o2j98K43
$$ 6 -66 -16 194 -31 -156 59 62 132 190 111 -60 41 37 192 157 27 68 161 369 -172 7 150 88 -110 133
7997A33j40O1j27K1K08k23K06j17j01Q1j56Q2K32K2J0j9K7k98K67k49k1Q6Pq0
$$ 133 -7 54 -73 -52 156 -67 139 22 -79 2 -154 -72 160 182 192 173 200 -98 169 -80 -101 -15 -8 -88
8021h8J56l33M18k06N3j15j41L01J33n5k74L47o0J6j67J87k58M43o43J20K57p0
$$ -88 68 -265 153 -53 0 -115 -256 45 178 123 -151 196 136 152 -15 172 -86 357 -286 -166 91 21
8043B1L7k19NK36k65pM48l05N5O5j64J41l8K92k91j04j75J77K67l14K31m64M29
$$ 21 58 -161 -156 80 -185 -192 256 -49 6 71 -93 48 10 302 11 -93 -268 -91 176 -138 93 -371 58
8066E8k03J26K9l41L85j71J32j87M3J99Q7j60K64n53K17r8o6J46o7M4M58n09L23
$$ 58 -145 -19 10 -331 54 -117 15 -172 -129 70 157 -3 261 -292 -75 -173 -239 -93 -160 -116 342 -167 156
8089A56j35L9J93j68R1j05K85l38m5j33k64N12N7j03Q7j23j48J36r2M2J39j19
$$ 156 21 60 253 85 176 71 356 18 -27 -160 -424 88 145 42 129 6 -142 -6 -98 -56 83 -36
8111c6q4J47j09J55j26M62m36J9P3k01J09K08P5l31J66r2QJ46p1L4J45j41J1k8
$$ -36 -120 27 -82 73 -53 409 -27 -8 65 -136 -27 181 256 -75 91 -1 7 153 82 116 261 120 131 103
8135A03k19K55j33J16k35K08j3j81J68m04L69o3qK52l35k2J51J61k68R0j20J41
$$ 103 -116 139 6 122 -113 95 82 -99 69 -335 34 -29 -37 215 -120 -142 9 170 -98 -8 -128 13
8157A3k06L23M8j10K16k23o0m1L36k26k15K08M2K6kn0n9o5K5m8pKj41K25N1j40
$$ 13 -193 130 178 68 284 61 1 -40 296 70 -145 63 105 131 129 79 20 -45 -20 -68 -75 -73 -214 11 62 -78
8183g8J24j76M14l66K62n9l8k55
$$ -78 46 -130 284 -82 180 121 83 -172
8191a72
$$ Imaginary data points
##PAGE= N=2
##DATA TABLE= (X++(I..I)), XYDATA
0@%%%%%%%%%%%%%%%rK1k4K4k4K4l4M6m8N3o5P4q6J01j13J32j53J72j92K18k46
$$ 0 0 0 0 0 0 0 0 0 0 0 0 0 0 0 0 -9 12 -12 12 -12 12 -22 24 -24 29 -36 38 -48 53 -60 72 -81 91 -101 117 -129
36a29K75l07L43l85M29m76N27n82O43p12P86q64R50j046J153j271J401j548J712
$$ -129 146 -161 182 -203 226 -250 277 -305 338 -374 412 -452 498 -548 605 -666 735 -813 899
55H99j896K108k349K628k963L367l863M491n315O450q111J0775j5704K7683j04820
$$ 899 -997 1111 -1238 1390 -1573 1794 -2069 2422 -2893 3557 -4554 6221 -9483 18200 -86620
70h6620j21080K70131j7309r3692J44638J2710j03154J21578K1059j21038N7734
$$ -86620 -207700 62431 45122 -48570 96068 108778 5624 127202 148261 27223 84957
81H4957L6084j22589K4530M7313r0492J7841P1746q4652l6199M7416m1083k2763
$$ 84957 121041 -1548 22982 70295 -20197 -2356 69390 -15262 -51461 -4045 -45128 -67891
93f7891L5874l8498j0306N2455j2800j862N2663j5969j3938M1801j6709j8277
$$ -67891 -32017 -70515 -80821 -28366 -41166 -43028 9635 -6334 -20272 21529 4820 -13457
105a3457M4784j4267j8890N5904j1533m4981N0133N417o4837K0559J5628n7424
$$ -13457 31327 17060 -1830 54074 42541 -2440 47693 53110 -11727 8832 24460 -32964
117c2964J5988L0750n0211P573M8326l5944j2560M2294k5297k1219M0623q851
$$ -32964 -16976 13774 -36437 -28864 19462 -16482 -29042 13252 -12045 -33264 7359 -1492
129a492k6345L6761J0920k4575J9376J2025j9913O441N056k0311K446O892j2152
$$ -1492 -27837 8924 19844 -4731 14645 26670 6757 13198 18254 -2057 389 7281 -4871
142d871J109M995p512M561K378j1971L318L421j1087N480Q541q993O172J3298
$$ -4871 -3762 1233 -6279 -1718 660 -11311 -7993 -4572 -15659 -10179 -1638 -10631 -4459 8839
156H839q554K583J2994j0031n232J1753o531q883J1089j731r996P909R78j0782
$$ 8839 285 2868 15862 5831 599 12352 5821 -3062 8027 6296 -3700 4209 5187 -5595
170e595L367K898r327n02M505l752K56M880L00J33L059K603k42l02K210K293k921
$$ -5595 -2228 670 -8657 -9159 -4654 -8406 -8150 -3270 -2970 -2837 222 2825 2583 2281 4491 6784 3863
187C863J56M828l391l126N153k664p084M338q6q960K724L349q439J398O216o169
$$ 3863 4019 8847 5456 2330 7483 4819 -2265 2073 1987 -6973 -4249 -900 -9339 -7941 -1725 -7894
203g894n58P757l573j896Q210p58l504O538J420m172M574J961m179J424J518l403
$$ -7894 -8452 -695 -4268 -6164 2046 1288 -2216 4322 5742 1570 6144 8105 3926 5350 6868 3465
219C465K17M29l726L0p53l221J14k31l041J559J129k676K448K636l453K497L497
$$ 3465 3682 4111 385 415 -338 -3559 -3445 -3676 -6717 -5158 -4029 -6705 -4257 -1621 -5074 -2577 920
236I20l120J266N200k570k97N908k445k474N109j520n116L156o47n319J930J241
$$ 920 -2200 -934 4266 1696 1399 7307 4862 2388 7497 5977 861 4017 3370 -1949 -19 1222
252A222n127O41K876l641o93K642k180j258L262p28p16K918J445o62K211J482
$$ 1222 -3905 -3264 -388 -4029 -4722 -2080 -4260 -5518 -2256 -2984 -3700 -782 663 1 2212 3694
268C694o87N81L27j038j18l17K6J16q81k83K13j845j023M87k150j480J337n56
$$ 3694 3007 3588 3915 2877 2759 2442 2468 2584 1703 1420 1633 -212 -1235 -748 -2898 -4378 -3041 -3597
286c597j354K041J279j336J673K067j478j18K566j046p47K480L08j031J584R59
$$ -3597 -4951 -2910 -1631 -2967 -1294 773 -705 -823 1743 697 -50 2430 2738 1707 3291 4250
302D250j880M0Q68k344j480Q90j264j110N12R4n68L01P47q02m31L35k28m33J028
$$ 4250 2370 2410 3278 934 -546 344 -920 -2030 -1518 -1424 -1992 -1691 -944 -1746 -2177 -1842 -2070 -2503 -1475
321a475R50J48J074J354q1k76Q23m34p18k9l1o67K26K72l43m79N02o57q50j01
$$ -1475 -525 -377 697 2051 1970 1694 2517 2083 1365 1336 1305 638 864 1136 793 314 816 159 -691 -792
341g92n12p80J12O26p9M1Q83M72l87N08j97o8j13O21j19J18R68j66n04Q80j83
$$ -792 -1304 -2084 -1972 -1346 -1425 -1384 -501 -29 -416 92 -105 -173 -286 335 216 334 1302 1136 632 1512 1329
362A329r06M3J35j032l27N95k27l47P16K74m40N1N10j106l4O45r21K72J129j62
$$ 1329 423 466 601 -431 -758 -163 -390 -737 -21 253 -187 -136 374 -732 -766 -121 -1042 -770 359 197
382A97J6J29K47l56j12Lj66l14M25l42k39N75M43l14j67J64k09n81N61q8o02P11
$$ 197 213 342 589 233 121 124 -42 -356 69 -273 -512 63 506 192 25 189 -20 -601 -40 -128 -730 -19
404a9M13k08J88M88o04n1O9l74m17J24K97l44L23K13n19K81P3m87K47K1n04L06
$$ -19 394 186 374 862 258 207 276 -98 -515 -391 -94 -438 -115 98 -421 -140 -67 -554 -307 -286 -790 -484
426d84J80K76M3L97K41n7J33q9o0k47l70L32j20k56N0N39l21m84l3k17p5q9j21
$$ -484 -304 -28 15 412 653 596 729 640 580 333 -37 295 175 -81 -31 508 187 -297 -330 -547 -622 -711 -832
449h32o9O25j70m7O21k11R5J58l0l54K83L82j80m5Q06j69l62L7Q7K7n15o8m20
$$ -832 -901 -276 -446 -493 128 -83 12 170 140 -214 69 451 271 226 1032 863 501 538 625 652 137 69 -351
472c51j35J08R7P6q3j87R4q8k15L70L7l52L87M4J20N78oj95L66P7n90M44j22l01
$$ -351 -486 -378 -281 -205 -288 -475 -381 -469 -684 -314 -277 -629 -242 -198 -78 500 494 299 665 742 152 596 474 173
496A73l6L83n77J78L6k5j46P1k29n74M54l81j28N11Pj24RM32k19p1M25p2k86M21
$$ 173 137 520 -57 121 157 132 -14 57 -172 -746 -292 -673 -801 -290 -283 -407 -398 34 -185 -256 169 97 -189 232
520B32R5P9J62kJ77l60k8J7j04j51Pp3J33n77J63O1n1L83m95j78L77N5m16L38
$$ 232 327 406 568 566 743 383 355 372 268 117 124 51 184 -393 -230 -169 -220 163 -332 -510 -133 -78 -494 -156
544a56J36m24K17O10j68l27K00O3j07O21q62M30J72j34K4R8J9k56J5l3p75J207
$$ -156 -20 -444 -227 383 215 -112 88 151 44 665 -197 233 405 271 295 393 412 156 171 138 -637 570
566E70o46n44N05j55j50M65j69m71M92J47k40K00k29k99M30J26p3J83K60o32L52
$$ 570 -76 -620 -115 -270 -420 45 -124 -595 -103 44 -196 4 -225 -524 -94 32 -41 142 402 -230 122
587A22J58j2l01K71l68J79J00l67l2O91m06n49O95K6p86O57k72mM41R7p64L15
$$ 122 280 268 -33 238 -130 49 149 -218 -250 441 35 -514 181 207 -579 78 -194 -198 243 340 -424 -109
609a09N08m23L4l7l29L80J23J94l26N34p30K20N4m80J16K97N8m44N39M0o91R12
$$ -109 399 -24 10 -27 -356 24 147 341 15 549 -181 39 93 -387 -271 26 84 -360 179 219 -472 440
631D40k10q24O58k21k58K35M6j80K52K81n48K10L31m7l72L71P8m55L93k10k2J67
$$ 440 230 -594 64 -157 -415 -180 -134 -314 -62 219 -329 -119 212 165 -207 164 242 -213 180 -30 -52 115
653A15r9k89M24j55J55L8l43j78L02l10j28M05j21J62k13L13l29K08ll96M32j7
$$ 115 16 -273 151 -4 151 189 -154 -332 -30 -340 -468 -63 -184 -22 -235 78 -251 -43 -46 -442 -10 -27
675b7R3L7K18n62K93J87J75l00K26l22q0L12k09r6K63m2j70J26p9k36K5L7M4j18
$$ -27 66 103 321 -241 52 239 414 114 340 18 -62 250 41 -55 208 166 -4 122 43 -193 -168 -131 -87 -205
699b05J9p0M46J98m67L4M3j1l32M31k14K7L41k26J54m9p1Q4M8m05K3J29J8k6O1
$$ -205 -186 -256 190 388 -79 -45 -2 -13 -345 86 -128 -101 240 14 168 119 48 132 180 -225 -202 -73 -55 -81 -20
724b0j87j01M51j61j22J36k45k05N06l75K41j93J96K70j68J78m20m0M36k96MJ59
$$ -20 -207 -308 143 -18 -140 -4 -249 -454 52 -323 -82 -275 -79 191 23 201 -219 -259 177 -119 -115 44
746D4J22J01j54r1J64l5j42o0M93n36j21N74k50k0q3n1J9j67L06k24K40O1j90
$$ 44 166 267 113 22 186 151 9 -51 442 -94 -215 359 109 89 6 -45 -26 -193 113 -111 129 190 0
769@O8J8j34L03o8l64M60Q8l00oJ55Qj94L6k48J29O4k8K71k39l0k22K44L7j12
$$ 0 68 86 -48 255 187 -177 283 371 71 65 220 228 34 70 -178 -49 15 -13 258 19 -11 -233 11 48 -64
794f4O6j02K51j52K23q5l68j1L05l19J59J04J85L2p4k94L98o9J78n50O2J04L5
$$ -64 2 -100 151 -1 222 137 -231 -242 63 -256 -97 7 192 224 150 -144 254 185 363 -187 -125 -21 14
817A4P6k9j04J85k21k41L13j37M58l07j48m6J28j2K72k04k47Q1N72n79M2J73k07
$$ 14 90 61 -43 142 -79 -320 -7 -144 314 7 -141 -187 -59 -71 201 -3 -250 -169 403 -176 -134 39 -168
840a68N2PJ67J2j4N2r1K81k9l59M8K50k98J2J3J82j00QJ74j58j63j09LJ98K26
$$ -168 -116 -109 58 70 56 108 17 298 269 -90 -42 208 -90 -78 -65 117 17 25 199 41 -122 -231 -228 -30 196
865A96k49O8j21K07J48j79j0o3K5l4q0J85j3j86o3K28k11KK11k20K78J42j76l69
$$ 196 -53 15 -106 101 249 70 60 -3 22 -12 -92 93 80 -106 -169 59 -152 -150 61 -159 119 261 85 -284
889b84M52K3l71J09r5j95K87L0q9L66n3r7n3R5k42J52l17J35J63R2k12M8q0J58
$$ -284 168 191 -180 -71 -166 -361 -74 -44 -133 233 180 83 30 125 -117 35 -282 -147 16 108 -104 -56 -136 22
913B2J24k77k08N25o1j27J5p6K79k90l3o5K68K00k58O4N6j69j89K99J24m33j4
$$ 22 146 -131 -339 186 125 -2 13 -63 216 -74 -107 -172 96 296 38 102 158 -11 -200 99 223 -210 -224
936b24K20O8k30L09j95o4K11k38K27Q8K58k90l10J94J07k04j62K37j69K59j80
$$ -224 -4 64 -166 143 -52 -116 95 -143 84 172 430 140 -170 24 131 -73 -235 2 -167 92 -88
957h8K46k27J64k31jM12l03nJ60k6J05j93l28L52r9r0R1j70K42k35K61M8Qj22
$$ -88 158 -69 95 -136 -137 275 -28 -33 127 101 206 13 -315 37 -62 -152 -61 -231 11 -224 37 85 93 -29
981b9J59N7j75L7J40k31N5K19r8j08j32J81j07N7j94q8M39k54J22m5L00m74K5
$$ -29 130 187 12 49 189 -42 13 232 134 26 -106 75 -32 25 -169 -257 182 -72 50 5 305 -169 -144
1004a44K88k60J25J82r6k33K78j24j07K77j74P6K88m10k7o6J13j8R3K7L01k04
$$ -144 144 -116 9 191 95 -138 140 16 -91 186 12 88 376 -34 -61 -127 -14 -32 61 88 389 185
1026A85k53j45L42J02l15K04M3k32J35j11P3j9l34M83l4m9k0r6K48L0m12K94k86
$$ 185 -68 -213 129 231 -84 120 163 -69 66 -45 28 9 -325 158 124 75 55 -41 207 237 -175 119 -167
1049a67L06k98K05O2m0Ko2o6q1K06j14R4p0J21j44L24j66j08P2q2J29K73m67J93
$$ -167 139 -159 46 108 68 70 8 -58 -139 67 -47 47 -23 98 -46 278 112 4 76 -6 123 396 -71 122
1073A22j17Q8j28n7N1L03k53p8J42m4m0J58j59Q9p8K5k51J98KJk73L59l51L67
$$ 122 5 93 -35 -92 -41 262 9 -69 73 29 -11 147 -12 77 -1 24 -227 -29 -27 -26 -299 60 -291 76
1097G6j31p6K69r4P8r4p8j37QN3J98m4k18J17J4q6K95j01k69K60j22n8M44m12
$$ 76 -55 -131 138 44 122 28 -50 -187 -179 -126 72 28 -190 -73 -59 -145 150 49 -220 40 -82 -140 304 -108
1121a08j64J65K72m89J40P5J18mK91j68j03P3k43l6Q6L64l03J35l25p1K81k1j28
$$ -108 -272 -107 165 -324 -184 -109 9 5 296 128 25 98 -145 -181 -95 269 -34 101 -224 -295 -14 -35 -163
1144a63O3L7J23J21o02O08Nj58k9oK60k06L7j44J11K2n2L0O2n51L62p2m9K43j05
$$ -163 -100 -63 60 181 -421 187 192 34 5 -1 259 53 90 -54 57 79 27 57 119 -432 -70 -142 -191 52 -53
1169e3K90j56J82j41N7L7Q3k74k7K9rM9l04J14K12j15nj88K28m2J05j27P7j77
$$ -53 237 81 263 122 179 216 299 25 -2 27 18 67 -237 -123 89 -26 -31 -219 9 -33 72 -55 22 -155
1193a55K82N4m28K70j40J24K68k80R2J51l01J48j49K87m13J91J66j68M17l95j57
$$ -155 127 181 -247 23 -117 7 275 -5 87 238 -63 85 -64 223 -190 1 167 -1 416 21 -136
1214a36N38k05n29J65R4K32j19k97N01q6k59J94L8k04Ok33L23K93l11M7k00L25
$$ -136 402 197 -332 -167 -73 159 40 -257 244 158 -101 93 131 -73 -67 -300 23 316 5 52 -148 177
1236A77l91M28pM2J72j97n48M80j96K03r5j88m0M4l14K71K16J64k62K75l38R0
$$ 177 -214 214 207 249 421 224 -324 156 -40 163 68 -120 -160 -116 -430 -159 57 221 -41 234 -104 -14
1258a4Q1j94r5K90p9j92j56k5M38p0n6l6J5PL76l50J7j15L23k05k4N9Pq1j37K73
$$ -14 67 -127 -222 68 -11 -203 -359 -384 54 -16 -72 -108 -93 -86 290 -60 -43 -158 165 -40 -64 -5 2 -79 -216 57
1284E7j25P1j9K89n0l10j19o2L05m6m7K53k44Qj6k58K62L0j75K33l65L94K21k82
$$ 57 -68 3 -16 273 223 -87 -206 -268 37 -9 -56 197 -47 -39 -55 -313 -51 -21 -196 37 -328 66 287 5
1308EK24J6l3l50K53j09r2J20p9L6K06n8n6k73k4N1K88j42j50J9K7m6M3k05K19
$$ 5 229 245 212 -138 115 6 -86 34 -45 -9 197 139 83 -190 -214 -163 125 -17 -167 -148 -121 -167 -124 -329 -110
1333a10J26k68K71k25K24P2j28j91L59j25l8J30k72J98j32K8L59n02K35p1J47
$$ -110 16 -252 19 -206 18 90 -38 -229 130 5 -33 97 -175 23 -109 -81 278 -224 11 -60 87
1354H7p6j44j46J53q5M00k36k08K01m9R7K8O2j45J16J66k79J01j19J1JR2L6J49
$$ 87 11 -133 -279 -126 -211 189 -47 -255 -54 -103 -6 22 84 -61 55 221 -58 43 -76 -65 -64 28 64 213
1378B13l98N8J91k54J03q4L15m0q4J16j62r0O4j73L46r5J44k08r5J94m9l29K90
$$ 213 -185 -127 64 -190 -87 -171 144 104 20 136 -26 -116 -52 -225 121 26 170 -38 -133 61 12 -317 -27
1401b7j80M10j39J17l24K29m8JK50q3J05r2j87k0J81k47O2k48M78j31m2J39q6
$$ -27 -207 203 64 181 -143 86 38 39 289 206 311 219 32 12 193 -54 8 -240 238 107 65 204 118
1424A18J24p1L71o53K73m61J61K17J89k92k20J56K79j6m03M56j81j4l4J45l35
$$ 118 242 171 542 -111 162 -299 -138 79 268 -24 -244 -88 191 175 -228 228 47 33 -1 144 -191
1445a91M14m63L84k09L33l90Q9J8j49O3K7o1P4k6J55j96J31O6K53k47M4r3o9K99
$$ -191 223 -240 144 -65 268 -122 -33 -15 -164 -101 -74 -135 -61 -87 68 -128 3 69 322 75 119 26 -43 256
1469B56m84M01j06L9j48Q7J17k7j18k38NL9J35NJ64j06j7J61l07J68O2N1l36N5
$$ 256 -228 173 67 106 -42 45 162 135 17 -221 -216 -177 -42 -37 127 21 4 165 -142 26 88 139 -197 -142
1493a42M4l3J98l39M32M5j46K6k41Q5K01K6l06J74R0k40O4oL41n1j39k21J84M0
$$ -142 -98 -131 67 -272 160 205 59 85 -156 -71 130 156 -150 24 114 -126 -62 -68 273 222 83 -138 46 86
1517H6J82k02k02R3K28k36J16j14j54J72J20j75K46k00N4J7j12P1L9J12j90L5
$$ 86 268 66 -136 -43 185 -51 65 -49 -203 -31 89 -86 160 -40 14 31 -81 -10 29 141 -49 -14
1539a4j01p2J70j96K70p2Q9j39j86J04J14p6P8M3j69J92J98l89J90k06K60k93
$$ -14 -115 -187 -17 -213 57 -15 74 -65 -251 -147 -33 -109 -31 12 -157 35 233 -156 34 -172 88 -205
1561b05J5J30j25j4O4N2l9m11L78O0J34mkL7k03L76J43k36n33M18k31K88R6j99
$$ -205 -190 -60 -185 -199 -135 -83 -122 -533 -155 -95 39 35 33 70 -133 243 386 150 -383 35 -196 92 188 -11
1585a1J2p3k24K96J49j33k52L98j08L0L6j1L2j15k2K3j87m4L31j92K29k20K2Q6
$$ -11 1 -72 -296 0 149 16 -236 162 54 84 120 109 141 26 4 27 -160 -204 127 -65 164 -56 -34 52
1609E2l23K07j91K20P9N6J15k26p8O2j55j92K33O5K9N9k63L9K89J90k36j46M3
$$ 52 -271 -64 -255 -35 44 100 215 -11 -89 -27 -182 -374 -141 -76 -47 12 -251 -212 77 267 31 -115 -72
1632g2j9L45o4l2k8k55K9J53j8r9p3J76N0n11K11L25J59j03k0l29K69J1k79J06
$$ -72 -91 254 190 158 130 -125 -96 57 39 -60 -133 43 93 -418 -207 118 277 174 154 -175 94 105 -174 -68
1656f8L11m32MO05m16m7Q6k79j7K81L9P1l22J66M8k56K16q9O9p0J84k37Q6j13
$$ -68 243 -189 -185 420 4 -43 43 -236 -253 28 67 138 -184 -18 30 -226 -10 -99 -30 -100 84 -153 -67 -180
1680a80P4R5J90j85J8j78N58l36O6K60m52J26j25J87l7j22Ok34K05P1j24k54K87
$$ -180 -106 -11 179 -6 12 -166 392 56 122 382 -70 56 -69 118 81 -41 -35 -269 -64 7 -117 -371 -84
1703h4L32j67n6j6l20j68O80l00J24K2J09m52L44k15PM4J50j31J78j23M45l74
$$ -84 248 81 25 9 -311 -479 201 -99 25 47 156 -296 48 -167 -160 -116 34 -97 81 -42 403 29
1725B9k28K81j91K16k35L8k3j5J39q8j84M26k8j34K52j62j22pM68l96j83L63k26
$$ 29 -199 82 -109 107 -128 -90 -113 -128 11 -77 -261 165 137 3 255 93 -29 -36 432 36 -147 216 -10
1748a0J2l85N26j68rM0l72J85MJ09j53L77k3j56K8Q1Q5k08j15P7L1q9K16m2j48
$$ -10 2 -383 143 -25 -34 6 -366 -181 -177 -68 -221 156 133 -23 5 86 171 -37 -152 -75 -44 -133 83 41 -107
1773a07K6n1L49O1o2l60M5%O9k7O6k22J78J55q5M2j92M7K39k63K04j31J18l3K12
$$ -107 -81 -132 217 278 216 -144 -99 -99 -30 -57 9 -213 -35 120 35 77 -115 -68 171 -92 112 -19 99 66 278
1798B78l10J47m0j1J47p0k12J07R3pj8k69J35nN5P5l9m26L41K7k15R4q9L3L27
$$ 278 -32 115 75 64 211 141 -71 36 129 122 104 -165 -30 -35 20 95 56 -370 -29 -2 -217 -123 -212 -179 148
1823A48j07R2n85N37o6LJ62j79k0k35r4M57o1K60o21L28P8J49l20J43P1R2l16
$$ 148 41 133 -452 85 19 22 184 5 -15 -250 -344 113 52 312 -309 19 97 246 -74 69 140 232 -84
1846h4J9MK3J27M3K6N9j95J0j80r2L4L42l10OK84Kp6m0k65L15j94L90j48M4l68
$$ -84 -65 -61 -38 89 132 158 217 22 32 -148 -240 -206 136 -174 -168 116 118 42 2 -263 52 -142 248 100 144 -224
1872b24J68J6k61K8M89l24n9K87l43L48l78M43k6j65m9J38l02L07n0mK76k8m27
$$ -224 -56 -40 -301 -273 216 -108 -167 120 -223 125 -253 190 164 -1 -50 88 -214 93 43 39 315 287 -140
1895a40L65m61J78K79n77J07M72l0m42K10K09k01k59J95J25p6J46j3m2j25m9L74
$$ -140 225 -236 -58 221 -356 -249 223 193 -249 -39 170 -31 -290 -95 30 -46 100 87 45 -80 -129 245
1917B45L4l80k30K15K91M2l83L25k61R7Jj56M13j2j95k42J2K27n0k3k9J99l8M6
$$ 245 279 -101 -331 -116 175 217 -166 159 -102 -5 -4 -160 253 241 46 -196 -184 43 -7 -30 -59 140 102 148
1941A48m24M14J1j87j88K65l5J68m47L61k39mk29K99K21l08K40k86K61k32Q7K00
$$ 148 -276 138 149 -38 -226 39 4 172 -275 86 -153 -157 -386 -87 134 -174 66 -220 41 -191 -104 96
1963I6j57K13L2j37j13R5M9J29j27j86R0J84Jl41K34J66j97p4K84j48j02k73L17
$$ 96 -61 152 184 47 -66 29 78 207 80 -106 -16 168 169 -172 62 228 31 -43 241 93 -9 -282 35
1986C5J19l4j39o6j27K5K12l8K39j83k2m8N0J97k79j46P6K69k41K10m3j50K21
$$ 35 154 120 -19 -85 -212 -187 25 -13 226 43 21 -27 23 220 -59 -205 -129 140 -101 109 66 -84 137
2009A37P9j26M4j04K82k99n7k01R0K38J71j76o9j20J01j38K2P4MJ67p2J94o6k33
$$ 137 216 90 134 30 312 13 -44 -245 -155 83 254 78 9 -111 -10 -148 -126 -52 -48 119 47 241 175 -58
2033e8j16K29k61J39j80M21n04M83j75j8J79j55J15q9K4N5l4K98k11j51P0J72
$$ -58 -174 55 -206 -67 -247 174 -330 153 -22 -40 139 -16 99 10 34 89 55 353 142 -9 61 233
2055B33l42m4Q5Q9k02K37O7O4j79l07L63j0M6j58p8K01J87l07K45j5l0k53mj81
$$ 233 -109 -153 -68 21 -181 56 123 187 8 -299 64 54 100 -58 -136 65 252 -55 190 175 145 -108 -112 -293
2079b93K42r8K00l03L26j66J78r5J38l3p9J63J7k6l63K74j97l0K78k63J87K11
$$ -293 -51 -149 51 -252 74 -92 86 -9 129 96 17 180 197 171 -192 82 -115 -145 133 -130 57 268
2101B68k02J83l50K65L5l09J06K29k6k80PK10K48l45j28K76k68j03p1K71j59o2
$$ 268 66 249 -101 164 199 -110 -4 225 199 -81 -74 136 384 39 -89 187 -81 -184 -255 16 -143 -205
2123b05j1J23L14m96L16L2j49L0J58k7J2n35M91M3J51k78N0o3L4J23J97k21j90
$$ -205 -216 -93 221 -275 41 73 -76 -46 112 85 97 -438 53 96 247 -31 19 -44 -10 113 310 89 -101
2146a01k4J78J12k47Q6Q0m45M05j01j31J94l4j12K64k12j27L33l66n6J45J63l31
$$ -101 -125 53 165 -82 4 84 -361 44 -57 -188 6 -28 -140 124 -88 -215 118 -248 -304 -159 4 -327
2168c27K55l6L51j69l60L18K6R9ml3k93L83q7l46J6K23k48M27k4k23J21l65K95
$$ -327 -72 -108 243 74 -286 32 58 157 153 120 -173 210 123 -223 -207 16 -232 195 171 -52 69 -296 -1
2191aK16j53p5M6j76M3L41m57N07l57O2J14j62K6O7rp6Q3j02J17Q1K36l91N7l30
$$ -1 215 62 -13 33 -143 -100 241 -216 291 -66 -4 110 -52 -26 41 32 -44 39 -63 54 135 371 -20 37 -293
2216b93O49l92q9M48l00j06K51l70L33j12l70N73l40K92P1j30k73K65j71J20k93
$$ -293 356 -36 -125 323 23 -83 168 -202 131 19 -351 222 -118 174 245 115 -158 107 -64 56 -237
2237b37L50r1KK34k32n4M1N8p2j78J94J30J34k02j33J30r6Q0j24K8kK28O9l25
$$ -237 113 22 24 258 26 -28 13 71 -1 -179 15 145 279 77 -56 74 -22 58 -66 -38 -40 188 257 -68
2261f8j89K39m2NJ55m00JM14j72j1j8J85j31o0J89j98J79l97K94j30J93o5Q5j85
$$ -68 -257 -18 -60 -55 100 -300 -299 115 -57 -68 -86 99 -32 -92 97 -101 78 -319 -25 -155 38 -27 58 -127
2285a27K56l73K57K04k42J2l15K23L12J7k80K57M7k23k48L99o1n8M24k38p1j88
$$ -127 129 -244 13 217 -25 -13 -328 -105 207 224 -56 201 248 25 -223 176 115 57 481 243 172 -16
2307a6J96j22J55k38n8K61m12L86l15R9n4K65j82O5k82K62j0p0j08M2J67j85J67
$$ -16 180 58 213 -25 -83 178 -234 152 -163 -64 -118 147 -35 30 -252 10 0 -70 -178 -136 31 -154 13
2330A3k77L2J97r1K25k16R6j2j2J14j15R9l4RK20j46o7L13j74l58J93J65j29J74
$$ 13 -264 -232 -35 -126 99 -117 -21 -33 -45 69 -46 53 19 28 248 102 35 348 174 -184 9 174 45 219
2354B19m06j23M70n3j23l1j11J55k0j56L5L4K9pK27k09j92O3R0p3L61k53K1J47
$$ 219 -187 -310 160 107 -16 -47 -158 -3 -23 -179 -144 -110 -81 -88 139 -70 -262 -199 -109 -182 179 -74 -53 94
2378I4L4j10j74J52Q0j67Q5k19L59k60J69J27J5j57o9M33n04K56K0j77J20k58
$$ 94 128 18 -156 -4 76 -91 -6 -225 134 -126 43 170 185 28 -41 392 -112 144 164 -13 107 -151
2400a51K81p6k26K97j03j00J34k46L20j86J86j16l59O09r5m03K01J46j34J70l09
$$ -151 130 54 -172 125 22 -78 56 -190 130 -56 130 14 -345 264 169 -234 -33 113 -21 149 -160
2421a60K87m7j19Q1K0J3l57N13m40J16M41n17L50j84J20j2L3l3k19k3K72p8l46
$$ -160 127 80 -39 42 62 75 -282 231 -209 -93 348 -169 181 -3 117 105 138 105 -114 -137 135 57 -289
2444b89K33n8j9N7J0N1J85m05J06J67k88K03n8J02R2M76n74L8J52k54J28j21J72
$$ -289 -56 -114 -133 -76 -66 -15 170 -235 -129 38 -250 -47 -105 -3 89 565 -9 29 181 -73 55 -66 106
2467A06j58j27J00l6L6Qp5J44j17J60p7N4l66N06M8l31%K91K19l99j18K04j3k18
$$ 106 -52 -179 -79 -115 -79 -71 -146 -2 -119 41 -36 18 -348 158 206 -125 -125 166 385 -14 -132 72 59 -159
2491a59M1M27o47L17N1l85L85Rp6K66k21J13k60q0M24j32J31l55L91l31L28m30
$$ -159 -118 309 -338 -21 30 -355 30 39 -37 229 8 121 -139 -219 205 73 204 -151 240 -91 237 -193
2513a93M75r8j68L40k23q8j27M0j39N0j11L14n3l02L00nj34K08L41n70K87j41
$$ -193 282 184 16 356 133 45 -82 -42 -181 -131 -242 72 19 -283 17 12 -122 86 427 -143 144 3
2535Cj35J76k69K40k28j00M08J43k99j07J54o5K73k01l7O4o1r3Q6r3L24k02l1
$$ 3 -132 44 -225 15 -213 -313 95 238 -61 -168 -14 -79 194 -7 -44 20 -41 -134 -48 -141 183 -19 -50
2558e0M33k84q8J45m7k28J32r7Q9k23J47K11j35k1l6Q4p8j84L66j39k6M18j33
$$ -50 383 99 11 156 109 -119 13 -84 5 -218 -71 140 5 -16 -52 32 -46 -230 136 -3 -29 389 256
2581B56n13K10J38o7J13L5p1J09j33K19j91j77J92j30K38k46q5J10j3l77M36j52
$$ 256 -257 -47 91 24 137 172 101 210 77 296 105 -72 120 -10 228 -18 -103 7 -6 -383 53 -99
2603i9J32O4j24K04k33K02J64k04l34J89j77K87M3j2Ln9J12l48K78k40K09m3J79
$$ -99 33 97 -27 177 -56 146 310 106 -228 -39 -216 71 114 102 105 46 158 -190 88 -152 57 14 193
2626A93q5k84M89l5n79J11P4N5K77l6j3q6k44qL37l39M70l44J60K02j96j16j24
$$ 193 108 -176 313 278 -301 -190 -116 -61 216 180 167 81 -163 -171 166 -173 297 -47 113 315 119 3 -121
2649a21N22o16L74k23k58K2L01K19j24n7J76k72l3N4Rq4J68K02Jm19r6M98j39
$$ -121 401 -215 159 -64 -322 -300 1 220 96 39 215 -57 -90 -36 -27 -111 57 259 260 -159 -255 243 104
2672A04r2J97k34J69j15j19r1J44l7j50L31k88J20J59j3k49L0J25J39m9k11r0
$$ 104 12 209 -25 144 29 -90 -181 -37 -74 -224 107 -181 -61 98 85 -164 -134 -9 130 81 -130 -220
2694b20J33K58j61j29L13j01k07J8J16L1k04K38J64j83l9j47J73j19K6J91q8L9
$$ -220 -87 171 10 -119 194 93 -114 -96 20 51 -153 85 249 66 27 -120 53 -66 -40 151 63 102
2716A02k97J19J42K15k64j25J25R9k48K19o5k3K96k21j3k29M19p1k07j42K62l2
$$ 102 -195 -76 66 281 17 -108 17 116 -132 87 22 -1 295 74 61 -168 251 180 -27 -169 93 61
2738F1l61J52K31l63K01K11j00qpk30M53m10L60J0j56M1j49q2J20Q4l02K93Lj7
$$ 61 -300 -148 83 -280 -79 132 32 24 17 -213 240 -170 190 200 44 85 -64 -146 -26 58 -244 49 52 35
2762C5k8q3K78k56J63l64K80j84M30j83kO4k7l70L67jl87J79q0P1P1J53m10K60
$$ 35 7 -76 202 -54 109 -255 25 -159 271 88 86 150 123 -247 120 119 -268 -89 -169 -98 -27 126 -284 -24
2786b4L16l85K83m04K20K23j66j67K53K1k12k2J84l50J89K5k74M41j60J17q1j09
$$ -24 292 -93 190 -214 6 229 63 -104 149 170 -42 -64 120 -230 -41 -16 -290 151 -9 108 27 -82
2808h2j30L90l16K70RK4K8k88l0J16k07K82j31%M26l20nl29M94m55L2J46N9K26
$$ -82 -212 178 -138 132 141 165 193 -95 -125 -9 -216 66 -65 -65 361 41 36 -293 201 -254 -222 -76 -17 209
2832B09l57J22L30l87k12O50n81K93l23M07m38L24o7M4J00l33L93l63O9Q0K36
$$ 209 -148 -26 304 -83 -295 355 -226 67 -256 151 -287 37 -30 14 114 -219 174 -189 -120 -40 196
2853A96k09R0m1q9J26N0k0l04qJ80l08L22r5L27o59M19j6J12j46j5J1K85k86J04
$$ 196 -13 77 36 -53 73 123 103 -201 -209 -29 -337 -15 -110 217 -442 -23 -39 73 -73 -88 -77 208 -78 26
2877B6J96j59o9kj09K07j19R8l7k02J30J66k60M2L8j7j59M6Q2OK10l37K72k23
$$ 26 222 63 -6 -8 -117 90 -29 69 32 -170 -40 126 -134 -92 -54 -71 -230 -184 -102 -96 114 -223 49 -174
2901a74j00L65k04J84j45L12l78L77k92j90k5K72m0J08N0l90K78l45L87rj78k9
$$ -174 -274 91 -113 71 -74 238 -140 237 -55 -245 -270 2 -38 70 120 -270 8 -337 50 41 -137 -166
2923a66L66k38J7m4j8k5P9ojK2M3O3Q4J68k54k3j73J37o3R0J95k10K5j26k67L47
$$ -166 200 -38 -21 -65 -83 -108 -29 -35 -36 -14 29 92 176 344 90 67 -106 31 -32 58 253 43 68 -58 -325 22
2949B2q0P1k2M4O9k75R8m9N3K42j67j74L84k04J1q4r8M32m61O56l93k10K10M6
$$ 22 -58 13 -9 35 104 -171 -73 -122 -69 173 6 -168 216 12 23 -61 -159 273 -188 468 75 -135 75 121
2973A21K8R1j8j44q8M1J55j21J69l93N7K29M2M2P1m0l70l9J82J89l16K65j64K20
$$ 121 149 240 222 78 -10 31 186 65 234 -159 -102 127 169 211 282 242 -128 -167 15 204 -112 153 -11 209
2997B09l3J22r9m2k98L6J12jK41k00l6k1K24K76n59k21J63J5J92j73L41k82p9
$$ 209 176 298 199 157 -141 -105 7 6 247 47 11 -10 214 490 -69 -290 -127 -112 80 -93 248 -34 -113
3020a13m5K85l23K55k58K65n2l10M12k8l95M50j63l59L43P2q7J95J8j39m9L17
$$ -113 -158 127 -196 59 -199 66 14 -296 116 88 -307 143 -20 -379 -36 36 -51 144 162 23 -26 291
3042B91m42K6L07k43q%J95l89J04J82L7j7j27RL3j05Q9j91J99o5j4N13m65L29
$$ 291 -151 -125 182 -61 -69 -69 126 -263 -159 23 60 43 -84 -75 -42 -147 -58 -249 -50 -115 -129 384 -81 248
3066B48j43J51k63J09j14Q8K1k63N31l91J90k2j31l8M5o8o9Q6k7M29m18k43L61
$$ 248 105 256 -7 102 -12 76 97 -166 365 -26 164 142 11 -27 18 -50 -119 -33 -60 369 -49 -292 69
3089F9P8l03J36M80l95J56k28r4K68k50N2Q8j2m6q5L3q5J60J86L3k8l74j24J5
$$ 69 147 -156 -20 460 65 221 -7 -101 167 -83 -31 57 45 -1 -86 -53 -138 22 208 241 213 -161 -285 -270
3113b70L26k76K01O5r6J71j37q0O4LR3J64j89K1j53P3L65n80K88O0J6K4j76K7
$$ -270 56 -220 -19 46 -50 121 -16 -96 -32 -29 64 228 39 60 -93 -20 345 -235 53 113 129 153 -23 4
3137Dn1j59J39j79p3M78m7j09K53l51j02K33n1L40k12J28k09j60R7K35m8j31j56
$$ 4 -47 -206 -67 -246 -319 159 112 3 256 -95 -197 36 -15 325 113 241 32 -128 -31 204 156 25 -131
3160a31m0j6K47n02N21p9M5o0j52M23j70k77M1J57Q7J6M7k60J24Q1k07M30j72
$$ -131 -171 -187 60 -442 79 0 45 -15 -167 256 86 -191 -150 7 94 110 157 -103 21 102 -105 325 153
3183A53k70Q7q3J74j72J29J13M7j53l7j15J61J08mj4j20J38l41N8J37L1J6r5K2
$$ 153 -117 -30 -113 61 -111 18 131 178 25 -12 -127 34 142 138 124 4 142 -199 -141 -4 27 43 -52 -30
3207c0K5k1J28j41M50o00L19k10Q7J19q7K92m67L53l91J08J93o0N6k18rM10k75
$$ -30 -5 -26 102 -39 411 -189 130 -80 7 126 39 331 -136 217 -174 -66 127 67 123 -95 -104 306 31
3230C1j14K37l35K28N7p0k62M07l24j24O19l75k22P4L75j24K5k92J62R7Q7L4l12
$$ 31 -83 154 -181 47 104 34 -228 179 -145 -269 350 -25 -247 -173 202 78 103 -189 -27 70 157 191 -121
3253a21K76j06k88K57l83J20O42m17O4k53L64k94L57O1k80R0J79k34K69l73K12
$$ -121 155 49 -239 18 -365 -245 397 -20 44 -209 155 -139 218 279 -1 89 268 34 303 -70 142
3274A42j59L1n4p9K94k43L60k99rk55L28P5j87L0J24k26L43j77j59L6J71j91J14
$$ 142 -17 14 -40 -119 175 -68 292 -7 -16 -271 57 132 -55 -25 99 -127 216 39 -120 -84 87 -104 10
3297A0r0nJ74K8j65P4j89P9p3K11J94j31k15J83n0k23L50J25l61P9q4K68o75K99
$$ 10 -80 -85 89 117 -48 26 -163 -84 -157 54 248 117 -98 85 35 -188 162 287 -74 5 -79 189 -486 -187
3321a87L63l27L37k44L33k23Rn7K05j78O6k47J23Q2n4K68m17M2O7P8k42oK87l55
$$ -187 176 -151 186 -58 275 52 61 4 209 31 97 -150 -27 55 1 269 -148 -106 -39 39 -203 -209 78 -277
3345b77J21L5Q7L8J82j34l3N8L90k69l30O02n13j57o0N15k72K18j64k31J96Q9
$$ -277 -156 -121 -34 4 186 52 19 77 467 198 -132 470 -43 -200 -260 255 -17 201 37 -194 2 91
3367I1Km45M82j55J7J85l26R5J59k7j98J05K11k35L26j68k30J86Nl8q4o5J85p2
$$ 91 93 -352 130 -25 -8 177 -149 -54 105 78 -120 -15 196 -39 287 119 -111 75 80 42 -42 -107 78 6
3391FO0k68k35O24J8k66L24j44K08l71o4J72J41j17k8k56J96Q5k47J60K81m68
$$ 6 66 -202 -437 187 205 -61 263 119 327 -44 -108 64 205 88 60 -196 0 85 -162 -2 279 -189
3413a89K97N2p2M7m0p1k81O21l88q6J17o2K83J56l15J0P5k72kj14M7K84j99K2
$$ -189 108 160 88 135 95 24 -257 364 -24 -110 7 -55 228 384 69 79 154 -118 -120 -234 -187 97 -102 -80
3437h0k04L19k99L91l65L68j81k47M02j05k16K19k9L0O9J1J46r2r4k08K47r3P2
$$ -80 -284 35 -264 127 -238 130 -51 -298 104 -1 -217 2 -27 3 72 83 229 137 43 -165 82 -11 61
3460F1K4j7K72k16j63R4j50J16K0j54P7O8j06Q1p5J82N5L13l68j30P9j56j62L15
$$ 61 85 68 340 124 -39 55 -95 21 41 -113 -36 32 -74 7 -68 114 169 482 114 -16 63 -93 -255 60
3484F0k46L42Lk29k8J51k0J04M5k47l4j37M47j77J17k89k00N13k82j20K19K10
$$ 60 -186 156 159 -70 -98 53 33 137 182 -65 -99 -236 211 34 151 -138 -338 175 -107 -227 -8 202
3506B02l56K29q2l26L22N22k23k78K7k61L0N3m6J09J88j63N1J26j73K2J6N6J82
$$ 202 -154 75 -7 -333 -11 511 288 10 37 -224 -194 -141 -187 -78 110 -53 -2 124 -49 -27 -11 45 227
3529B27k22j94M38k97qj47J08RL29j82M06o40K4L3q9K42K25k66m3M19l92J09j05
$$ 227 5 -189 249 -48 -56 -203 -95 -86 243 61 467 -173 -149 -116 -205 37 262 -4 -47 372 -20 89 -16
3552a6k43K00j7J13J91j35j50MK59k49k22K2L78L9j61J19l83R2K00Q2o7N8k75
$$ -16 -259 -59 -76 37 228 93 -57 -53 206 -43 -265 -243 135 174 13 132 -251 -159 41 123 56 114 -161
3575a61L79j10m7J78j32l6l5Oj34K44R5l98J63L1k15k70K30L37n3j05J42Q8k04
$$ -161 218 108 61 239 107 71 36 42 -92 152 247 -151 12 43 -172 -442 -212 125 72 -33 109 197 -7
3598gJ25M9k69K12j0j1j11o1K79j90m7M6j17K65j44o3K31l46l9J9q2L77j83M67
$$ -7 118 167 -102 110 100 89 -22 -83 196 6 -41 5 -112 153 9 -54 177 -169 -208 -189 -271 106 -77 390
3622C90m94J28R8m41K06J24J28k25K18j02l9k06L44k08J10j66J1L40m86K98j8
$$ 390 -104 24 122 -319 -113 11 139 -86 132 30 -9 -215 129 -79 31 -135 -124 216 -270 28 10
3643A0k06M46l15O2K47k66j13m2J24K30o9j7r6n9O1K3J94j95j90J63O6jk53M42
$$ 10 -196 250 -65 -3 244 -22 -135 -177 -53 177 108 91 -5 -64 -3 20 214 19 -171 -8 58 57 -196 246
3667B46j70N6m0k0J01j78j29L20l17P2J17L2k11P3q0j24J37o2J88k61J12J52K62
$$ 246 76 132 92 72 173 -5 -134 186 -131 -59 58 90 -121 -48 -128 -252 -115 -177 11 -250 -138 14 276
3690B76k56l10M54k8l48L0K30J6j34Q3j91K67j46k49N19j47k98J67L42r6j35p2
$$ 276 20 -290 164 136 -212 -182 48 64 -70 13 -178 89 -57 -306 213 66 -232 -65 277 181 46 -26
3712b6l0J66k2J91n03J96Q0J32k65K13k15l7K73j88K95l26P9J11k7j22j67J59
$$ -26 -56 110 88 279 -224 -28 52 184 -81 132 -83 -120 153 -35 260 -66 13 124 97 -25 -192 -33
3734c3l0R0P6m72M04j83m1L82l19J32K3K13l66j29M41J00m57K96J07l88q4M05
$$ -33 -63 27 103 -369 35 -148 -189 193 -126 6 29 242 -124 -253 188 288 -169 127 234 -154 -238 167
3756A67j67R4M6O6r0k29J33J74j98j87K07J09p0m8j69M7ML8nk9K25j7j68K40J8
$$ 167 0 94 140 206 116 -113 20 194 -4 -191 16 125 55 7 -162 -115 -111 -73 -78 -107 118 101 -67 173 191
3781A91r9k1J41k26K40j98p5oj90J87l8N7L8Q2l52K79O6l67L82J38l94L26k43
$$ 191 92 71 212 -14 226 28 -47 -53 -243 -56 -94 -37 1 83 -269 10 76 -291 91 229 -165 161 -82
3804h2J76j31K9K6o6m22N49rj05n7L17k51k6m3O2J34p6J3r9l23N63k17p7N03k53
$$ -82 94 -37 -8 18 -48 -470 79 70 -35 -92 225 -26 -52 -95 -33 101 25 38 -61 -384 179 -38 -115 388 135
3829A35j01m2k9q8j15K97q1j47L03oj9j76R9k39J65K32p9l09J29j30K60M5j23
$$ 135 34 -8 -37 -125 -240 57 -24 -171 132 126 107 -69 30 -209 -44 188 109 -200 -71 -201 59 104 -19
3852a9m16L35L06l63j55M56r8Q8k5j8r3m48O41j3l37R5J03J66j56p2j06M16k02
$$ -19 -435 -100 206 -157 -312 144 46 134 109 91 -2 -450 191 178 -159 -64 39 205 49 -23 -129 287 85
3875H5J1j1j75J19k69L92j13l18J94J16K96m70qJ50j17J39L5JK9J82l16j37lL18
$$ 85 96 85 -90 29 -240 152 39 -279 -85 31 327 -143 -151 -1 -118 21 56 57 86 268 -48 -185 -188 130
3899A30l41K84j25j93J47m1J68k6k60k7L14L53k71N2p3j15J14l13J01J44J72k20
$$ 130 -211 73 -52 -245 -98 -139 29 3 -257 -284 30 383 112 164 91 -24 90 -223 -122 22 194 -26
3921b6P7j4j35Q1n1L3j10K53k10J77m39j7L31K52k11j32L92n5k26O4Q0j10j08
$$ -26 51 37 -98 -17 -68 -35 -145 108 -102 75 -364 -381 -50 202 -9 -141 251 196 -30 34 114 4 -104
3944a04K38m0O8NL58o39K61J88m55R5J8j22N6k10J8L39j30k72L39Q5P8k67j82
$$ -104 134 94 162 167 525 -114 147 335 -120 -25 -7 -129 -73 -283 -265 74 -56 -328 11 96 174 -93 -275
3967b75J53K95o4k93K67p8J98k44J00J12jM5k61J51Km45L62J90j25n6k04K52n
$$ -275 -122 173 109 -184 83 5 203 -41 59 171 170 215 -46 105 107 -338 24 214 89 33 -171 81 76
3990G6k80L27lk19R2R6j41K06m6j26j38o5J17J79N5k03K10M6r8l07J73r1K04J79
$$ 76 -204 123 120 -99 -7 89 -52 154 108 -18 -156 -221 -104 75 130 -73 137 183 85 -222 -49 -140 64 243
4014B43l43J03l7K3l8q6J83m2j70o2L35j43p5J58j60Q7j83K6qo6L12q5L09k21
$$ 243 -100 3 -34 -11 -49 -135 48 6 -164 -226 109 -34 -109 49 -111 -24 -207 -181 -189 -255 57 -28 281 60
4038F0K57j43K20k86K8J16l53J03j05L85j83p1j38J46L8k39K33J83l57J27P6j33
$$ 60 317 174 394 108 136 252 -101 2 -103 282 99 28 -110 36 74 -165 68 251 -106 21 97 -36
4060c6J2K6k76N33k60p0K99j50p6Rk88K08J34l44K66n3J86k32K78k36J36q5J08
$$ -36 -24 2 -274 259 -1 -71 228 78 2 11 -277 -69 65 -279 -13 -66 120 -112 166 -70 66 -19 89
4083H9J98j99nk5r8n3P7R8j17J2l0J11J34n2k25J16mj66J05j83L0J38k7k3k10
$$ 89 287 88 83 58 -40 -93 -16 82 -35 -23 -53 58 192 140 -85 31 27 -139 -34 -217 -187 -49 -76 -99 -309
4108c09L94j11J36J84j76k26j97L02P5l24M25K14l19K65j72j28J28j87j91Q4n9
$$ -309 85 -26 110 294 118 -108 -305 -3 72 -252 173 387 68 333 161 33 161 -26 -217 -133 -192
4129a92L59j28n40M39K00o8j5k4P6j53Q6JL8J54k32j72K82k6j92J06l7pK31k17
$$ -192 167 39 -501 -62 138 70 55 31 107 -46 40 41 79 233 1 -171 111 85 -107 -1 -38 -45 186 -31
4153c1R8j09J68m5J38j17n4j84K83k99J77k16j28M47l1j37J12j23j0L3Q5p8l90
$$ -31 67 -42 126 81 219 102 48 -136 147 -152 25 -191 -319 128 97 -40 72 -51 -61 -28 57 -21 -411
4176d11O26j2r5j28J15j51J19l64k70K57M67j61q2j24M50p5m8J64k99j49K89l8
$$ -411 215 203 108 -20 95 -56 63 -301 -571 -314 153 -8 -90 -214 236 161 113 277 -22 -171 118 80
4198H0p9J78j19o1J68q0qK1m2o5o8m2J60n7n3J53K1j39J9J30j40P4j7J99q5l67
$$ 80 1 179 60 -1 167 87 79 100 58 -7 -75 -117 43 -14 -67 86 107 -32 -13 117 -23 51 34 233 148 -219
4224b19K52k87J50k15K55K46k88M14l67J11P2o7J91m5j6K9m25J08J0J01L14J4
$$ -219 33 -254 -104 -319 -64 182 -106 308 -59 52 124 57 248 203 187 216 -209 -101 -91 10 324 338
4246C38m85J32K70m97L38k23O0J82k24J48N5k42K99rj57j77J35M3J26j16K37J82
$$ 338 -147 -15 255 -242 96 -127 -67 115 -109 39 94 -148 151 142 -15 -192 -57 -14 112 -4 233 415
4268D15l64r6JK87k55k91K77P8Q1r3p2Oj30L21p3J81j52K27l41n7m6m2J87j76
$$ 415 51 -45 -44 243 -12 -303 -26 52 133 40 -32 -26 -156 165 92 273 121 348 7 -50 -96 -138 49 -127
4292a27O3k59k0J95L79m01J29j60R5m4q6L17K54j88j65K92j90J0j66J76o0J97
$$ -127 -64 -323 -343 -148 231 -170 -41 -201 -106 -150 -236 81 335 147 -18 274 84 94 -72 104 44 241
4314B41k01J2j26J76N7L0l11L2J09r3oM6J03knJ3J1O3j84j8P8J75k33R8k59j44
$$ 241 40 52 -74 102 159 189 -122 -90 19 -74 -80 -34 69 67 62 75 86 149 -35 -53 25 200 -33 65 -194 -338
4340c38M95o09P36m97j10R2M51l85J40J61j16n8j56L37l31L01j22j85J21q2J80
$$ -338 157 -452 284 -213 -323 -231 220 -165 -25 136 20 -38 -194 143 -188 113 -9 -194 -73 -155 25
4361B5k29R3o6N84l79J10J8k97M06m48M85j95K6k67K78p4k16M14j54j51M8K63
$$ 25 -204 -111 -177 407 28 138 156 -141 265 -183 302 107 133 -134 144 70 -146 268 114 -37 11 274
4383B74k54Q5j4j04j8j39L52p9j1l81L67j14K3k1oO7N2q6j19R3j58K2J46L49j6
$$ 274 20 105 91 -13 -31 -170 182 103 92 -289 78 -36 -13 -34 -40 27 79 -7 -126 -33 -191 -169 -23 326 310
$$ [...]
8191B8
##END NTUPLES=NMR FID
##END=
