##TITLE=31Pdec_SR_137_rm1h
 , 24 sc
 27.7.2022
##JCAMPDX= 6.0         $$ Bruker NMR JCAMP-DX V2.0
##DATA TYPE= NMR SPECTRUM
##DATA CLASS= NTUPLES
##ORIGIN= UXNMR, Bruker Analytische Messtechnik GmbH
##OWNER= root
$$ XWIN-NMR		Version 3.5
$$ Wed Jul 27 17:05:06 2022 Russian Standard Time (UT+4h)  she@DPX200
##.OBSERVE FREQUENCY= 81.013821
##.OBSERVE NUCLEUS= ^31P
##.ACQUISITION MODE= SIMULTANEOUS
##.ACQUISITION SCHEME= undefined
##.AVERAGES= 24
##.DIGITISER RES= 16
##SPECTROMETER/DATA SYSTEM= spect
##.PULSE SEQUENCE= zgpg30
##.SOLVENT NAME= CDCl3
##.SHIFT REFERENCE= (INTERNAL, CDCl3, 0, 248.564)
##AUDIT TRAIL= $$ (NUMBER, WHEN, WHO, WHERE, WHAT)
$$ ##TITLE= Audit trail, XWIN-NMR		Version 3.5
$$ ##JCAMPDX= 5.01
$$ ##ORIGIN= Bruker BioSpin GmbH
$$ ##OWNER= she
$$ F:/spectra/data/she/nmr/P31/1/pdata/1/auditp.txt
$$ ##AUDIT TRAIL=  $$ (NUMBER, WHEN, WHO, WHERE, WHAT)
(   1,<2022-07-27 16:48:31.45 +0400>,<she>,<DPX200>,
      <created by zg, POWCHK disabled, PULCHK disabled
       configuration hash MD5:
       00 E9 B6 7A A2 85 ED C7 34 08 36 98 17 FE 4E 26
       data hash MD5: 32K
       F0 6E 29 58 CB 18 CA 77 75 BD D6 23 1C DD 4E A8>)
(   2,<2022-07-27 16:48:33.84 +0400>,<she>,<DPX200>,
      <Start of raw data processing
       efp BC_mod = 2 LB = 1 FT_mod = 6 PKNL = 1 PHC0 = -10277.57 PHC1 = 106.4568 SI = 64K 
       data hash MD5: 64K
       A6 78 B2 7D 47 E6 30 CC CF 44 0C 26 47 94 C1 C3>)
(   3,<2022-07-27 16:48:59.39 +0400>,<she>,<DPX200>,
      <pk PHC0 = -88.88766 PHC1 = 221.5999 
       data hash MD5: 64K
       92 70 DB EF 56 F9 46 E7 5A 12 C3 06 B1 78 8E 98>)
(   4,<2022-07-27 16:49:04.87 +0400>,<she>,<DPX200>,
      <abs ABSG = 5 
       data hash MD5: 64K
       C3 8F 4A 49 53 06 72 B0 60 8D F2 44 2E D8 59 F4>)
$$ ##END=
$$ 
$$ hash MD5
$$ 05 39 4B 22 AD D2 CD 48 80 07 F4 E0 F7 31 73 D3
##$RELAX= 
##$RELAX= 
##$RELAX= 
##$RELAX= 
##$RELAX= 
##$RELAX= 
##$RELAX= 
##$RELAX= 
$$ Bruker specific parameters
$$ --------------------------
##$DU= <F:/spectra>
##$EXPNO= 1
##$NAME= <P31>
##$PROCNO= 1
##$TYPE= <nmr>
##$USER= <she>
##$AMP= (0..31)
100 100 100 100 100 100 100 100 100 100 100 100 100 100 100 100 100 100 
100 100 100 100 100 100 100 100 100 100 100 100 100 100 
##$AQSEQ= 0
##$AQ_mod= 1
##$AUNM= <au_zg>
##$AUTOPOS= <>
##$BF1= 81.014009
##$BF2= 200.13
##$BF3= 200.13
##$BF4= 200.13
##$BF5= 200.13
##$BF6= 200.13
##$BF7= 200.13
##$BF8= 200.13
##$BYTORDA= 1
##$CFDGTYP= 0
##$CFRGTYP= 5
##$CHEMSTR= <none>
##$CNST= (0..31)
1 1 145 1 1 1 1 1 1 1 1 1 1 1 1 1 1 1 1 1 1 1 1 1 1 1 1 1 1 1 1 1 
##$CPDPRG= <waltz16>
##$CPDPRG1= <>
##$CPDPRG2= <waltz16>
##$CPDPRG3= <>
##$CPDPRG4= <mlev>
##$CPDPRG5= <mlev>
##$CPDPRG6= <mlev>
##$CPDPRG7= <mlev>
##$CPDPRG8= <mlev>
##$CPDPRGB= <>
##$CPDPRGT= <>
##$D= (0..31)
0 1 0 0 0 0 0 0 0 0 0 0.03 2e-05 3e-06 0 0 0 0 0 0 0 0 0 0 0 0 0 0 0 0 
0 0 
##$DATE= 1658926110
##$DBL= (0..7)
120 120 120 11 120 120 24 19 
##$DBP= (0..7)
150 150 150 150 150 150 150 150 
##$DBP07= 0
##$DBPNAM0= <>
##$DBPNAM1= <>
##$DBPNAM2= <>
$$ [...]
##$SUBNAM3= <"">
##$SUBNAM4= <"">
##$SUBNAM5= <"">
##$SUBNAM6= <"">
##$SUBNAM7= <"">
##$SUBNAM8= <"">
##$SUBNAM9= <"">
##$SW= 501.771253377433
##$SWIBOX= (0..15)
0 1 3 0 0 0 0 0 0 0 0 0 0 0 0 0 
##$SW_h= 40650.406504065
##$TD= 32768
##$TD0= 1
##$TE= 0
##$TE2= 300
##$TE3= 300
##$TEG= 300
##$TL= (0..7)
0 120 53 12 22 120 120 120 
##$TP= (0..7)
150 150 150 150 150 150 150 150 
##$TP07= 0
##$TPNAME0= <>
##$TPNAME1= <>
##$TPNAME2= <>
##$TPNAME3= <>
##$TPNAME4= <>
##$TPNAME5= <>
##$TPNAME6= <>
##$TPNAME7= <>
##$TPOAL= (0..7)
0.5 0.5 0.5 0.5 0.5 0.5 0.5 0.5 
##$TPOFFS= (0..7)
0 0 0 0 0 0 0 0 
##$TUNHIN= 0
##$TUNHOUT= 0
##$TUNXOUT= 0
##$USERA1= <user>
##$USERA2= <user>
##$USERA3= <user>
##$USERA4= <user>
##$USERA5= <user>
##$V9= 5
##$VALIST= <valist>
##$VCLIST= <CCCCCCCCCCCCCCC>
##$VD= 0
##$VDLIST= <DDDDDDDDDDDDDDD>
##$VPLIST= <PPPPPPPPPPPPPPP>
##$VTLIST= <TTTTTTTTTTTTTTT>
##$WBST= 1024
##$WBSW= 4
##$XGAIN= (0..3)
0 0 0 0 
##$XL= 0
##$YL= 0
##$YMAX_a= 10286
##$YMIN_a= -14668
##$ZGOPTNS= <>
##$ZL1= 120
##$ZL2= 120
##$ZL3= 120
##$ZL4= 120
##$ABSF1= 248.5645
##$ABSF2= -253.2056
##$ABSG= 5
##$ABSL= 3
##$ALPHA= 0
##$AQORDER= 0
##$ASSFAC= 0
##$ASSFACI= 0
##$ASSFACX= 0
##$ASSWID= 0
##$AUNMP= <proc_1d>
##$AZFE= 0.1
##$AZFW= 0.5
##$BCFW= 0
##$BC_mod= 2
##$BYTORDP= 0
##$COROFFS= 0
##$CY= -3
##$DATMOD= 1
##$DC= 0
##$DFILT= <>
##$DTYPP= 0
##$F1P= 0
##$F2P= 0
##$FCOR= 1
##$FTSIZE= 65536
##$FT_mod= 6
##$GAMMA= 0
##$GB= 0
##$INTBC= 1
##$INTSCL= 5.30512e-09
##$ISEN= 30
##$LB= 1
##$LEV0= 0
##$LPBIN= 0
##$MAXI= 10000
##$MC2= 0
##$MEAN= 0
##$ME_mod= 0
##$MI= 50
##$NCOEF= 0
##$NC_proc= -8
##$NLEV= 6
##$NOISF1= 182.463
##$NOISF2= 159.3651
##$NSP= 0
##$NTH_PI= 0
##$NZP= 0
##$OFFSET= 248.5645
##$PC= 4
##$PHC0= -10366.46
##$PHC1= 328.0567
##$PH_mod= 1
##$PKNL= yes
##$PPARMOD= 0
##$PSCAL= 0
##$PSIGN= 0
##$REVERSE= no
##$SF= 81.014009
##$SI= 65536
##$SIGF1= 159.3651
##$SIGF2= -187.1042
##$SINO= 113.3802
##$SIOLD= 16384
##$SREGLST= <1H.CDCl3>
##$SSB= 0
##$STSI= 65536
##$STSR= 0
##$SW_p= 40650.406504065
##$SYMM= 0
##$S_DEV= 0
##$TDeff= 32768
##$TDoff= 0
##$TI= <>
##$TILT= no
##$TM1= 0
##$TM2= 0
##$TOPLEV= 0
##$USERP1= <user>
##$USERP2= <user>
##$USERP3= <user>
##$USERP4= <user>
##$USERP5= <user>
##$WDW= 1
##$XDIM= 65536
##$YMAX_p= 417590681
##$YMIN_p= -243033738
$$ End of Bruker specific parameters
$$ ---------------------------------
##NTUPLES= NMR SPECTRUM
##VAR_NAME=  FREQUENCY,     SPECTRUM/REAL,   SPECTRUM/IMAG
##SYMBOL=    X,             R,               I
##VAR_TYPE=  INDEPENDENT,   DEPENDENT,       DEPENDENT
##VAR_FORM=  AFFN,          ASDF,            ASDF
##VAR_DIM=   65536,         65536,           65536
##UNITS=     HZ,            ARBITRARY UNITS, ARBITRARY UNITS
##FACTOR=    0.620285442955139, 1,           1
##FIRST=     20137.2065510759, 0,            0
##LAST=      -20513.1999529892, 0,           0
##MIN=       -20513.1999529892, -243033738,  0
##MAX=       20137.2065510759, 417590681,    0
$$ Real data points
##PAGE= N=1
##DATA TABLE= (X++(R..R)), XYDATA
$$ [...]
44936 -2544699 349002 2139896 255936 -2957620 -2642307 972740 2421969 -351302
44928 -351302 -2721786 -1127319 1436476 1280563 288939 1554891 3000982 1037364 -2430062
44919 -2430062 -2713061 -250033 287572 -1896803 -2416727 1013680 5183461 6502651 5208336
44910 5208336 3037953 555073 -1391523 -805557 2634650 6140195 7126547 6226159 5354742
44901 5354742 4451519 2233727 -636223 -1350214 1486813 5273955 5755289 2225775 -898640
44892 -898640 761360 5609598 7848770 5327983 2393773 3504525 7252048 9318577
44884 9318577 8571238 6732470 4132052 83052 -3424375 -2850435 1535209 4887114
44876 4887114 3463919 -1205497 -4484150 -3157795 2290531 8068745 9781291 6532591
44868 6532591 2142905 784797 2303064 3682082 3620474 2853191 1342416 -1223601 -2923174
44859 -2923174 -1519595 1377738 2069454 689346 1044668 3997478 5623179 3466826
44851 3466826 384318 58707 2355805 5288361 8087125 9966954 9250160 6389594
44843 6389594 4710820 5428699 5260680 2149203 -284873 1654452 4849017 3612300
44835 3612300 -1160817 -3389089 -1847110 -1990814 -6136531 -8322298 -3060738 5390285
44827 5390285 7967653 2903128 -2549946 -2361686 1228388 2534395 405921 -1694431
44819 -1694431 -1483870 -190421 555554 1039915 1817791 2085416 1225978 557297 1902028
44810 1902028 5071984 7966054 8621744 6325213 1642564 -3464847 -6466059 -6574118
44802 -6574118 -5461877 -4498030 -2685677 761504 3468173 2675434 67338 -43341 2523111
44793 2523111 3048545 -818360 -5162719 -5639228 -3588833 -2837133 -3220807 -1729369 1461011
44784 1461011 2959021 2053695 1909959 3647072 3520790 -1288954 -7091942 -7376037 -812779
44775 -812779 7410663 11706058 10846418 6853880 2183216 -970890 -1039818 1283245 3008932
44766 3008932 2196485 545461 1015592 3539160 5085974 3856607 1333576 -281992
44758 -281992 -725750 -858590 -955277 -1159752 -2251982 -4282402 -5385622 -3769436 -392123
44749 -392123 2078366 2671954 2635487 2600193 1456131 -1075857 -2717793 -1351385 1408944
44740 1408944 1499065 -2337331 -6203775 -5284467 211075 4951366 4728462 1422879 504142
44731 504142 4293958 9325199 10528491 6711425 1299786 -1570763 -1151756 -552759 -3102790
44722 -3102790 -8099503 -11134125 -9498228 -5791126 -4176360 -4516233 -3525432 -1023462
44714 -1023462 -613391 -3404894 -5784665 -5598999 -5976320 -9381902 -11783834 -7762872 851117
44705 851117 6688972 6242605 2792739 384494 -351287 -42939 1175025 2104684 1005507
44696 1005507 -1033008 -678343 2385530 4235395 2461127 -67599 676732 4727520
44688 4727520 9360929 12959628 14940922 13862964 8891797 2479737 -1120852 -118663
44680 -118663 3620209 7246536 9135119 8716866 6066001 2342667 -448137 -1036936 -56706
44671 -56706 760233 508081 -131050 -252638 -304010 -1326220 -2839573 -3142732 -2236023 -2385678
44661 -2385678 -4274135 -4668435 -638287 5197793 7066487 3539648 -771423 -1779987
44653 -1779987 -926476 -1807106 -4345361 -5069761 -2229027 1919765 4249222 4469538 4593233
44644 4593233 5373832 4940278 1903207 -1405924 -1040624 3197086 6997093 6985451 4343718
44635 4343718 1636918 -893584 -3344827 -3493498 -31126 3597105 3111160 49504
44627 49504 -266309 2916330 4584002 1969064 -1204215 -672744 2156652 2907899 494297
44618 494297 -2306042 -3104924 -2278502 -1635296 -2302354 -3811080 -4622872 -3687051 -1408565
44609 -1408565 1140535 3152140 3738119 2198361 -341897 -1554452 -1561703 -3229072 -6662496
44600 -6662496 -7023738 -1663543 4010352 3138300 -2640785 -5913757 -4326257 -1901198
44592 -1901198 -598624 1806902 4979475 4704533 119921 -4140093 -4724571 -2604497
44584 -2604497 1446878 7459302 11448314 8295974 1538553 1270927 8825941 13039134
44576 13039134 6994160 -1046391 -704197 5303284 8193751 7957350 10174036 13028646
44568 13028646 9495822 753179 -3548417 962560 8056548 10366603 7001510 919500
44560 919500 -4779370 -7024929 -4869577 -2035259 -2624941 -4883382 -4457300 -2550387 -4134824
44551 -4134824 -8482821 -8882449 -2892906 3894714 6159908 4856888 2929662 898593
44543 898593 -650739 480341 3842316 4756075 363758 -5895822 -8742337 -7361313
44535 -7361313 -4742839 -2968579 -1605237 543596 3762648 6759043 7297081 4613922
44527 4613922 837832 -1571267 -2860256 -4272016 -4661242 -2117652 1816103 3226390
44519 3226390 1058345 -1981249 -3610259 -3966995 -3823152 -4046988 -6307862 -10835466 -14032807
44510 -14032807 -11990939 -5880887 -272182 2890459 4528091 4138243 691142 -2934927
44502 -2934927 -2446897 881698 1914678 661936 2447601 7531241 8380941 1130344
44494 1130344 -7150567 -8120856 -3872590 -2700915 -6640858 -9807385 -7758358 -2562078
44486 -2562078 1674748 3509852 3163857 536502 -3499736 -5860683 -4009351 205015
44478 205015 1791714 -1074178 -3916811 -1778580 3175602 4249134 447411 -1667568
44470 -1667568 1535061 4896371 3548701 1381436 3519387 6018553 2354801 -3742034
44462 -3742034 -2976546 3547911 4856881 -2487133 -9210010 -8626565 -5987164 -7534683
44454 -7534683 -10247372 -9044478 -5845023 -4284177 -2424119 1899995 4496420 1171433
44446 1171433 -4231236 -5444913 -3176039 -1895059 -1398393 1038296 3681034 3247549
44438 3247549 2050344 4483343 8374871 7659808 2667259 196093 3337961 8034783
44430 8034783 10290628 10583349 10058363 7895704 4113728 708087 -1412574 -3313395
44422 -3313395 -5218508 -5974484 -5676383 -5832066 -6659253 -6807485 -5650212 -3551550 -531736
44413 -531736 2965108 5007408 4349924 2463635 1130068 -152130 -1919343 -2467963 -966899
44404 -966899 3372 -1165522 -1277359 2358572 5815449 3734695 -1582143 -3036452 445086
44395 445086 3130979 2531538 2732518 6000188 8026795 4941797 -245352 -2172144 -467495
44386 -467495 1133549 611921 -654001 -707618 938700 3521019 5850707 7090023 7095109
44377 7095109 5981688 4177948 3240744 4661452 6750580 5511228 820866 -1534871
44369 -1534871 2423025 8220393 8741452 4140851 330783 -543115 -1634597 -4200967
44361 -4200967 -5730891 -5684331 -6445549 -7344265 -4320296 2286119 5853237 2527194 -3168844
44352 -3168844 -5254823 -4176076 -3978174 -5527255 -6656782 -6366029 -5277404 -3800300
44344 -3800300 -2399709 -1752888 -863142 2395836 7133643 8925437 5523935 22778
44336 22778 -3759817 -5627032 -6353060 -4677270 -602787 1667443 -1401456 -6950118 -9149092
44327 -9149092 -6989054 -4705491 -5396527 -8002925 -10142054 -10419991 -8006442 -3088266
44319 -3088266 1983527 4659255 5555574 7407749 10412678 11259870 7729380 1958009
44311 1958009 -2443996 -4903557 -7407074 -10180760 -10470021 -6794122 -2516530 -2562183 -6879697
44302 -6879697 -10044850 -8228424 -3679167 -524266 870348 2314448 3094753 953682
44294 953682 -3581143 -7797989 -10613638 -11862170 -9511799 -2918614 2392601 -3759
44286 -3759 -7068098 -8496117 -1147672 6084245 5217647 -101687 -1876655 398051 1640089
44277 1640089 487153 -286495 -97493 -906084 -2637135 -3496907 -3494932 -3095047 -407073
44268 -407073 5273689 9321905 6973970 1069266 -1466442 311268 1264802 -634002
44260 -634002 -2245630 -2766074 -5628442 -10873805 -12851209 -9012637 -4758946 -5101063 -6719803
44251 -6719803 -3601032 3247418 7396087 6179502 3060614 1733987 2383088 3744583
44243 3744583 5117965 5612728 4070840 798930 -1945165 -1893130 964012 3725368 2600665
44234 2600665 -2802783 -7463141 -6019650 -311315 1937501 -2367568 -6852507 -4791724
44226 -4791724 994535 2625385 -1190660 -4416986 -3688796 -2294272 -3221259 -4580809
44218 -4580809 -4442478 -4761375 -6994465 -8298537 -6212116 -3508738 -3829455 -5366251 -4001483
44209 -4001483 -757124 -448984 -3552928 -5131328 -2604485 718313 1755400 2581251
44201 2581251 6115849 10298730 10395319 5624577 416105 -456153 3828367 9969556 13278072
44192 13278072 11476197 6880385 3738854 2868209 1093960 -2973296 -5787259 -4155778
44184 -4155778 -913300 -1271933 -4933421 -6318505 -2689407 2077486 2979994 -9618
44176 -9618 -2829727 -2055065 2525242 8219154 11350624 10503187 8367725 8456521 9828183
44167 9828183 8001331 1973802 -3253623 -3449216 -1143516 -1203093 -2797572 -710248 5794676
44158 5794676 10571252 8756472 3310707 575525 2172084 4822048 6349848 7562695
44150 7562695 8494121 7284290 4200109 2967070 5680497 9458432 11068753 11884861
44142 11884861 14140491 14876266 9613262 1350550 -1015401 4941822 10771121 8655069
44134 8655069 1720991 -2193794 -2354036 -3875381 -7426134 -8080394 -4501381 -1948247
44126 -1948247 -3897994 -6568437 -5316909 -2198314 -2791676 -7757490 -11758832 -10393865
44118 -10393865 -5020673 59369 3152808 6130039 10077617 12099992 8727651 1936865
44110 1936865 -1812012 -12588 2085874 -779623 -5772400 -6443801 -2932351 -1402751
44102 -1402751 -3900687 -5525702 -3005144 319115 854178 498108 2117162 3817562
44094 3817562 2423750 -486454 -900656 1126301 1832334 -244474 -2589433 -2892072 -1615980
44085 -1615980 -72099 1527819 3437467 5324966 6302642 5408390 2464944 -1055410
44077 -1055410 -2981682 -2847801 -2146295 -1739475 -859052 479096 308143 -2441349 -5848997
44068 -5848997 -7630365 -8166640 -8796665 -8518507 -5033061 1212448 6130866 5779281 494814
44059 494814 -4875113 -5270036 -777949 2937689 1121973 -4078521 -6685642 -5049589
44051 -5049589 -2888009 -2024445 771726 7414731 13497128 13451747 7954009 2606206 1084368
44042 1084368 2542779 4178730 3773119 1203563 -524994 2268765 8527795 12017095
44034 12017095 8639867 1631695 -2965167 -3145055 -623085 2916178 5724295 5341779
44026 5341779 2107993 428580 2362954 3225500 -1293843 -6884302 -6094945 47749
44018 47749 3361046 892552 -1671861 -38912 2621105 2401904 1203665 2444265 4595283
44009 4595283 3454906 -1408817 -6043435 -6931901 -4268922 -1131456 -448705 -2058870
44001 -2058870 -2696060 -42446 3903339 5379529 3732181 1108628 -1525827 -4530097
43993 -4530097 -6610294 -5963651 -4233438 -4819786 -6888722 -5813252 -601937 3926448
43985 3926448 4162703 2396624 2182775 3135845 3136283 2245219 1485088 533586 -723798 -901220
43975 -901220 255257 465344 -1649447 -4294444 -5702366 -6685048 -7700981 -6545775 -1928679
43966 -1928679 3359521 5907810 5908093 5098468 3274293 232134 -1490587 127738 2582131
43957 2582131 2149418 -439800 -1730768 -1383066 -1684074 -2218972 -43192 4699165 7973301
43948 7973301 7554491 5658461 4958860 5541515 6737225 8410360 9268363 7445379 4239411
43939 4239411 3734164 6839600 9263401 7871799 5534678 6176097 8019364 6387023
43931 6387023 1639544 -704640 2144592 6682321 8476702 7272463 5001074 2094934
43923 2094934 -1475575 -3735052 -2401599 1777932 5803542 8108215 9601028 11551108
43915 11551108 14247727 17280051 19390869 18748724 15506746 13402948 15964279 21106126
43907 21106126 22589398 17678956 10549494 6833461 7396129 9134110 9478145 7910788
43899 7910788 4862180 1448472 -722528 -1136732 -765728 -68125 1347561 2093723 -697216
43890 -697216 -6063607 -7591532 -1066584 8564117 12406089 8438856 2522080 -494054
43882 -494054 -1398911 -2063254 -1683183 324138 1793734 954116 -514717 53217 2578738
43873 2578738 4792302 5091688 3491348 973311 -1084604 -1794307 -1451215 -418995 2065429
43864 2065429 6144674 9247558 8576662 5363915 3471616 3782410 3535284 1543460 -17362
43855 -17362 -92785 -771707 -2901072 -3698525 -1384243 1385361 1847943 1732294 3846446
43846 3846446 6606790 6175688 2604741 -318560 -905448 -1491733 -4151435 -7558620 -9160868
43837 -9160868 -8425409 -6706271 -4946795 -2673839 611456 3558908 3679867 933144
43829 933144 -671288 2429150 7677972 8610696 3451570 -2133325 -2678563 207277 1480848
43820 1480848 153209 -810945 -343272 -743357 -3457911 -6778567 -8231989 -6908760 -3226690
43811 -3226690 1416789 4469744 3789619 113931 -3372037 -4435045 -3775112 -3409813 -4128969
43802 -4128969 -5044028 -5100640 -4457543 -4061029 -3814800 -2004436 2380442 7314387 9413477
43793 9413477 7881792 5060717 3134492 2395340 2742369 4089360 4655494 1916314 -3342797
43784 -3342797 -6693766 -5489934 -2119720 -165110 6738 -145635 -295498 -298080 1119472
43775 1119472 3874895 5066064 3003586 531155 1095659 3560833 4451902 3452693 2730091
43766 2730091 2387604 1031258 -57142 2023678 6619916 9747868 9877458 9342985 9266000
43757 9266000 7401096 2855791 -681381 871278 6600754 11550180 11848226 7639822
43749 7639822 2261964 -374813 1170474 4356863 5032033 1888353 -2337945 -4284382
43741 -4284382 -3267694 -864496 1331488 2783843 3842711 5139093 6590407 6989558
43733 6989558 5428145 2983229 1798583 2396497 3083863 2281606 374045 -1095183 -1087653
43724 -1087653 562054 3606294 7325089 10148586 10264646 7514330 4586885 4945017
43716 4945017 8674061 11751317 11015307 8395381 7676141 8433625 7025795 3127478 605605
43707 605605 1232536 2508641 3228205 5615507 9043345 7568903 -1220565 -9703071 -8926944
43698 -8926944 -730974 5293145 4795065 1964906 1156396 2218992 4210202 7094834
43690 7094834 8684974 5891540 671506 -682580 3772608 8561336 8828564 7077935
43682 7077935 8875582 15030097 20964035 21934304 17031321 9629209 4837960 4883545 6902373
43673 6902373 7135636 6216017 7198394 9753645 10868910 10502787 11125543 11762937 8642473
43664 8642473 2626274 -471938 1145889 2393670 -11635 -2447535 -1429492 532021
43656 532021 403566 8730 1065166 709266 -2283823 -2562349 3426831 9085790 6049375
43647 6049375 -2555794 -6153513 -1965927 2915998 3927283 4092944 5808093 6621146
43639 6621146 5702985 6406662 9003663 8263440 2409486 -2316457 -993076 2258863 1745406
43630 1745406 -131156 2178937 6918796 7763424 4902482 4866703 9294614 12023636 9293103
43621 9293103 5574393 5740776 7496100 6374294 3746268 4197012 7555918 9237563
43613 9237563 7587095 5808353 6469933 8460603 10033606 10934291 10466795 7184989 2183763
43604 2183763 -498794 1255095 5025333 7861242 9945605 11960308 11947428 8330612
43596 8330612 3812146 2192128 2619193 1229958 -2081002 -3063607 152343 4025302
43588 4025302 5020986 4528645 5866802 8941398 10932460 11081128 11787527 14713206 17901890
43579 17901890 17882556 13811154 8377492 4535534 2425452 430073 -1716089 -2881161
43571 -2881161 -3300252 -4558372 -6009732 -4340934 1369162 7117641 9210592 9196950 10100021
43562 10100021 10539453 7438403 2696794 1452656 4241768 6679878 7269128 9448243
43554 9448243 14293236 17069209 14066214 8166410 4226338 2785994 1837260 1450552
43546 1450552 2752986 4626086 4930688 3427547 898181 -2707958 -6774408 -8748014
43538 -8748014 -6980772 -3076188 714740 4241760 7515163 8826157 7553402 6083668
43530 6083668 5822814 4221640 -345238 -3565780 -163910 7697717 12435678 11191848
43522 11191848 8782883 9748123 12236927 11866864 8153384 4436324 3228828 3803565
43514 3803565 3732241 1682901 -981430 -1145175 2924280 9350924 14094100 14430794 10739651
43505 10739651 5684215 2255301 1640480 2244504 1711332 297065 727737 4219569 8676818
43496 8676818 11667878 12882894 12711214 11337745 10661703 13437370 18031114 17999143 10754133
43487 10754133 3079825 2870769 8027847 9694154 5197857 966314 1972597 4807310
43479 4807310 3827989 -743213 -4283066 -4215750 -1903540 22063 -147531 -2410927 -4843538
43470 -4843538 -5158920 -3259479 -946371 1106125 3875268 6824811 6958694 3031640
43462 3031640 -1147557 -297888 5671076 10659489 8995237 2178258 -2501389 -610367
43454 -610367 3800260 3472676 -2065377 -5750109 -3222386 827624 -14590 -4124155 -4818261
43445 -4818261 -1029630 1351982 -958874 -3661797 -1571580 4123634 8162397 7914269
43437 7914269 5094325 2521681 1437072 1335436 1192675 1050499 2190818 4900014 7002077
43428 7002077 6390301 4084547 2533229 1944377 1153440 1053843 3452330 6997869 8324335
43419 8324335 7300745 6917276 7556486 6019593 1413146 -2639774 -3494795 -2765184 -1913484
43410 -1913484 799928 5701061 8239451 4604598 -1871605 -4396410 -1351156 2637045
43402 2637045 3411688 1583433 195398 722333 1791048 717756 -3345494 -7429146
43394 -7429146 -7531089 -4053520 -2013216 -4397789 -7998118 -8078541 -4724491 -1701968 -918594
43385 -918594 -1131438 -952058 -252979 654054 899202 -968118 -4717085 -7296740 -6252114
43376 -6252114 -3113991 -1029668 -372217 470979 1141661 -365211 -3642972 -5418949 -3741227
43367 -3741227 -157767 2855472 4531092 5252079 5221090 4625983 4020543 3810168 3876171
43358 3876171 3965559 4193186 5166227 7341308 9616557 9341997 5623523 2052697 3026146
43349 3026146 7071180 7804498 2955304 -1997043 -1880551 1059906 2236411 2532338 5186387
43340 5186387 8121095 6562141 1862149 204974 2422558 2557965 -1989996 -6128273
43332 -6128273 -5656736 -3590707 -4015443 -5389773 -4710204 -3497709 -4254113 -4858512 -2383507
43323 -2383507 436929 -1059362 -4928512 -4406399 1872254 7464731 6936235 1920638
43315 1920638 -3061557 -5987842 -6372800 -3426073 1448840 3479054 -309327 -6361997
43307 -6361997 -8418340 -5292988 -1867394 -2440426 -5777513 -7575102 -6002854 -3367156
43299 -3367156 -2770148 -4368283 -5688618 -5299747 -4673503 -5382463 -5896320 -3625933 280558
43290 280558 1405491 -1678644 -4654819 -3042387 1910409 5591396 6329806 6011154 5570804
43281 5570804 3753402 589799 -1276374 100990 3502355 6153222 6050331 2608775
43273 2608775 -2676768 -5999945 -4360801 487501 3832871 4138486 4067905 4673704 2953156
43264 2953156 -2464774 -7357759 -7301468 -3870181 -1476145 -805065 26109 187660 -2347945
43255 -2347945 -5173165 -3380090 2501618 6054090 3706149 -1040195 -3702473 -4248755
43247 -4248755 -4172996 -2911028 -587287 -523127 -4944638 -10655410 -12748456 -10902051 -8667257
43238 -8667257 -8041072 -8107771 -7997924 -7885589 -7412343 -5831367 -3610138 -1865414 -553460
43229 -553460 1056920 2696640 3420903 2806743 582322 -3398863 -7222678 -7113957 -2171286
43220 -2171286 3002207 3611617 1052605 285733 2124466 2768422 860775 -26378 2612785
43211 2612785 6106312 6963751 6032126 6343548 8036663 8426369 5998321 1933629 -1605176
43202 -1605176 -2834924 -884607 2982507 5213449 3156266 -1476837 -4027909 -2144154
43194 -2144154 1766398 3866288 3383506 2623479 3134244 3448594 1256794 -3140967 -6746366
43185 -6746366 -7083957 -4474638 -1034642 1453164 2384446 2359326 3006946 5524304 8636732
43176 8636732 9457232 7338653 5101617 5025382 5774198 5584380 6167176 9699340 13441865
43167 13441865 12232353 6404009 2146883 2480598 2771683 -1728021 -7981168 -9209669
43159 -9209669 -4467900 505014 1262842 -676257 -1492388 1394 2299826 3936647
43151 3936647 4919871 6148340 7774792 8077071 5078439 -3745 -2942326 -1977699 -860737
43142 -860737 -3298298 -6324045 -3793319 4191452 10622446 11151052 8989027 8176196 7279665
43133 7279665 3643674 -456676 -1089524 634601 528410 -1639698 -2595632 -2274474 -4182953
43124 -4182953 -8428969 -10107870 -6667625 -2025952 -585632 -1231621 -523490 1593307
43116 1593307 3012556 3751843 4981653 5528714 3381801 -211728 -1819328 -558700
43108 -558700 1503773 3290587 5637863 8227704 9027308 7587000 6042230 5846468 6021253
43099 6021253 5772207 6453997 9264917 12652188 13846170 12299530 10306058 10312426 12172679
43090 12172679 13193500 11176116 7345411 5005971 4763957 3214284 -1783681 -6754331
43082 -6754331 -6814746 -2823642 -143494 -533276 66069 4397342 8841324 8244098 3018023
43073 3018023 -1564176 -1895265 354687 676422 -3213444 -8232627 -8135314 -467391 9234238
43064 9234238 12896098 9333275 4772656 3834677 4529436 3694944 2562851 3756180 6590573
43055 6590573 9036916 11248478 13346840 12678280 7838664 3227881 4478639 10275536
43047 10275536 13621933 11309192 7687320 8041096 11781498 13889943 11095231 5310396
43039 5310396 1703931 3500394 8383698 11206536 10681426 10772427 13968291 16761736 15179328
43030 15179328 11546229 10827614 12356009 10953316 5589829 1100589 750078 2454081
43022 2454081 3628034 4789689 6447698 6873685 5378874 4197801 4894000 6153505
43014 6153505 7012992 8612941 10500537 9190754 3719880 -874669 162195 3972713
43006 3972713 3612470 -2334259 -8124091 -8644067 -4759018 -222297 3053241 4875792
42998 4875792 4717165 2577372 932616 3067219 8683250 12876269 11140759 4839307
42990 4839307 -184547 -561464 1348043 2150960 2464096 4377263 6141868 4031264 -757486
42981 -757486 -1959620 3397711 10555267 13444735 12156184 10671825 9776731 6635157
42973 6635157 719602 -4045817 -4182386 -1009837 1411673 1100809 -613124 -1790280
42965 -1790280 -2027490 -1620802 -49489 3231582 6851618 8253753 7091408 6169391 7549262
42956 7549262 9282583 8220855 4918340 2847468 3081651 2902794 291295 -3004960
42948 -3004960 -4050581 -2183318 1280156 4941189 7773220 9206048 9664432 9733666 8556141
42939 8556141 4974960 497141 -1485553 -327527 587382 -1513651 -5227852 -7403692
42931 -7403692 -6686921 -3127624 2955183 9365304 11781709 8290612 2759765 691117
42923 691117 2564485 4165495 3060370 1659801 3108514 6441087 7550862 4428762
42915 4428762 769 -1234601 914685 1744448 -1736420 -5709740 -4262903 1948520
42907 1948520 6210835 5295731 3609426 5853868 10123762 11579220 9291754 5560826
42899 5560826 1411329 -2855272 -4805612 -2269228 2461761 4983018 4593298 3904492
42891 3904492 3461334 1133370 -3081950 -5927610 -5542838 -3829463 -3017085 -2732035 -1742333
42882 -1742333 -282292 684145 931893 802342 648407 697859 561912 -592060 -2218082
42873 -2218082 -1931138 1300298 4848313 5674143 4482082 3776296 3287018 1034209 -2173399
42864 -2173399 -3651441 -3734199 -5033226 -6789901 -5226661 -519532 2024365 -121407
42856 -121407 -2720201 -1677945 761269 564253 -1335997 -1365051 597425 2173877 3358559
42847 3358559 5605004 7492158 6230329 2970891 1934669 4018630 5568507 4335888
42839 4335888 2706628 3431663 5314982 5196176 2225208 -1547193 -3589633 -2867327 -473716
42830 -473716 1223171 1169608 1270342 3834269 7693255 9263709 7581894 5409829 4588576
42821 4588576 3480549 801850 -920641 1452948 6778008 10791954 11301450 9808948
42813 9808948 8651283 8826459 10285733 12241283 13253056 12687012 11803789 11872170 11929718
42804 11929718 10412203 8300493 8129525 10126135 12015413 12813085 14080048 16884282
42796 16884282 20165126 22850796 24965766 25811869 24003081 20611101 19182538 20710025
42788 20710025 21619263 19278475 16541378 17341892 20107773 19844579 15696110 12091574
42780 12091574 12217106 14067229 13919597 10959565 7324197 5395486 5875186 7418795
42772 7418795 8032714 7554842 7814984 9316870 9752555 7946145 6913601 9449203 12501572
42763 12501572 10542627 3780406 -1879013 -3193568 -3008066 -4464833 -6582102 -7204682
42755 -7204682 -6100321 -3378277 1077912 4817126 3868623 -978289 -3218913 953846
42747 953846 7101410 8845220 6263612 4095906 4368683 4984353 3889696 1032512 -2570114
42738 -2570114 -4964576 -4022748 -406311 2232344 2150715 1935961 3624408 4756535 2594669
42729 2594669 -1064004 -3279073 -5036229 -8337287 -11021965 -9711617 -5886279 -3753209
42721 -3753209 -3618469 -2601648 -574314 36202 -645894 -468058 -49642 -1541955 -3368963
42712 -3368963 -2114792 861703 1090969 -855570 48295 3792597 4104160 -976838 -4784490
42703 -4784490 -2204368 2329502 1983647 -2497730 -5396194 -4732087 -2916966 -1436156
42695 -1436156 -120004 6590 -2098144 -4433373 -4139572 -2131374 -1995404 -4621325 -7149218
42686 -7149218 -7331640 -6214207 -5917458 -6609030 -6479400 -4173877 -1069089 -675574 -4556661
42677 -4556661 -9188176 -9176206 -4003915 1074821 1899371 351466 644092 3208636 4919105
42668 4919105 3973089 1951647 1262411 2130109 2448901 533156 -1951007 -1225218 2996758
42659 2996758 5409696 2119924 -2243001 36316 7835899 11649807 7296677 1643311
42651 1643311 1171675 2389600 -399523 -4278377 -2942078 1431723 934191 -4875993
42643 -4875993 -7738239 -3540678 1915524 2643206 824724 1349167 3545880 3522416 1320017
42634 1320017 486101 1965367 2964634 1842186 565297 1408936 3529412 4004457 1053040
42625 1053040 -4621776 -10705968 -14469031 -13792467 -8610943 -1768590 2721737 3221252
42617 3221252 1733802 1089622 1887333 3089962 4087821 4388857 2809804 -419703 -2105838
42608 -2105838 -9578 2846427 2138575 -277524 1340043 6281267 6317828 -2026495 -10778318
42599 -10778318 -11109590 -5160929 -1088938 -802612 -160862 1517649 690334 -2186226 -1896068
42590 -1896068 2525398 5012062 1430699 -4279351 -6171555 -4082912 -1900065 -1404662
42582 -1404662 -1477209 -1386549 -1587319 -1971727 -1496826 480737 3164717 4360994 2187754
42573 2187754 -2005187 -3580593 132498 5484802 6546744 2921149 -147845 706827
42565 706827 3556549 5748692 7273454 8048071 6279633 1967723 -1685394 -2964416
42557 -2964416 -4287571 -7374044 -9264384 -6728975 -1698776 1755057 3490600 5804616
42549 5804616 7550581 5060831 -980488 -4504101 -1525982 4847768 8796768 8456443
42541 8456443 6010363 3233959 -70224 -3702762 -5859785 -5258974 -3020842 -1234949
42533 -1234949 -394937 473224 1551490 1811807 1161286 1147197 2436342 3331528 2556582
42524 2556582 1940617 3719897 6159334 5242336 940714 -1614864 1293519 6831660
42516 6831660 9162539 6612849 3167753 3287959 6800319 9301089 7315918 2704512
42508 2704512 898773 4116004 8071003 7540049 3574141 1627679 3194065 3900145
42500 3900145 933042 -2198497 -933570 3766310 7291670 7436260 5477696 3032315
42492 3032315 853455 -507746 -1503777 -3921331 -8040650 -10788755 -9261590 -4854315
42484 -4854315 -1308206 60946 395747 4260 -1433441 -2233261 -244560 2946921 3191405
42475 3191405 -163988 -2992811 -2354300 -264812 375632 432438 2244964 4918153 5419969
42466 5419969 3606071 2741421 4450747 5992033 4327183 1132667 1061651 5097554 8424116
42457 8424116 6645745 2189897 1378090 5478007 8413934 4997734 -1724982 -4411795
42449 -4411795 -794461 4603129 7506289 8628708 10285080 11626460 9913370 5198746
42441 5198746 1174660 995748 3576661 4864609 2494396 -1662633 -4052999 -3718774
42433 -3718774 -2601247 -1925989 -644567 1684912 2974509 1589672 -614896 -684279 1452000
42424 1452000 3994490 6839589 10814452 14210998 13879762 9885147 5618907 2976597
42416 2976597 912692 -791186 -396327 1798892 2298838 -512828 -3451004 -3214395 -1121576
42407 -1121576 -472298 -1736051 -3236650 -4398298 -5373765 -5449379 -4767179 -5616247 -8818349
42398 -8818349 -10868475 -8424524 -3909983 -2314100 -3550342 -2890895 1035587 3684018
42390 3684018 1428711 -3112489 -4860575 -2797158 -549863 -1683328 -5584657 -7622522
42382 -7622522 -3911795 3215509 6435800 2422396 -2919298 -2275581 2361406 2876018
42374 2876018 -2090040 -5027406 -1639565 2759819 2493489 158204 773745 3061783
42366 3061783 2973540 1706939 3261417 6607496 7073201 4168079 1852773 1764537 1816338
42357 1816338 1014063 291013 -1035431 -4326261 -7479062 -7094628 -4502410 -3997358 -5290796
42348 -5290796 -4030548 -172002 1182623 -1279193 -2594587 -661010 -618781 -5868483
42340 -5868483 -11177741 -10347492 -5819280 -4582284 -7923809 -11028540 -10382214 -6355488
42332 -6355488 -367505 5609860 8252857 6170242 2847970 2429558 4052107 4214206
42324 4214206 2890874 2782324 3830231 3120358 -375958 -4841106 -8418792 -9392349 -5440535
42315 -5440535 2714487 8715616 7075690 1061764 -1776044 -935453 -2800432 -8957977
42307 -8957977 -12552165 -8772979 -1931777 1750692 2415199 3005774 2604105 -987933 -5475622
42298 -5475622 -6683785 -5000068 -4084715 -4541461 -3880523 -2037786 -1793842 -3244476 -2546627
42289 -2546627 2187158 7341665 8314449 5086034 1103000 -1463167 -2748318 -2588984
42281 -2588984 -50639 3751496 4893076 847078 -5515811 -8487823 -6217999 -2575581
42273 -2575581 -1427200 -1458642 1042418 5833634 8359682 5816122 878758 -1616124
42265 -1616124 -8094 3208664 4711325 3776044 2694266 3927320 6815215 8004779
42257 8004779 5745606 2335363 936411 1505830 1970876 2035924 3013575 4722990 5647994
42248 5647994 5870373 6800142 8053884 7677238 5628136 3984510 3432704 2631791 1309298
42239 1309298 707711 740816 420909 1389397 6418806 13275472 15253381 10420383 5567885
42230 5567885 7278413 13091759 15993317 14474708 12914878 13765888 14739135 13632258
42222 13632258 11469962 9978726 9117152 8098651 6688148 4789057 2354372 158372
42214 158372 -478021 1051253 4110578 6984823 7311050 3921794 -884596 -2836256 -864397
42205 -864397 1205241 -17673 -2562813 -2078177 1941478 5984865 7666827 7904460 8065758
42196 8065758 7736132 6036961 3509842 2010517 3132201 6220367 7740322 4404571
42188 4404571 -2063335 -5629496 -3399446 30782 -1303690 -6234622 -8114686 -4167160
42180 -4167160 1180339 2853086 1041610 -1062578 -2187693 -3069292 -3599803 -2845367 -1436014
42171 -1436014 -1348566 -2625457 -2311498 1635627 6503619 7425651 3843245 320098 -293167
42162 -293167 -816504 -3795406 -5325421 -362916 8027947 11814120 9970957 9376300 12369471
42153 12369471 12277777 5441271 -885496 528056 5025995 3682081 -2294327 -4324801
42145 -4324801 -548708 2818032 3021170 3797061 6398407 7069805 5407603 6378129 10844530
42136 10844530 12250790 7118983 1663669 2461135 6259778 5204453 -1754540 -8541601
42128 -8541601 -10407851 -7559892 -2366378 2289513 3255855 50262 -3218149 -2398106
42120 -2398106 1114078 2685198 1422256 1082869 4039914 7846677 8881651 7029712
42112 7029712 5269320 5670237 6986011 6271842 2551792 -1682072 -3152691 -1380900
42104 -1380900 1489965 3732593 5049035 4972585 2762514 -664648 -2854202 -2416755 250461
42095 250461 4639474 9929860 13262904 11791691 7248682 4770480 5740978 5680894 1586417
42086 1586417 -2444862 -583588 6286300 11536813 11091768 7274759 4673040 4911094
42078 4911094 5801920 4054959 -1264201 -7216408 -9521483 -7102189 -3002052 -476731
42070 -476731 92871 24312 470448 2580026 6884640 11226640 11890005 8268930 3836291
42061 3836291 1136143 -1042167 -3780453 -5004240 -3068651 -132466 1082795 1015273
42053 1015273 964221 480055 191497 3188141 9381777 12673328 9151592 4155012 4473145
42044 4473145 7034688 3818914 -3974261 -6501057 -559915 5463459 4763614 1388097
42036 1388097 1829735 4901259 5763171 4217683 2886299 1552467 -774320 -1798560
42028 -1798560 293048 2193480 431041 -1936159 101813 4523052 4832627 551497
42020 551497 -1914066 845862 5058979 6612304 6092922 5203799 3504339 941434 -1005824
42011 -1005824 -2777369 -6787020 -11978779 -13257362 -9097740 -4779098 -4491558 -5030916
42003 -5030916 -1928684 2418895 2473442 -1466746 -3962273 -2584654 28674 1326093
41995 1326093 1124369 -449291 -2558645 -2071183 2654229 7103156 5095237 -2242061
41987 -2242061 -7358993 -6188803 -1656130 2787361 6847982 9726724 9397503 7469888
41979 7469888 8526942 12457015 13848848 11364657 10439768 13232678 13810118 8553295
41971 8553295 3635226 5096979 8239857 5338255 -1473435 -4268595 -2238616 -826487
41963 -826487 -709188 2256358 7232282 8392360 5005632 2707736 3987285 5521787
41955 5521787 5609000 6164699 6639166 4221241 986350 2314260 7148728 8896261 7270811
41946 7270811 9017052 14560630 15376466 9076251 5422729 10416365 15303536 10593509
41938 10593509 1779235 317709 5954157 9438208 7923568 6137321 5157842 1251009
41930 1251009 -4972749 -8059801 -6554212 -4231226 -2636514 18586 2797964 2490328
41922 2490328 295261 871645 4313086 5839721 3828665 1501441 356133 -1176944
41914 -1176944 -2042795 1153253 6813342 8398832 3959159 -802235 -1355363 -211649
41906 -211649 -1276785 -3863398 -5357846 -5246122 -3845155 -1116906 1356336 1489433 1136414
41897 1136414 4425859 10264997 12321968 8567265 4532008 4061826 3498276 -442967
41889 -442967 -3361686 -300 6359692 8317206 5240743 2900356 3776239 4348285 2104039
41880 2104039 -414539 34080 2794722 4614790 3462140 347804 -1505712 300412
41872 300412 4242018 6243157 5292732 5260286 8931165 12921258 12003981 6604165 1997983
41863 1997983 1104618 2157546 3155728 4362024 5652708 5148185 2114852 -1387150 -3324537
41854 -3324537 -4175723 -5214543 -6056457 -5482831 -3547900 -1465311 -193198 -277530 -2283953
41845 -2283953 -5925237 -9065860 -9166940 -6251592 -3411247 -3515052 -5962173 -7628674
41837 -7628674 -6691878 -4307709 -2520070 -2046890 -2693511 -4331166 -6268341 -7024039 -6238774
41828 -6238774 -5615935 -6290984 -6607053 -4754036 -2381139 -2538338 -4551218 -4369988 -410248
41819 -410248 4175709 5992993 5215150 3637571 1807532 55523 97178 3162439 7662871
41810 7662871 10614644 10779863 9310448 8046132 7873630 7878593 5970898 1842420 -846592
41801 -846592 2107305 9179739 13454635 11056232 6274799 5472333 8347905 9222519 6003860
41792 6003860 3519002 6870898 14599856 20487134 20619829 16724850 13072582 11981748
41784 11981748 12948000 14765501 16712644 17612183 15601772 10259691 4143947 778542
41776 778542 1384114 4567431 8535230 12241747 14989359 16643453 18132970 20405661
41768 20405661 23148963 25579883 27569030 28546617 26651401 21250383 15354708 13062291
41760 13062291 15223526 19665008 24241739 26975035 25188081 18675059 12464280 11708751
41752 11708751 14522022 14900656 12138646 11244597 13748305 15160455 13608153 14058911
41744 14058911 20311448 28712304 34111953 36851187 39162471 39468205 35708376 30513546
41736 30513546 27508903 25517186 21759746 17930746 17401782 18671403 17447853 13787600
41728 13787600 11706729 12832175 15575730 19459596 24974505 29941711 31205490 29422871
41720 29422871 27411361 24872407 20242484 16607102 18920509 25103068 27019344 21965658
41712 21965658 16412355 15619962 16130256 12958264 8780389 10023248 16850902 23026877
41704 23026877 24963099 25951409 30560451 38125370 43377247 42146965 35360181 27783753
41696 27783753 23452376 22668506 23367046 24344265 26135083 29358615 33382414 36284100
41688 36284100 35555781 30133330 22775337 18545612 19098303 20539441 19424574 18303895
41680 18303895 21300742 26275070 27064250 23390439 22670107 30050801 41163341 47372750
41672 47372750 45143388 38069248 32244288 31461601 34648742 36446538 32321762 24012453
41664 24012453 17611192 15925992 16038799 15031745 13869368 13864686 13686223 12812723 14170304
41655 14170304 19613409 25591499 27179186 24489090 21567326 20495758 19900438 18051319
41647 18051319 14482073 9759999 6241371 7334193 13063704 18193692 18117154 14876811
41639 14876811 13650091 15163846 16268954 16600818 18850425 22431755 23084376 20471896
41631 20471896 20458446 26754019 35026285 39164273 39493674 40144717 41158583 38713021 32188532
41622 32188532 25841349 22955981 22362855 21571292 19856852 17195367 13382828 9656739
41614 9656739 8342475 9280298 9275018 6947028 5533059 8545798 14896775 20834007 24557724
41605 24557724 26113020 25080353 22188343 21274502 24794616 28282933 24701842 14613526
41597 14613526 6433435 5156705 6539825 5145241 2404401 2163748 3013657 1123631
41589 1123631 -2254257 -2637248 -279006 212604 -1850500 -1727392 2680980 7143229 8017521
41580 8017521 7739636 9815500 12502923 12101203 9859111 10440592 14347851 16740014 14503733
41571 14503733 10404433 8385256 7995328 6352633 3555600 2447498 3450458 3492180
41563 3492180 1253249 -1879 2540859 6075855 5886925 2749820 2003264 5209825
41555 5209825 7529482 4875590 -588914 -4378488 -5279207 -4203241 -1044278 3693313
41547 3693313 6948490 6663867 5143729 5306836 5952978 4634567 2669710 2567598 2701926
41538 2701926 102760 -2931676 -1126591 5278993 10334404 10920964 9668164 8810980
41530 8810980 7341052 5696673 7099434 11702460 14738642 13172185 9395750 6051325
41522 6051325 2595360 -200175 1599152 8085116 12104228 8308758 1292982 -1038943
41514 -1038943 1541601 3602574 3970836 6132586 9838282 9912381 4710407 -255186 510137
41505 510137 5790811 10246517 10626773 7634690 3974626 2101030 2402968 2934942 2219024
41496 2219024 1897538 4411880 8508710 10210292 8765832 8384269 12405500 18268914
41488 18268914 20619164 18032806 14169391 12406331 11587492 8415243 2997623 -329708
41480 -329708 1268876 4526047 3912444 -558653 -2897203 661881 6672129 9863521
41472 9863521 10192487 11093513 13164423 13938936 12889272 12289080 13032747 13506920 13256141
41463 13256141 14106114 16350719 17092849 14367330 10439224 8703667 8960049 8144553 4985241
41454 4985241 1784919 1479383 4331564 8008573 10228707 10702945 10404938 9513148 7184415
41445 7184415 3757738 1836438 3633737 7764546 10387246 9645618 7564799 7313897
41437 7313897 9985015 14571383 19791520 24854123 28886380 30454205 28066302 21723405
41429 21723405 14317232 10383789 11840651 15281985 15358991 11021855 6448576 5264104
41421 5264104 6235938 6240475 5239152 5591544 7803238 10414364 13874094 20542999 29340955
41412 29340955 33912059 29220031 18077799 7996153 2748692 318488 -1642329 -2384502
41404 -2384502 -712892 2461458 5586458 7884455 8427443 6704096 4994108 6655422
41396 6655422 10564875 11137341 6108084 278632 -1411744 -279413 499158 2117244
41388 2117244 6416615 9836592 8208274 5208385 8147455 16152460 20705814 18637228
41380 18637228 16468396 19589638 24631804 26109916 24112919 21121165 16798959 10906666
41372 10906666 7057114 8429286 12517772 14303235 12367691 8711635 5229642 3452026
41364 3452026 4921938 8612753 10547136 8812227 6198209 5339373 4751521 2877814
41356 2877814 2461138 6821302 14445343 21117812 25285336 28080521 30268403 32087090
41348 32087090 33849325 34424963 31946349 27732866 25572950 25611608 24707317 25112911 34667684
41339 34667684 52816852 64457862 56494109 35119316 17512826 10761315 8920343
41332 8920343 7348410 8058116 11133806 11932155 8975142 6096862 4957527 3095421
41324 3095421 667891 1185106 3970458 3948949 1017334 1434840 6907286 10259713 6102378
41315 6102378 -1117938 -4219491 -2495836 552459 3249744 4975306 4042736 701375
41307 701375 -1649946 -1736920 -2763850 -6353433 -8833421 -7193343 -4103955 -3029423 -2756149
41298 -2756149 -939448 1157460 1777974 2403708 3984796 3689273 245235 -1774692 1345710
41289 1345710 5383113 4239311 -49750 -512222 3559028 6196655 5094406 4940620
41281 4940620 9256209 15315184 19322642 21275825 21942390 19496811 12743187 4879151
41273 4879151 588754 659646 1936442 1724106 169647 -1299829 -2111810 -2787638 -3935063
41264 -3935063 -5421369 -6388581 -6031703 -4420719 -2526577 -1354166 -959244 -413786 925507
41255 925507 2225371 2094299 893790 782138 2539703 3793472 2049654 -1576639 -3561863
41246 -3561863 -2126212 1616203 5655397 8117483 7402993 3929606 1009281 1422424
41238 1422424 3914403 5560263 6068278 6429665 5160215 575431 -4359314 -4926984 -2100340
41229 -2100340 -1268421 -3224253 -2819375 2072323 6966130 8701940 10374827 14494846
41221 14494846 17241407 14590265 9420404 7120367 7812180 8242585 8186035 9301106 9950322
41212 9950322 7031605 2001321 -121515 2274510 5469832 5617629 2781957 -232337
41204 -232337 -739060 1854754 5272093 6384339 5039712 3992764 4004251 2188460 -2636678
41195 -2636678 -6389906 -4758948 872146 5711308 7278947 5871925 2334021 -1024524
41187 -1024524 -273039 5078102 9301720 7184923 1513905 -491086 3763712 11052266
41179 11052266 17840566 21941399 20823584 14303738 7940046 7743914 11755855 12698955
41171 12698955 9033393 6959348 10118287 13722469 12140610 7373839 5737651 8971990
41163 8971990 12723985 12795549 9712032 6847243 5901027 5369349 3424279 1146699 1077979
41154 1077979 2693572 2360884 -763227 -2154626 1799418 7834256 10090588 8161412
41146 8161412 6303085 6292161 6423260 6949074 10567757 16485271 19407818 16684250 12185328
41137 12185328 10521549 10953727 9977662 7238397 5642644 7051513 10551202 14221712
41129 14221712 16571158 16825268 15633517 15193522 16965549 19049645 17346011 10373837
41121 10373837 2214515 -938466 2421207 7289104 8362872 6541293 6849400 10954920
41113 10954920 15301147 16911420 17174788 18281847 19283190 18171699 15586481 14103424
41105 14103424 15360808 19316575 24542742 28300630 28691815 27512630 28068841 29721712
41097 29721712 28740810 25395637 24725851 28106742 30075037 27144701 23769767 24690793
41089 24690793 27185085 27113554 27400012 33020807 41778625 48389780 54555111 65535061
41081 65535061 77913059 80455365 68597467 50325428 35659463 26826260 20985546
41074 20985546 16633987 13949559 12500209 11237241 8999557 4821211 -148534 -2199788
41066 -2199788 579100 5259196 8593857 11728086 16068166 18010975 13927479 7455618
41058 7455618 4796029 5279963 4486360 4363343 10602686 20606237 24436591 19233994
41050 19233994 13029424 11702189 11447415 7929511 4312023 5141570 9079778 12698928
41042 12698928 15923707 19291932 20807247 19542285 18005575 17737954 16906759 14715993
41034 14715993 13290337 12871979 10560906 6359749 4853269 8116897 12560241 15468068
41026 15468068 18613160 22429032 23169193 19696866 16761149 17176553 16840536 12322864
41018 12322864 7555984 7537084 10479709 11832128 11647340 12332504 12890369 10996860 7928381
41009 7928381 6533804 6648796 6386552 5581025 5017923 5090269 7244428 12760318 18209768
41000 18209768 17356435 10131615 4002994 3434776 4309223 2447657 620511 1953942
40992 1953942 3060447 93284 -3850723 -3861881 -1148709 215589 147421 397621 -190803
40983 -190803 -2715106 -4713095 -4724995 -5655718 -8638984 -9067840 -4192156 1341860 3508587
40974 3508587 5778350 10978468 13427586 8014646 799960 573296 4946178 5243559
40966 5243559 1036161 -933358 944349 2658439 3874897 7098776 9562012 6622359
40958 6622359 1829843 2935985 8745382 10596881 6585187 3567707 4626750 5210072
40950 5210072 3129744 2372513 4864381 7294553 7989395 8856430 9405838 7004260 3659594
40941 3659594 4015504 6410187 5283220 2604231 6170491 15238996 19239509 13706095
40933 13706095 6551666 4667518 4856099 2772444 790166 1395169 1813648 891647 2844339
40924 2844339 8485841 10999720 6453049 755834 182819 2619326 4260809 6999245
40916 6999245 12148949 14447847 10213556 4927270 4795437 6880804 5731544 3823564
40908 3823564 6279325 10126661 8631727 3171264 1409968 5484667 10383322 12716115
40900 12716115 13348565 12396282 9031174 5736120 6036005 8427233 8702265 7516377 9205806
40891 9205806 13492438 14959438 11302588 6227129 3332855 2424421 2751890 4812145
40883 4812145 7611438 8563964 7489844 6889445 7184657 5644724 1566546 -1180780 877125
40874 877125 5794214 8466080 6584957 2585837 340315 1230952 3512436 4836579
40866 4836579 4691379 4007476 3245377 2280468 1696174 2259080 3231610 3308659 3137529 4545638
40856 4545638 7435452 10150138 12545708 15381322 17156823 15787418 13233790 13518204
40848 13518204 15974916 16108580 13583399 12632252 13384000 10753883 4628787 2525336
40840 2525336 7596874 12569000 11690235 10225674 14079815 17898830 13728989 5471635
40832 5471635 3292805 7613512 10401354 10010844 12665535 19744103 25485105 28363140
40824 28363140 33251010 39825037 39968115 31045492 22006994 20799446 23809341 23606938
40816 23606938 20234408 18623994 20299284 23557914 27617379 31662897 33999644 36464119
40808 36464119 44588713 58078181 66108845 58882406 40628394 24602470 17640967 16160381
40800 16160381 15396000 15073242 15700223 15864724 15085978 14817883 15057125 13636902 10230830
40791 10230830 7825714 8813207 12152080 15437223 17522485 18361388 18427560 18853993 20141879
40782 20141879 20784948 19796957 20300707 26534034 36174260 40083657 32765914 19913807
40774 19913807 11872475 11825302 14535374 15174866 14228104 13382268 11796643 8962792 7559255
40765 7559255 9942163 13747741 14454723 11614519 9460092 11162390 15040950 17309415
40757 17309415 16704281 15041953 14022914 12882767 9759192 5106118 2628114 5478672
40749 5478672 11881939 16596609 17167614 16286175 16885711 18018899 18055885 18836970 22546539
40740 22546539 26673129 27341816 26810942 31710810 42926490 53006272 56000792 54695627
40732 54695627 54551178 55015997 51817780 44902209 38425852 33880047 28638435 21976691
40724 21976691 17809426 19157207 22971058 23481454 19501084 15602441 15779705 18148998
40716 18148998 17401782 11346509 3008200 -3398315 -6111154 -5080085 -725325 4783467
40708 4783467 7928795 8215262 9461161 13458553 15437529 10800067 3872099 3285756
40700 3285756 9407317 13645530 11225403 7346424 8088308 12047544 15012216 17107596
40692 17107596 20281037 23029135 22785688 20656779 19487818 19697662 20526319 22637377
40684 22637377 26110564 28714459 29349207 30126992 32164866 33258650 33122650 36349587
40676 36349587 45635806 56365241 62947270 66194022 68739990 67899463 60663465 52235441
40668 52235441 50748603 54953047 55734853 49635411 42468247 38583019 34834666 28001297
40660 28001297 21237142 19088569 20745328 21903792 20211878 16187860 11265054 7013119
40652 7013119 4474973 3175119 2326230 2862851 6054636 10674247 14336463 17036619
40644 17036619 20296494 23543975 24826688 24599557 25295456 27619494 30665318 34856120
40636 34856120 41008536 47416654 52016181 56557876 64034675 72486966 76174721 72997756
40628 72997756 66543521 61050431 58537303 60082195 64903530 68593652 67584156 65408653
40620 65408653 69319978 80404663 91888653 97109981 94182103 83540077 67198619
40613 67198619 50786580 40273411 35912760 34341741 35416453 40137113 43313468 37756370
40605 37756370 26472595 20804799 24167142 27621004 25128829 22640273 26086381 30132373
40597 30132373 27176702 20115192 17088763 18624965 18714304 15342660 12159079 11834681
40589 11834681 14218943 19110788 25275577 28756000 27129904 23321911 21110426 20004514
40581 20004514 18754765 19800610 24947447 30607641 33189610 35400568 40890459 46593542
40573 46593542 47957883 48645241 56392154 70611187 82649451 88452967 93064031 101328598
40565 101328598 111022720 117040082 116766051 109755562 97429707 84973459 78806040 79864101
40557 79864101 82699347 82610732 80659333 80898072 85782888 94935966 105518904 113508469
40549 113508469 117267149 119514337 123001688 125499138 122956806 116507355 111553849 110361674
40541 110361674 110620112 111264517 113893662 117195629 115831467 107812589 98616783 94621226
40533 94621226 95518567 96390608 94994058 93693737 94953380 97269161 96010351 88086110
40525 88086110 76050154 66645719 63800135 64032082 60948633 53416704 46583821 45268892
40517 45268892 49122081 54162248 56559452 55140074 52489206 52947734 57217135 60319370
40509 60319370 57811486 52174835 49224311 50236548 52624900 56418727 63274808 69652217
40501 69652217 68853741 61406415 55902759 56729448 58281537 55450974 52592324 55707735
40493 55707735 61302160 60833095 53356025 46288682 44638597 45968705 46006275 43553480
40485 43553480 39252170 34572857 33210335 38859538 49377784 56411905 53444786 42828829
40477 42828829 33359194 31783259 37458958 44674227 49685776 54961997 64900282 77200275
40469 77200275 82110397 73361605 57299732 46827387 47577517 54529402 61162618 66299339
40461 66299339 71699296 78904702 89833332 104410646 115654544 114548757 104340604
40454 104340604 102487045 120226556 144953629 152561967 135666794 110318862 94894868
40447 94894868 92136081 94391648 97230667 102610297 114920392 138338076 171869358 202402750
40439 202402750 209985736 187930162 153773390 133239373 135754901 150403542 160608280
40432 160608280 155658260 133520626 102979702 80618720 75497472 78263605 75119027
40425 75119027 69460249 76050220 94779845 107847980 107904255 110931216 129571747 148414361
40417 148414361 142459660 111598531 79228570 60547469 49800730 39303698 33490695
40410 33490695 37357781 43923708 42991032 35460205 30456206 32104542 36171944 37712965
40402 37712965 36166144 33515281 31858750 32916043 36784526 40889599 42477958 42437735
40394 42437735 44621823 50632727 56867624 58214614 54078397 48927665 46407629 44876339
40386 44876339 40635609 34222304 30530270 32731285 38941822 45471457 50619937 54450801
40378 54450801 57831027 63307108 74317086 91330548 110214072 125892004 136472897
40371 136472897 143060442 146891563 147192716 141161193 127229488 109609689 96510419 90460010
40363 90460010 84161606 71521795 58776313 56349181 62798481 67672994 68837879 73912604
40355 73912604 83384011 86718118 79663228 71454948 68505341 64713531 55999096 50632663
40347 50632663 54917565 61448871 62756119 64010820 70372825 75326902 75256946 80998677
40339 80998677 98485146 113386623 115494636 122886519 155426820 196177834 209643791
40332 209643791 191696016 170579731 163394380 165292978 179208490 217225226 267453074
40325 267453074 298890978 309618526 330859739 369102241 387493994 368586055 351810326
40318 351810326 371499382 394429368 366915931 299871882 254562406 254207318 260523338
40311 260523338 238355130 196865394 157723427 123335497 92407877 74970788 74205043
40304 74205043 76726907 74782056 77199166 87174109 91120090 82135329 73512185 74936383
40296 74936383 74968045 62828181 49762808 51137405 61531575 65081443 59109461 51135880
40288 51135880 42743565 32829161 28225410 34620019 43174526 41224450 31091968 24455160
40280 24455160 23256606 20401395 15352914 14592265 18373671 20005238 17818032 16897128
40272 16897128 19397490 22675864 26040030 30502185 33236929 30713510 25660904 23125981
40264 23125981 22210000 19572599 17470673 19401799 21668467 19272995 16496243 20642613
40256 20642613 28610966 31742392 31366473 36418428 47252060 55821959 61464381 71743664
40248 71743664 86957729 99403433 109859947 128075143 154199298 179582589 211612370
40241 211612370 272673243 358126865 417590681 404436760 332711702 258872707 214119753
40234 214119753 184080342 154427657 141001722 157938477 182005826 175408687 133941750
40227 133941750 89156917 65682429 57173714 46949678 33483675 25866828 26104012
40220 26104012 27864775 27730883 27716567 28142006 25938087 20675682 16414887 15816236 16395009
40211 16395009 14577593 10717426 8011254 8072036 9467580 10004154 9158820 8309601 9060537
40202 9060537 11329405 13231294 13151044 11470239 9659528 8391119 7620784 7844977 9728006
40193 9728006 12707779 15342619 16765958 16510245 13700983 8579618 4418209 5246954
40185 5246954 11169959 18024967 21998214 22487534 20531586 17442139 15475177 16389870
40177 16389870 18062111 16034210 10389907 7565338 12325268 20705536 24416697 20503967
40169 20503967 13545471 9809176 12168580 19292582 26805093 30418734 30583438 32525728
40161 32525728 39108568 46021033 47674839 45478761 45428417 49105941 52644434 54008823
40153 54008823 55279084 56965980 55838092 50368767 43603065 38417967 34030436 29348899
40145 29348899 25907941 25116312 25914063 27142564 28990126 30697131 30925992 32001632
40137 32001632 38661504 49815543 56961643 54970575 49431705 47974426 48790588 44547881
40129 44547881 34747205 26686366 24972914 26835337 28215969 28785185 29972164 32542321
40121 32542321 36692734 40739872 40262469 33061662 24172127 20618910 21892749 21888899 19862667
40112 19862667 21470875 27485050 30255453 25642836 20794479 23943799 32301549 36877549
40104 36877549 35054867 31337274 28594443 25758801 22766413 21208927 20547694 19254842
40096 19254842 19100954 22675231 27032662 25954063 19366968 14815111 17763452 25193380
40088 25193380 30795890 32196114 30682864 27704134 24792018 24412004 27850559 33354920
40080 33354920 37977389 40100551 39431023 36484874 33207371 32316488 34757015 38791361
40072 38791361 41838187 41970267 38343796 32648828 29595203 32571543 38633343 41387325
40064 41387325 39461656 38267436 42209850 49180148 54641718 57264492 57904339 56439152
40056 56439152 52780211 48533777 44890565 41088569 37196517 35572979 36892902 37769749
40048 37769749 35628785 33012122 33064961 33395959 29433002 22501919 19295228 23023891
40040 23023891 29289492 31646706 28261380 22371667 18516753 18776386 21089691 21528424
40032 21528424 19446577 18739890 21908224 25302027 24098678 20271133 20605144 26976493
40024 26976493 33613022 35191682 33378364 33401911 37488475 43852566 49584214 52170323
40016 52170323 49788855 42391378 32389721 23569333 19193174 20028174 22961427 23028455
40008 23028455 19132001 16382693 19662434 26116846 28199404 23708663 18027305 15930231
40000 15930231 16390509 17255839 19797369 25078870 29811306 30293560 28318597 29063436 34098423
39991 34098423 39886958 42912634 43582144 44690517 47495814 49651284 46996017 38321712
39983 38321712 28145080 22726593 23160314 24931271 24586197 23395091 23435502 24206280 25311703
39974 25311703 28351343 32938431 34727587 31469294 27541202 27701200 29618656 28499659
39966 28499659 26390162 29348323 36235953 38586156 33113144 26594780 25077870 25332741
39958 25332741 22110462 18070022 19637712 26233547 30568911 28608313 23290636 18585560
39950 18585560 15465342 14485908 17044259 22039158 25436598 25675371 26419997 31498251
39942 31498251 39688791 47102570 52661242 58527829 66530702 76518710 86888021 94271896
39934 94271896 93968383 83721571 67053763 50831597 39713246 34258099 32924017 33244087
39926 33244087 32160563 28665615 26015686 28093899 33392820 35964405 32984109 28015143
39918 28015143 25743746 26965196 30440570 36157200 43859421 50796799 54196778 55047959
39910 55047959 57305380 64097807 75705825 89299416 99028778 98601653 86482529 67812101
39902 67812101 49810287 36550745 28958997 26988685 29331060 33041738 36029108 38563294
39894 38563294 40783075 41169214 39692591 39860115 44818953 53561905 63485406 74265497
39886 74265497 86820351 101603223 120583784 146501879 175698370 195937114 197569338
39879 197569338 184343147 167351188 150922177 131142761 106318430 81467481 62758243
39872 62758243 53447348 54135855 60843665 64744046 61148568 56875643 60390032 66837845
39864 66837845 63564608 49801212 38535196 37179289 39205213 38637488 39619642 45504575
39856 45504575 51434440 56125621 68290424 89763046 103247052 91627554 62573913
39849 62573913 39051412 29828604 24502672 15339245 7631283 6320454 6966132 5388804
39841 5388804 5154239 9344729 13475733 12786981 10051317 10425605 13673658 16585433 18674945
39832 18674945 20520420 20209203 16684515 14168630 18052792 27116298 34070315 34312142
39824 34312142 31118105 30985941 36096311 44035591 54458735 71535563 95748346 115996818
39816 115996818 117536148 99760928 79027232 69272334 66120507 56748283 39902371
39809 39902371 26584312 23148924 23870477 21574853 17331283 16413936 20279895 25727049
39801 25727049 28819828 28327182 27715967 32755452 43420466 50177481 44042028 29075695
39793 29075695 18252638 17317027 19860809 18765819 14774452 11770457 10735355 11429948
39785 11429948 14218910 17273265 16924596 13076938 9494959 7251472 3432947 -2071902
39777 -2071902 -4677964 -2290577 1498100 3674150 5292257 6543345 4928158 1071762
39769 1071762 -417679 1031190 233536 -3897191 -4681744 1121978 6301005 4115899
39761 4115899 -431647 1998892 11467019 20221753 23834763 23457982 20215361 14739439
39753 14739439 10283252 9840146 11531195 11772416 10850941 10893033 11301850 10861049 10980531
39744 10980531 12192995 11444249 7769533 5805088 8019298 9168391 5524894 3352648
39736 3352648 8878666 15485912 12604615 3733767 2443949 11350808 18465107 16145366
39728 16145366 10897996 10405771 12409533 12322891 12150718 14821099 17193092 15798205 13652230
39719 13652230 14627875 16035272 13588071 9733151 10000523 13709833 15305867 13859560
39711 13859560 14642404 20577761 27666097 31140735 32275930 35730571 41980989 46362322
39703 46362322 46189602 44982420 46623504 48575779 46676665 44980959 52058559 65837613
39695 65837613 72858743 68987570 69926702 89039750 112942804 116189734 97681244 83479808
39687 83479808 89585602 99979312 91346879 65087704 41135493 29610582 23869223
39680 23869223 17213194 11645371 9630205 9026411 9055021 12773000 20433572 26777149
39672 26777149 28030775 26772879 27061023 28665713 29154525 29187680 32865749 43220567
39664 43220567 57989602 69269082 68409464 53859860 34348074 21806140 20196249
39657 20196249 22931412 21766602 15950238 10930821 9770494 9112576 4528869 -2702437
39649 -2702437 -6870924 -5036139 113575 4746936 7809148 9468475 9511046 9359409 11846274
39640 11846274 16333171 18237649 16532699 16503793 20754028 23959224 23237183 26696361
39632 26696361 41821653 61384301 73067382 77917497 84504097 89439627 83342760 75162238
39624 75162238 86509660 115605695 131474580 117164495 95907505 94964091 103279690
39617 103279690 91014449 57873514 32180067 26797985 25602950 15953924 7217568
39610 7217568 8858003 13203782 11733137 10276276 15223109 19207523 13756204 4779018
39602 4779018 2606086 5651877 6161079 4535976 5787730 7808809 5351132 1529091
39594 1529091 3666367 9969111 11062218 4120669 -3759547 -6416113 -4931731 -2559079
39586 -2559079 -307092 1165862 839290 81634 2179905 7909255 13998814 16208851
39578 16208851 12528376 4710571 -1820003 -1953749 3311260 7844380 8686807 9083566
39570 9083566 10974605 10421883 5235661 1469856 5437029 13235389 15800815 11913452
39562 11913452 8592090 9935210 13084436 14992754 16077378 16408941 14462746 10791610
39554 10791610 7810022 5353135 1498487 -2005529 -813496 4717888 8964570 9095325
39546 9095325 8245088 8990586 9227389 7150251 5378725 6801453 10097451 12526576 14106976
39537 14106976 16289790 19233842 22756719 27288837 31824615 33972887 34279171 37074382
39529 37074382 43951174 49511378 47497390 38959543 30194773 24069698 18079881 10939500
39521 10939500 6262107 7420815 11725046 13031447 9608662 6567291 9255631 16111875
39513 16111875 20745480 20915664 22019521 29562652 40764978 47194832 44602335 36349820
39505 36349820 27460558 19608222 12977902 8850576 7796001 7994782 7689846 7246855
39497 7246855 6988328 5462521 2134475 -598282 -842469 -586009 -2507641 -5211285 -5396906
39488 -5396906 -3683557 -4047482 -7500645 -10534451 -10790604 -10308490 -11229647 -11764637 -9327470
39479 -9327470 -5218707 -2882938 -2982154 -3495629 -3763697 -4766872 -5445956 -2649290 3941954
39470 3941954 10037171 11891553 10820797 10410065 11349564 11637861 10280270 7918978 4917102
39461 4917102 1730900 293097 1875700 4164196 3864017 1939522 2442516 5857917
39453 5857917 7870191 6060528 3720813 4712413 7943067 9667699 8548942 5718359
39445 5718359 2217405 -826447 -1580236 80112 1233465 -437847 -3319640 -4497025
39437 -4497025 -3715044 -2250204 -160945 2339740 3104080 1216019 -144011 1944270
39429 1944270 4668518 3029469 -2131521 -4693270 -2036551 1458601 961486 -2529661
39421 -2529661 -4267239 -1654506 3496769 7261285 7409355 5560354 5064222 6322455
39413 6322455 6374055 4513488 4943262 10486240 16751410 17402105 13193855 10363926 11298236
39404 11298236 12746450 13027229 14635743 18318858 20118979 16803861 10451911 5715008
39396 5715008 5425738 9736444 16331921 20782741 19886611 15211973 10733098 7832471
39388 7832471 6057460 6908601 11606353 16532351 17193627 15795053 17798395 21695914
39380 21695914 20755818 15192889 12651112 14587485 13130656 5891001 2670975 10021723
39372 10021723 19139761 19013192 13656515 14597231 21510774 23110756 15530271 7622141
39364 7622141 6562739 8355168 6085536 80760 -4418215 -4924623 -3186740 -1483257
39356 -1483257 -104173 2149281 5600198 7891406 6236105 2140860 809906 4162210
39348 4162210 8207506 9756071 11063179 14154839 15682371 12685431 8753068 8141484
39340 8141484 8049292 4015023 -789911 -42808 4713300 6562429 5062971 6126609 10532551
39331 10532551 12336924 9803516 8585426 11835931 15780199 17884453 21212829 27327584
39323 27327584 32722699 36209408 42171898 51677582 57525305 53986372 45438675 39106759
39315 39106759 34560580 27416715 19231253 15700684 16846537 16477881 11672448 6786788
39307 6786788 6569723 9615633 10807609 7870345 3478715 1553143 2827557 4787216
39299 4787216 5619854 6314453 7627066 7459648 4444867 2120137 4783095 10108607 11556098
39290 11556098 8438987 7378332 11940457 17050416 17138638 14509199 15057406 19563175
39282 19563175 24151033 27180372 31437827 40339443 54198038 68760153 76315788 71383332
39274 71383332 57260344 43813499 36849105 33201085 28171044 22939321 21031903 21920511
39266 21920511 22885872 24010865 26745037 30382750 34445773 41377164 51385949 57240121
39258 57240121 50882788 34684144 20073746 14374303 14072591 12114370 6961598 2156058
39250 2156058 482646 1553711 3662456 5728480 7539808 9148528 10501103 11805620
39242 11805620 13754607 16294038 17428881 14993259 9779480 5084293 3146553 4236604
39234 4236604 8786214 16799025 24821487 27750732 24978332 20811224 17698069 13757868
39226 13757868 8506300 5354970 5836162 7258123 9281115 16008052 26908524 33142378
39218 33142378 29920855 25744880 30551121 40628353 46018000 48012752 55745218 66946349
39210 66946349 67121209 51098986 32106825 23341160 21797504 18349548 14129967 16205692
39202 16205692 23250882 27408766 28250058 33727771 45954845 55330831 52732822 41090698
39194 41090698 29990435 23118170 16853767 9457562 5183489 7389380 12142844 12721749
39186 12721749 8572014 5494426 7144951 10702012 12210395 12039036 12343911 12547287
39178 12547287 11026506 8994757 8823561 9944339 9960241 8560936 6947720 4897323
39170 4897323 2204859 1476772 4939283 9518862 10074050 7081279 5932966 8570510
39162 8570510 11371058 12129574 13268859 16118929 17616408 15968498 15067443 19438910
39154 19438910 28154439 37377849 45872139 53735505 57826385 53467848 41064173 27652438
39146 27652438 20520608 20530757 22370405 20812604 16284796 13924363 17009518 22485488
39138 22485488 24397796 20931727 16060040 14506110 17009425 20453555 20932219 16939511
39130 16939511 11137885 8433921 10839943 15335310 18179331 19083839 19111169 18055496
39122 18055496 17778778 24021752 38345173 51015951 50114688 37063919 24747926 19935590
39114 19935590 16960392 10895666 6575095 8917239 13082291 12188397 8785980 10166499
39106 10166499 15920567 18474189 14661227 9811727 10239523 16529714 24222285 27662230
39098 27662230 24006258 16385096 11721114 13044005 16469131 18117563 19792946 23738091
39090 23738091 26360920 23345324 17720036 15869891 17553654 17138901 13695131 12210664
39082 12210664 14487171 16447715 16241425 17820482 23129424 26878477 23931623 17872672
39074 17872672 16944971 23098530 29455519 28691983 21062121 13372491 11532968 15175201
39066 15175201 19403803 20714993 19756864 18450761 16853387 14271005 11439030 9602461
39058 9602461 8983590 9910032 13413720 18480179 21041163 18788280 15071830 14647128 17218725
39049 17218725 18737608 17461188 14823757 11801414 8808566 8150379 11858970 17330734
39041 17330734 19340329 16326898 11157892 6651072 4397743 6476076 12981962 18741294
39033 18741294 18307960 13989529 13191932 18373248 26208420 35910702 49480088 62353352
39025 62353352 63660637 50265861 32450020 20488356 13134536 5326141 -497083 769789
39017 769789 6355301 9168431 8651278 9502305 11846404 11170549 7027475 3950203 4010738
39008 4010738 5489885 8325312 13486062 17327237 14744425 8650461 7994375 14732648
39000 14732648 21328088 23785370 27728102 36370392 41430052 34299537 20177149 11808580
38992 11808580 12505580 14398124 11978872 8268934 6803053 5868020 3724611 3163533
38984 3163533 6801850 12129193 15206017 16360694 18437926 21247338 21387125 17147404
38976 17147404 11072644 7494284 8646245 12816000 15663682 14250228 10260380 7897239
38968 7897239 8152624 7294170 2180261 -5228175 -10469764 -11497632 -8723225 -2515205
38960 -2515205 5854250 12253751 12837027 8993723 5526927 3906463 1291202 -3272914
38952 -3272914 -6280074 -5298569 -3023898 -3052612 -4924672 -6339857 -7131745 -7507093 -5383993
38943 -5383993 20006 4378367 3375618 104956 1275714 6416232 7698389 2061800
38935 2061800 -3295601 -1254653 4943197 6879782 2635191 -2364528 -4001070 -3301721
38927 -3301721 -2246787 -827875 1028649 2279348 2269324 965719 -1944431 -5485120
38919 -5485120 -6127687 -2120336 1740692 -1128022 -9139608 -13016044 -8095425 -613083
38911 -613083 1497554 -1035684 -2114438 344748 3806864 6865185 9551192 9664244
38903 9664244 4977061 -1469942 -4142947 -3107002 -3612081 -7297962 -10100218 -10074094 -10369564
38894 -10369564 -11662860 -8679393 830716 9560136 9510159 3249779 -537117 292889
38886 292889 802530 -431711 1315020 7688779 12855431 11602598 6483592 3275331
38878 3275331 3322739 4033923 3924588 3419881 2548637 1152860 252462 541367 446802 -1907229
38868 -1907229 -5374730 -6599931 -4165149 -424757 1116107 -392551 -2203701 -1065228
38860 -1065228 2550902 4361606 1602621 -2873759 -4138919 -1820912 -14461 -927914
38852 -927914 -2371324 -2041287 -376401 2069854 6192638 11302056 13992386 12392237
38844 12392237 8728957 5731882 3514385 1868592 2116950 4433656 7002752 10075568
38836 10075568 16272075 23825056 25119922 17029390 7595286 5870606 9441184 9866230
38828 9866230 6978927 8079063 14190610 17602077 14588003 10965868 11816839 14382548
38820 14382548 15622512 18932730 27501478 37386833 43525823 47257928 51408011 53399927
38812 53399927 51654966 54512585 71673246 96720424 108742757 95439153 67476051
38805 67476051 45354992 37694139 37784034 36836348 32954064 27911062 22303572 16604425
38797 16604425 12888356 12260864 12504640 10793326 7526115 5397345 5789365 8226758
38789 8226758 12224481 16916552 19708461 18863113 17481361 20959773 29394652 36414020
38781 36414020 37378464 34790377 33047088 32133695 30397436 29468104 30973983 31438834 26881153
38772 26881153 20665000 19944583 25408957 32358068 41990542 61960183 91614921 114722019
38764 114722019 114100826 90115609 59360105 37532361 27996869 24626908 20514738 13893819
38756 13893819 8631677 9119650 13931010 16489279 13024018 6816435 2920651 2336845
38748 2336845 3831189 7461157 12579703 15715876 14672618 12240522 12042346 13297896
38740 13297896 13509846 13292410 13995654 13495902 9702535 5906856 6938711 11840131 16219173
38731 16219173 20058167 26292948 32537799 31997237 23680239 14671772 10243619 8085579
38723 8085579 4894578 2468496 3407678 5713566 6045321 4953160 4968119 5992807 5851402
38714 5851402 3462492 -830064 -5811115 -8483165 -5672073 1162829 5904600 5301521
38706 5301521 3392969 5221095 9168080 9691365 5665079 1649766 1717923 5762618 11562415
38697 11562415 17187247 21187249 22869476 22609357 20535644 15959050 9925779 6670917
38689 6670917 9545159 16391428 22058469 24974312 27888728 32079445 34493612 31995487
38681 31995487 25704711 19279028 14671181 11368396 8637216 6619263 5440203 4630898
38673 4630898 3831162 3533711 4786840 8157017 12949210 17323255 19116120 16927355
38665 16927355 11373026 5790726 4548576 9024955 15671253 19899019 21759678 25452504
38657 25452504 32730084 39494552 40532233 35487668 28127137 21444937 16024119 12190096
38649 12190096 10942917 12436649 15216417 17350461 17629752 16078726 14046931 13156710
38641 13156710 13533104 13973339 14102684 14568097 14797045 13660979 13622495 19862201 31657548
38632 31657548 38710076 32140086 17052767 7178591 7426568 9508846 6447736 2863724
38624 2863724 5731950 11938363 12997537 8435576 5893415 8772255 11977841 11397205
38616 11397205 10234067 12396830 15442226 15076607 12734636 13010114 15586907 15554382 11657258
38607 11657258 9004463 12075242 18912720 24213215 25163584 22134473 16337302 9649764
38599 9649764 5054470 4273110 5543740 5818989 4405549 2560004 722577 -1318064
38591 -1318064 -2521427 -1883656 -1073465 -2458434 -4614585 -3479565 1487953 6147423
38583 6147423 7814031 8523308 10246469 11040878 9076267 6742502 6697028 6940993 4641022
38574 4641022 2382782 4880628 10738216 13701725 12101626 10617845 11385945 10000236
38566 10000236 3571013 -3060594 -3889109 -219392 2720398 4373163 7935168 12540952
38558 12540952 12950834 7583887 1358371 -1041369 -234808 1356056 3775057 7463129
38550 7463129 10381408 10718416 10154857 10955532 11692911 9788614 7050871 8017938 12677069
38541 12677069 15639035 14165056 12571664 15634810 21324145 24487044 25336298 28834667
38533 28834667 36257835 43213307 47431177 52921125 62797316 72120567 72866224 64045284
38525 64045284 52109262 42219501 34047687 26538117 21720268 21282213 22617940 21305089
38517 21305089 16200307 10215901 7064587 8348156 12524687 15722613 15002758 11699882
38509 11699882 9896413 10934646 11917659 10890291 10329050 12744775 15516224 14089325
38501 14089325 8996954 5505546 6422971 9103045 10148060 9539683 8879548 8514941 7975627
38492 7975627 6925955 4408055 -310475 -4582357 -3012447 5917319 15883221 18829074
38484 18829074 14240198 9048855 8440283 10254165 9678623 6378309 4178073 4993276
38476 4993276 6231378 4930713 2305603 2282472 6212180 11177050 14170975 16070384
38468 16070384 19646225 24757919 28249758 28936273 30123533 35854258 46523638 59552927
38460 59552927 72242423 81905053 85620648 83675768 82104439 87029998 95631941 97197522
38452 97197522 85559498 67066897 53214106 48303418 48274627 49307321 51877401 55983366
38444 55983366 57677829 53320808 44898575 38702077 39495451 46570777 54074828 55077494
38436 55077494 47635897 37377717 31707383 31332367 30957042 28522194 28193046 31853043
38428 31853043 34096975 31121288 29106932 35829931 47605131 54536348 57714650 69731683
38420 69731683 95105674 120844552 132603461 131420311 126308589 117640776 98933444
38413 98933444 71647626 46735717 31090505 21784268 15031188 11969181 12755682 13068215
38405 13068215 10869899 10143971 13201624 15198857 11907712 7809299 9569297 14890050
38397 14890050 15372134 9094848 3099653 2970122 6358103 8497067 8682716 8597006 8288836
38388 8288836 6946125 5177365 4145325 4344793 6671785 12034436 18155222 20136796
38380 20136796 17397667 17050283 25578745 38570104 44386891 38812836 30586033 29599867
38372 29599867 34258343 35340859 29545820 22922107 20984446 21771572 21264640 20406334
38364 20406334 21998709 23922168 21482369 15880108 14530005 21359859 31296216 36975015
38356 36975015 37586725 38105073 42500533 51514532 65521036 84907579 106557167 122817663
38348 122817663 125907935 113218509 88903809 61701527 40447528 28953358 24045576
38341 24045576 19732180 13750412 8904424 7995078 9561331 9872142 7675221 5226681
38333 5226681 5070859 7283629 10095924 12230005 13922532 15756915 17029169 15952464
38325 15952464 11814071 6431423 2813161 2654957 5722536 10932402 16555139 19704159
38317 19704159 17923095 12367554 7885896 8565933 14054833 21058199 26932943 30656304
38309 30656304 32685473 36645457 48759020 70306837 90687851 94231779 77161826
38302 77161826 53206838 38155522 32891815 27395651 17841113 10811594 10597860 11933869
38294 11933869 9400309 6311215 7933125 11371812 9762808 3421072 -856267 -365426
38286 -365426 860894 -67712 -1260200 -1296453 -1729708 -2513285 -798420 3285345 5104344
38277 5104344 2684835 271640 1337179 3013113 1672354 -578721 -195109 789708
38269 789708 -1879777 -6608253 -7462010 -2953198 2270317 4493194 4658458 4549515 3991025
38260 3991025 3190116 3963741 6772237 9170947 8673403 5282549 643765 -3084374 -3160537
38251 -3160537 2073875 10150828 15335088 14230819 9300939 5610409 5165433 5792770
38243 5792770 5064158 3804843 4832129 8635128 12012864 12282304 11247770 12147425 13628588
38234 13628588 11197108 5236741 2293424 5803472 10574937 10484989 7054392 5123259
38226 5123259 4146275 665089 -3239467 -1817805 4623351 9209602 8251840 4857920
38218 4857920 1993666 -1210381 -4458732 -4267366 107104 4216284 4865114 4066781 3848455
38209 3848455 2367682 -1327173 -3543993 -1099566 3619088 6557862 7383163 7348089 5560985
38200 5560985 1647884 -1033822 629503 4527549 6234093 4952950 3245240 2962548
38192 2962548 4471188 7451631 9558211 7268960 1205095 -2870328 -1945759 -634331
38184 -634331 -3668265 -7910337 -7914422 -5563723 -6519758 -9571357 -8206832 -2210335 1217826
38175 1217826 -734184 -2010047 1915067 6615227 6216577 2388753 577611 1667059
38167 1667059 2921157 4122506 7048726 10459248 11023831 8925657 7839785 8918176
38159 8918176 9093384 6655191 4653293 6290744 9756701 10964185 9957860 10810484
38151 10810484 15060655 18984338 19023348 16866060 16433835 18114321 19511737 20415839 22646688
38142 22646688 25197978 24191572 18772585 12910616 9707277 7827249 5523515 4053311
38134 4053311 4310264 4045684 2040956 1551318 5426812 10677785 12327907 10328224 8149863
38125 8149863 6644753 4199159 1459495 952560 2839247 5322199 8064467 10866235
38117 10866235 10647950 5031194 -2196594 -4683148 -1865167 1630234 3874400 6713460
38109 6713460 9618836 9495087 7020039 6166225 6587520 3859742 -1312511 -2144193 3358859
38100 3358859 8515632 8519004 6994515 7534691 6707904 1628696 -2771388 -1420956 1977969
38091 1977969 1515331 -842878 -205160 1085619 -2041682 -6282704 -4032151 3119262
38083 3119262 5770006 1513227 -2332837 -2040469 -2617651 -6407839 -7051813 -461603 6882341
38074 6882341 7453879 3666262 2113527 2422196 -208204 -5115296 -6836159 -3825178
38066 -3825178 343193 3209551 4709000 3646386 -444561 -2696419 2548110 11845016
38058 11845016 14437769 6292142 -3823766 -5603101 665432 7246694 9866196 10357753
38050 10357753 10944664 11158250 10156932 8380901 6497921 4840635 3700492 2601868
38042 2601868 147473 -3682516 -6170389 -4767319 -363367 4200245 7551730 9563665
38034 9563665 9358565 6593225 3661673 3285954 4490128 4261224 2594573 2031789 2484340
38025 2484340 1204975 -1330506 -625402 4443145 8076681 5141645 -1021428 -2672806
38017 -2672806 2380279 9011104 11853519 10238668 6394864 2475129 163427 484367
38009 484367 2706267 4765270 5332942 4541811 2874041 722616 -942523 -865895 1070947
38000 1070947 3345082 3919416 1924386 -1135376 -1904753 1651834 7125665 9419917
37992 9419917 6587907 2239537 981389 3273939 6281995 7951750 8300668 8147194
37984 8147194 8485157 9919061 11293056 10541609 8191605 7516173 9359674 9958571 6840801
37975 6840801 3644038 4891485 8689513 9743802 7704795 6614774 6968732 4920351
37967 4920351 89001 -2426533 -273204 1633446 -1406148 -6224495 -6308403 -1424713
37959 -1424713 2182849 732657 -2173784 -1018799 3702380 5669083 1047553 -5590320
37951 -5590320 -6107441 971765 8502035 10065520 7393721 5702065 5588188 4477904
37943 4477904 3434744 6227221 12138917 15648596 14035184 10333659 7945390 7178808
37935 7178808 8086835 11595251 16033493 17201832 14057284 10393920 9090144 8697533
37927 8697533 7474905 6552228 6958379 7517557 7851753 9613740 12792838 14806274 14941210
37918 14941210 15072724 14277875 8546167 -1262011 -7356376 -5234112 -291619 847967
37910 847967 117576 2868281 7822007 9759051 9015618 10344435 13916593 15011825 12116149
37901 12116149 8377297 5106226 667279 -3600235 -3154316 2333653 7223774 7758793
37893 7758793 6603126 7349015 9353659 10677339 11624663 12145905 9782735 4214258 707831
37884 707831 4261900 11759954 14618348 9452457 2333710 1170869 6674780 13038361
37876 13038361 15895990 16494473 17537887 17819709 13807711 5822594 -594574 -767757
37868 -767757 3724762 7434964 7378449 5104165 3512430 3978740 6572491 10859684 15340370
37859 15340370 17331375 15232371 11284923 10586544 15573718 21942802 22649399 16626831
37851 16626831 10414873 9323251 10714567 9687460 7674436 9391397 13518146 13863921
37843 13863921 9537970 6228621 6204980 5024419 812360 -1218011 2191136 6144896
37835 6144896 5809693 4058190 4647118 4219687 -1121934 -6599071 -5058951 1080218 3351162
37826 3351162 518474 -832715 1967484 4485850 4236870 4373370 6581036 7762879
37818 7762879 6248232 4987937 6003377 7059606 6216916 4854745 4175483 3415064 3289741
37809 3289741 6185698 10752812 11457735 6546197 1866008 3099997 7893177 9708033
37801 9708033 6802791 3183213 2053292 2318475 1723753 457141 223472 1025447 762975
37792 762975 -1368374 -2692417 -485659 3295510 4320869 3030518 4574989 9934886
37784 9934886 12859103 9444116 5125247 6498427 11083946 12132856 9446116 7343124
37776 7343124 5210162 -563731 -7085997 -7425705 -2363975 225830 -1539598 -1300840
37768 -1300840 2864648 4276443 131976 -2098847 3170685 9729241 9115616 3446379
37760 3446379 1063401 4105764 7710509 8472162 7304044 5833112 4961365 5487472 6666361
37751 6666361 6168702 3935134 3046383 4614679 5855006 5530594 6190236 7818283 5067969
37742 5067969 -4394571 -13884332 -15591484 -10438716 -4737654 -994585 2102062 3928832
37734 3928832 2543735 -812517 -3080716 -3675103 -3384687 -1473528 2142160 4886340
37726 4886340 5803519 8162108 13256480 16079216 13023074 9538532 12939681 21039798
37718 21039798 25829653 25994194 27544516 33474976 40966138 48099971 55389640 61290035
37710 61290035 64640885 71200902 87835564 108426833 115601159 100938694 75483345
37703 75483345 55305583 43948422 35135998 26301924 21118872 21383949 23712009 24162787
37695 24162787 21629068 16995095 12307281 10099152 10736245 11334305 9646372 7519567
37687 7519567 7827776 9583605 9385927 6779958 4826195 5585603 8032049 10500750 12353400
37678 12353400 12760118 10550991 6370916 2891917 1661372 1398876 544329 -280605 58815
37669 58815 698800 135638 -965727 -834126 183643 381817 439672 2719111 6079115
37660 6079115 5735970 733237 -2594245 1267785 8537103 10862435 6565413 1488351
37652 1488351 -513149 -1773253 -4936833 -8713717 -11145226 -12105150 -10866832 -6111593
37644 -6111593 -166171 2037716 603585 1758889 8081507 13157937 10405291 2451705
37636 2451705 -3327007 -4685250 -4661366 -5193635 -6071471 -7738470 -9904640 -9462960 -4723325
37627 -4723325 329158 920766 -1391390 -1596852 623291 1153185 -1213011 -2970638 -1165300
37618 -1165300 3705704 9327072 12548516 10442471 4234936 -68562 898337 2919977
37610 2919977 1603273 573994 5055617 10827029 9002063 413154 -4818216 -2601825
37602 -2601825 196200 -1754428 -4582496 -3890629 -2214163 -2543355 -1980960 1948429 4821046
37593 4821046 1827361 -3870952 -5846390 -3922108 -2619614 -2790793 -1216719 2870689
37585 2870689 6782962 9463511 12424850 15381053 15500488 12068061 8387735 7537845
37577 7537845 8532818 8155520 5211718 1564417 -638637 -1531638 -2531968 -3297883 -1648789
37568 -1648789 2443039 4946742 2396813 -3067227 -6469028 -6711655 -6713398 -7497275 -6751490
37559 -6751490 -3685098 -710978 803000 2068584 2926593 1143227 -2424451 -2951881
37551 -2951881 1090856 4396652 2317108 -2089800 -2914857 -83618 1721702 689363
37543 689363 -594303 -375701 -37854 -1078109 -3106261 -5073613 -6085269 -5200867 -2578432
37534 -2578432 -361482 -347620 -1311546 -713763 1398820 2253714 8119 -3991912 -6559851
37525 -6559851 -5485975 -1633960 1281769 343785 -2561491 -2387004 2390028 7221294
37517 7221294 7477679 4457616 2624519 2832219 1846913 -2142366 -6900503 -9267664 -8421475
37508 -8421475 -5638975 -2754074 -1295451 -1650963 -2582099 -2447483 -1039484 403824 748972
37499 748972 -110870 -1486816 -2408350 -2238095 -1126010 583775 3295610 7440123 11756094
37490 11756094 13711838 12084215 8008166 3421754 -159944 -1652346 -1285553 -1332033
37482 -1332033 -3400611 -5111330 -2860780 1661663 2022101 -4009014 -10240844 -9948059
37474 -9948059 -4500012 -177896 879522 1755171 4153877 5775639 4748790 2740248
37466 2740248 2293457 3558887 4834044 4721664 3048474 894203 2565 998111 2160872
37457 2160872 1261558 -1318283 -2690025 -1148801 1335839 1249364 -2109392 -5362220 -4954146
37448 -4954146 -1933243 -1066627 -4394407 -7880185 -6812662 -2667234 -895434 -2806063
37440 -2806063 -4249132 -2754776 -1024465 -1496333 -2012969 177298 3758422 5830787
37432 5830787 5960326 4714965 1349113 -3577749 -6312928 -4605628 -1638493 -1144964
37424 -1144964 -1318698 1561636 5916548 7186891 5897378 6830539 10227483 10517373 5270635
37415 5270635 -733081 -2891265 -2756865 -3361881 -3584076 -1593427 112849 -1505622 -3876901
37406 -3876901 -2393145 1052135 -466243 -8102220 -14128021 -12494684 -7204154 -5445551
37398 -5445551 -6338350 -3121756 4844905 9673790 6176348 -956369 -4699833 -4941525
37390 -4941525 -5189533 -4621322 -346454 4776561 4264369 -2016824 -6971457 -6544921 -4300662
37381 -4300662 -3746365 -2842747 176565 1633187 -1590374 -5297797 -3301115 3083364
37373 3083364 6825851 5447080 3977365 7066832 12470198 14387679 11260808 8142450
37365 8142450 10792529 18134129 23023515 22241249 22344674 30758843 44266110 55072671
37357 55072671 67149934 93255317 130188299 150331501 130905631 84644843 47039450
37350 47039450 35697210 36530780 30430092 18001947 11240522 12755586 14319617 10926398
37342 10926398 6425677 5617049 7235994 6298479 541904 -6581025 -8980972 -4539680
37334 -4539680 1835042 3628334 527613 -2156215 -1356928 622149 1339148 1903019 3546893
37325 3546893 4593302 3544150 2176802 2906998 5338081 7555548 8630288 7952614
37317 7952614 4550102 -643477 -3958096 -2906451 506251 2440192 1886259 779471
37309 779471 521024 214967 -1966883 -6487947 -11097036 -12034861 -8061084 -2904740 -1328971
37300 -1328971 -2790115 -2117779 2748804 7172298 5944263 250662 -4075080 -3583452
37292 -3583452 -99842 2465494 2217006 477347 -15334 1767783 3898060 4214354 3596264
37283 3596264 4486452 6568815 6834458 4417375 2327525 3095062 5252270 5702494 3565401
37274 3565401 292865 -2270790 -2869125 -1621165 -580071 -1588926 -3147794 -1869436
37266 -1869436 2404846 5835982 5823736 3989384 2865695 2928922 4305204 7678894 11282655
37257 11282655 10642680 4425214 -2325711 -3936050 -641507 3570352 6927232 9987871
37249 9987871 12009437 11483225 9322028 7787797 6704605 3816671 -1515991 -7581556
37241 -7581556 -12554775 -15027968 -13444963 -7888642 -1556624 2369365 4396562 6431919
37233 6431919 7244178 4159616 -1309943 -3961568 -1759316 1533532 1794463 -529167
37225 -529167 -2340086 -2010244 64272 2833179 4774487 4246780 1199916 -2339365 -4253035
37216 -4253035 -3921280 -1815825 869016 2092065 628398 -1620687 -1283289 1684487
37208 1684487 3409299 1708291 -441841 553684 3181555 2971923 -870161 -4705155
37200 -4705155 -6169326 -6824197 -8070813 -8020517 -4889233 -1030344 -465344 -3594860 -7313211
37191 -7313211 -9676711 -11269867 -12020214 -10271536 -6177802 -2791132 -1849404 -1254831 884942
37182 884942 2404852 601352 -2417583 -1959348 2581133 7261153 9394169 9687612 8622337
37173 8622337 5443696 1837830 1812340 5647449 8226577 6313182 3575767 4732575
37165 4732575 8225670 9263814 7438627 6117843 5987836 4799921 2883189 3132941
37157 3132941 5090277 4812635 2118666 2180046 7041327 10939668 8452079 2959020 1427365
37148 1427365 3814215 4302767 1849286 2155808 7845648 13432189 13474780 10337369 9132526
37139 9132526 9092482 5935615 468356 -1876344 57527 1101438 -1740091 -4319228
37131 -4319228 -1860475 3911913 7727173 7464536 4202427 -1284815 -7464442 -9676742
37123 -9676742 -4243196 5387787 11254535 10050668 5778811 2961114 1534310 -227811
37115 -227811 -1839050 -2131257 -1810884 -1868505 -1278650 1321845 4737656 6016189 3869479
37106 3869479 244452 -1446618 297644 2898281 1719900 -4238194 -9730314 -8895312
37098 -8895312 -2754437 2324930 3440589 4028355 6813675 8767793 6394952 2457252
37090 2457252 2853339 8177045 12518830 10785047 4219930 -1974040 -4340344 -3441576
37082 -3441576 -1668464 -279868 838900 1147124 -918737 -5075093 -7730651 -6044755
37074 -6044755 -2531234 -2340592 -6099449 -9025537 -7674676 -3841599 -635976 1513605
37066 1513605 3093675 3234463 1544008 -541785 -2101130 -3484110 -3276238 1375855
37058 1375855 8896925 12251879 7801801 1453168 1194856 6417909 9859618 8012044
37050 8012044 4022846 1408019 437453 596375 1546733 1224569 -2404064 -6898601 -6872672
37041 -6872672 -1176973 5028826 6686483 4241442 1367113 79203 -302194 -1193277
37033 -1193277 -2982963 -4263764 -2904865 842744 3299687 1609918 -2011068 -3179625
37025 -3179625 -1680358 -1422060 -4294335 -7721874 -8761402 -7333525 -4875427 -2947948
37017 -2947948 -3575805 -7516952 -11535526 -10998552 -6154508 -2116178 -1357046 -418176 3601246
37008 3601246 7322837 5609791 -767502 -6024626 -6757559 -4831254 -3144207 -1785354
37000 -1785354 619143 3821626 5815751 5325968 3326465 1611520 446088 -1119516
36992 -1119516 -2527086 -1312479 3239625 7985530 9732165 9501656 10022520 10419028 7456916
36983 7456916 1637618 -2485758 -2833948 -2349538 -3535130 -4519848 -2876571 57293 1346579
36974 1346579 286067 -2284605 -5759687 -8323918 -6605452 -151836 5849176 5936574
36966 5936574 1189166 -2637837 -2766024 -1707069 -2228454 -3365566 -2287309 1899118
36958 1899118 6978344 9384925 7371346 3160139 877018 1306769 512244 -4314809
36950 -4314809 -9483226 -8559925 -941213 6538154 7020777 372500 -7736449 -11340828
36942 -11340828 -8519464 -2407352 1544710 963344 -702698 1301513 6079096 7637448
36934 7637448 3128801 -2735978 -3632299 500286 4383165 4644543 2767136 1116835
36926 1116835 -480449 -2899919 -5005349 -5043784 -3631858 -3096883 -3998199 -4311780 -2544442
36917 -2544442 201463 2431546 4936669 9234628 14052051 15831223 13228781 9066122
36909 9066122 6743375 6370588 5898075 4699763 4010929 4425682 5050740 5218638 5244994
36900 5244994 5100606 3965443 1789644 -133975 -1059727 -1971605 -3764565 -5485855 -5961048
36891 -5961048 -6140737 -7583943 -8920578 -6552376 159818 6714748 8294500 5236546
36883 5236546 1622425 -378259 -2029797 -4309419 -5850855 -5565705 -4683040 -4486995 -4039651
36874 -4039651 -2221928 -444474 -755601 -2201364 -2059844 -617027 -1390439 -5299487 -7659484
36865 -7659484 -3995744 2627021 3947064 -3106357 -11702560 -13139347 -7281725 -1462033
36857 -1462033 -119217 -407524 796158 878892 -3356940 -8270653 -7191576 -489422 4356762
36848 4356762 3367698 821856 1490323 3782387 4017894 2733347 2367567 2355141 1208766
36839 1208766 557572 2241237 3793089 1947182 -1288614 -1488575 747581 1056115 -851541
36830 -851541 -957037 1352912 1962442 -251316 -853653 2341160 4699385 1763312 -3750610
36821 -3750610 -6137184 -4538935 -2499580 -2094655 -2381493 -2247439 -1584590 -421436 938170
36812 938170 1678692 1571372 1087492 65131 -1448478 -916139 4438011 12156792 15644859
36803 15644859 12587637 7875708 5888740 4957570 2836362 2095128 4850231 6967283
36795 6967283 4041136 -537156 -711948 1829624 512527 -4228702 -4675995 1853013
36787 1853013 8672360 9921416 7742019 6171718 4543211 1113293 -2234571 -3525100
36779 -3525100 -4563152 -6769658 -7027899 -2527811 3390828 5356789 3766777 3519895
36771 3519895 6385701 9354423 9832199 8162242 5358573 2318058 1091196 3025485
36763 3025485 5485510 4208057 -493362 -3389051 -1106637 3913089 7276898 7452943
36755 7452943 5428444 2428625 -174971 -823840 547157 2263258 3421144 4812020
36747 4812020 6394205 6326522 4216182 2933788 4808728 7855612 8394350 6027304 3341183
36738 3341183 1843649 1133257 1251888 2522596 3180517 577627 -4546959 -7985590 -7369419
36729 -7369419 -4974175 -3942319 -4206350 -3935291 -2868237 -1964966 -1216687 -63590 958786
36720 958786 1035753 746995 892836 349380 -2524862 -6474602 -7829452 -5128501 -1307702
36711 -1307702 -101622 -1624865 -2898838 -1928882 325378 1965529 2669426 3440617 4675500
36702 4675500 5596101 5431397 4062149 1413789 -2414497 -5917000 -6836072 -5393331 -5122859
36693 -5122859 -8256148 -11710767 -10717744 -5566864 -1029309 719152 2166801 4641166
36685 4641166 5389666 2965030 976250 2616298 4970013 3336638 -1193309 -3235324
36677 -3235324 -761358 3156240 5268170 4755674 1970584 -1267358 -1273338 2952632 5875551
36668 5875551 1664161 -6154332 -7693202 -327870 7302120 7473711 3397787 2927454
36660 2927454 7128797 10284690 8443366 3214385 -1484833 -2878629 -807568 1454036
36652 1454036 -480795 -6326243 -9765771 -6035642 1162299 4111056 987197 -2875300
36644 -2875300 -3058917 -1062165 -529243 -2186130 -4268543 -5578194 -6084319 -5536953 -3163206
36635 -3163206 1035716 5130415 5952048 1877445 -4709367 -8852906 -7945456 -4532751
36627 -4532751 -3217837 -5311374 -7622159 -6429975 -1907956 1694226 472111 -4465980
36619 -4465980 -7750792 -6119934 -2685476 -2730253 -6268956 -7908583 -4107324 2613459
36611 2613459 7337537 7735397 4679477 780563 -949013 139711 494865 -3310014
36603 -3310014 -8358953 -8316731 -3369153 -1151775 -5187909 -8814757 -5229256 2068323
36595 2068323 4925938 2248273 -729375 -1647843 -2204049 -2077245 837855 4648858 4815978
36586 4815978 1502155 -672537 -431038 -934880 -2491186 -1216010 3093509 4666930
36578 4666930 770280 -2927242 -451309 5600256 8180772 5553720 1959622 489703
36570 489703 132827 -491445 -422840 1747937 5411183 8144125 7654002 3645777 -1755409
36561 -1755409 -5816421 -7475005 -7157425 -5046039 -1404417 1732826 1855088 -488675
36553 -488675 -1966684 -1205319 -774328 -3021142 -6164603 -6568654 -3556748 2174 1397657
36544 1397657 952184 1103154 3103498 4966507 3535670 -1003547 -4313079 -3081301
36536 -3081301 783629 3519605 5135210 7942335 10752574 9490093 4007214 -514283
36528 -514283 -602186 1096465 524400 -2088820 -3591979 -2334426 801758 3560684 3189172
36519 3189172 -1178884 -5888777 -5782299 -1195419 1885195 482866 -1034483 1750420
36511 1750420 6260864 7599208 6411665 6560730 7633967 6077630 2738854 2848315
36503 2848315 7677388 11700372 10097382 5030948 2106341 3409234 6199777 6545225
36495 6545225 2585940 -4126629 -9091546 -8159857 -1922399 4119259 4965768 1111377
36487 1111377 -2584987 -2256411 1527308 5071821 5372822 2552528 -998254 -3274874
36479 -3274874 -3930932 -3326772 -1801582 -476206 -1184412 -4079763 -6353033 -5224838 -1741063
36470 -1741063 347892 -584802 -2317421 -2299615 -983758 -514397 -1444966 -2382363 -2515463
36461 -2515463 -2926127 -4724611 -6686972 -5981769 -1664705 3373412 5095282 2970780
36453 2970780 771467 2018986 5476436 6429522 2493068 -3005562 -4377295 -49418
36445 -49418 5431922 6474197 2531577 -2238699 -4688328 -5607510 -6572042 -6806138 -5100350
36436 -5100350 -2532950 -656450 1281547 4377335 6893068 6562556 4916909 5181090
36428 5181090 6392803 4307950 -1376416 -5496469 -4566099 -1100725 1049094 1476021
36420 1476021 1035997 -913690 -4003510 -5205615 -3174811 -1211201 -2428181 -4813493
36412 -4813493 -4772461 -2875549 -1918268 -1432848 1388689 6511182 10697885 11448581 8288726
36403 8288726 1857565 -4986841 -7369185 -3791928 642399 717224 -1446136 -587563 2356939
36394 2356939 1913341 -1881003 -2670511 2033251 7030154 7954848 7045681 7370008 7318120
36385 7318120 4838445 2181196 2095643 3285212 3646115 4144253 5309424 3890196 -1905874
36376 -1905874 -7264041 -6737552 -2922474 -2734495 -6330869 -6749688 -1148401 4397662 3994920
36367 3994920 470715 739241 5864738 10166591 9172912 4742553 1700251 1798460 2536798
36358 2536798 1194964 -1557338 -2808046 -1333826 1118316 2564983 3137869 3955880
36350 3955880 5184472 6262596 6599189 5014369 441633 -5248613 -7413670 -4093408
36342 -4093408 752559 2456320 1974994 3053234 5014794 3971915 726842 958687
36334 958687 5943145 9386255 6885720 3009524 4042309 7945758 7589578 1544446
36326 1544446 -4587236 -6774579 -6645735 -6656101 -6428053 -5158554 -3399190 -1080255 2500121
36317 2500121 5613685 5056351 1651908 549710 3739625 6410825 4000720 -770652
36309 -770652 -2045337 653278 2722490 1936943 909121 1988199 3495145 2116925
36301 2116925 -3035980 -9262281 -12037308 -8757784 -2185462 1299263 -1164948 -5398873
36293 -5398873 -6245322 -4533995 -4042044 -4035031 -760800 4539576 6003317 2701897 1120034
36284 1120034 5141996 9533839 7837431 2021328 -1130509 38149 1584403 1615251
36276 1615251 2362121 4598752 5326569 2623539 -858575 -1191662 2132313 6145526 7683934
36267 7683934 6040782 3444692 3057219 5495161 7785168 7116286 4804261 4394951 6273492
36258 6273492 6802217 3312754 -2309564 -6007854 -5874126 -3112765 -38404 1698396
36250 1698396 1626296 370845 -755021 -412434 1969867 5254739 6528524 3562440 -1815502
36241 -1815502 -4534405 -2115846 1870896 2520302 418462 461344 4221568 7369473 5929775
36232 5929775 1763320 -595952 -323099 -480882 -2642039 -4351187 -2757715 1061466
36224 1061466 2927508 374913 -4454467 -7157446 -5707883 -1957754 1136125 2331347
36216 2331347 1766192 -352475 -3139275 -4405396 -2919153 -824309 -1433611 -4519375
36208 -4519375 -6208279 -4177049 -532383 1728746 2830103 4686555 6886154 6958422
36200 6958422 4342029 1691354 1716427 4313411 7292716 8545690 7033533 3275087
36192 3275087 -72468 447538 5410257 10776681 11580507 7248215 1764574 -1242378
36184 -1242378 -1606654 -661279 1207295 3582446 4732838 3553935 1564650 832688 940606
36175 940606 256158 -789003 -389712 1314269 2582507 3449188 5519260 8219656 8654904
36166 8654904 5942300 2484949 89343 -1815082 -3117990 -2084914 873205 2483976
36158 2483976 1892431 2532221 5882676 7789890 5044771 1435296 1979101 4561632 3526438
36149 3526438 -881531 -3597710 -3840812 -5484862 -8253481 -6637033 198571 4899688
36141 4899688 2343912 -2482554 -2075710 2678993 4850697 1811719 -2483131 -4341197
36133 -4341197 -4335115 -4320637 -4383534 -3638295 -1725678 916597 2872835 2480697 363048
36124 363048 -14940 3351055 7351956 7445669 4218392 2569655 4198514 5040183 1837280
36115 1837280 -2522061 -3411436 -1686265 -2405347 -7143288 -11702772 -12179590 -9634314 -6932098
36106 -6932098 -4151970 -234166 2905705 1913834 -2678517 -6272241 -5999897 -3720924
36098 -3720924 -2264138 -1573431 -224977 1559456 2354463 1445341 -1000324 -3941029 -4711897
36089 -4711897 -877828 5545109 8573504 5370633 262870 -1190152 431096 518708
36081 518708 -2194236 -4575053 -4348133 -2561619 -1342083 -2292309 -6112690 -10768899 -11685783
36072 -11685783 -7384912 -2933930 -3343494 -5719182 -3716591 1969891 4748645 3256432
36064 3256432 3233427 6992992 9338826 7161865 5263075 7735773 10318780 7475204
36056 7475204 1800619 -352998 1217091 1863465 625213 675978 2674499 3987511 4022161
36047 4022161 4702731 5763389 4790372 2171867 1076813 1923152 1580672 -831905 -1780580
36038 -1780580 1233213 5587504 6960109 4262135 -518901 -5083802 -7638727 -6755390
36030 -6755390 -2451808 3046763 6577698 6072277 1852333 -3140163 -5105570 -2913622
36022 -2913622 527579 1719283 441613 -1503316 -3901515 -7515087 -10712964 -10397491
36014 -10397491 -6628189 -2952058 -1363724 -279161 1263754 1015419 -2388339 -5641708
36006 -5641708 -4574820 -377574 1400079 -2018465 -7187408 -8662624 -4812248 1188682
35998 1188682 4749918 3645890 -445919 -3498982 -2997799 -681621 -645527 -4444008 -9319486
35989 -9319486 -11951499 -12386326 -12678688 -12984903 -11579127 -8375248 -5499695 -3738654 -1262384
35980 -1262384 2774733 6131733 7058787 7422933 9381404 10989088 8698067 3067206
35972 3067206 -1696461 -3361834 -3338999 -3095978 -2581473 -2188369 -2549931 -2152204 1047830
35963 1047830 5288865 6388540 4069394 2554556 4017893 6245671 7957350 10712741
35955 10712741 13227098 10148447 804490 -6434512 -4251394 3347536 6902008 4185273
35947 4185273 382384 -1767842 -4333270 -7345190 -7128426 -2887853 1020958 1494450
35939 1494450 711327 1694919 3706609 4245305 2791653 802209 60067 1821531 5367353
35930 5367353 7183813 4364679 -912867 -3383036 -1526483 975689 1252688 868317
35922 868317 1887696 2931777 1669572 -1250824 -3264954 -3266921 -1987494 -409009 587162
35913 587162 308636 -668431 -904227 -759928 -2837089 -7969213 -12419026 -11663357 -6411192
35904 -6411192 -2230060 -2630411 -4715237 -3351071 1605215 4867768 2953696 -862856
35896 -862856 -1165134 1837807 2838195 -613111 -4928281 -6392864 -5990024 -5912729 -5232481
35887 -5232481 -2655604 -409419 -1073467 -2841806 -2389094 -563177 -479371 -1503260 -430296
35878 -430296 2195378 2583712 495742 -180313 1554978 1857830 -1280877 -4745530 -5980723
35869 -5980723 -6924733 -9171188 -9715565 -5575158 525681 3186546 1069135 -2786744
35861 -2786744 -5625073 -6644244 -5387296 -1912683 1790957 3303975 2812084 2764856 4463108
35852 4463108 6475783 6636283 4665903 2567919 2610453 4786217 6593469 6045136 4370878
35843 4370878 4407664 6671909 8732608 8419420 5847247 2103106 -2207529 -6523327 -9806051
35834 -9806051 -11031091 -9645043 -5994422 -2023958 -273234 -839062 -998530 321950
35826 321950 955 -4365358 -9250731 -9159936 -4540445 -1141121 -1950783 -4329222 -5197151
35817 -5197151 -4675725 -4099812 -4218613 -5506155 -6817051 -4719670 1516783 5875955 2369111
35808 2369111 -5366586 -8238949 -4800199 -1946700 -2320066 -823606 3908729 4941576
35800 4941576 -1061634 -6721885 -5227479 -444653 1588689 3355431 9055291 13833010
35792 13833010 10425479 2265919 -748720 2908077 6058864 5881520 6879774 10515065
35784 10515065 11810606 8463784 5016493 5051901 6095366 5245408 3967303 4179091 4476937
35775 4476937 3297864 1977089 2082521 2745429 2435144 807352 -1969225 -4930888 -5441544
35766 -5441544 -2207439 981984 -1167713 -7846722 -12593339 -11956199 -9115462 -7939830
35758 -7939830 -8131443 -7773352 -6381762 -3769303 182993 3219097 2252345 -1395606 -2626950
$$ [...]
##END NTUPLES=NMR SPECTRUM
##END=
