##TITLE=1H_DE-12KrTFA
 DMSO-d6
 8 sc, 
 1.9.2023
##JCAMPDX= 6.0         $$ Bruker NMR JCAMP-DX V2.0
##DATA TYPE= NMR FID
##DATA CLASS= NTUPLES
##ORIGIN= UXNMR, Bruker Analytische Messtechnik GmbH
##OWNER= root
$$ XWIN-NMR		Version 3.5
$$ Fri Sep  1 15:45:56 2023 Russian Standard Time (UT+4h)  she@DPX200
##.OBSERVE FREQUENCY= 200.13135
##.OBSERVE NUCLEUS= ^1H
##.DELAY= (6, 6)
##.ACQUISITION MODE= SIMULTANEOUS
##.ACQUISITION SCHEME= undefined
##.AVERAGES= 8
##.DIGITISER RES= 18
##SPECTROMETER/DATA SYSTEM= spect
##.PULSE SEQUENCE= zg30
##.SOLVENT NAME= CDCl3
##.SHIFT REFERENCE= (INTERNAL, CDCl3, 0, 15.7039)
##AUDIT TRAIL= $$ (NUMBER, WHEN, WHO, WHERE, WHAT)
$$ ##TITLE= Audit trail, XWIN-NMR		Version 3.5
$$ ##JCAMPDX= 5.01
$$ ##ORIGIN= Bruker BioSpin GmbH
$$ ##OWNER= she
$$ F:/spectra/data/she/nmr/H-F/1/audita.txt
$$ ##AUDIT TRAIL=  $$ (NUMBER, WHEN, WHO, WHERE, WHAT)
(   1,<2023-09-01 15:44:48.60 +0400>,<she>,<DPX200>,
      <created by zg, POWCHK disabled, PULCHK disabled
       configuration hash MD5:
       00 E9 B6 7A A2 85 ED C7 34 08 36 98 17 FE 4E 26
       data hash MD5: 16K
       FA 5A 3C 33 96 1E 6F ED A8 3C FA 3B 62 22 9C F1>)
$$ ##END=
$$ 
$$ hash MD5
$$ 3C DD 2F B6 3F E4 44 DA 1B E6 CE 56 BD 8B 28 E7
##$RELAX= 
##$RELAX= 
##$RELAX= 
##$RELAX= 
##$RELAX= 
##$RELAX= 
$$ Bruker specific parameters
$$ --------------------------
##$DU= <F:/spectra>
##$EXPNO= 1
##$NAME= <H-F>
##$PROCNO= 1
##$TYPE= <nmr>
##$USER= <she>
##$AMP= (0..31)
100 100 100 100 100 100 100 100 100 100 100 100 100 100 100 100 100 100 
100 100 100 100 100 100 100 100 100 100 100 100 100 100 
##$AQSEQ= 0
##$AQ_mod= 1
##$AUNM= <au_zg>
##$AUTOPOS= <>
##$BF1= 200.13
##$BF2= 200.13
##$BF3= 200.13
##$BF4= 200.13
##$BF5= 200.13
##$BF6= 200.13
##$BF7= 200.13
##$BF8= 200.13
##$BYTORDA= 1
##$CFDGTYP= 0
##$CFRGTYP= 5
##$CHEMSTR= <none>
##$CNST= (0..31)
1 1 145 1 1 1 1 1 1 1 1 1 1 1 1 1 1 1 1 1 1 1 1 1 1 1 1 1 1 1 1 1 
##$CPDPRG= <>
##$CPDPRG1= <>
##$CPDPRG2= <>
##$CPDPRG3= <>
##$CPDPRG4= <mlev>
##$CPDPRG5= <mlev>
##$CPDPRG6= <mlev>
##$CPDPRG7= <mlev>
##$CPDPRG8= <mlev>
##$CPDPRGB= <>
##$CPDPRGT= <>
##$D= (0..31)
0 1.2 0 0 0 0 0 0 0 0.06 0 0.03 0 0 0 0 0.0002 0 0 0 0 0 0 0 0 0 0 0 0 
0 0 0 
##$DATE= 1693568687
##$DBL= (0..7)
120 120 120 120 120 120 120 120 
##$DBP= (0..7)
150 150 150 150 150 150 150 150 
##$DBP07= 0
##$DBPNAM0= <>
##$DBPNAM1= <>
##$DBPNAM2= <>
##$DBPNAM3= <>
##$DBPNAM4= <>
##$DBPNAM5= <>
##$DBPNAM6= <>
##$DBPNAM7= <>
##$DBPOAL= (0..7)
0.5 0.5 0.5 0.5 0.5 0.5 0.5 0.5 
##$DBPOFFS= (0..7)
0 0 0 0 0 0 0 0 
##$DE= 6
##$DECBNUC= <off>
##$DECIM= 32
##$DECNUC= <off>
##$DECSTAT= 4
##$DIGMOD= 1
##$DIGTYP= 9
##$DL= (0..7)
0 120 120 120 120 120 120 120 
##$DP= (0..7)
150 150 150 150 150 150 150 150 
##$DP07= 0
##$DPNAME0= <>
##$DPNAME1= <>
##$DPNAME2= <>
##$DPNAME3= <>
##$DPNAME4= <>
##$DPNAME5= <>
##$DPNAME6= <>
##$DPNAME7= <>
##$DPOAL= (0..7)
0.5 0.5 0.5 0.5 0.5 0.5 0.5 0.5 
##$DPOFFS= (0..7)
0 0 0 0 0 0 0 0 
##$DQDMODE= 0
##$DR= 18
##$DS= 0
##$DSLIST= <SSSSSSSSSSSSSSS>
$$ [...]
##$SUBNAM2= <"">
##$SUBNAM3= <"">
##$SUBNAM4= <"">
##$SUBNAM5= <"">
##$SUBNAM6= <"">
##$SUBNAM7= <"">
##$SUBNAM8= <"">
##$SUBNAM9= <"">
##$SW= 18.05172834244
##$SWIBOX= (0..15)
0 0 2 0 0 0 0 0 0 0 0 0 0 0 0 0 
##$SW_h= 3612.71676300578
##$TD= 16384
##$TD0= 1
##$TE= 0
##$TE2= 300
##$TE3= 300
##$TEG= 300
##$TL= (0..7)
0 120 120 120 120 120 120 120 
##$TP= (0..7)
150 150 150 150 150 150 150 150 
##$TP07= 0
##$TPNAME0= <>
##$TPNAME1= <>
##$TPNAME2= <>
##$TPNAME3= <>
##$TPNAME4= <>
##$TPNAME5= <>
##$TPNAME6= <>
##$TPNAME7= <>
##$TPOAL= (0..7)
0.5 0.5 0.5 0.5 0.5 0.5 0.5 0.5 
##$TPOFFS= (0..7)
0 0 0 0 0 0 0 0 
##$TUNHIN= 0
##$TUNHOUT= 0
##$TUNXOUT= 0
##$USERA1= <user>
##$USERA2= <user>
##$USERA3= <user>
##$USERA4= <user>
##$USERA5= <user>
##$V9= 5
##$VALIST= <valist>
##$VCLIST= <CCCCCCCCCCCCCCC>
##$VD= 0
##$VDLIST= <DDDDDDDDDDDDDDD>
##$VPLIST= <PPPPPPPPPPPPPPP>
##$VTLIST= <TTTTTTTTTTTTTTT>
##$WBST= 1024
##$WBSW= 4
##$XGAIN= (0..3)
0 0 0 0 
##$XL= 0
##$YL= 0
##$YMAX_a= 76525
##$YMIN_a= -149713
##$ZGOPTNS= <>
##$ZL1= 120
##$ZL2= 120
##$ZL3= 120
##$ZL4= 120
##$ABSF1= 10
##$ABSF2= 0
##$ABSG= 5
##$ABSL= 3
##$ALPHA= 0
##$AQORDER= 0
##$ASSFAC= 0
##$ASSFACI= 0
##$ASSFACX= 0
##$ASSWID= 0
##$AUNMP= <proc_1d>
##$AZFE= 0.1
##$AZFW= 0.1
##$BCFW= 1
##$BC_mod= 2
##$BYTORDP= 1
##$COROFFS= 0
##$CY= 11.3945322036743
##$DATMOD= 1
##$DC= 2
##$DFILT= <>
##$DTYPP= 0
##$F1P= 15.7292609196834
##$F2P= 12.9074282941183
##$FCOR= 0.5
##$FTSIZE= 0
##$FT_mod= 4
##$GAMMA= 1
##$GB= 0.15
##$INTBC= 1
##$INTSCL= 1
##$ISEN= 128
##$LB= 0.24
##$LEV0= 0
##$LPBIN= 0
##$MAXI= 10000
##$MC2= 0
##$MEAN= 0
##$ME_mod= 0
##$MI= 1.114404
##$NCOEF= 0
##$NC_proc= 0
##$NLEV= 6
##$NOISF1= 3.799351
##$NOISF2= 2.8
##$NSP= 1
##$NTH_PI= 0
##$NZP= 0
##$OFFSET= 15.70392
##$PC= 1
##$PHC0= -21055.31
##$PHC1= 16.45272
##$PH_mod= 1
##$PKNL= yes
##$PPARMOD= 0
##$PSCAL= 0
##$PSIGN= 0
##$REVERSE= no
##$SF= 200.130013532006
##$SI= 16384
##$SIGF1= 3
##$SIGF2= 2
##$SINO= 400
##$SIOLD= 16384
##$SREGLST= <1H.CDCl3>
##$SSB= 0
##$STSI= 0
##$STSR= 0
##$SW_p= 3612.71676300578
##$SYMM= 0
##$S_DEV= 0
##$TDeff= 0
##$TDoff= 0
##$TI= <>
##$TILT= no
##$TM1= 0
##$TM2= 0
##$TOPLEV= 0
##$USERP1= <user>
##$USERP2= <user>
##$USERP3= <user>
##$USERP4= <user>
##$USERP5= <user>
##$WDW= 1
##$XDIM= 8192
##$YMAX_p= 0
##$YMIN_p= 0
$$ End of Bruker specific parameters
$$ ---------------------------------
##NTUPLES= NMR FID
##VAR_NAME=  TIME,          FID/REAL,        FID/IMAG
##SYMBOL=    X,             R,               I
##VAR_TYPE=  INDEPENDENT,   DEPENDENT,       DEPENDENT
##VAR_FORM=  AFFN,          ASDF,            ASDF
##VAR_DIM=   8192,          8192,            8192
##UNITS=     SECONDS,       ARBITRARY UNITS, ARBITRARY UNITS
##FACTOR=    0.0002768,     1,               1
##FIRST=     0,             0,               0
##LAST=      2.2672688,     0,               0
##MIN=       0,             -149713,         0
##MAX=       2.2672688,     76525,           0
$$ Real data points
##PAGE= N=1
##DATA TABLE= (X++(R..R)), XYDATA
0@%%%%%%%%%%%%%qJ6j6J6k4L2l2M0m8N6o7P5q8J04j20J39j63J87k12K41k74L10
$$ 0 0 0 0 0 0 0 0 0 0 0 0 0 0 -8 8 -8 8 -16 16 -16 24 -24 32 -35 40 -48 56 -64 75 -88 99 -113 128 -146 164
35A64l50L95m43M93n50O14o83P59q41R30j028J135j252J379j518J672j843K034
$$ 164 -186 209 -234 259 -291 323 -360 399 -442 488 -540 595 -657 722 -796 876 -967 1067
53A067k242K476k742L040l381L777m242M796n469O309p393Q854j0937J4159j9868
$$ 1067 -1175 1301 -1441 1599 -1782 1995 -2247 2549 -2920 3389 -4004 4850 -6087 8072 -11796
68a1796L2999j18747n2169J25247p9648M8357Q5256j7343M282N2793o0802J405
$$ -11796 21203 -97544 -149713 -24466 -104114 -55757 29499 12156 16438 69231 8429 9834
80I834N5114l1170j6141N8888m450m34K307n2745k925J8757r0147j9867P1079
$$ 9834 64948 33778 17637 76525 72075 71641 73948 21203 18278 37035 -53112 -72979 -1900
93a900l4606k9226P1533j6868l2270N5119l2787o0022P1887J4910o1121N4426
$$ -1900 -36506 -65732 5801 -11067 -43337 11782 -21005 -81027 -9140 5770 -55351 -925
105i25N8756l0093J5471J6814l0075J5976k038m8739K5689L0582l4553J0938J5540
$$ -925 57831 27738 43209 60023 29948 45924 43886 -4853 20836 51418 16865 27803 43343
118D3343l5488R383p740o9681J5989L6327o1672j448O4543k3877j5102L8787k5651
$$ 43343 7855 17238 9498 -60183 -44194 -7867 -69539 -70987 -6444 -30321 -45423 -6636 -32287
131c2287j0659M5067k4319j6877O6491J1516k5205L4733J0101j9363R756k2454
$$ -32287 -42946 2121 -22198 -39075 27416 38932 13727 48460 58561 39198 48954 26500
143B6500k3791L0887j1559l6508K8288P063l4702O158j1552l3874K2114k118m0403
$$ 26500 2709 33596 22037 -14471 13817 20880 -13822 -7664 -19216 -53090 -30976 -33094 -73497
156g3497L6782L8707l1465J1493L6033j9856Q83J7049k4469J2869L6883k1728
$$ -73497 -36715 1992 -29473 -17980 18053 -1803 -920 16129 -8340 4529 41412 19684
168A9684k870L8584j0445k1263M892j9422r593R709k6882o320L4839j2545k2381
$$ 19684 16814 55398 44953 23690 28582 9160 -433 9276 -17606 -23926 10913 -1632 -24013
181b4013K0423q308k0680J1848j4423j2829L7965L968k1860L4208K1119k5023
$$ -24013 -3590 -11898 -32578 -20730 -35153 -47982 -10017 -6049 -27909 6299 27418 2395
193B395N911R068j5714J1394P279j6954K0303K1002k2487l736R570j9606j0415
$$ 2395 8306 17374 1660 13054 20333 3379 23682 44684 22197 18461 28031 8425 -1990
206a990m368k0084R125J4467k2169K301K5042j5890j3951J1326r549j784J9507
$$ -1990 -6358 -26442 -17317 -2850 -25019 -22718 2324 -13566 -27517 -16191 -25740 -27524 -8017
219h017p004L194L5266J0j5542J7158L192j6559K535l454n116J6636k747j5594
$$ -8017 -15021 -11827 23439 23449 7907 25065 28257 11698 14233 10779 5663 22299 19552 3958
233C958J3397J383k3950m878k789j2544N771Q8j0481J8963J3245j8207K662J4438
$$ 3958 17355 18738 -5212 -10090 -12879 -25423 -19652 -19564 -30045 -11082 2163 -16044 -13382 1056
247A056j1695k773R393k789J1305J6582p976K691J7032j0377j4324M025m910m640
$$ 1056 -10639 -13412 -4019 -6808 4497 21079 13103 15794 32826 22449 8125 12150 7240 2600
261B600M447p049N87J3259j0057j5201N640m507j3505J687L57O49J4279J718n707
$$ 2600 7047 -2 585 13844 3787 -11414 -5774 -10281 -23786 -22099 -21742 -21093 -6814 -5096 -10803
276a0803J3641N445j3418J125P434j485M915N350m38J0436M818j3604l243L622
$$ -10803 2838 8283 -5135 -4010 3424 1939 6854 12204 11766 22202 27020 13416 10173 13795
290A3795j0885p753J286k823L876L656q997m37O555j0431j0059N105J439J04P161
$$ 13795 2910 -4843 -3557 -6380 -2504 1152 -7845 -8282 -1727 -12158 -22217 -17112 -15673 -15569 -8408
305h408L181N770J0578k942o487O228J306o381J845M364L377M868k069n095K785
$$ -8408 -5227 543 11121 8179 1692 7920 9226 2845 4690 9054 12431 17299 15230 10135 12920
320A2920l726j3620l996K063l006n29J623L8M330j40q428p96M388k712j446O765
$$ 12920 9194 -4426 -8422 -6359 -9365 -9894 -8271 -8233 -3903 -4043 -12471 -13267 -8879 -11591 -13037 -6272
336f272O886N656L483k99J974K820n857n303K753K320r21K17P71J051j198p682
$$ -6272 614 6270 9753 9454 11428 14248 8391 3088 5841 8161 7240 7457 8228 9279 8081 399
352C99p257o82j523n676R3N041L775J222l71K04J920j138l530Q38O456L915J571
$$ 399 -6858 -7540 -9063 -14739 -14646 -9605 -5830 -4608 -4979 -4775 -2855 -3993 -7523 -6685 -229 3686 5257
369E257L333M692J357l475m457j712j34k403l025J845L975r26l796j876j999l301
$$ 5257 8590 13282 14639 11164 6707 4995 4861 2458 -567 1278 5253 4327 531 -1345 -3344 -6645
385f645m387l181J943M518J269J39M911L953k419k285N26P93K038R53J398O092
$$ -6645 -11032 -14213 -12270 -7752 -6483 -6344 -1433 2520 101 -2184 -1658 -865 1173 2126 3524 9616
401I616M216k607j945K3l059m379l595j821K530J810l646j51L134l646n669o36
$$ 9616 13832 11225 9280 9303 6244 1865 -1730 -3551 -1021 789 -2857 -3008 126 -3520 -9189 -9825
417i825j145k72L122R05L142P501J270k657K276J474l447l79J011J618M162N10
$$ -9825 -10970 -11242 -8120 -7215 -4073 3428 4698 2041 4317 5791 2344 1965 2976 4594 8756 9266
433I266k735K471j12p041l503j024k999L19M32k007M207L051n487j431L417l362
$$ 9266 6531 9002 8890 1849 -1654 -2678 -5677 -5358 -4926 -6933 -2726 325 -5162 -6593 -3176 -6538
449f538k349L487J279L069N837q51J31N128k207n442J758K81j035K376l65J40
$$ -6538 -8887 -5400 -4121 -1052 4785 3934 4065 9193 6986 1544 3302 3583 2548 4924 4559 4699
465D699L601l281o362J180j820n830Q06R02j155M644R24m389L591K298o493J52
$$ 4699 8300 5019 -1343 -163 -1983 -7813 -7007 -6105 -7260 -2616 -1692 -6081 -2490 -192 -6685 -6533
481f533N076j253K077N258l65K817L479m870k281K742l209k701K665r99O95K166
$$ -6533 -1457 -2710 -633 4625 4260 7077 10556 5686 3405 6147 2938 237 2902 1903 2598 4764
497D764m543k161K599n605n220L642l19j377N078R10j340N641o60n899L875K465
$$ 4764 221 -1940 659 -4946 -10166 -6524 -6843 -8220 -3142 -2232 -3572 2069 1409 -4490 -615 1850
513A850m287L446M457q67L099J408m485O09J23o245q97K240k443J283J982l214
$$ 1850 -2437 1009 5466 4599 7698 9106 4621 5230 5353 -892 -1789 451 -1992 -709 1273 -1941
529a941J461J302p336j286M392m028q86O867l80M28N697k321k663M438j797m361
$$ -1941 -480 822 -6514 -7800 -3408 -7436 -8322 -1455 -1835 -1407 4290 1969 -694 3744 1947 -2414
545b414M788J927j641L683O24k372J833l017n394J429q00m020K814J604k881L390
$$ -2414 2374 4301 2660 6343 6967 4595 6428 3411 -1983 -554 -1354 -5374 -2560 -956 -3837 -447
561d47Q0o042K432J831n793J803N895j818J598N794k347M6K924l738j876L542
$$ -447 -367 -6409 -3977 -2146 -7939 -6136 -241 -2059 -461 5333 2986 3032 5956 2218 342 3884
577C884j581q92L684q16j078J553m184k935K112m253k786M641o63j858M638k91
$$ 3884 2303 1411 5095 4279 3201 4754 570 -2365 -253 -4506 -7292 -2651 -3314 -5172 -534 -825
593h25l579L880n77m851L940K961k844L504L796j923J506J084m037K96R75m114
$$ -825 -4404 -524 -1101 -5952 -2012 949 -1895 1609 5405 3482 4988 6072 2035 2331 3306 -808
609h08J199K838k592Q29J693m545o16J320n042q73M222k416k39N356j372j206
$$ -808 391 3229 637 1466 3159 -1386 -2002 -682 -5724 -6597 -2375 -4791 -5030 326 -1046 -2252
625b252L937k246k576M244m48k030M864J127j685L002m92l522J568j496m208K359
$$ -2252 1685 -561 -3137 1107 659 -1371 3493 4620 2935 5937 5445 1923 3491 1995 -2213 146
641A46Q49l001K312R17m008J154J35m625J285K304l016K290M091j812J212L309
$$ 146 995 -2006 306 1223 -2785 -1631 -1496 -6121 -4836 -2532 -5548 -3258 833 -979 233 3542
657C542l014l68L096k854m72M364j100o08L163j798k486J458k749l305K569j190
$$ 3542 528 160 3256 402 -70 4294 3194 2586 5749 3951 1465 2923 174 -3131 -562 -1752
673a752k148L192m18j892K044r62l045K722l36k264L531K355j591K735K061k947
$$ -1752 -3900 -708 -1126 -3018 -974 -1936 -4981 -2259 -2595 -4859 -1328 1027 -564 2171 4232 1285
689A285J313J269l803J109K326k125N23K518k388q34Q44l254j643J746k617o07
$$ 1285 2598 3867 64 1173 3499 1374 1897 4415 2027 1193 2037 -1217 -2860 -1114 -3731 -4338
705d338L070j083m64K816j726j580K656j289j589L838O41q36L389N58j792J825
$$ -4338 -1268 -2351 -2815 1 -1725 -3305 -649 -1938 -3527 311 952 116 3505 4063 2271 4096
721D096p05l167J589K92k403J374J366k113M03l8k893j67K56k513O14K387j549
$$ 4096 3391 224 1813 2105 -298 1076 2442 329 732 694 -2199 -2366 -2110 -4623 -4009 -1622 -3171
738c171J105K521j568M05J603k084j19K961j029K14K856k05p47J444j451j942
$$ -3171 -2066 455 -1113 -708 895 -1189 -1308 1653 624 838 3694 3489 2742 4186 2735 793
754G93R63j233k101J780P3j506J259l90k075J055j081j908J482O50q31K027J757
$$ 793 1756 523 -1578 202 275 -1231 28 -362 -2437 -1382 -2463 -4371 -2889 -2239 -3070 -1043 714
771G14j038J383P54j810Q55J141j510R20J816p31n8J021j763r32M14k068j037
$$ 714 -324 1059 1813 3 858 1999 489 1409 3225 2494 2436 3457 1694 762 1176 -892 -1929
788a929J330j001n98J442n47o00O79j203n04J304o0n57K450P99n68J614L52j252
$$ -1929 -599 -1600 -2198 -756 -1303 -1903 -1224 -2427 -2931 -1627 -1687 -2244 206 1005 437 2051 2403 1151
806A151P65m4j562J086Q73r61P99M29j643k81m57j840k69M20j371P38R96l71R1
$$ 1151 1916 1872 310 1396 2269 1308 2107 2536 893 612 155 -1685 -1954 -1534 -2905 -2167 -1171 -1542 -1451
825a451P63q55k14J089p52L89J735L61L79J093k10l32L21r72m63K72nr62R75k34
$$ -1451 -688 -1543 -1757 -668 -1420 -1031 704 1065 1444 2537 2327 1995 2316 1344 881 1153 1148 186 1161 927
845I27q58l1q47j182R3k56q32J032O82j70N15P42l29L33K54o01O57J134k16O44
$$ 927 69 38 -809 -1991 -1898 -2154 -2986 -1954 -1272 -1442 -927 -185 -514 -181 73 -528 129 1263 1047 1691
865A691R41m6n80J48j216m74P2q76k08O45k73m25J73o25o00j33m42j96Q26L99
$$ 1691 2632 2586 2006 2154 938 464 536 -340 -548 97 -176 -601 -428 -1053 -1653 -1786 -2228 -2424 -1598 -1199
885a199K80Q80N16N0J49K8l13N18J05p7N89N25j32p6l72p84m35o60q06K1K68J28
$$ -1199 -919 -39 477 527 676 704 391 909 1014 937 1526 2051 1919 1843 1471 687 252 -408 -1214 -1193 -925 -797
907g97j81K79k06m50p8l99j1O77K60L68R74O25K69k2L6j13M5n18M6L54J44j1k33
$$ -797 -978 -699 -905 -1355 -1433 -1832 -1843 -1166 -906 -538 436 1061 1330 1308 1344 1231 1276 758 804 1158 1302 1291 1058
930A058j58n03o50o76n35N1K6k17K45M93J54k42L49k42M9J73J39O01Q49K66L13
$$ 1058 900 397 -253 -929 -1464 -1413 -1387 -1604 -1359 -866 -712 -954 -605 -847 -798 -625 -486 115 964 1230 1543
951A543K26q0l02k50n40N7k8p6l6rm2m06j066j21l11l04N2N0K12R30J94k48L07
$$ 1543 1769 1689 1387 1137 597 654 626 550 514 505 463 57 -1009 -1130 -1441 -1745 -1693 -1643 -1431 -501 -307 -555 -248
974b48N47l06O3L09K88M27L63J6K60R0n16o02k91q0o15j94K08J85k9p95QK9l99
$$ -248 299 -7 56 365 653 1080 1443 1459 1719 1809 1293 691 400 320 -295 -489 -281 -96 -125 -920 -912 -883 -1282
997a282m01J89J01M30P14K81K8N03R2k51R1M14j84L19q6K58M14l58o66j60r5p74
$$ -1282 -1683 -1494 -1393 -963 -249 32 60 563 655 404 495 909 725 1044 958 1216 1630 1272 606 446 351 -423
1019d23m01k5l6K09Nm85L00p7l88j08L85J42K06N98L98M72O76l38l90M49k92l53
$$ -423 -824 -849 -885 -676 -671 -1156 -856 -933 -1321 -1429 -1044 -902 -696 -98 300 772 1448 1110 720 1169 877 524
1041E24J83L86%ll07m82M3m51p54j71j02k29O7L58r8N03o1k68m5O80j96J6R06
$$ 524 707 1093 1093 1090 783 301 344 -107 -861 -1032 -1134 -1363 -1296 -938 -1036 -533 -594 -862 -907 -227 -423 -407 499
1064D99R8M12L61j94l74P49p19n80M15M5m50J90j27k42o9m91n41j35J60n64M42
$$ 499 597 1009 1370 1176 802 1551 832 252 667 712 262 452 325 83 14 -477 -1018 -1153 -993 -1557 -1115
1085a115M25J25L38oq3K53L03n69M75N74n6L18M70l03J3R9p03l15N7n61j8K95
$$ -1115 -690 -565 -227 -233 -316 -63 240 -329 146 720 664 982 1452 1149 1162 1261 558 243 300 -261 -279 16
1107A6l62r2J51m93m93M21l99k65O87K82j46N91K21J4L65K1l80O30J91l95L75
$$ 16 -346 -438 -287 -780 -1273 -852 -1251 -1516 -829 -547 -693 -102 119 133 498 519 139 769 960 565 940
1128I40K12j70j85J10p40J4j15n61o1K08m28L3K83l22J67k99j57J11M91j01K79
$$ 940 1152 982 797 907 167 181 66 -495 -556 -348 -776 -743 -460 -782 -615 -914 -1071 -960 -469 -570 -291
1149b91P73n1L1O25m41k01N09n03j1L46o4k17M3n6m94j97j45n72N0J66k82J22
$$ -291 482 431 462 1087 646 445 954 451 440 786 722 505 548 492 -2 -199 -344 -916 -866 -700 -982 -860
1171h60L52l86L63J25n89N53M57k72L82N34p5J48L61n25K96j16k47l26M48l08
$$ -860 -508 -894 -531 -406 -995 -442 15 -257 125 659 584 732 1093 568 864 748 501 175 623 315
1191C15o4R0m13p4j20m39l13M13j81l30M71L79l33N18o4n8K09Q9r8L15N56j11
$$ 315 251 341 -72 -146 -266 -705 -1018 -605 -786 -1116 -645 -266 -599 -81 -145 -203 6 95 -3 312 868 757
1213G57Q9L36m55qR3p96K46r4l70m0J01l26k8J97o04N1R0l02K31N23k9L20K72
$$ 757 846 1182 727 719 812 16 262 168 -202 -242 -141 -467 -495 -298 -902 -851 -761 -1063 -832 -309 -338 -18 254
1236B54k96K07M27k35l50P91j73k82N97k99q6j62n1m17J31r5m73J77n9j69J69
$$ 254 -42 165 592 357 7 798 625 343 940 641 555 393 342 -75 56 -39 -512 -335 -394 -563 -394
1257c94K5l98L92K6m19K79L38rM56R5j79K83L03m79J19L60m62L4J12J28k27N1
$$ -394 -369 -767 -375 -349 -768 -489 -151 -160 296 391 212 495 798 319 438 798 336 370 482 610 383 434
1279D34k57k24L7n16l12L05J4p5K96j34o3K50M6k03K44J60m0L39K14j8KJ32K2
$$ 434 177 -47 -10 -526 -838 -533 -519 -594 -298 -432 -495 -245 -199 -402 -158 2 -38 301 515 497 499 631 653
1302F53j72p4k37M4J56m44Q4k03j06K36j15o01J40j35j32L59K61q1J27K68j55
$$ 653 481 407 170 214 370 -74 10 -193 -299 -63 -178 -779 -639 -774 -906 -547 -286 -367 -240 28 -127
1323a27R9K54m6j18N55J68j88J69r8m18N84o23k55J93j11j98J19N2l76m4k1k91
$$ -127 -28 226 180 62 617 785 597 766 668 250 834 211 -44 149 38 -160 -41 11 -365 -409 -430 -721
1345g21L8N9QJ82L65PJ13J14R1r5L54l41K9K69L9o7j6P9n4p8l43j77m2k32k25
$$ -721 -683 -624 -616 -434 -69 -62 51 165 256 161 515 174 203 472 511 444 428 507 453 375 32 -145 -187 -419 -644
1370f44M57rk5P1k01j38Q7J9j48N67o4K32rK59n6j71K92j68Q0J02j72j25K87l73
$$ -644 -187 -196 -221 -150 -351 -489 -402 -383 -531 36 -28 204 195 454 398 227 519 351 431 533 361 236 523 150
1394A50q2L2l15M7o1k73j38K14j12j59L83L0Jl2l0K14K33J00j24K74K39k32L4
$$ 150 68 100 -215 -168 -229 -502 -640 -426 -538 -697 -314 -284 -283 -315 -345 -131 102 202 78 352 591 359 393
1417C93J78j60J15l10m1P3L5k96j83K4m1j1q3k39j56L62k59J69J2K12L02Lk33
$$ 393 571 411 526 216 175 248 283 -13 -196 -172 -213 -224 -307 -546 -702 -340 -599 -430 -418 -206 96 99 -134
1440a34K93J60l90K37R2L31j32q0O2k28J9j83l0l9j86P6J3o4j35j2j6K7j45Kj6
$$ -134 159 319 -71 166 258 589 457 377 439 211 230 47 17 -22 -208 -132 -119 -183 -318 -330 -346 -319 -464 -462 -478
1465d78K93j3K05j9J03J8M3J01j38R3K5K30n5j28M0j22k24J9k03L37l46j22J17
$$ -478 -185 -198 7 -12 91 109 152 253 115 208 233 463 408 280 320 198 -26 -7 -210 127 -219 -341 -224
1488b24J05j45r9j48J56p8K44J6K43m6jJ17k8O9L16l0m18L42j27M3j13L9j12m4
$$ -224 -119 -264 -363 -511 -355 -433 -189 -173 70 24 23 140 112 181 497 467 49 391 264 307 194 233 121 77
1512G7l1j37p5p3k52J23J19q0j02K44r2J05J51o9l7K03j04L61q4N8N8q2j35J90
$$ 77 46 -91 -166 -239 -491 -368 -249 -329 -431 -187 -279 -174 -23 -92 -129 74 -30 331 247 305 363 281 146 336
1536C36j81k32K31o4J38j00j76j40j6j24j45mK86J10ll5M9J75Mr1K4J94j32K15
$$ 336 155 -77 154 90 228 128 -48 -188 -204 -328 -473 -477 -191 -81 -84 -119 -70 105 109 18 42 236 104 319
1560C19Q4K5l3o8j11M3l47K53k47J66k78J16P2j64O1l4l20R6r1L54n7p9J85l9
$$ 319 403 428 395 327 216 259 -88 165 -82 84 -194 -78 -6 -170 -109 -143 -463 -367 -458 -104 -161 -240 -55 -94
1584i4Q1K08k4Q5j13Q2j4J5M6j03lo5M0j54Q7j45l4j40j6K54k13P1j5m4J36K2
$$ -94 -13 195 171 256 143 225 211 226 272 169 166 101 141 -13 74 -71 -105 -245 -261 -7 -220 -149 -164 -208 -72 -50
1610e0j00J71j16K44R0P1j4j04j11J11L5j30o7R8RM3p7J03l02O3j72j29N8K68
$$ -50 -150 21 -95 149 239 310 296 192 81 192 227 97 30 128 137 180 103 206 -96 -33 -205 -334 -276 -8
1634hk74m3K29l4kLj88L59p1o6M01k21J61r5M3j43K35m1j77j48J50LL1j57R1j81
$$ -8 -282 -325 -96 -130 -132 -129 -317 42 -29 -95 306 85 246 151 194 51 286 245 68 -80 70 73 104 -53 38 -143
1660a43j31P7j56K53j32K1m3J72j10J93j63K36q1M3k09M67K19k74l0J59q1l3j30
$$ -143 -274 -197 -353 -100 -232 -211 -254 -82 -192 1 -162 74 -7 36 -173 294 513 239 209 368 287 254 124
1683A24l1L0k23L2O1J60l68OJ4n5L9J39r9n9R4J82k75K41J80o5q0L01k10P3k09
$$ 124 93 123 -100 -68 -7 153 -215 -209 -195 -250 -211 -72 -171 -230 -136 46 -229 12 192 127 47 348 138 211 2
1708BJ69m3ML1k76J28j51K09j89j28R5O3M4q2N0J5lo7n0J51Q6q9j09L95m7j89
$$ 2 171 128 132 163 -113 15 -136 73 -116 -244 -149 -86 -42 -124 -74 -59 -62 -129 -179 -28 58 -31 -140 255 208 19
1734A9O6O3o4R5J71l15M07k84n7j23R6j25j35P5J88j84j10m9J74J76p1j42R6J29
$$ 19 85 148 84 179 350 35 442 158 101 -22 74 -51 -186 -111 77 -107 -217 -266 -92 84 13 -129 -33 96
1758I6l17M9K63k7n0L0Q1P7R2j20q4R7j11J6n9j15J60o9k31j67M03j84o7pJ84
$$ 96 -221 -172 91 64 14 44 125 202 294 174 90 187 76 92 33 -82 78 9 -222 -389 14 -170 -237 -244 -60
1783f0O3j83NL17m5j11qk8J56P7j51j10K48K08k91J21j9j25J4j8k04J72r4k30
$$ -60 3 -180 -175 142 97 -14 -22 -50 106 183 32 -78 170 378 87 208 189 64 78 60 -144 28 -66 -296
1807b96K30nj75J20P7kk6O6N1m1J24p7o6r1L39l3j36J0J02M8j1k80J6K41k59l9
$$ -296 -66 -71 -246 -126 -49 -51 -77 -11 40 -1 123 46 -20 -111 228 195 59 69 171 219 208 -72 -56 185 -74 -113
1833a13J1k38J89J97k18J63K5k54q5M52j88n7Q9L9J45j3j78K4K15k51K3J11K6
$$ -113 -102 -340 -151 46 -172 -9 16 -238 -323 129 -59 -116 -27 12 157 144 -34 -10 205 -46 -23 88 114
1856A14j52J36j60m1Q0J04k53qK34j96q7q7K58O7r8j90J03L30l40q9M38K3k23
$$ 114 -38 98 -62 -103 -23 81 -172 -180 54 -142 -229 -316 -58 9 -89 -279 -176 154 -186 -275 163 186 -37
1879c7J25q2L08j57m8r9j49J46L5p9K6K64m52J07J37j4O4k68j94M99j90Nm2J73
$$ -37 88 6 314 157 109 10 -139 7 42 -37 -11 253 -199 -92 45 31 95 -173 -367 132 -58 -53 -95 78
1903G8R5R4k99RK95j94K3k07K24p6o3j59L14q6l6P2j26r0J11J03m4j66J36j4j21
$$ 78 173 267 -32 -23 272 78 101 -106 118 42 -21 -180 134 48 12 84 -42 -132 -21 82 38 -128 8 -6 -127
1928a27J29K9k20P9oL04p2k2j10K07j49q2k32M65n6j06l6J09K35m25J36j93L36
$$ -127 2 31 -189 -110 -116 188 116 94 -16 191 42 -40 -272 193 137 31 -5 104 339 -86 50 -143 193
1951A93m32K0J96L6j9k07R4K19m9j22N4Pk8rO6m4J41J01j39n3M0J16k54J67m0
$$ 193 -239 -219 -23 13 -6 -213 -119 100 51 -71 -17 -10 -38 -47 19 -25 116 217 78 25 65 181 -73 94 54
1976E4L6O8j54l4J41j85q3Lj0J93k74K82LOj30k2K07k97J94r9K57nl3j30j1J14
$$ 54 90 158 4 -30 111 -74 -157 -154 -164 29 -245 37 40 46 -84 -106 101 -196 -2 -101 156 151 118 -12 -23 91
2002I1n9M3j04r9J42J5r4j9k7J80j18M9p8j19J00J74J93l88J95n7J46j5j92M2
$$ 91 32 75 -29 -128 14 29 -65 -84 -111 69 -49 0 -78 -197 -97 77 270 -118 77 20 166 151 -41 1
2026Ar9L66n9Nj42M7J83k72k6N9l3J69m60K76O1m8Ok44K31j99K28k54L22m6m4
$$ 1 -98 268 209 214 72 119 302 30 4 63 30 199 -261 15 76 28 34 -210 21 -178 50 -204 118 72 28
2051B8j31J76M8p1j60J67k6L17m30L52k21m8lj80K24q5Q3J8n2J85l72J37J57j17
$$ 28 -103 73 121 50 -110 57 31 348 -82 270 49 1 -2 -182 42 -43 40 58 6 191 -181 -44 113 -4
2075dJ26L9J7k21Pn2L8J71j69j53K86J65k10q4J11O5j70P8p5j84K84j25j9J11
$$ -4 122 161 178 -43 -36 -88 -50 121 -48 -201 85 250 40 -44 67 132 -38 40 -35 -219 65 -60 -79 32
2099C2j78Q8M9m3O5O4m5k3K5j8J18j92J07Q9N6k32J65j76K03l02K10N3L3k4j28
$$ 32 -146 -58 -9 -52 13 77 32 9 34 16 134 -58 49 138 194 -38 127 -49 154 -148 62 115 148 124 -4
2124dj18O2MlK7q7l0O7J5J52k02K98k60J46n6L4j6q7L33r6r5o4n0O6n9J37L5k04
$$ -4 -122 -60 -56 -59 -32 -119 -149 -82 -67 85 -117 181 -79 67 11 45 29 -58 275 179 84 20 -30 36 -23 114 149 -55
2152e5l8J10k06K31J23l91J39O8L5j6O8Mj61J25r7J65j35j6N7j48L79n7j13j94
$$ -55 -93 17 -189 42 165 -226 -87 -19 16 0 68 72 -89 36 -61 104 -31 -47 10 -138 241 184 71 -123
2176a23J14j06p2K41p9K04j70o3m6J73l34K56l6K3J57k43n2J4J84p4k8o0J21K0
$$ -123 -9 -115 -187 54 -25 179 9 -54 -100 73 -261 -5 -41 -18 139 -104 -156 -142 42 -32 -60 -120 1 21
2200B1N0j27J54J18o7k09K11j42Q3k66J08l5K90k04L9q5J89j25k14J17Q3j74J55
$$ 21 71 -56 98 216 149 -60 151 9 92 -174 -66 -101 189 -15 24 -61 128 3 -211 -94 -11 -185 -30
2223c0m9j89K30P8N7Q4j16j36K36k03J1J57r7J23j95M7l1nn4l3J51k92K92j96
$$ -30 -79 -268 -38 40 97 181 65 -71 165 -38 -27 130 33 156 -39 8 -23 -28 -82 -115 36 -256 36 -160
2247a60R2R1j17J24j22J91j91K7J01o1Q7pj99J41J2J06M4J2j71J99Jr7q6m6l02
$$ -160 -68 23 -94 30 -92 99 -92 -65 36 -25 62 55 -144 -3 9 115 159 171 0 199 200 103 17 -29 -331
2272c31L50J8p3J70k23P5k0J45r9j3M6N1P3j59N0j32J01kl6On5J96j30J66l18
$$ -331 19 37 -36 134 -89 -14 -34 111 12 -1 45 96 169 10 60 -72 29 27 -9 -3 -58 138 8 174 -144
2297a44K77k62J26p1Olm7L19j10j50kJ1R0j90J87o3M3J27k52J62J72k42r9R4K04
$$ -144 133 -129 -3 -74 -68 -71 -118 201 91 -59 -61 -50 40 -150 37 -26 17 144 -108 54 226 -16 -115 -21 183
2322A83r3l8O8m04M13r2L4k44L09j05j3j70O0J67k2j01j04J20l1K13l72L50k04
$$ 183 90 52 120 -284 129 37 71 -173 136 31 18 -152 -92 75 53 -48 -152 -32 -63 150 -222 128 -76
2345g6J66J70j58J07q9j08q2O9j22R8j92J67J45k74R8J23j41R6p9j50K49O8p4
$$ -76 90 260 102 209 120 12 -70 -1 -123 -25 -217 -50 95 -179 -81 42 -99 -3 -82 -232 17 85 11
2368A1r8ORM9K7j28K35k19O5J0J14J5j70K53k61L8P5%k52Q5J77k24J16J3M8J26
$$ 11 -87 -81 -72 -23 4 -124 111 -108 -43 -33 81 96 -74 179 -82 -44 31 31 -221 -136 41 -183 -67 -54 -6 120
2394A20l44L62j73l6P0j16K14j68J67j94nJ13j62K07m2K72k53j62K17o2J58k11
$$ 120 -224 138 -35 -71 -1 -117 97 -71 96 -98 -103 10 -152 55 13 285 32 -130 87 25 183 -28
2416b8J7J06j10p6R6k62K27j7j09Q7Mj51J01Q3N3M6Q4j36J0k08J74J15j68J22
$$ -28 -11 95 -15 -91 5 -257 -30 -47 -156 -69 -65 -216 -115 -32 21 67 151 15 25 -183 -9 106 -62 60
2440F0k0j02J46k2j27J20M9k16P0K8R5j52J46l46J35M4R4j82Q7o7J43R6k31P9
$$ 60 40 -62 84 62 -65 55 104 -112 -42 -14 81 -71 75 -271 -136 -92 2 -180 -93 -160 -17 79 -152 -73
2464g3J82j69J20K8k94K36r3Rm4J98j01J03k5M7j76J35j90J62n3j94K66n0%m5
$$ -73 109 -60 60 88 -206 30 -63 -54 -98 100 -1 102 77 124 -52 83 -107 55 2 -192 74 24 24 -21
2488b1K05k20L7j9q1J44M3j51J38p4q4j01R1Q0r7m3O5J77j65k5Q7J5N5N3m1j14
$$ -21 184 -36 1 -18 -99 45 88 -63 75 1 -83 -184 -93 -13 -110 -153 -88 89 -76 -101 -14 1 56 109 68 -46
2514d6k6J89rj91K54r6K2n3j5oO2k28L26j75k67M02k46L01k21Q3k9q5P7j60N7
$$ -46 -72 117 108 -83 171 75 97 44 29 23 85 -143 183 8 -259 143 -103 198 -23 60 31 -54 23 -137 -80
2539h0j9J23n0j56K45q7J39k92J81j84L02Qpn2k99N3m4K95k64R0M1J23k68R5L8
$$ -80 -99 24 -26 -182 63 -24 115 -177 4 -180 122 130 123 71 -228 -175 -219 76 -188 -98 -57 66 -202 -107 -69
2564f9j96K06J75l0j88j18Q3K9L4J85o7J25j42Q7k95K58l3k5m5P3Q0k6Rpj79Q3
$$ -69 -265 -59 116 86 -102 -220 -137 -108 -74 111 44 169 27 114 -181 77 44 19 -26 47 127 101 110 103 -76 7
2590Gj24K02k06j62K78j26j51L64j37J2J10J02r4q6J0J46k39O8J37j31m1j68J25
$$ 7 -117 85 -121 -283 -5 -131 -282 82 -55 -43 67 169 75 -11 -1 145 -94 -26 111 -20 -61 -229 -104
2613a04M7k3r2P8K04k00Q0M0m4j41J13Jp2K17L7q6j32J0J5O3j45J99o4K4n6j14
$$ -104 -57 -80 -172 -94 110 -90 -10 30 -14 -155 -42 -41 -113 104 141 55 -77 -67 -52 11 -134 65 1 25 -31 -145
2639a45J97m3N7n4j31K33q6n4M1r6M4J12j86J59k12J78Nj15k6J29J54j92K83k11
$$ -145 52 9 66 12 -119 114 28 -26 15 -81 -37 75 -111 48 -164 14 19 -96 -122 7 161 -31 252 41
2663D1j4R0l3p3R3k5j2m1M9j96n4L07j91J3J21o9j49p2K71P4j98k9K10j03K44
$$ 41 27 117 84 11 104 79 67 26 75 -121 -175 132 -59 -46 75 6 -143 -215 56 130 -68 -97 113 10 254
2688B54l21K5rJ00Pj49L27k89l5J81N9r5K42k33N0j75J95p8k07J35j68J96j98
$$ 254 -67 -42 -51 49 56 -93 234 -55 -90 91 150 55 297 64 114 -61 134 56 -151 -16 -184 12 -186
2711a86L01m8J3l7r8K43l3j72j38J14j4J42p0jj11J18N2R1j00j18K15j33L6j39
$$ -186 115 67 80 43 -55 188 155 -17 -155 -41 -55 87 17 16 -95 23 75 166 66 -52 163 30 66 -73
2735g3MK46n3j61q1J85q0Q6mj76P2O2O7j07n3K01j82J7Q2J1j8j62j10J93L02l58
$$ -73 -69 177 124 -37 -118 67 -13 73 69 -107 -35 27 94 -13 -66 135 -47 -30 52 63 45 -117 -227 -34 268 -90
2761i0q9P9rJ05N2q5j39J59L1J0n7J01j25J49j64J70l7q3J51p3j64R1KJ97k25
$$ -90 -179 -100 -109 -4 48 -37 -176 -17 14 24 -33 68 -57 92 -72 98 61 -22 129 56 -108 -17 -15 182 -43
2786d3j6J7J80j18j25J57j14n3J35k65J70Q2q7L1R5j19J33N9p5P0k18J23L7M2
$$ -43 -59 -42 138 20 -105 52 -62 -115 20 -245 -75 7 -80 -49 46 -73 60 119 44 114 -104 19 56 98
2810I8pj2k04L8J45r3O7k17J45R6l0j29rL79q0k25K01k55J39q5j33K51m5q7l0
$$ 98 91 79 -125 -87 58 -35 32 -185 -40 56 26 -103 -112 267 187 -38 163 -92 47 -38 -171 80 35 -52 -82
2835h2J3J5q3m4K35N9j3p8j70J50J0J76k84M11l19o0j88L34L6l46K56m7o9J62
$$ -82 -69 -54 -137 -181 54 113 100 22 -148 2 12 188 -96 315 -4 -64 -252 82 118 -228 28 -19 -88 74
2859G4m7J6j47J59k58K67l6m9Q0k33K75L3j49p7N7K7J0K7j4kj25Q2j18J0K88j83
$$ 74 27 43 -104 55 -203 64 28 -21 59 -174 101 134 -15 -92 -35 -8 2 29 15 13 -112 -30 -148 -138 150 -33
2885c3M1K3j5n0j8j00J87l6O1o7J71j96J90N0k25L8j54J21j45K59j57j09qJ17
$$ -33 8 31 16 -34 -52 -152 35 -1 60 -7 164 -32 158 208 -17 21 -133 -12 -157 102 -55 -164 -172 -55
2909e5O6Nl0j39M2lJ55r0J14Q1j18k67K59j17K6M2J42L9j61Qj3N2K5l19J2J82
$$ -55 11 16 -14 -153 -111 -114 41 -49 65 146 28 -239 20 -97 -71 -29 113 152 -9 -1 -14 38 63 -256 -244 -62
2935f2J56J02o1q8j49NJ58j03K6M9o7M6j02N7K2J02k1j99L2K10j17n4K02o0m3
$$ -62 94 196 135 47 -102 -97 61 -42 -16 33 -34 12 -90 -33 -11 91 70 -129 -97 113 -4 -58 144 84 41
2960D1p5J66o1j51o2L37n4m1nn0j27KJ61O0k25JQ0Q8r3J34N9l22Q7J26Q3q0J54
$$ 41 -34 132 71 -80 -142 195 141 100 95 45 -82 -80 81 141 -84 -83 -3 85 -8 126 185 -137 -50 76 159 79 233
2987B33j90j71j7k2j0K39k0n8k27L96k62J6o2K93j47K5J63k27kRl6K71k42pJ33
$$ 233 43 -128 -145 -167 -177 62 42 -16 -243 153 -109 -93 -155 138 -9 16 179 -48 -50 -41 -77 194 -48 -55 78
3012G8j23J52k04J27k90K52J38j93P1J70L5l90J79p9q3J05J6J07j63J73r2K8M
$$ 78 -45 107 -97 30 -260 -8 130 -63 8 178 213 -177 2 -77 -160 -55 -39 68 -95 78 -14 14 18
3035A8j59J85j72J23%j5J22k2k28K87j54j53K52j12k9L8j61J11k0J8n0K77k66
$$ 18 -141 44 -128 -5 -5 -20 102 80 -148 139 -15 -168 84 -28 -57 -19 -180 -69 -89 -71 -121 156 -110
3058a10P5R2M8l4J69l04R6j16j72K76pm7Q7R7l06O5Q6N3K1j24m7R8j66J88P7j56
$$ -110 -35 57 105 71 240 -64 32 -84 -256 20 13 -34 53 150 -156 -91 -5 48 69 -55 -102 -4 -170 18 95 -61
3084f1J11N4j52M9J11q1m2P4M0k36J23oj1j50K03r0PK4m7N1J01N4k67l8L92j34
$$ -61 50 104 -48 1 112 31 -11 63 103 -133 -10 -16 -27 -177 26 -64 -57 -33 -80 -29 72 126 -141 -179 213 79
3110G9j33Q6K8r0r8M5J70j70J64Lj5ll3J22l10J83R6j98k3K85j60J4n7K1l4k6
$$ 79 -54 32 60 -30 -128 -83 87 -83 81 84 69 66 33 155 -155 28 124 -74 -97 188 28 42 -15 6 -28 -54
3136e4n2K82j77k6J1K9k4J85J05l30Q0L4J42j75k67K80O8m6o7j05L8J90j51J91
$$ -54 -106 176 -1 -27 -16 13 -11 174 279 -51 29 63 205 30 -237 43 111 65 -2 -107 -69 121 -30 161
3160A61l17K44o9R4qj94J79QM2j50K34l67N7N9J67j49MM2j3j77O3K04r6j42J20
$$ 161 -156 88 19 113 105 -89 90 98 140 -10 224 -143 -86 -27 140 -9 -5 37 24 -153 -90 114 18 -124 -4
3185dp5N1M8Q1j26J90j10j11J73k91L63k3l21jJ0K38o1M6K2r6o5J14j25J21j79
$$ -4 -79 -28 20 101 -25 165 55 -56 117 -174 189 166 -155 -156 -146 92 31 77 99 3 -62 52 -73 48 -131
3210a31o2O3J72L1j54K23Lk07K35j35p9N9k04J24j82J91J93J2k58J89r5Q5j52
$$ -131 -193 -130 42 73 -81 142 145 -62 173 38 -41 18 -186 -62 -244 -53 140 152 -106 83 -12 73 -79
3233g9J34j30N4J09j56ln1JK47p0n0l9j3j02O0P2J0P4k58L9M15l69Q9q8J06J01
$$ -79 55 -75 -21 88 -68 -71 -122 -121 126 56 6 -33 -46 -148 -88 -16 -6 68 -190 -151 264 -105 -16 -104 2 103
3259A03p5K0o7j20K13j02k5J24k28J70Q6k86J86M6rj14p6m0K29j69K18o0k07J80
$$ 103 28 48 -19 -139 74 -28 -53 71 -157 13 99 -187 -1 45 36 -78 -154 -194 35 -134 84 24 -183 -3
3283cl3n6J03j6J95m05K34o5r0K01l3p7J04J19l33M2OJ59j72J23j65K03j31J26
$$ -3 -36 -92 11 -5 190 -215 19 -46 -136 65 32 -45 59 178 -155 -113 -107 52 -120 3 -162 41 -90 36
3307C6j13POk0J28j32J14k16K14k13J00M9N4j35K30l60L40m3o6Q4j00J23j14K7
$$ 36 -77 -70 -64 -84 44 -88 26 -190 24 -189 -89 -40 14 -121 109 -251 89 46 -20 64 -36 87 -27 0
3331@j63J35M3O8j63q0J02R1K8q0J26lj32mN8%%O0k15r6L59k41m0J56P1k46M57
$$ 0 -163 -28 15 83 -80 -160 -58 33 61 -19 107 104 -28 -32 26 26 26 86 -129 -225 134 -107 -147 9 80 -166 291
3358B91l03Q9k07J08O9k16K53r8j00K59q8j55j39L59Op9p8j23KO4J04k37J47n0
$$ 291 -12 77 -130 -22 47 -169 84 -14 -114 145 57 -98 -237 122 128 49 -29 -152 -150 -86 18 -219 -72 -122
3382a22P0l0M6j9J44p9p9lj7M1J5J39k35K36p7O6P0j92J87j56l4J6N0M6MM6k51
$$ -122 -52 -82 -36 -55 89 10 -69 -72 -89 -48 -33 106 -129 107 30 96 166 -26 161 5 -29 -13 37 83 87 133 -118
3409a18K69j55K05k36K12k15N7O5Q1j35j18J49k37K31j98nJ49n6L4l%J5R7L9j88
$$ -118 151 -4 201 -35 177 -38 19 84 165 30 -88 61 -176 55 -143 -148 1 -55 -21 -24 -24 -9 88 127 -61
3434f1L45j88k20K41k10LN4R6j44j2J84j21K25j72J6j10N3J20oL0N5k52K18k90
$$ -61 284 96 -124 117 -93 -90 -36 60 -84 -96 88 -33 192 20 36 -74 -21 99 93 123 178 -74 144 -146
3458a46J10j5j25N3J88L0j41J6K9P6j15r6K46j34M7o2J20j89J73J15j90Qj17J66
$$ -146 -36 -51 -176 -123 65 95 -46 -30 -1 75 -40 -136 110 -24 23 -39 81 -108 65 180 -10 -2 -119 47
3482D7R9j60o5J92po7k09J62q7RJ01R7r6J06j7l5o2r3J10Mm7J81j62Prj36n2L3
$$ 47 146 -14 -79 113 106 39 -170 -8 -95 -86 15 112 16 122 105 70 8 -85 25 29 -18 163 1 8 -1 -137 -189 -156
3510a56R4O0p3J86j33o8N6l3KK14Pm1k33L20k46Q0j4J4n4J29o8M6m1j08P6j58
$$ -156 -62 -2 -75 111 -22 -90 -34 -67 -65 149 156 115 -118 202 -44 36 22 36 -18 111 43 89 48 -60 16 -142
3536a42J61q8m7J32j7K6k4oJ15j46P2j7j32l2J31J15K6j39o2Q9n5J36j78J2o3
$$ -142 19 -69 -116 16 -1 25 1 -5 110 -36 36 19 -113 -145 -14 101 127 -12 -74 15 -40 96 -82 -70 -133
3561a33R4M8K31m8k40O7J59m5nj66M5j06L43k89J08Pj25n8l9L9N7OK62k88K7M6
$$ -133 -39 9 240 192 -48 19 178 133 128 -38 7 -99 244 -45 63 70 -55 -113 -152 -113 -56 -50 212 -76 -49 -3
3587cj37Q1p7K05Q9l8j61m5J24j75R9Q5k6n7J96l27J92j0j25OJ02j38K6J84k10
$$ -3 -140 -59 -136 69 158 120 -41 -86 38 -137 -38 47 21 -36 160 -167 25 15 -110 -104 -2 -140 -114 70 -140
3612a40nK26j7j84J45P4k39J95P1k46K69j48L6n2N7J9n7p6J27j05J94l76L40j24
$$ -140 -145 81 64 -120 25 99 -140 55 126 -120 149 1 37 -15 42 61 4 -72 55 -50 144 -232 108 -16
3636a6M9j62J39p9K2Q2J6R9l26L67j87p0jj51K39O1m0J21j26J32j47o9L16k30
$$ -16 33 -129 10 -69 -47 35 51 150 -176 191 4 -66 -67 -218 21 82 42 163 37 169 22 -47 269 39
3660C9P8k01J0J38k40J0J14M4k03L21k94K34j61J9K51k44l2K33j72O5j90J47k0
$$ 39 117 -84 -74 64 -176 -166 -52 -8 -211 110 -184 50 -111 -92 159 -85 -117 116 -56 9 -181 -34 -54
3683e4l1P8n5K0P6jN7j97J42j02J86j35k5o0J54p7J48j63J2l9J43p1p1O9r3K17
$$ -54 -85 -7 -62 -42 34 33 90 -107 35 -67 119 -16 -41 -101 53 -24 124 -39 -27 -66 77 6 -65 4 -89 128
3709A28j57N8J08m1k28L59j70q6J24k49K32P6j07j35J72K6j32N4n5k2l5j5J92
$$ 128 -29 29 137 96 -132 227 57 -29 95 -154 78 154 47 -88 84 110 -22 32 -23 -45 -80 -95 97
3732I7l23J99K6o0J11J01k40l9J59k8L5L0j72l8J19k6J43k0l4r3P3m7p8j6J17
$$ 97 -226 -27 -1 -61 50 151 -89 -128 31 3 38 68 -104 -142 -23 -49 94 74 40 -53 20 -27 -105 -121 -4
3757dn9j89K75J2p0j4J22j75J60n1K86j74J6J48l24l3R2p7J46J7j52J75j27j70
$$ -4 -63 -252 23 35 -35 -49 73 -102 58 7 293 119 135 283 -41 -74 18 -59 87 104 -48 127 0 -170
3781a70K11j55p0J80j53K16L5o7q1K40o1j85q7J9Q6J51n5j85J63Mo3q2J50L9K0
$$ -170 41 -114 -184 -4 -157 59 94 27 -54 186 125 -60 -147 -128 -42 109 54 -131 32 36 -27 -109 41 80 100
3806A00k43P7l3J62j23j18Q3L6j7P0j50J44K1K6J53k45K09o5j03P4j71K1L02j25
$$ 100 -143 -66 -99 63 -60 -178 -95 -59 -76 -6 -156 -12 9 35 188 -57 152 87 -16 58 -113 -92 210 85
3830H5l11K08RK2J07r9j12j15L7J87m2m9J5K7j51O3K26j29o8K31p3l5o3p5K2J77
$$ 85 -226 -18 -9 13 120 21 -91 -206 -169 18 -24 -73 -58 -31 -182 -119 107 -22 -90 141 68 33 -30 -105 -83 94
3856I4j23r9J41J27r8o7l1M1L0q6Q2J66j08j01r5Q1O0Pj98J49qj11K15j61Q4J3
$$ 94 -29 -128 13 140 42 -25 -56 -15 15 -71 11 177 69 -32 -127 -46 14 21 -177 -28 -36 -147 68 -93 -9 4
3882Dn9m3L8Q3K26j89J2j9j23o4J13J73j11L7j65n0J33j12J03j24J36J86j34j18
$$ 4 -55 -98 -60 23 249 60 72 53 -70 -134 -21 152 41 78 -87 -137 -4 -116 -13 -137 -1 185 51 -67
3906f7K18j94J25l59M32k28K9M8j00J18l10K73O9R4j87J05J27k99J55k49M63j54
$$ -67 151 -43 82 -277 155 -73 -44 4 -96 22 -288 -15 54 148 -39 66 193 -106 49 -200 263 109
3928A09k56K2J24ml7j3k7oO2R4o5l2J67k03L4P9Jj9l6R4n6o8J14j32j92K96l8
$$ 109 -147 -125 -1 -5 -42 -55 -82 -88 -26 68 3 -29 138 -65 -31 48 49 30 -6 88 32 -36 78 -54 -246 50 12
3955A2P2j31P3l1J6K6O8k46R7J38j26o3j3J07Q2q3k32K56M31l06Mk25O4R4K2K8
$$ 12 84 -47 26 -5 11 37 105 -141 -44 94 -32 -95 -108 -1 81 -2 -234 22 453 147 151 -74 -10 84 106 134
3981A34n3l6j75N4%j00L4m8J05J7M6J00j61K40o4j6j56P2Q2Qk2j14N5J32j2k59
$$ 134 81 45 -130 -76 -76 -176 -142 -190 -85 -68 -22 78 -83 157 93 77 -79 -7 75 83 61 -53 2 134 122 -137
4007a37J75j31J01P4q4k1m4J70q0L4l8rQ8j79K76k81J68K4j42j06J14k8n8p3M7
$$ -137 38 -93 8 82 -2 -23 -67 103 23 57 19 10 98 -81 195 -86 82 106 -36 -142 -28 -56 -114 -187 -140
4032a40K0L74j60j94L03j58j99J94Pj99J04j1o8J20Q8P4j05j59J46l1L9j84J56
$$ -140 -120 254 94 -100 203 45 -154 40 47 -152 -48 -59 -127 -7 81 155 50 -109 37 6 45 -139 17
4055A7n0RN0J65n0j21K83k34J38j86J7P2r6n2Q5l9J33j90J46or9j06J18N5j07
$$ 17 -33 -24 26 191 141 20 303 69 207 21 38 110 14 -38 47 8 141 -49 97 91 -8 -114 4 59 -48
4080d8J42j86K58p0q7Mk66K48j28K92k32j62K55L5p5j45J72l4l8Q5j18J17k01
$$ -48 94 -92 166 96 9 13 -253 -5 -133 159 -73 -235 20 55 -20 -165 7 -27 -65 20 -98 19 -182
4103a82p4M13n9R4L5l54L42k96J64j5or1%J81k38j6M4j7M6N7J05R8k77j57J56
$$ -182 -256 157 98 192 227 -127 215 -81 83 68 62 -29 -29 152 -86 -102 -58 -75 -29 28 133 231 -46 -203 -47
4128d7j61K15j87K30k5JJ08j32j81L02Nj45j16J09J98j95j58K84p8j4P2n1j88
$$ -47 -208 7 -180 50 25 26 134 2 -179 123 128 -17 -133 -24 174 -21 -179 105 27 13 85 34 -154
4151a54P2M9l3P0q6L13j21j7k05J71n5J58j53J63j80j8n2j1R4k86L47j16J49j54
$$ -154 -82 -33 -66 4 -82 231 110 93 -112 59 4 162 9 172 -8 -26 -78 -89 5 -281 66 -50 99 -55
4175e5J92k09J73o2L5k75J37Q8J84j33j25K13k99J32J17k65j2P1J13p7L8j13n7
$$ -55 137 -72 101 39 74 -201 -64 24 208 75 -50 163 -136 -4 113 -152 -164 -93 20 -57 -19 -132 -189
4198a89K50p8K40l32J70q0P4j1j0j14O2K25j62QL9J40k00j33J63k24K19k5J9m2
$$ -189 61 -17 223 -109 61 -19 55 44 34 -80 -18 207 45 53 92 232 32 -101 62 -162 57 32 51 9
4222Ik2J2l2J19m2k0P4J00j48k36K50o9q5P1p9R9q7P0Q9j37jj2R4%K2R7o9k87
$$ 9 -13 -1 -33 86 44 24 98 198 50 -186 64 -5 -90 -19 -98 1 -86 -16 73 -64 -65 -77 17 17 39 136 67 -220
4250b20J13J95L6J6j03Q9k62R3nj7l0N9o7K02qk05R9k01L80j62J02j68K7J22J15
$$ -220 -107 88 124 140 37 126 -136 -43 -48 -65 -95 -36 -103 99 91 -114 -15 -216 164 2 104 -64 -37 85 200
4275B00j24K8j01j67J56n9J83m6j54j1J03l1q9K62ml0l5kl1J79j34qO5j67j35
$$ 200 76 104 3 -164 -8 -67 116 70 -84 -95 8 -23 -112 150 146 116 81 79 48 227 93 85 150 -17 -152
4300a52K70K2K7l38K90K8j54m5Q3l7j46L47k43J96k04J02K3O9j05j4j27k8K1K43
$$ -152 118 140 167 -171 119 147 -7 -52 31 -6 -152 195 -48 148 -56 46 69 138 33 19 -108 -136 -115 128
4324A28j01K03j77j16K14n1p0j99J16J69l58K50p8J53j06Q1J07m29L75r3k2J28
$$ 128 27 230 53 -63 151 100 30 -169 -53 116 -242 8 -70 83 -23 58 165 -264 111 18 -4 124
4346A24k06K30l03j4P9R6p9Q5Nr7Q6J5k5P0Jk53M1O6K44j93P5j6N9j88K6J23K49
$$ 124 -82 148 -155 -169 -90 6 -73 12 17 -80 6 21 -4 66 67 -186 -145 -79 165 -28 47 31 90 -98 -72 51 300
4373C00j70l09J31J34j91J87k4j57J12l3L6o5j02J41L6r1R8mJ23q4M2j25MJ87
$$ 300 130 -179 -48 86 -105 82 58 -99 13 -20 16 -49 -151 -10 26 -65 33 29 152 68 110 -15 -11 176
4397A76n5r6l5j7j55K60n9l0Qj21J41m6R0J3p7q1o7L20m4j91J39J78l46K15r9
$$ 176 121 25 -10 -27 -182 78 19 -11 -3 -124 17 -29 61 74 -3 -84 -151 169 125 -66 73 251 -95 120 21
4422B1n7nJ33r6J76k48J09j42K95l18J03N7j09K2L1q2NQ5J70j29j89Q6J34j46
$$ 21 -36 -41 92 -4 172 -76 33 -109 186 -132 -29 28 -81 -59 -28 -110 -105 -20 150 21 -168 -82 52 -94
4446i4K26j2m5j31oJ73K7j75m4J99j20O2j95o8J52r2J18nO7O0k78%Q8J85j1j91
$$ -94 132 120 75 -56 -62 111 138 -37 -81 118 -2 60 -135 -203 -51 -143 -25 -30 37 97 -181 -181 -93 92 81 -110
4472a10J79J6l5r1K13j50j9q9Q5K63j44k6m9j56J25M8j52J33l9O3k08O8rR3n8
$$ -110 69 85 50 -41 172 22 3 -86 -1 262 118 92 43 -113 12 60 -92 41 2 65 -143 -75 -84 9 -49
4497d9n3J16j3k9j2J67j10K05n21K52LO8n6M6j20J42j3nM1j01J4o7K7K2r5q0J70
$$ -49 -102 14 1 -28 -40 127 17 222 -299 -47 -44 24 -32 14 -106 36 23 18 59 -42 -28 -95 -68 -46 -141 -221 -51
4524e1j81J94k41K43O9n5J9k8o6J1L7O5k2j07J57o8J04k6k5J32j41P1j30K79j64
$$ -51 -232 -38 -279 -36 33 -22 -3 -31 -97 -86 -49 16 -6 -113 44 -24 80 54 29 161 20 91 -39 240 76
4549G6n9J81l12L03k85J1M6Nq0L15o4m2k34L7m6K02P7j37k6J97j99Q6l0n1lR8
$$ 76 17 198 -114 189 -96 -85 -39 -34 -114 201 137 95 -139 -102 -148 54 131 -6 -32 165 -34 52 22 -29 -32 66
4575F6q5k8K55l33K04r7K71k91K9n5Q9n0K03j45q7J22k54r2M60k34J25j6J6r7
$$ 66 -19 -47 208 -125 79 -18 253 -38 -9 -64 25 -25 178 33 -54 68 -186 -278 182 -52 73 57 73 -24
4599b4j76J49n5P9p4J94k99J91k3J55j70M5M8p3J02p0q9j76J69J35O2j95l6M8
$$ -24 -200 -51 -106 -27 -101 93 -206 -15 -38 117 -53 -8 40 -33 69 -1 -90 -266 -97 38 100 -95 -131 -83
4623h3m9L9J74J2j23M9o3o3R3j8O0K0j31M2K45k26J14k10O5j14K93J2j34O0j48
$$ -83 -132 -93 81 93 -30 19 -44 -107 -14 -32 28 48 -83 -41 204 -22 92 -118 -53 -167 126 138 4 64 -84
4648h4k2J50j55J23n0M3o6OO5K4J18q1j44J10k61K72K33m73K70j48K8j81L72m4
$$ -84 -106 44 -111 12 -38 5 -61 -55 10 34 152 71 -73 37 -224 48 281 -192 78 -70 -42 -223 149 105
4672A05j46j5j22L3K22J05j66j34J30m0J49n0j36Q1p8N2r9O8L0J8o8O5P8J5n6
$$ 105 -41 -56 -178 -145 77 182 16 -118 12 -28 121 71 -65 16 -62 -10 -109 -41 -11 7 -61 4 82 97 41
4697D1k74K38n8N0j05R8J24j56N7j42J29k86L54J04l08J83nJ1k64L25j50J14k43
$$ 41 -233 5 -53 -3 -108 -10 114 -42 15 -127 2 -284 70 174 -134 49 44 55 -209 116 -34 80 -163
4720a63K32n2j99P0Q9J03j31J11j28k3o3K11j47N2j01MJ81M6m6j51M7J42j35K3
$$ -163 69 17 -182 -112 -23 80 -51 60 -68 -91 -154 57 -90 -38 -139 -135 46 92 46 -105 -58 84 -51 -28
4744b8N3J36j92J67j34j8J79j69n2J3J94j65J3J78j39k7qj35l3J60n9R6M7l4J7
$$ -28 25 161 -31 136 2 -16 163 -6 -58 -45 149 -16 -3 175 36 9 1 -134 -167 -7 -66 30 77 43 60
4769F0k49J06M2k64K96P2r8j13J08j17M3n0J87M3K4l5J24k60K01n9j27L8M3O1
$$ 60 -189 -83 -41 -305 -9 63 -35 -148 -40 -157 -114 -164 23 66 90 55 179 -81 120 61 -66 -28 15 76
4793G6j82O9m3R0PQ4k87O9j00K36J04l5m1M7k04L6p3J62o5L5J89j91N9J34o0l
$$ 76 -106 -37 -80 10 17 101 -186 -117 -217 19 123 88 47 94 -110 -74 -147 15 -50 -15 174 -17 42 176 116 113
4819A13k61R6O5K4J29j72j1Qr8J13K84k61j23J9N3lP1J06k86mK11j7j17Q8J85
$$ 113 -148 -52 13 37 166 -6 -17 -9 -107 6 290 29 -94 -75 -22 -25 46 152 -134 -138 73 56 -61 27 212
4844B12k95MJ24K2n8m5J15j04J45j37lp8m8L51k79r7J36K1R2j84O2K9N8k6J52
$$ 212 -83 -79 45 67 9 -36 79 -25 120 -17 -20 -98 -146 205 -74 -171 -35 -14 78 -106 -44 -15 43 17 169
4869A69j62J03j4J4j93L56k41qk0m5%j27L32j99L%M3Q6Jl8j37J20j52J37k06J31
$$ 169 7 110 96 110 -83 273 32 24 4 -41 -41 -168 164 -35 -32 -32 11 97 98 60 -77 43 -109 28 -178 -47
4895d7J64n5p9kJ17rk22kJ89l4Q7k92r4R4K44q8J07M9j30J4j27K33j89j2K20m8
$$ -47 117 62 -17 -19 98 89 -133 -135 54 20 107 -185 -279 -185 59 -29 78 127 -3 11 -116 117 -72 -84 136 88
4921H8o4J03k42J02j45P9K52j28l7r4O1j28J64k22K73q4J50k13K47j85j6O3k26
$$ 88 24 127 -115 -13 -158 -79 173 45 8 -86 -25 -153 11 -211 62 -22 128 -85 162 -23 -39 24 -202
4944b02K78j09%lO7N5j35L73o3k89l5J5p6K85q0r5K7j96K24O0N9K8l49M2M5k3
$$ -202 76 -33 -33 -36 31 86 -49 324 261 -28 -63 -48 -124 161 81 -14 13 -183 41 101 160 188 -161 -119 -74 -97
4970i7J02J33j05J07L1j84k03M50l19K8K22k61R2j81K41q1K0NK2r9Q7M3j41n0
$$ -97 5 138 33 140 171 -13 -216 234 -85 -57 165 -96 -4 -185 56 -25 -5 0 22 -77 10 53 -88 -138
4994a38J32R2m0n1o0J7K04j37j50J2lM9N3j13J2J65L3p8P9J66l59J63j91Q1R7
$$ -138 -6 86 46 -5 -65 -48 156 19 -131 -119 -122 -73 -20 -133 -121 44 77 -1 78 244 -115 48 -143 -62 35
5019C5m6k2K3O1k6l5J6p8L5J39j25N8k07J96L1R3k51O8j4N5j3J42n5j38n8K41
$$ 35 -11 -33 -10 51 25 -10 6 -72 -37 102 -23 35 -172 24 55 148 -103 -35 -49 6 -7 135 80 -58 -116 125
5045A25j97J8J50n5J69l71J51J42j05n2k5j82K03QQ8n1N3j59q3J68K03k06P5J04
$$ 125 -72 -54 96 41 210 -161 -10 132 27 -25 -50 -232 -29 -21 67 16 69 -90 -173 -5 198 -8 67 171
5069A71pk50q8J48J24rj70N5n8Q4q5Q7oJ01j69P5N1K1l5j25K34j51J56j45J35
$$ 171 164 -86 -174 -26 98 89 -81 -26 -84 0 -85 2 -4 97 -72 3 54 75 40 -85 149 -2 154 9 144
5094A44k7j20l6P3N9J6P1m2R0j84N9j28J23M9q4m8J24q2o2o3P6pj8J35j35J12
$$ 144 117 -3 -39 34 93 109 180 138 228 44 103 -25 98 147 63 15 139 57 -5 -68 8 1 -17 118 -17 95
5120I5n4j05K92r1J10k46j64K61j00j5mj27J55P9O4j59L5O2j02m1j6K72k69L0
$$ 95 41 -64 228 137 247 1 -163 98 -2 -17 -21 -148 7 86 150 -9 26 88 -14 -55 -71 201 -68 -38
5144c8j33J32J9N3k5r6K03j40j11J30m0k33L17j69M9MJ79o4q7q2J51J20j2k10
$$ -38 -171 -39 -20 33 8 -88 115 -25 -136 -6 -46 -279 38 -131 -82 -78 101 37 -50 -132 19 139 127 -83
5168h3J87p7j07N5P4o0k07P1N6q0L09k05J04J0r8j0J15j20K12J39n00K12n5N6
$$ -83 104 27 -80 -25 49 -11 -218 -147 -91 -171 138 -67 37 47 -51 -61 54 -66 146 285 -215 -3 -58 -2
5192bq8n1N1K29Rk95M1J80j8m9j32K06j54q2K80k46N5N9K22j6k17J52j4j96M3
$$ -2 -90 -141 -90 139 148 -147 -106 74 56 7 -125 81 -73 -155 125 -121 -66 -7 215 199 -18 134 120 -76 -33
5217c3k3MR5j9j72O0J53M0lk04J03JP2J11q5j60N5J28r6J43l6k35K53j07qj24
$$ -33 -56 -52 43 24 -148 -88 65 105 102 -102 1 2 74 185 100 -60 -5 123 27 170 134 -101 152 45 37 -87
5243h7J73p4m5L0K7j51J07N6o4m7P7j01J28n2J20r5q2O6l9J67k23K13j0O7k48
$$ -87 86 12 -33 -3 24 -127 -20 36 -28 -75 2 -99 29 -23 97 2 -80 -14 -53 114 -109 104 94 161 -87
5268h7J10M5j63L3K6j24J70J29j93J9J09L7r7J06L9k79J24M9j02P9p9j11K00M6
$$ -87 23 68 -95 -62 -36 -160 10 139 -54 -35 74 111 14 120 159 -120 4 53 -49 30 -49 -160 40 86
5292H6j69Q4oR0ro7R4k07J55j79R0o3o7J53L6nj58Q3J08l5l0R5j32j3M9p4OP5
$$ 86 -83 1 -5 85 76 9 103 -104 51 -128 -38 -101 -168 -15 21 16 -142 -59 49 14 -16 79 -53 -66 -17 -91 -85 -10
5320a0J50l55L49j24J16j56M0L0P2k16Q0N0mJ56q4j48m7K00j02o0M8m9o1J56l4
$$ -10 140 -215 134 10 126 -30 10 40 112 -104 -24 26 22 178 94 -54 -101 99 -3 -63 -15 -64 -125 31 -3
5345cq2O4J05J10k78j04Q5R8rK3k7J44j03J37j44J88j79J8l8J00j12J42j81Q9
$$ -3 -85 -21 84 194 -84 -188 -103 -5 -14 9 -18 126 23 160 16 204 25 43 5 105 -7 135 -46 43
5369D3M8r4k2l9m6J50P9j92J73j15M7jr2j9M6J48k13O4l4n7J53Qj04J20r5J05
$$ 43 91 -3 -25 -64 -110 40 119 -73 100 -15 32 31 -61 -80 -34 114 -99 -35 -69 -126 27 35 -69 51 -44 61
5395F1j53k9J33j35L0J75j50J17n5J35k24N3R7J53j36j67J18j8j6J59j85k26L98
$$ 61 -92 -121 12 -123 -93 82 -68 49 -6 129 -95 -42 55 208 72 -95 23 5 -11 148 -37 -263 135
5418A35k35J33Q4k40J39q2N8j17J36k1l5M0q3P0p5R9L51l03m3j42K18m5p6l4M6
$$ 135 -100 33 117 -123 16 -66 -8 -125 11 -10 -45 -5 -88 -18 -93 6 357 54 11 -131 87 42 -34 -68 -22
5443b2M8M5J59j98kr0O0L6p6L4O6q0j6PK7O5j04P7k13J70N9k43K55j22M7R9l04
$$ -22 26 71 230 32 30 -60 0 36 -40 -6 60 -20 -36 -29 -2 63 -41 36 -177 -7 52 -191 64 -58 -11 88 -216
5470b16J17J83Mj46J52l8m7M0p1J74p3j22J3N6j59O8pO0J29j23R0J04j80J09l7
$$ -216 -99 84 88 -58 94 56 9 49 -22 152 79 -43 -30 26 -133 -65 -72 -12 117 -6 84 188 8 117 80
5495H0j44O8J08k10J52p2O5j18P2j94K43Q3j23j04j9J06p0J22K1l5O8j21K4K33
$$ 80 -64 4 112 -98 54 -18 47 -71 1 -193 50 133 10 -94 -113 -7 -77 45 66 31 99 -22 2 235
5519B35j90J05j92O4k26J35J43m7j46O0O8m4O1j40J94j31m0Q9j44J05j16J62J07
$$ 235 45 150 -42 22 -204 -69 74 27 -119 -59 9 -35 26 -114 80 -51 -91 -2 -146 -41 -157 5 112
5542A12r8k51L42p6N0j67K05p2L7K1k29R9N1J42k52J17Jj28J02l4L3J5M0j63J84
$$ 112 14 -237 105 29 79 -88 117 45 82 103 -126 -27 24 166 -86 31 32 -96 6 -28 5 20 60 -103 81
5567H1j57mq6K82k38L2J56oO2j26J29j32M2k8K1M9O8j82J15J7o5l8R0K0j27O7
$$ 81 -76 -80 -166 116 -122 -90 66 60 122 -4 125 -7 35 7 28 77 145 -37 78 95 30 -8 82 102 -25 42
5593D2n2m6j1J54k01k5K7P1K08r5o8M1o7PK24k49j15J87J3m5l7Q4j06j75J41K2
$$ 42 -10 -56 -67 87 -114 -139 -112 -41 167 72 4 45 -22 -15 209 -40 -155 32 45 0 -37 47 -59 -234 -93 -71
5619g1NJ99k78L89k67n5M1Q4l9J39k27O7q0M6j41L19k24R3m9J0l1oK74r6P2j11
$$ -71 -66 133 -145 244 -23 -78 -37 47 8 147 -80 -13 -93 -47 -188 131 -93 0 -49 -39 -70 -76 198 102 174 63
5645F3Oj1j12P8M1J74l08J22j22mJ65o0J10m2P4j15j06J0J14j95j0L19j69m2J0
$$ 63 69 58 -54 24 65 239 -69 53 -69 -73 92 32 142 100 174 59 -47 -37 77 -118 -128 191 22 -20 -10
5670a0n8M4J1QJ46r2k08K59p8j0J4m2P9j47J60q5KJ90k79J44k9j88J58K6J01j29
$$ -10 -68 -24 -13 -5 141 49 -159 100 22 12 26 -16 63 -84 76 -9 -7 183 -96 48 19 -169 -11 15 116 -13
5696a3M4j36K62j43N8j22p7J84m3K74k14L1Rj07j17K43mq4q5Q3j19K8J06j26K80
$$ -13 31 -105 157 14 72 -50 -127 57 14 288 74 105 114 7 -110 133 129 45 -40 43 -76 -48 58 -68 212
5721B12k20J13r7j54J20J27j09q7J02j12J84k7j14ll6K00J1r4j47L7J36M9p3m1
$$ 212 -8 105 8 -146 -26 101 -8 -95 7 -105 79 52 -62 -65 -101 99 110 16 -131 -94 42 91 18 -23
5745b3P2J1j36L06l45J36j51J04R1J28j38j92J88k12K94l9m1pp2R1k09N2P5n5
$$ -23 49 60 -76 230 -115 21 -130 -26 65 193 55 -137 51 -161 133 94 53 46 -26 65 -144 -92 -17 -72
5769g2n1Q0L2P4J65k62j9L9k1P3mJ7j54J20O6p3n6J75j63%j40J98k8J45k10K98
$$ -72 -123 -43 -11 63 228 -34 -53 -14 -35 38 34 51 -103 17 83 10 -46 129 -34 -34 -174 24 -4 141 -69 229
5795B29q6j93Q7M9j08o2K20l74J34R5J11j62O2j92J96MJ11p6lk0J2Q7N0k1j50
$$ 229 143 -50 37 86 -22 -84 136 -238 -104 -9 102 -60 2 -190 6 10 121 45 42 22 34 121 171 150 0
5820@j93L25j65L6J87q0l7p2P7j26k5q2K3J13K07k32j77J46Q2P8M6l09K40l11
$$ 0 -193 132 -33 3 190 110 73 1 78 -48 -73 -155 -132 -19 188 -44 -221 -75 7 85 131 -178 62 -249
5844b49L76M7j64k4j04N7j3J58NK4j34j04Q9N6J3q5j4P1j99L25j15j02q0J56p0
$$ -249 127 174 10 -14 -118 -61 -74 84 89 113 -21 -125 -36 20 33 -52 -66 5 -194 131 16 -86 -166 -10 -80
5869h0J78R2r5k0l7JL7K2pK01l11O4q6rJ33L1p3p9M4l62L89j05J15j8j2j8K33
$$ -80 98 190 95 75 38 39 76 98 91 292 -19 45 -41 -50 83 114 41 -38 6 -356 33 -72 43 25 13 -5 228
5896B28n4j97l6J09L4j09K39j27j3J9j67j60N21j03k29M5J01k06L1J37M4l32J43
$$ 228 174 -23 -59 50 84 -25 214 87 74 93 -74 -234 287 184 -45 0 101 -105 -74 63 107 -225 -82
5919h2m2l7Q4P9J41k21L01l50K28r5j51L33k10J14k36J47j30J3J89l47M85k04
$$ -82 -124 -161 -77 2 143 -78 223 -127 101 6 -145 188 -22 92 -144 3 -127 -114 75 -272 213 9
5941Ir6m3L10j57j53R5J2j0j12J34MP0k5K0R5k38N0j30Q1O1J10J46k69o5P1j46
$$ 9 -87 -130 180 23 -130 -35 -23 -33 -145 -11 -7 63 38 58 153 -85 -35 -165 -84 -23 87 233 -36 -101 -30 -176
5967a76J87O5j06m7P1p3J03L5k47K07J89k62N4J60k98Q6P2R0j9j6j77N5J05J69
$$ -176 11 76 -30 -77 -6 -79 24 59 -188 19 208 -54 0 160 -138 -52 20 110 91 75 -102 -47 58 227
5991B27j49j90J23j8m1J88j27J32k00J5j50K03J21j13Mk38M04j07j67K72l99K40
$$ 227 78 -112 11 -7 -48 140 13 145 -55 -40 -190 13 134 21 25 -213 191 84 -83 189 -210 30
6013C0k48J32J98j31q0L3P0j53P8oP2N4n1q9M5J41l01K54K5q1p5Q6P9j53r6J10
$$ 30 -218 -86 112 -19 -99 -66 4 -149 -71 -77 -5 49 -2 -91 -46 95 -206 48 73 -8 -83 3 82 -71 -167 -57
6039e7J95n1mO1m9K4k32L62l22K69k64k7M1N0r2J8J72r2PO5j24N4q2j5j1m8K95
$$ -57 138 87 83 144 95 119 -113 249 -73 196 -68 -95 -54 -4 -96 -78 94 2 9 74 -50 4 -78 -93 -104 -152 143
6066A43k21K42k74rj11j0J65j21J35N3j77K79n4p4J74k70MK40J4Ro7j91J11M3
$$ 143 -78 164 -110 -119 -230 -240 -75 -196 -61 -8 -185 94 40 -34 140 -130 -126 114 128 137 70 -121 -10 33
6090C3k32M43k49j43K23r1j4p9K11J7k2k15L04j50M4j33PJ90k48jL5J45J34k15
$$ 33 -199 244 -5 -148 75 -16 -30 -109 102 119 97 -118 186 36 80 -53 -46 144 -104 -105 -70 75 209 -6
6114fk6K3o8r6J68j4J11n5L6n6n0J08j8j42K0N0p7K76j10m3J43k17P0j01J03n8
$$ -6 -32 -9 -77 -173 -5 -19 92 37 73 17 -33 75 57 -85 -65 -15 -92 184 74 31 174 -43 27 -74 29 -29
6140b9k0J00k3J1K2n4qr2K19p0J05o5q6j10k7R5R6j66L14k35j04K06L6l2m2r9
$$ -29 -49 51 28 39 61 7 -1 -93 126 56 161 96 10 -100 -127 -32 64 -102 212 -23 -127 79 115 83 41 -58
6166e8J62l9J7k09J1K12k71K89q0r6m2M2J59m5J03p3j22Q1j09O1J21L8k4j70P3
$$ -58 104 65 82 -127 -116 96 -175 114 34 -62 -104 -62 97 52 155 82 -40 41 -68 -7 114 152 128 -42 31
6191C1j32K07K9k42K02M2J0j66j05J81J4j69J53o6Q6R7j40K3j76J32n7q6K10P
$$ 31 -101 106 135 -107 95 137 147 -19 -124 57 71 -98 55 -11 75 172 32 55 -121 11 -46 -132 78 85
6215H5p4Q9n1r8M5r6L4m1J47N5q9m6o0mM3p5J57K9J35j09Kn1R9j19j30K03r4O6
$$ 85 11 100 49 -49 -4 -100 -66 -107 40 95 6 -40 -100 -104 -61 -136 21 50 185 76 78 27 126 7 -123 80 -14 52
6243E2r6Q5j43J93j74J95N0j6p5k61R9J3P2q7Q6Q5j01L7k30K31qM4l20L41j11
$$ 52 -44 41 -102 91 -83 112 162 146 71 -190 -91 -78 -6 -93 -7 78 -23 14 -216 15 7 51 -269 72 -39
6268c9j58L76k34K0l9J62k00Q8m3J55j7J2r5J47k24J25n2j54J23q0r6K3K67j23
$$ -39 -197 179 -55 -35 -74 88 -112 -24 -67 88 71 83 -12 135 -89 36 -16 -170 -47 -127 -223 -200 67 -56
6292e6k7J01J21k32j08J99j2J33l08K05j35K09j33j04K1K69p9k5j25J6L6L1J53
$$ -56 -83 18 139 -93 -201 -2 -14 119 -189 16 -119 90 -43 -147 -126 143 64 39 -86 -70 -34 -3 150
6315A50k48p0J08J05o2K2q4R8K7R4k85O2K8KJ07k55J47K1J61j03R5p1O7k07J81
$$ 150 -98 -168 -60 45 -17 5 -79 19 46 140 -145 -83 -55 -53 54 -201 -54 -33 128 25 120 49 116 -91 90
6340I0j60pM4mM1j67R3J8J66l6p0k18J12Q9Q7j5k12J62j14L51k51J66k59J94o
$$ 90 -70 -77 -33 -37 4 -163 -70 -52 114 78 8 -210 -98 -9 78 63 -149 13 -101 250 -1 165 -94 100 94
6365I4j88K29k31J06K07k89J25j65J27r5J16l1L8J00l66J00R2j00O3K24q6j46
$$ 94 -94 135 -96 10 217 -72 53 -112 15 -80 36 5 43 143 -223 -123 -31 -131 -68 156 70 -76
6387g6P3M0l9J94j63J08k48J02l3kJ87j16m0J03j13q1J65J87l37K06k11P6K2j7
$$ -76 -3 37 -2 192 29 137 -111 -9 -42 -44 143 27 -13 90 -23 -104 61 248 -89 117 -94 -18 4 -13
6411a3L1j48K94j48Q7j36j29K8k8J45J2J19j38n8j48K91j15J40J29o5k76M8J54
$$ -13 18 -130 164 16 103 -33 -162 -134 -162 -17 -5 114 -24 -82 -230 61 -54 86 215 150 -126 -78 76
6434G6l4j25J27m8r5J11rl8q9Q0Q5J56l35J12J29j10Ll7O4P9k26Q3J9J69j68M
$$ 76 42 -83 44 -4 -99 12 3 -35 -124 -44 41 197 -138 -26 103 -7 -4 -41 23 102 -124 -41 -22 147 -21 -17
6460a7M9j05q9J8J06r6O6j8K30j89q0J30r8m8J30J23j01oJ69K9r9r1L4M8j00P1
$$ -17 32 -73 -162 -144 -38 -134 -68 -86 144 -45 -125 5 -93 -141 -11 112 11 5 174 203 104 13 47 95 -5 66
6486F6J55j50Q7j55N9P3mm7j20M2j03N5n3K00n2Ko3k91K96j58K48q3Mj21J70l4
$$ 66 221 71 158 3 62 135 131 84 -36 6 -97 -42 -95 105 53 55 -8 -299 -3 -161 87 4 8 -113 57 23
6512B3j2rj42K60n7j32J10q7J08N7L3r7j34N5q9J90j77J85q7Q1q9J60j69l7M9
$$ 23 11 2 -140 120 63 -69 41 -46 62 119 152 55 -79 -24 -113 77 -100 85 -2 79 -10 150 -19 -56 -7
6537gJ16Ok25K06q7J69k81J49r9j6K01k75L01q2j19K0J0N1P3j1J14j32k44J99
$$ -7 109 115 -110 96 9 178 -103 46 -53 -69 132 -143 158 76 -43 -23 -13 38 111 100 214 82 -162 37
6561C7j01J11L09l79q0J10j44O2J04j29K7J30N1j03p8o4p6J89q1J11j33o4J88
$$ 37 -64 47 356 -23 -103 7 -137 -75 29 -100 -73 57 108 5 -73 -137 -213 -24 -105 6 -127 -191 -3
6584cN9j8r5J22j86J72j33O6p9K33j20q0L8M2m4j7j4P2k5J66k53RN2m7R2J66j62
$$ -3 56 38 -57 65 -121 51 -82 -16 -95 138 18 -62 -24 18 -26 -43 -57 15 -10 156 -97 -88 -36 -83 9 175 13
6611A3KJ50n3n1j49K5P3q2o9J81L4o6j75M3J27p6K80m12K93j98k5K31j87Q5r6
$$ 13 15 165 112 61 -88 -63 10 -72 -141 40 74 8 -167 -124 3 -73 207 -205 88 -110 -135 96 -91 -6 -102
6636a02J86k33j7K87j19j11J61j74J11l0o8L6J05o7J73j5k1m8j68J63K5j82N9
$$ -102 84 -149 -166 121 2 -109 52 -122 -11 -41 -109 -73 32 -35 138 123 102 54 -114 49 74 -108 -49
6659d9K21n6l8P9m5k04P2P2j74K61j29J02o7Q5j03J07k31J5R1j03R0N9Qj84J06
$$ -49 172 116 78 157 112 -92 -20 52 -122 139 10 112 45 130 27 134 -97 -82 9 -94 -4 55 63 -121 -15
6684a5j10J04J13k01J33j03K4J5r5P0j4K00l6N4p4j19M6q9n4J99j12P7m5Q6P8
$$ -15 -125 -21 92 -109 24 -79 -55 -40 -135 -65 -79 121 85 139 65 -54 -8 -97 -151 48 -64 13 -32 54 132
6709A32q9l5o4K7N0n3j3J58j7k58L11j95PN1p4j52J64L06j68j0j20P1M8m8J5j84
$$ 132 43 8 -56 -29 21 -32 -45 113 96 -162 149 -46 -39 12 -62 -214 -50 256 88 78 -42 29 77 29 44 -140
6735a40J44n1J2Q1o9J39N1r0j85K19l5j46N8J55n5k4R2j25j29j03J17K53j28j6
$$ -140 4 -47 -35 46 -23 116 167 77 -108 111 76 -70 -12 143 88 64 156 31 -98 -201 -84 169 41 25
6759B5m4P8j58P6o4L5R9j4q3J45m0j0N7k2oJ67l03Q8j25R5Q2j45L2N4o7j23L93
$$ 25 -19 59 -99 -23 -87 -52 47 33 -50 95 55 45 102 80 74 241 -62 26 -99 -4 78 -67 -35 19 -48 -171 222
6786B22k77n4J31j4j18j6l7K19K4J10j20p7L3j23l9Q2j4J37r2n4J8Q9m8J03j88
$$ 222 -55 -109 22 8 -110 -126 -163 56 80 190 70 -7 26 -97 -136 -54 -68 69 -23 -77 -59 30 -18 85 -103
6811a03q3L90j56j46k5O9q6j0L01j37j2J13l04K67J1pr9N0j14K1o6L48n3k88N5
$$ -103 -186 204 48 -98 -123 -54 -140 -150 151 14 2 115 -189 78 89 82 -17 33 -81 -60 -126 222 169 -119 -64
6836f4J42j0l0P7k58%J24NP5k0j0j05K32k21J00m2o7k7J5J72k5M2K1n0n1p1O4
$$ -64 78 68 38 115 -143 -143 -19 -14 61 41 31 -74 158 -63 37 -5 -72 -99 -84 88 63 105 126 76 25 -46 18
6863A8p1k3Jr2J93K45n06L44j23L0J07k66P1o8J57k2kK11k26j9p4J62k39O7J53
$$ 18 -53 -76 -75 -167 26 271 -235 109 -14 16 123 -143 -72 -140 17 -5 -7 204 -22 -41 -115 47 -192 -125 28
6888B8k04L08k08N2Q9l1n8k63L57j12R0p8P9j7m3l0N1J8o0J32k11N2jj8L0k8K12
$$ 28 -176 132 -76 -24 65 34 -24 -287 70 -42 48 -30 49 32 -11 -41 10 28 -32 100 -111 -59 -60 -78 -48 -76 136
6915A36J10j29n9j89R5l9J59O5l19K41j60J05M7J20l96K50l2J7k3J01j91O2j0
$$ 136 246 117 58 -131 -36 -75 84 149 -170 71 -89 16 63 183 -213 37 5 22 -1 100 -91 -29 -39
6938c9L1j6o9R9j2Qj7K6j2Q7p0n2l67J60J32J23K4J75l76m0K75KO7jk94L6K9K6
$$ -39 -8 -24 -93 6 -6 2 -15 11 -1 86 16 -36 -403 -243 -111 12 36 211 -165 -205 70 72 139 138 -156 -120 -91 -65
6966f5P2Q6Q2k37L1o6M4J97k50k9J46J74j23k48Q5O4m5K01j87R9q1k0J55Lj89
$$ -65 7 93 175 -62 -31 -97 -53 144 -106 -135 11 185 62 -186 -101 -37 -82 119 -68 31 -50 -70 85 88 -101
6991a01L9Kj0m2K58k07Q8j27q2J58J69k89J08K5j2J61p7J25q0p7j95L38j53p1
$$ -101 -62 -60 -70 -112 146 -61 27 -100 -182 -24 145 -144 -36 -11 -23 138 61 186 106 29 -166 172 19 -52
7015e2m3j93K87l4J15k86L61l6j42L7n7qj79O3K14j30o4J19p4Q2O0k06K8K4K99
$$ -52 -95 -288 -1 -35 80 -206 155 119 -23 14 -43 -51 -230 -167 47 -83 -147 -28 -102 -20 40 -166 -138 -114 185
7040A85r6n2k12K31N8m1j07R8J2Ml1J54k01J70j87P8n4J4J17j83K40k52R6j52
$$ 185 89 37 -175 56 114 73 -34 64 76 80 49 203 2 172 -15 63 9 23 140 -43 197 -55 41 -111
7064a11O6K13j44j08l1J13p0L3r4L8j4J50k01J64%j16Q9L4P0l4k1q1K9rl5q1J16
$$ -111 -45 168 24 -84 -115 -2 -72 -39 -133 -95 -109 41 -160 4 4 -112 -23 11 81 47 26 -55 -26 -35 -70 -151 -35
7091c5l9Q9j3J94k93l1K15q5o1OJ11j42k7K1O3R6K5k6j19J65j15r4L2P2J26jj51
$$ -35 -74 15 2 196 -97 -128 87 2 -59 -53 58 -84 -111 -90 -27 69 94 68 -51 114 -1 -95 -63 9 135 134 -17
7118a7j21J8n6L13q5p1J68j67L5j00J43L1j27K3qj41K33j18K6l7L9Q6J50j03j95
$$ -17 -138 -120 -176 137 52 -19 149 -18 17 -83 60 91 -36 -13 -21 -162 71 -47 -21 -58 -19 67 217 114 -81
7143h1Q9P1j21n3K03Lj09L5m8n4K74k99J78m6l3l0K2L8k54J75m2J82j82J33j15
$$ -81 8 79 -42 -95 108 111 2 37 -11 -65 209 -90 88 42 9 -21 1 39 -215 -40 -82 100 -82 51 -64
7168f4L1j63M06j10j03j20J92j12J27j15J33j79K27j47p0K2O1j3r8K11J00j91
$$ -64 -33 -196 210 100 -3 -123 69 -43 84 -31 102 -77 150 3 -67 -45 16 3 -95 116 216 25
7190B5k7L7m5J7k1J12j95M7j9J8J92l37J68N0j34K08k15J88Qk30K62k75J50j05
$$ 25 -2 35 -10 7 -14 98 -97 -50 -69 -51 141 -196 -28 22 -112 96 -119 69 77 -153 109 -166 -16 -121
7214a21J04K32j49J07k40N0Q4j04Q4k9n4J41p5l0o5Q2j19L29k47mjJ32j67J02
$$ -121 -17 215 66 173 -67 -17 67 -37 47 18 -36 105 30 0 -65 17 -102 227 -20 -24 -25 107 -60 42
7238D2r0Pj77K52J00rm8k80J72Q7N6k52N5R9p7l0J78N9l28K3J36Om3l7R4N4N9
$$ 42 -48 -41 -218 34 134 125 77 -203 -31 56 112 -140 -85 14 -63 -93 85 144 -184 -161 -25 -19 -62 -99 -5 49 108
7265A08r9L8O1k01l3P8M8p2o5O7K6K36j11j49J40m4m4j11J21lN4Jj35J56j29p6
$$ 108 9 47 108 -93 -126 -48 0 -72 -137 -70 -44 192 81 -68 72 28 -16 -127 -6 -9 45 46 -89 67 -62 -138
7291a38LN2R1KK0NJ9k21R4J36n9j00J7K07J61k55n5m7J08q9m2J33j54J63l04J85
$$ -138 -135 -83 8 10 30 35 54 -167 -73 63 4 -96 -79 128 289 34 -21 -68 40 -49 -91 42 -112 51 -253 -68
7317f8P2rK1Q4P7k21Qr0P1Q5j2JR2r2k63J97n2K03k69J43J31j15K4M8n9k1k05
$$ -68 4 -5 16 100 177 -44 -36 -126 -55 30 18 19 111 19 -244 -47 -99 104 -165 -22 109 -6 18 66 7 -14 -219
7344b19J90K1K16k67J24M4l42K27j46O0J07j21J39J69k50J25r9o6M0k7K33l9j74
$$ -219 -29 -8 208 -59 65 109 -233 -6 -152 -92 15 -106 33 202 -48 77 -22 -88 -48 -75 158 119 -55
7367e5N3P6j4j96P7j06K22p4K0N3m4q9M0J15p4k15J30J10J48j23L0K7j74oJ24
$$ -55 -2 74 60 -136 -59 -165 57 -17 3 56 12 -77 -37 78 4 -211 -81 29 177 54 84 111 -63 -69 55
7392E5K2K6j93M7N5j39Q4j27L22j62L4l6j93K35J12j57O9j76j09M9J55J2J2m4
$$ 55 77 103 -90 -43 12 -127 -43 -170 152 -10 24 -12 -205 30 142 -15 54 -122 -231 -182 -27 -15 -3 -47
7416d7J1K4r0R2J46q4%n7K32l21K67j98L5j38J02J40k62P6M4K1K38k03J28j89
$$ -47 -36 -12 -102 -10 136 52 52 -5 227 -94 173 -25 10 -128 -26 114 -148 -72 -28 -7 231 28 156 -33
7440c3M8J08j33Q6j73Q4j35K26n8q7J36k85J07R8J58k33J09o0j03N6J48R3m14
$$ -33 15 123 -10 76 -97 -13 -148 78 20 -67 69 -216 -109 -11 147 -86 23 -37 -140 -84 64 157 -257
7463b57L52k40J07j43N2K39K7j82J09j38j04M1m7M4O2l0M4j32K09J17k35qJ47
$$ -257 95 -145 -38 -181 -129 110 137 -45 64 -74 -178 -137 -184 -140 -78 -108 -64 -196 13 130 -105 -113 34
7486C4J21o5k5j34L5Pj00O2J08o2p0R6k13K1L30l71J99l8m3J21k0j21P2kP6m8
$$ 34 155 90 65 -69 -34 -27 -127 -65 43 -19 -89 7 -206 -185 145 -226 -27 -65 -108 13 -7 -128 -56 -58 18 -30
7512c0K3Q5K01k52P4P4k31O5J18j50m8R4k9J12l16J92K7j19J3m5J16R7l24J59
$$ -30 -7 78 279 27 101 175 -56 9 127 -23 -71 23 -6 106 -210 -18 9 -110 -97 -142 -26 71 -253 -94
7536i4J88j32q7J42l2J42j69K11j94J81Rj59k8M6J40r3r7J63k38P1k1J92k10K53
$$ -94 94 -38 -125 17 -15 127 -42 169 -25 156 165 6 -22 24 164 71 -26 137 -101 -30 -51 141 -69 184
7560A84l07o9J02J50k18K02m1n8K84l42J07J00k12L3R8j52L14j43L5l2j76J3J09
$$ 184 -123 -192 -90 60 -158 44 3 -55 229 -113 -6 94 -118 -85 13 -139 175 32 67 35 -141 -128 -19
7583a9n5M7j27K16o9KJ19j73J57j83j65J75J99o6J39l98R0R7q8N1L4M2M5l0j34
$$ -19 -74 -27 -154 62 -7 -5 114 -59 98 -85 -250 -75 124 58 197 -201 -111 -14 -102 -51 -17 25 70 40 -94
7608i4J38Q7L3Kq8q5q9L6O1J45j44J77j96N5k35J17J74r6N7q8j29L59k01K40k09
$$ -94 44 131 164 166 78 -7 -96 -60 1 146 2 179 -17 38 -197 -80 94 -2 55 -33 -162 197 -4 236 27
7633B7j09J54J0j00r1j09K16OJ47j10o0j80Q4R4Q1j89K09n4O0p3j12R0J2k6j29
$$ 27 -82 72 82 -18 -109 -218 -2 4 151 41 -19 -199 -115 -21 60 -129 80 26 86 13 -99 -9 3 -23 -152
7658a52J2O5J05l9J51l08L17o8j2p1P8kn5Q9j47J88k50K9J89k64J09j20K36N6
$$ -152 -140 -75 30 -9 142 -166 151 83 71 0 78 76 21 110 -37 151 -99 -70 119 -145 -36 -156 80 136
7682A36kj43j14Q6j71Q2K59lj78kk8Q4j14K07q4k2k0n7J73j00Q4k24J07o0K18
$$ 136 134 -9 -123 -37 -208 -126 133 130 -48 -50 -78 6 -108 99 15 -7 -27 -84 89 -11 73 -151 -44 -104 114
7707A14q0M5J00j70j3J6q9P2o7J06m4p4M3k9K24j81o6j5L14j19n9j51K50j33K4
$$ 114 34 79 179 9 -4 12 -77 -5 -72 34 -10 -84 -41 -70 154 -27 -93 -108 206 87 28 -123 127 -6 18
7732A8J77l48J58P3k60J32p5L6Q1J56p6j72K68j74j6j26N1N0n2L1K2R4M7Oq3J7
$$ 18 195 -153 5 78 -182 -50 -125 -89 -8 148 72 -100 168 -6 -22 -148 -97 -47 -99 -68 -46 48 95 101 18 35
7758C5p0K6P2KMq8jn4Q6J42n5j89J50k82O3M4k0m9J2J74qk2NL0j8mJ62r1K2j0
$$ 35 -35 -9 63 65 69 -19 -20 -74 12 154 99 -90 60 -222 -159 -115 -135 -184 -172 2 -6 -28 -23 7 -11 -15 147 56 78 68
7788F8k42K71j30L46k59o4M5j16KJ65j38J89j93PJ15L7k31J83o9M2nm8K7Q1j48
$$ 68 -174 97 -33 313 54 -10 35 -81 -79 86 -52 137 -56 -49 66 103 -128 55 -14 28 23 -25 2 83 -65
7813f5Q2Q4p3%J70j51M1Q4j67j06J92j27l9K18j69N1P1j01j9qk03R9J37j56J66
$$ -65 17 101 28 28 198 47 88 172 5 -101 91 -36 -75 143 -26 25 96 -5 -24 -32 -235 -136 1 -155 11
7838A1o9K8K97l66Jl1M0J41M1j41J56p9M1j32J39M0J5n5K5j55J99j74j09J43N6
$$ 11 -58 -30 267 -99 -98 -129 -89 52 93 -48 108 29 70 -62 77 117 132 77 102 -53 146 -28 -137 6 62
7863F2o0j01J45K6j33o6K0oJ44q6L38l03K3j40K51k8n6J86l33O4M2J6k2K2q6J56
$$ 62 2 -99 46 72 -61 -127 -107 -113 31 -55 283 -20 3 -137 114 86 30 216 -117 -53 -11 5 -17 5 -81 75
7889G5p8j85J20o8J14O1j4o9j35K49J14j40m3OK19j54J42j28k6r8K01r3O3K1k64
$$ 75 -3 -188 -68 -136 -22 39 25 -44 -179 70 184 44 1 7 226 72 214 86 60 -38 163 70 133 154 -110
7914a10j79K84j37L25k52QQ4j09j12K78J27k39L0j34kP3N6N1m2m2j4O3q3O8Q5
$$ -110 -289 -5 -142 183 -69 -61 23 -86 -198 80 207 -32 -2 -136 -138 -65 -9 42 0 -42 -56 7 -76 -8 77
7939G7l62J65O9J81k48K15j36K08k36j39N4O0L20l36J43q0L0J13j84L1q7M0oj0
$$ 77 -285 -120 -51 130 -118 97 -39 169 -67 -206 -152 -92 228 -108 35 -45 -15 98 -86 -55 -142 -102 -108 -118
7963a18J20J9r5J21R8j55j41NP5J18M5J24j65j5J12k49R7J43p9k9J29K67m85J42
$$ -118 2 21 -74 47 145 -10 -151 -146 -71 47 92 216 51 36 148 -101 -4 139 60 31 160 427 -58 84
7987H4m8j35L8Q3O0j05l3M1j7o0k2Q8PP5r6LK04o1m3j65R9j2J70j46QK4N2k46
$$ 84 36 -99 -61 22 82 -23 -56 -15 -32 -92 -114 -26 -19 56 -40 -37 167 106 63 -102 -3 -15 155 9 17 41 93 -153
8015a53l8K34Rj20N2J38K2p2Qq3L7p5J59j8O5k51K67m09K66j46Q5m8J9P9k2K0
$$ -153 -191 43 52 -68 -16 122 144 72 80 -3 34 -41 118 100 165 -86 181 -228 38 -108 -23 -71 -52 27 5 25
8041B5Q5o9r4j24J06J03l3M1O1j57J53q1kn6Q1k7j30R8n1m5P8q8KK24j78J14N2
$$ 25 110 41 -53 -177 -71 32 -1 40 101 -56 97 16 14 -42 39 12 -118 -20 -71 -116 -38 -126 -124 100 -78 36 88
8068H8p0j95J82J56j98R4o2mm9J20l7m7p1J23kJ06j68R9j02RP8K8n2q1k7P6l2
$$ 88 18 -177 5 161 -37 57 -5 -9 -58 62 25 -22 -93 30 28 134 -34 65 -37 -28 50 78 26 -55 -82 -6 -38
8095c8O2J99l14L1J10m2O6MJ4k79K34R8k21R5K3o6J7o2J74j16k2J15j38q6J12
$$ -38 24 223 -91 -60 50 8 74 78 92 -187 47 145 -76 19 42 -24 -7 -69 105 -11 -33 82 -56 -142 -30
8120c0r1O5R3j06J85l5o7q2J15L0l4o5j32J28r8J70n6Op2M6n1N7M8l6J61j50l27
$$ -30 -121 -56 37 -69 116 81 14 -68 47 77 43 -22 -154 -26 -124 46 -10 -4 -76 -30 -81 -24 24 -12 149 -1 -328
8147c28N16O4j56k0k6k40rL34mj19j71J56J3p1L3q4J29n5J8O1k7q2K65r7o2j8
$$ -328 188 252 96 76 50 -190 -199 135 131 12 -159 -3 10 -61 -28 -112 17 -38 -20 41 14 -68 197 100 38 20
8173B0n7J47Ljj61k2K07j02j09Q0m8K8j17J82j77J08Q8k11
$$ 20 -37 110 113 112 -49 -71 136 34 -75 5 -43 -15 -132 50 -127 -19 69 -142
8191a42
$$ Imaginary data points
##PAGE= N=2
##DATA TABLE= (X++(I..I)), XYDATA
0@%%%%%%%%%%%%%%%%%%Pj5J6j6J6j6K1k9L2l6M4m8N6o6P4q4R4j07J22j38J55j73
$$ 0 0 0 0 0 0 0 0 0 0 0 0 0 0 0 0 0 0 0 7 -8 8 -8 8 -8 13 -16 16 -20 24 -24 32 -34 40 -44 50 -57 65 -73 82 -91
40i1J91k11K35k61K89l20L53l90M30m73N22n75O34p00P72q52R42j046J163j297
$$ -91 100 -111 124 -137 152 -168 185 -205 225 -248 274 -301 333 -367 405 -447 495 -551 612 -685
60f85J458j650J883k177K554l064L800m967P232k0820L6424o9312m8982Q0611
$$ -685 773 -877 1006 -1171 1383 -1681 2119 -2848 4384 -16436 19988 -49324 -98306 -17695
74a7695n0313m8162L7685l1462j7194Q5025L080j1923P3710K3011k0058J7099
$$ -17695 -68008 -116170 -78485 -109947 -127141 -42116 -39036 -50959 22751 45762 25704 42803
86D2803k5950m299M0761m4044k2560Q7610j0460o0504M9006p357p4002K4949j3183
$$ 42803 16853 12554 53315 9271 -13289 74321 63861 3357 52363 45006 -28996 -4047 -17230
99a7230p3277N1517L9694p0188K6284O6452m5831j8954K8078k5210N835K6806
$$ -17230 -90507 -38990 704 -69484 -43200 23252 -22579 -41533 -13455 -38665 -32830 -6024
111f024k4522K8123N7843k2339j147L3783k5616n295J5214m5536Q041N5532m5286
$$ -6024 -30546 -2423 55420 33081 31934 65717 40101 34806 50020 4484 12525 68057 22771
124B2771k6659N9867k5015n6488K1564k0416l8776L2728j0182l4076N3132J9430
$$ 22771 -3888 55979 30964 -25524 -3960 -24376 -63152 -30424 -40606 -74682 -21550 -2120
136b120m4073J9947K4708k4101J0741R946q679M1327J8926k8163K7488K4853l8587
$$ -2120 -46193 -26246 -1538 -25639 -14898 -4952 -13631 27696 46622 18459 45947 70800 32213
149C2213n010N728l2174R675J1047m1403J3342L5759m5385k2348K9112k4278k1829
$$ 32213 27203 32931 757 10432 21479 -19924 -6582 29177 -16208 -38556 -9444 -33722 -55551
162e5551K1623j0803L491M2766r656j3030M0533R5k7670J4251M190m489K1770
$$ -55551 -33928 -44731 -41240 1526 -8130 -21160 19373 19468 -8202 6049 10239 5750 27520
175B7520m327p061L4753n130l5861J1729j255l0885N198j396j8662K5926O872
$$ 27520 23193 16132 50885 45755 9894 21623 20368 -10517 -5319 -6715 -25377 549 7421
188G421l5345J3379J9180l5993r154J9031j0369O595K1107q267J4375K7696j8376
$$ 7421 -27924 -14545 4635 -31358 -40512 -21481 -31850 -25255 -4148 -12415 1960 29656 11280
201A1280r431K0173p894q577J1903m127P760J9318j8901j1848J9020j8380k9247
$$ 11280 1849 22022 14128 5551 17454 13327 21087 40405 21504 9656 28676 10296 -18951
214a8951P851m390j1744J4518l524r745K3023r70k7212J0538J1806j4525O643
$$ -18951 -11100 -15490 -27234 -12716 -16240 -25985 -2962 -3932 -31144 -20606 -8800 -23325 -16682
227a6682J4165K332J8147Q203j3703J0464R157k1944m691R965p200L131N610j2420
$$ -16682 -2517 -185 17962 26165 12462 22926 32083 10139 5448 15413 8213 11344 16954 4534
241D534N252Q018k6111j1841J2166j1921j0993J2073J111L145J4052p903n226
$$ 4534 9786 17804 -8307 -20148 -7982 -19903 -30896 -18823 -17712 -14567 -515 -8418 -13644
254a3644J5456m406j3658J1907R046K52J0482K859m20J1587o914j8250N302K030
$$ -13644 1812 -2594 -16252 -4345 4701 4953 15435 18294 17874 29461 22547 4297 9599 11629
268A1629j3825J365N182l538M936k604j5333K340K412j7192k848J2417K04K973
$$ 11629 -2196 -831 4351 813 5749 3145 -12188 -9848 -7436 -24628 -27476 -15059 -14855 -11882
282a1882Q364R2O288N742j0628k116J1745j806k639R705M553K012L237q838o391
$$ -11882 -3518 -3426 2862 8604 -2024 -4140 7605 5799 3160 12865 17418 19430 22667 13829 7438
297G438M241r756j2755N324L429m625K100J33k988K006n781j0272M766N870l779
$$ 7438 11679 1923 -10832 -5508 -2079 -6704 -4604 -4471 -7459 -5453 -11234 -21506 -16740 -10870 -14649
312a4649M619J0521M523L818J23m035L559J539p592P97R120Q60j028J591k034
$$ -14649 -10030 491 5014 8832 8955 4920 8479 10018 2426 3223 12343 13203 12175 13766 11732
327A1732k342m258j0958m807L845k789m251M992M162k50j682l486l56K572k500
$$ 11732 9390 5132 -5826 -10633 -6788 -9577 -13828 -8836 -4674 -4924 -6606 -10092 -10448 -7876 -10376
342a0376j040Q178Q015J809K453L205R70p05m876m574K681J783k895N1M270o49
$$ -10376 -11416 -3238 4777 6586 9039 12244 13214 12509 7633 3059 5740 7523 4628 4679 8949 8300
358H300m906n339m208k002l057l825R25O310L348j037J194K779j6l160j796K877
$$ 8300 3394 -1945 -6153 -8155 -11212 -15037 -14112 -7802 -4454 -5491 -4297 -1518 -1534 -4694 -6490 -3613
374c613M920K517J208M638N062j227m416k261j006k567l105j118K113L109j534
$$ -3613 1307 3824 5032 9670 14732 13505 9089 6828 5822 3255 150 -968 1145 4254 2720
389B720m178m26o84n891m838Q14J640J902K316K126M552L223k763k075K340N03
$$ 2720 -1458 -1884 -2568 -8459 -13297 -12483 -10843 -8941 -6625 -4499 53 3276 513 -1562 778 1281
405A281o11K103L295M283K994k682k466J743m442p367q05L88j107J086j53j238
$$ 1281 670 2773 6068 10351 13345 10663 8197 9940 5498 -1869 -2674 -2286 -3393 -2307 -2460 -3698
421c698K541j959o779n05K663k441R20M831L677M187J818k013J690J898m574j291
$$ -3698 -1157 -3116 -9895 -10400 -7737 -10178 -9258 -4427 -750 3437 5255 3242 4932 6830 2256 965
437I65L329P38J387K002j940P25J087p892m917K801k790m176L412J701n40L014
$$ 965 4294 5032 6419 8421 6481 7206 8293 401 -4516 -1715 -4505 -8681 -5269 -3568 -4108 -1094
453a094k231l580L056q96m661L773M657P94L383K262j22K828j485n690K263K069
$$ -1094 -3325 -6905 -3849 -4745 -9406 -5633 -976 -182 3201 5463 5341 8169 6684 994 3257 5326
469E326l650J151L754j933Q02l24o929r87J731p300k107O056p60p03M190q03j212
$$ 5326 1676 2827 6581 4648 5450 5126 -1803 -2790 -1059 -8359 -10466 -4410 -5170 -5873 -1683 -2486 -3698
486c698K833l481k139N345J231o79N473K378j47K411l276l430K974k983n026M149
$$ -3698 -865 -4346 -6485 -1140 91 -588 4885 7263 7116 9527 6251 2821 5795 2812 -2214 1935
502A935J925l882K216M5n435Q00r85p155J825M864l426J679O335j043K13K067
$$ 1935 3860 -22 2194 2239 -3196 -2396 -3381 -10536 -8711 -3847 -7273 -5594 741 -302 -89 1978
518A978l460j4L645k865N57O151k32M8K939l316j910J479n978k937N273k130l511
$$ 1978 -1482 -1496 2149 -716 -159 5992 5760 5808 8747 5431 3521 5000 -978 -3915 1358 -772 -4283
535d283N633k77m491K388k172n307L192R06l977M882N090k220K248K374k694J109
$$ -4283 1350 1073 -3418 -1030 -3202 -8509 -5317 -4411 -8388 -3506 1584 -636 1612 3986 1292 2401
551B401M04l710L044L132k596K332L015m008J25k8o647p04L108n419j98O115k433
$$ 2401 2805 -905 2139 5271 2675 5007 8022 4014 4139 4111 -2536 -3240 -132 -5551 -5749 366 -2067
568b067k439M026k270l268K938j259j798N600J480j060M374R06j632J616k026
$$ -2067 -4506 -480 -2750 -6018 -3080 -4339 -6137 -537 943 -117 4257 5163 3531 5147 3121
583C121k862L608r73l084M495J022m523K014o83o098R91P28n410K390M530l381
$$ 3121 259 3867 2894 -190 4305 5327 804 2818 2135 -3963 -2972 -2244 -7654 -5264 -734 -4115
599d115O96M315l048q26K385k677K86M295j075O03N080j274j120K317l192j797
$$ -4115 -3419 896 -2152 -2978 -593 -3270 -2984 1311 236 839 5919 4645 3525 5842 2650 853
615H53K571l245j882M948j332l073L365j794m649J912j326l851L706J403k590
$$ 853 3424 179 -1703 3245 1913 -1160 2205 411 -4238 -2326 -3652 -7503 -3797 -2394 -4984
630d984L588K856l014J523J175l323K242K157k571K782L615k812J246J819m389
$$ -4984 -1396 1460 -1554 -31 1144 -2179 63 2220 -351 2431 6046 3234 4480 6299 1910
645A910q38J297m212l40L428k760o93L639l014k319K543l189j604L531o14r48
$$ 1910 1072 2369 -1843 -2183 1245 -1515 -2208 1431 -1583 -3902 -1359 -4548 -6152 -2621 -3235 -4183
661d183N093M99j875L487k75k954K401p5k469L474J447k492K246M95l822K80m86
$$ -4183 910 1409 -466 3021 2746 -208 2193 2118 -351 3123 4570 2078 4324 4819 997 1277 791
678G91m139J145J133l111J945K344k885K61J923l321j80K811k056N96M526o03
$$ 791 -3348 -2203 -1070 -4181 -2236 108 -2777 -2516 -593 -3914 -4094 -1283 -3339 -2743 1783 1180
694A180j73L394j143j875K114j730j607K968r12j275K366o44k689J073j678l071
$$ 1180 1007 4401 3258 1383 3497 1767 160 3128 2216 941 3307 2663 -26 1047 -631 -3702
710c702J548o13k405L132J222k194J922J172k834J101J270k092K142K588j432
$$ -3702 -2154 -2767 -5172 -2040 -818 -3012 -1090 82 -2752 -1651 -381 -2473 -331 2257 825
725H25J607K608j975m52J017k399o22J527k154j40K167j339j499J434k507j298
$$ 825 2432 5040 3065 2613 3630 1231 609 2136 -18 -158 2009 670 -829 605 -1902 -3200
741c200J237j658j113K786K60r07K916J49j482J283K08j686K281Q42j118K167
$$ -3200 -1963 -3621 -4734 -1948 -1688 -2595 321 470 -1012 271 479 -1207 1074 1916 798 2965
757B965J499j953N47o9k482O5q9k116J058R40j909M86Q02k028l65P94j973M68
$$ 2965 4464 2511 3058 2989 507 572 483 -1633 -575 365 -1544 -1058 -256 -2284 -2649 -1855 -3828 -3360
775c360K036o85O86K396k47l50J563o74o56J189m53l00J861r7j075Q60n61k038
$$ -3360 -1324 -2009 -1323 1073 826 476 2039 1365 709 1898 1445 1145 3006 2909 1834 2694 2133 95
793I5N9r87j425R97R6j133J079N62j423K66M71j496Q14R31m46J437J900p69P05
$$ 95 154 -833 -2258 -1261 -1165 -2298 -1219 -657 -2080 -1814 -1343 -2839 -2025 -1094 -1540 -103 1797 1028 1733
812A733J147j074o30O78r30k05J590q58k88R47j122j166j32j288q15N17n31k78
$$ 1733 2880 1806 1176 1854 924 719 2309 1451 1163 2110 988 -178 -310 -1598 -2413 -1896 -2427 -2705
830b705J769R0p07P39P8p88P64P9m9J467R73k06J027K11o13k68l96r39K03K02
$$ -2705 -936 -846 -1553 -814 -736 -1524 -760 -681 -730 737 1710 1504 2531 2742 2129 1861 1465 526 729 931
850I31r18L96P01j274o62m5j059o18M32n70M71J168r1L52R68pl89M35l87L52J060
$$ 931 13 409 1110 -164 -826 -871 -1930 -2548 -2116 -2686 -2215 -1047 -1138 -786 182 175 -214 221 -166 186 1246
871A246J45J2J112N7p77o4m97r68k41l12p26O76J82o81k47L9n10l51j40k47O86
$$ 1246 1391 1403 2515 2572 1795 1731 1234 266 25 -287 -1013 -337 -155 -836 -1083 -1044 -1554 -1905 -2045 -2292 -1606
892a606Q24J42N84R53j43r3J78R9o4K94j0K61P30l07m20j61o06p82o51n91p2M44
$$ -1606 -782 -640 -56 897 754 661 839 938 874 1168 1158 1419 2149 1842 1422 1261 655 -127 -778 -1369 -1441 -997
914i97k49k6L98m0m18p9Q5Q9L00L39N60Q37N00q4K64J12k64k71m00J17M47Q7l25
$$ -997 -1246 -1272 -874 -914 -1332 -1411 -1326 -1237 -937 -598 -38 799 1299 1215 1479 1591 1327 1056 656 773 1220 1307 982
937I82l10l4o20q13n72p8k89L2J74K81N87J97l85M0J19K92JJ96O83N06O99p4L42
$$ 982 672 638 18 -795 -1367 -1445 -1734 -1702 -1528 -1247 -660 -463 -848 -808 -689 -397 -396 -200 483 989 1688 1614 1956
960A956k09l89n08l32J34j65l86R0K9j7o62n46m12j60k85k64P81N36M25L4L18
$$ 1956 1747 1358 850 518 652 487 101 191 220 203 -459 -1005 -1417 -1577 -1862 -2126 -1345 -809 -384 -350 -32
981c2j9L19m6k96M24O14n6N58M02j48O0o83n80j54m12m49j48K31n6J9N7o00j45
$$ -32 -51 268 222 -74 350 964 908 1466 1868 1720 1780 1097 517 363 -49 -498 -646 -415 -471 -452 -395 -995 -1140
1004a140P4q76L07P56J21K88Q07M50j07J31k51k8L22j23K83J38K66m9q7o92k52
$$ -1140 -1066 -1942 -1635 -879 -758 -470 337 787 680 811 560 532 854 731 1014 1152 1418 1369 1282 590 338
1025C38l21n13o12J48K83j16Rj57l4L07k39o71R20K63k31N77Q78q6M84M6k76K68
$$ 338 17 -496 -1108 -960 -677 -793 -784 -941 -975 -668 -907 -1578 -658 -395 -626 -49 829 743 1227 1273 997 1265
1047A265k59n37J41K10n2m7M2o51j18j73p89k92J68m02n3P73J17k36N12k29j86
$$ 1265 1006 469 610 820 768 721 763 112 -6 -179 -968 -1260 -1092 -1494 -1547 -774 -657 -893 -381 -610 -796
1068g96P82j43k53Q42M50Q7K77R5k9n1m01m04m1N8m97J38J36m60j84j66p06Q7
$$ -796 -14 -157 -410 432 882 969 1246 1341 1312 1261 860 456 415 473 -24 114 250 -210 -394 -560 -1266 -1179
1090a179L25q06M83O64k2J45M72k27K21K61k47j01R16J15j85L89K58o29J21j79
$$ -1179 -854 -1660 -1177 -513 -535 -390 82 -145 76 337 90 -11 905 1020 835 1224 1482 853 974 795
1110G95r22L54l68m49M15L8m74J34j66m38J09L3m57N92N39l34P37K12J30Q9N0
$$ 795 -127 227 -141 -590 -175 -137 -611 -477 -643 -1081 -972 -939 -1396 -804 -265 -599 138 350 480 569 619
1131F19j94p4O85o23K84M97j07n46J86l56n42Qn92j98M43j87k42M71n8k56Q6K1
$$ 619 425 351 1036 413 697 1194 1087 541 727 371 -171 -163 -755 -953 -510 -697 -939 -468 -526 -782 -696 -675
1153f75m31O31L35l48R09J22q7K84P8l30K25J17m36K07R8l04KJ46q28l3j2o51
$$ -675 -1106 -475 -140 -488 421 543 456 740 818 488 713 830 394 601 699 395 397 543 -285 -318 -330 -981
1175i81R2L46m48K11J83K07jJ60k41n6N48jJ41N71J82l37M35k27l53K01k91k98
$$ -981 -889 -543 -991 -780 -597 -390 -391 -231 -472 -528 20 19 160 731 913 576 1011 784 431 632 341 43
1197D3L90j19n28L39q3m26kl28m09L47k8l45N72J47o4M00K90k29o8M11k71K25
$$ 43 433 314 -214 125 42 -384 -386 -714 -1123 -776 -804 -1149 -577 -430 -494 -94 196 -33 -101 310 39 264
1219B64N34p0J45J84l51r6j2m22j06O3m49j58J66M0q0p8j85m18L59j06j03P06
$$ 264 798 728 873 1057 706 610 598 176 70 133 -316 -474 -308 -268 -348 -426 -611 -1029 -670 -776 -879 -173
1241a73J27k52O13J01j22O7J24j6q1M50l34K11J84j37k65l40l44R8K2m70J05N6
$$ -173 -46 -298 315 416 294 361 485 469 388 838 504 715 899 762 497 157 -187 -89 -67 -537 -432 -376
1263c76j56k24K43k70K45O2k5j05O70K05j51L64Q7MR7j0j83K40j37m30M29k75
$$ -376 -532 -756 -513 -783 -538 -476 -501 -606 64 269 118 482 569 573 670 660 477 717 580 150 579 304
1285C04j44J28l76k13J6r7n91M87J47l52L21J10j38J74J49k94K29L01j6J54M14
$$ 304 160 288 -88 -301 -285 -382 -973 -486 -339 -691 -370 -260 -398 -224 -75 -369 -140 161 145 299 713
1306G13o5k8J29k50j39J38j67j43J34k02l34L0j91k8k3j05r2K98k25j84M33L26
$$ 713 648 620 749 499 360 498 331 188 322 120 -214 -184 -375 -403 -426 -531 -623 -325 -550 -734 -301 25
1328B5j56R1J37m8J55J43j28J66L45k90J94J93l96j18j00j98k10J69l87M0M20
$$ 25 -131 -40 97 49 204 347 219 385 730 440 634 827 431 313 213 15 -195 -26 -413 -373 47
1349D7m11J7o0k97m2M22k75p6O33J31k49L59J72o0j7J35k79K65J17k85L81k20
$$ 47 -364 -347 -407 -704 -746 -324 -599 -675 -42 89 -160 199 371 311 294 429 150 415 532 247 628 408
1371D08k70Q7k13l91N2j16Nl5J93m7j09K81l20K42oj1q9N33j80K98K04j02l4O1
$$ 408 138 225 12 -379 -327 -443 -438 -473 -280 -327 -436 -155 -475 -233 -239 -250 -339 194 14 312 516 414 380 441
1395D41o4J17l8k23N5J50q3l79P0n5k03k09J56j21j84OJ40K40j15m4J85m6J84
$$ 441 377 494 456 233 288 438 355 -24 46 -9 -212 -421 -265 -386 -570 -564 -424 -184 -299 -343 -158 -204 -20
1418b0o6K02q6L22L16j20j42j10L5m2j13k47K71m9j08k10Q2j16k48l8o9qL33j02
$$ -20 -86 116 30 352 668 548 406 296 331 289 176 -71 200 151 43 -167 -85 -201 -449 -487 -556 -564 -231 -333
1442c33k18M21j21mK12J3J28M2J19J4K42l6k08P9l6j56j34oj48J32j68L9j83J96
$$ -333 -551 -130 -251 -255 -43 -30 98 140 259 273 515 479 271 350 314 158 24 18 -130 2 -166 -127 -310 -114
1466a14o7j41m1j27J75n5J10J14L92j09O4j15J29k77J18J63J06P6l5k52J72p5
$$ -114 -181 -322 -363 -490 -315 -370 -260 -146 246 137 201 86 215 -62 56 219 325 401 366 114 286 211
1488B11j51j60L4o5j92O1n7J0J30k4k8J24r4K7j13J79L88j06J31p5Q5R2r1j49
$$ 211 60 -100 -66 -131 -323 -262 -319 -309 -179 -203 -231 -107 -201 -174 -287 -108 280 174 305 230 315 407 316 167
1512A67J8J97j71J09j37K26m21n8N3k16o1l5j43J06K48j70j88K72P8j00J45r6
$$ 167 185 382 211 320 183 409 -12 -70 -17 -233 -294 -329 -472 -366 -118 -288 -476 -204 -126 -226 -81 -177
1534a77J99mJ06J99J61j35J40l26K77k23p7o1P5L9j32j19Q5k12M1j84oO3J86k18
$$ -177 22 18 124 323 484 349 489 163 440 217 140 79 154 193 61 -58 27 -185 -144 -328 -334 -271 -85 -303
1558c03J32K11j9j91J44J12Q2j07J83J7k11K52k27L5o3J77j72j75k0J56j06j3
$$ -303 -171 40 21 -170 -26 86 168 61 244 261 50 302 75 110 47 224 52 -123 -143 13 -93 -106
1580a06j03O9p1j06r8Q0J32MQ4o5K74KR8k7n7J21j39j26L95lk82J52j17K9Q7l80
$$ -106 -209 -140 -211 -317 -415 -335 -203 -199 -115 -180 94 96 194 167 110 231 92 -34 361 358 76 228 111 140 227 -153
1606a53o1K70j70j52j2J20J52k30O9J15P2k05j8L9K14J16j15K87l4q7NP9m31K75
$$ -153 -214 56 -114 -266 -278 -158 -6 -236 -167 -52 20 -185 -203 -164 50 166 51 338 304 217 222 301 -130 145
1630A45L1j8J59j71j96n2Jr1L9n1l04K21K08l39K97O2P3l1j39K03L5J64k74J20
$$ 145 176 158 317 146 -50 -102 -101 -192 -153 -204 -508 -287 -79 -418 -121 -59 14 -17 -156 47 82 246 -28 92
1654I2O8P8j18j62J33j6p0k02J84K51l99K26j54p8R2l05K17l8Q2k45M20j24m3
$$ 92 160 238 120 -42 91 75 5 -197 -13 238 -161 65 -89 -167 -75 -380 -163 -201 -119 -364 56 -68 -111
1677a11m1L7J78l2j48J48P6J77j56nK00p8q7k02jn1Q1o2J6Kj43Q6O8j69P5j98
$$ -111 -152 -115 63 31 -117 31 107 284 128 123 323 245 158 -44 -45 -96 -15 -77 -61 -59 -202 -116 -48 -217 -142 -340
1703c40K50N3O4r0l1M85j31k75l1J59J14j23J18o7j6J0M0j72J57j38m0k21M0p2
$$ -340 -90 -37 27 -63 -94 391 260 -15 -46 113 227 104 222 155 139 149 189 17 174 36 -4 -225 -185 -257
1727b57K60k24lN5M5n2m1K12m3r9J68R4L0P7l4O8P1j69j33K10J1k4j74k4O8O3
$$ -257 3 -221 -224 -169 -124 -176 -217 -5 -48 -147 21 115 145 222 188 256 327 158 25 235 246 222 48 24 92 155
1753A55k09k40J96q3Nj9p0J95K12k36j15K96j29p0R9K83j2j44R5l8P3N0j94j65
$$ 155 -54 -294 -98 -181 -176 -195 -265 -70 142 -94 -209 87 -42 -112 -13 270 258 114 209 171 244 294 100 -65
1777f5K67K1j51j99J70j87L3J15j33N8j87P7R6P1np9j4J55k0K43l00K74kj0j64
$$ -65 202 223 72 -127 43 -144 -111 4 -129 -71 -258 -181 -85 -14 -19 -98 -112 43 23 266 -34 240 238 228 64
1802F4J54j41K04j49k9j20J51k76j4J10R7k16L7p2K38k08N0j6K07j50j16J47J08
$$ 64 218 77 281 132 103 -17 134 -142 -156 -46 51 -165 -128 -200 38 -170 -120 -136 71 -79 -195 -48 60
1825F0J66k15j38L51Nj27m7K27J64k23q6k61J80J92k48q7J19k22KR5l8O6Rk08
$$ 60 226 11 -127 224 229 102 55 282 446 223 137 -124 56 248 0 -87 32 -190 -188 -93 -131 -65 -56 -264
1849b64K93K3J97j86K4M3J26k09qJ53l2J21j80k4L2K01k67k9N4o5k71K5J42J32
$$ -264 29 52 249 63 87 130 256 47 39 192 160 281 101 77 109 310 43 14 68 3 -268 -243 -101 31
1873C1j58l7l3%K12k49K19O3o9j70K00L1J46m2k74K19J95j44j48P5J70j88j35
$$ 31 -127 -164 -197 -197 15 -234 -15 48 -21 -191 9 40 186 144 -130 89 284 140 -8 67 237 49 -86
1896h6N4K7n7O9m5k08L56l14PK84j23J18j97L4J45J5j13p3N29k90j72l0K60j2
$$ -86 -32 -5 -62 7 -38 -246 110 -204 -197 87 -36 82 -115 -81 64 79 -34 -107 422 132 -40 -70 190 178
1920A78j02j43J05O6Jk88l0L73q0k02J49j8L3j03j21m7J30Q2j48J41nJ67p6p2
$$ 178 76 -67 38 104 105 -183 -213 160 80 -122 27 9 42 -61 -182 -229 -99 -17 -165 -24 -29 138 62 -10
1944a0J40Q2k01J04K3j6J9n1mK4k16J3J35N0j88K08j88j03M15m08K7J66r1jj97
$$ -10 130 212 11 115 138 122 141 90 86 110 -106 -93 42 92 -96 112 -76 -179 236 -172 -145 21 -70 -71 -268
1969b68L02n1J18k2j74J09L1n4RJ0K5J36k13r2J77j65J32p8J32j04N3j51J82l5
$$ -268 34 -17 101 79 -95 14 45 -9 0 10 35 171 -42 -134 43 -122 10 -68 64 -40 13 -138 44 9
1993Ij67p0N9K22o6n5K2J8M01m06J22J19j33J74m36J84J6j8J01j69J76o9p2j09
$$ 9 -158 -228 -169 53 -13 -68 -46 -28 373 -33 89 208 75 249 -187 -3 13 -5 96 -73 103 34 -38 -147
2017a47R7J7r3K7J20p4r8J90J3l3R8k25K5J58J17k46l5J80R9q1j53K73m7k24K38
$$ -147 -50 -33 -126 -99 21 -53 -151 39 52 19 117 -108 -83 75 192 -54 -89 91 190 109 -44 229 182 -42 196
2042A96k50O5k16Q7j0J26N1k22K01j48L66k37o1k1J10r3Q8j45J87nk8M5k19J54
$$ 196 -54 11 -205 -118 -128 -2 49 -173 28 -120 246 9 -52 -73 37 -56 32 -113 74 69 41 86 -133 21
2066B1N8q7oQ7j69J24j9J67j74O6o5k18K84j26n1J18j06J25q1Qj77J61N0Q7Q1
$$ 21 79 -8 -14 73 -96 28 9 176 2 68 3 -215 69 -57 -108 10 -96 29 -52 -44 -221 -60 -10 77 158
2091A58j42j22M3J76k13J28j08Q4N6o7k71K32K1J52k69P1l0O9r4M2k8J85j35J54
$$ 158 16 -106 -63 113 -100 28 -80 4 60 -7 -278 -46 -25 127 -142 -71 -101 -32 -126 -84 -112 73 -62 92
2115I2rk03J1J3J75k3N9k68oN0M17k96j41K22N4p5o9J03p5j31J95k37J54M3j5
$$ 92 83 -120 -109 -96 79 56 115 -153 -159 -109 308 12 -129 93 147 72 3 106 31 -100 95 -142 12 55 40
2140D0q4j24m6J75L6R0j95J13J3R2J2N5l14K65J6j37M4J61l2j70m8p3L42k49K6
$$ 40 -44 -168 -214 -39 -3 87 -108 5 18 110 122 177 -137 128 144 7 51 212 180 10 -38 -111 231 -18 8
2165Hk29J59j17K8J10Q5J47k28K63j86ol1n6J72j03M2k22J57%J18j7j99k8J23
$$ 8 -221 -62 -179 -151 -41 44 191 -37 226 40 34 3 -53 119 16 58 -164 -7 -7 111 94 -105 -133 -10
2189a0n4N1J17j30J34k40P0p3K47k49J39Oj67K81J37k95J86j60l41K48J56J76
$$ -10 -64 -13 104 -26 108 -132 -62 -135 112 -137 2 8 -159 122 259 -36 150 -10 -351 -103 53 229
2211B29J98m18j00N0Q9Q2q0o2PJ03q4L1k27J54q8J5J76l6j36J06mQ1k92K36L8
$$ 229 427 9 -91 -41 48 130 50 -12 -5 98 14 45 -182 -28 -116 -101 75 39 -97 9 5 86 -206 30 68
2236F8KQ7j45O4J8j55J14j2j01J8k66K86r3J86j76N9j17K25P5k59J99j71J00o0
$$ 68 70 157 12 76 94 -61 53 41 -60 -42 -308 -22 -115 71 -105 -46 -163 62 137 -122 77 -94 6 -54
2260e4o1L5j81K43K8J9J15q1k8o4R9j41Q1K6L2L3j81K17j20P2j90MK05j86j22
$$ -54 -115 -80 -261 -18 10 29 144 63 35 -29 70 -71 10 36 68 101 -80 137 17 89 -101 -97 108 -78 -200
2285b00K05o0Q6O5j33o4N7J83k60J68q5O4j06K7J97p8j31j19K36p0J36k40K83
$$ -200 5 -55 31 96 -37 -101 -44 139 -121 47 -38 26 -80 -53 144 66 -65 -184 52 -18 118 -122 161
2308A61q8Kj9j98P0J91j84J00Jj26o1r5K74j73K01j10J15J50l1m10K88r6Q8r8
$$ 161 73 75 56 -142 -72 119 -65 35 36 -90 -151 -246 28 -145 56 -54 61 211 180 -230 58 -38 50 -48
2332d8J43Pj92J97r6r3OJ91K2j95K17j88j30K53J17j89k5K15j15Q5k39j29K39
$$ -48 95 102 -90 107 11 -82 -76 115 137 -58 159 -29 -159 94 211 22 -3 212 97 182 -57 -186 53
2355E3L2Q7j34K7mqo2r1J17j8N1K12m11J46nj65J47M9l0j71J18l3J17j33K60j13
$$ 53 85 172 38 65 61 53 -9 -100 17 -1 50 262 -149 -3 -8 -173 -26 23 -7 -178 -60 -93 24 -109 151 38
2381C8jj17m9L0J46n4Q0q3j24R6L8Qoj06K9P4J22k89K23k84J77K04j24J0m3Mj72
$$ 38 37 -80 -129 -99 47 -7 73 -10 -134 -38 0 8 2 -104 -75 -1 121 -168 55 -229 -52 152 28 38 -5 -1 -173
2408a73K55j0m4NJ31l21K79j44RJ27k0k11J25O8j82m2J17J1k3R2N9N1k11J61o3
$$ -173 82 72 28 33 164 -157 122 -22 -13 114 94 -117 8 76 -106 -148 -31 -20 -43 49 108 159 -52 109 46
2433D6q8J4K01k17O8R6Nl37L07P3l78Q0K57j49L3P1k14L32j44j22j32J30M2p7
$$ 46 -42 -28 173 -44 24 120 125 -212 95 168 -210 -130 127 -22 11 82 -132 200 56 -66 -198 -68 -26 -103
2457a03J49k62J12qJ26J57j57j49K36j37J17j02j40J99L15l88j32K43Nk5k6J51
$$ -103 46 -216 -104 -112 14 171 14 -135 101 -36 81 -21 -161 38 353 -35 -167 76 81 56 30 181
2479A81r9l15M10l50R6L2R1q1j37J71K05j92j88L14o7O0j19M9J9rk31K8J19j5
$$ 181 82 -233 177 -173 -77 -45 46 -35 -172 -1 204 12 -176 138 71 131 12 61 80 71 -160 -132 -13 -28
2503b8j47j03L39J0oj00l3J52j68j6L7J56o0K12r1j82J91k25k6R0M3K3N5q6k75
$$ -28 -175 -278 61 71 65 -35 -68 84 -84 -100 -63 93 33 245 154 -28 163 -62 -88 2 45 68 123 37 -238
2528b38K08J08j04l2K4j74J92j02K34p3r1j43K39P4j83O1j01K5K2k8K06L4o2P
$$ -238 -30 78 -26 -58 -34 -208 -16 -118 116 43 -48 -191 48 122 -61 0 -101 -76 -54 -82 124 158 96 103
2552A03j37j3l7P2j60O1J02M3j17j24K88n1j04N4J77j33q6K06j56J96k28p1J43
$$ 103 -34 -47 -84 -12 -172 -111 -9 34 -83 -207 81 30 -74 -20 157 24 -62 144 -12 184 -44 -115 28
2575B8J46j22j09P0l4K08k19K56k82J49l9j24J00q5j40J31J03o0j7J9J39j03N9
$$ 28 174 52 -57 13 -21 187 -32 224 -58 91 52 -72 28 -57 -197 -66 37 -23 -40 -21 118 15 74
2598G4r2J58k39Q6J30j08J2J14l15K49o4Jk4j51L12k00K78k2k67J14j40J01J18
$$ 74 -18 140 -99 -13 117 9 21 135 -180 69 5 6 -18 -169 143 -57 221 199 -68 46 -94 7 125
2621A25j06j63K57k05k3K92j55J79k78P5q6l6Q1J22k7j18J04m2j9m5l8J15j14
$$ 125 19 -144 113 -92 -115 177 22 201 -77 -2 -88 -124 -43 79 52 -66 38 -4 -23 -68 -106 9 -105
2644a05J93K9k42J78R7q3p9l05M39j91j65Q6J61Km5k51L33k29K77l9j90L29j43
$$ -105 88 117 -125 53 150 67 -12 -317 122 -69 -234 -148 13 15 -30 -281 52 -177 100 61 -129 200 57
2667E7q9K2j8L5J4k3O8j3j25J51K9l76M9J58J87n9N6j11o6M7l7P9n2nO7p2J80
$$ 57 -32 -10 -28 7 21 -2 66 53 -72 79 108 -268 -219 -61 126 67 123 12 -54 -7 -44 35 -17 -22 45 -27 153
2694A53j32q4J20J83k18qN3r5O8lp1K0o2R3j14l3J99j14J75p9Q9j06M3K8l01M0
$$ 153 21 -63 57 240 22 14 67 -28 40 37 -34 -14 -76 17 -97 -130 69 -45 130 51 140 34 77 105 -196 -156
2720a56J02OK54m0j27j51J99k26K16kl2M3r7p0J61P2r3k31J18L5K8j2n4K6J35
$$ -156 -54 -48 206 166 39 -112 87 -139 77 75 43 86 -11 -81 80 152 59 -172 -54 -19 9 -3 -57 -31 104
2745A04j83N0j05K22l8J13j78q5k9K47k68J17k13L07r5L6l5J52l5j80J67j79O9
$$ 104 -79 -29 -134 88 50 163 -15 -100 -129 118 -150 -33 -246 61 -34 2 -33 119 84 -96 71 -108 -39
2768c9L5P7q5j48J37J78j32l8P2l6M8j59Q7Q1n7J09Rk6J72l47N8J34j39o1J62
$$ -39 -4 73 -12 -160 -23 155 23 -15 57 21 69 -90 -3 78 21 130 139 113 285 -62 -4 130 -9 -70 92
2793I2j55L5q1L15q6j46M0K4P8j77o6K04jj15L9j41J6J72m4R0k50j2N8L01j11
$$ 92 -63 -28 -109 206 120 -26 14 38 116 -61 -127 77 76 -39 0 -141 -125 47 3 93 -157 -169 -111 190 79
2818G9k34P9L25j76j91K15j62p4J63N2q4P7l7r9o8K04J0n8j00J05K42k98p8J99
$$ 79 -155 -76 249 73 -118 97 -65 -139 24 76 -8 69 32 -67 -135 69 79 21 -79 26 268 -30 -108 91
2842I1j32j14L42j07j17n3J51j09qR0Q8N0p7l38K48k4o3K6L5rJ67j12k6J2Q8J3
$$ 91 -41 -155 187 80 -37 -90 61 -48 -56 34 122 172 95 -243 5 -19 -82 -56 -21 -30 137 25 -1 11 99 112
2868A12m1P5m4k33K23j47J79n6j92K63j18k99L00l9p0J70j34m9J36j47P0J22q7
$$ 112 71 146 102 -131 92 -55 124 68 -124 139 21 -278 22 -17 -87 83 -51 -100 36 -111 -41 81 -6
2891fj09J34o7k3j05J83O9k10L34l39m7J65p1Q5O3n3o1J12k51L21j8j55Q3q6N8
$$ -6 -115 19 -48 -71 -176 7 76 -134 200 -139 -186 -21 -92 -7 56 3 -58 54 -197 124 106 -49 34 -52 6
2916Fp3pJ13J44r9j54Q7O0j97J65k29O7J20j31J90J4k0j78j31L97n8l2k4O6N6
$$ 6 -67 -74 39 183 84 -70 17 77 -120 45 -184 -117 3 -128 62 76 56 -122 -253 144 86 54 30 96 152
2941A52k72O1N3O7j68j36M56l55K43k16J89k6p9L9j33P5J84k25M6L57l70%L9r8
$$ 152 -120 -59 -6 61 -107 -243 213 -142 101 -115 74 48 -31 8 -125 -50 134 -91 -45 312 -58 -58 -19 -117
2965a17l4J39P5j50R1j66K80r7j91J57o8J27rJ54k11O0L3j57J74j65j19J64P6
$$ -117 -151 -12 63 -87 4 -162 118 21 -170 -13 -81 46 37 191 -20 40 73 -84 90 -75 -194 -30 46
2988D6j11p4J18J9L2q9m1L3J18j03Q8M7m9o4m1J0Q8P9q1j76K36k3MJ72k04lO5
$$ 46 -65 -139 -21 -2 30 -59 -100 -67 51 -52 36 83 34 -30 -71 -61 27 106 25 -151 85 62 66 238 34 31 96
3015I6j7l2J51l59J07R2k29L20k21M5o3J29j46P8N6q1P2k14J05J39o7R4Q5q5k3
$$ 96 79 47 198 -161 -54 38 -191 129 -92 -47 -110 19 -127 -49 7 -74 -2 -216 -111 28 -39 55 140 55 32
3040C2k40L69N4k98M6q9J60j05L00l11L6R7J50l00j46K42q2J25L2q5L9J50k44
$$ 32 -208 161 215 -83 -37 -126 34 -71 229 -82 -46 51 201 -99 -245 -3 -85 40 72 -13 26 176 -68
3063f8J16R1m2j77J51p5k24K12m2R3j66J82R9j52j25M0K15k07j66L05o0n7L0j28
$$ -68 48 139 97 -80 71 -4 -228 -16 -58 35 -131 51 150 -2 -127 -87 128 -79 -245 60 0 -57 -27 -155
3087a55O6L7J08j28k9oJ34JJ78j41j38OJ83p8N3p9q0o6r7K49o6K1J8J2p0OL4K
$$ -155 -89 -52 56 -72 -101 -107 27 28 206 65 -73 -67 116 38 91 12 -68 -134 -231 18 -48 -27 -9 3 -67 -61 -27 -25
3115b5L6n0K5P4j27K76m44K39O6k08N1J16N8n3p8j14J52o1L60k75rk9m1r8J65
$$ -25 11 -39 -14 60 -67 209 -235 4 70 -138 -87 29 87 34 -44 -158 -6 -67 293 18 9 -20 -61 -159 6
3140Fj4j07QJ5m7M5J45Kj29J47q6K38k66qR9PL6k75M27k68p2O6J92l04J31j85
$$ 6 -8 -115 -107 -92 -139 -94 51 53 -76 71 -15 223 -43 -51 48 55 91 -184 243 -25 -97 -31 161 -143 -12 -197
3166a97J88l9J70k08K37j76p6r8M4K39Q4p1j19R3r3N2o8J67k08L08l00k5K01k98
$$ -197 -9 -48 122 -86 151 -25 -101 -199 -155 84 168 97 -22 71 -22 30 -38 129 -79 229 -71 -96 105 -193
3190a93J73J65j18j30J91j7p9j35J79j5r4On8K34k75K12k1K1m4l3R5L6k80R5N5
$$ -193 -20 145 27 -103 88 71 -8 -143 36 21 -73 -67 -125 109 -166 46 25 46 2 -31 64 100 -180 -85 -30
3215c0R4j44K22J45k97m2J36r7o8j29K41nk1m7J57k98O8K76Jj94K6q5lP9R8p9
$$ -30 64 -80 142 287 -10 -52 84 -13 -81 -210 31 26 5 -42 115 -183 -115 161 162 -32 -6 -91 -94 -15 83 4
3241DM0l5r2J86j0j35J60k5o9r5K9l7M1K3j81K78k02J21L3l6m3L40l10J58k10
$$ 4 44 9 -83 103 93 -42 118 93 24 -71 -42 -79 -38 -15 -196 82 -120 1 34 -2 -45 295 -15 143 -67
3266f7P2J58k39J76j09k34R7J12J55r4J17o8N9j69J23j0j99J46j8K14k85RK34
$$ -67 5 163 -76 100 -9 -243 -146 -34 121 27 144 76 135 -34 89 79 -120 26 8 222 -63 -54 180
3289A80l8l29K41m8J15p1j11P0j4ML4o0l0J73j53J34j13j31J71r9K38J19k80O8
$$ 180 142 -187 54 6 121 50 -61 9 -5 -1 33 -27 -57 116 -37 97 -16 -147 24 -75 163 282 2 70
3313G0j13L9j37%J41j45J72qQ4j32K7k0J46j83rK5j35J79J38k76R3J98j96J12
$$ 70 -43 -4 -141 -141 0 -145 27 19 103 -29 -2 -22 124 -59 -68 -43 -178 1 139 -137 -44 154 -42 70
3337G0j43q1nM08j25k29J36j80L9L8J20J49L2k78J06J77j36j5J01k18K8q9J15
$$ 70 -73 -154 -159 249 124 -105 31 -149 -110 -72 48 197 229 -49 57 234 98 83 184 -34 -6 -95 20
3360B0k38K53j32Q9j26K18p7J40K8j46K31k49j04J9NP0K47k87J63m0p1j73N9%
$$ 20 -218 35 -97 -8 -134 84 7 147 175 29 260 11 -93 -74 -69 1 248 -39 124 84 13 -160 -101 -101
3384a01P5L2l4O9M5j08p4j4K58j15m2M2jn7N3o1J13j89J27j70L2K81k80r7K95
$$ -101 -26 6 -28 41 86 -22 -96 -110 148 33 -9 33 32 -25 28 -33 80 -109 18 -152 -120 161 -119 -216 79
3409G9r9k2J50j84j2p5L02k78K20j69K59j23J41j38j60K28j44J6L8J1j12o4Q2
$$ 79 -20 -42 108 -76 -88 -163 139 -139 81 -88 171 48 189 51 -109 119 -25 -9 29 40 -72 -136 -54
3432e4J37l2o3J08K9j82Q6j09P1j43Q7NL9k7J35j84k3k0K66j89RJ02k23L9J67
$$ -54 83 51 -12 96 125 -57 29 -80 -9 -152 -65 -60 -21 -48 87 -97 -120 -140 126 -63 -54 48 -175 -136 31
3457C1o7O3l29L75K5j41J46r1J24l07O3N7N3o3n7J56j12K26j8j89K29p0Q4r1P
$$ 31 -36 27 -302 73 98 -43 103 12 136 -171 -108 -51 2 -61 -118 38 -74 152 134 -55 174 104 188 97 104
3482A04r3J83j58k64P3K30j48j22J46J73j38j72n4J90J66k23J81j41J92j35K22
$$ 104 11 194 36 -228 -155 75 -73 -195 -49 124 -14 -186 -240 -50 116 -107 74 -67 125 -10 212
3503B12j84K7q3Q8k31K34O7k16J95j11n1J82M6j44o5O4k5J75l00O3K1J61k80J15
$$ 212 28 55 -28 60 -171 63 130 -86 109 -2 -53 129 175 31 -34 30 5 180 -120 -57 -36 125 -155 -40
3527d0Q4q3M2J2K09l25L9N8J00k17J03R2l7mO1J1r5m4j7j67L89k12j27J32Q2%
$$ -40 44 -39 3 15 224 -101 -62 -4 96 -121 -18 74 37 33 94 105 10 -34 -51 -218 171 -41 -168 -36 46 46
3553D6M6j94Q1j48J95n6P5L0q0j0o8K59j24J03n9m7l9N6M1j48J2km3R8K1O7n6
$$ 46 92 -102 -21 -169 26 -30 45 75 -5 -15 -83 176 52 155 96 49 10 66 107 -41 -29 -31 -74 24 45 112 56
3580E6k09R9K6M5m7J74k26K01l80J30J04n3K2p5P4M0k0J29j84m2K63k38L6J70
$$ 56 -153 -54 -28 17 -30 144 -82 119 -261 -131 -27 -80 -58 -133 -59 -19 -39 90 -94 -136 127 -111 -75 95
3604I5j54J4j9L0J51L4j37q2m0j54L99j82K6lk5KP4j23K82r0jj25j2Q0j17oj12
$$ 95 -59 -45 -64 -34 117 151 14 -68 -108 -262 137 -45 -19 -22 -47 -45 29 -94 188 98 97 -28 -40 40 -77 -83 -195
3631a95L03J61l79J84L7j62J24j68J49j03J86j56J22r6J22j17Q1k14N4K27p9j92
$$ -195 108 269 -110 74 111 -51 73 -95 54 -49 137 -19 103 7 129 12 93 -121 -67 160 81 -111
3653a11m9J84j23J31j3Q5k55N8Q1K67j26K8R3k87N7k26J50R6K08k51k0r1J60j31
$$ -111 -160 24 -99 32 19 104 -151 -93 -12 255 129 157 250 -37 20 -206 -56 40 248 -3 -23 -114 46 -85
3677h5R9K16j47J19l70J76K2N2j78J33N0l0j02L4K07k80l9J29j4K6q5J3J55m9
$$ -85 14 230 83 202 -168 8 30 82 -96 37 87 57 -45 -11 196 -84 -123 6 -8 18 -67 -54 101 52
3701E2M1Mj20j15J03J64J59j81j96Q2o5K90r1j71J48j50J01l6J40j90J81j69R8
$$ 52 93 97 -23 -138 -35 129 288 107 -89 -7 -72 218 127 -44 104 -46 55 19 159 -31 150 -19 79
3724G9m8K7q7j70L20k14Q5J71j82k8l4K40j24j02M7lN6l9p7Q5j25J55j78O2J04
$$ 79 31 58 -29 -199 121 -93 -8 163 -19 -47 -81 159 35 -67 -20 -23 33 -6 -83 2 -123 32 -146 -84 20
3749B0j34L6R3L6k10J68j24J86j50O9j71K62l3o4J38Rk22J6J26K6l7n9Kr7J11
$$ 20 -114 -78 15 51 -159 9 -115 71 -79 -10 -181 81 48 -16 122 131 -91 -75 51 77 40 -19 -17 -114 -3
3774cPR6j15J08K0o1L0L1k60K29j39J32j14l0O8pJ69O6k13p2l5J15O9l1j99J73
$$ -3 4 100 -15 93 113 52 82 113 -147 82 -57 75 -39 -69 -1 -8 161 227 14 -58 -93 22 91 60 -139 34
3800C4K4Q4j87J54r8J01j11m7l8P7J04m5o1L9J7j7J9l7P2r8P8j88K30j48R8m8
$$ 34 58 142 -45 109 11 112 1 -46 -84 -7 97 52 -9 30 47 30 49 12 84 -14 64 -124 106 -42 56 8
3826HJ45k73Q9J38j60P1J5J57j22r8j08R4L1%M2l1p1K9q1J27P3kj48m2J33p1n
$$ 8 153 -120 -31 107 -53 18 33 190 68 -30 -138 -44 -13 -13 29 -2 -73 -44 -125 2 75 73 -75 -117 16 -55 -60
3853f0L5Q8k4p7m1J1j06K16r1Kj31lR7J89J02p5j44J60o5r6K09l88R2J29pM1q0
$$ -60 -25 63 39 -38 -79 -68 -174 42 -49 -47 -178 -181 -84 105 207 132 -12 148 83 -13 196 -192 -100 29 22 63 -17
3880a7k79J51J65M8j63J52r2R8j08J38q4o2N7o8J1LJ21p6J25j58L2j24P8O6K22
$$ -17 -296 -145 20 68 -95 57 -35 63 -45 93 9 -53 4 -64 -53 -50 71 -5 120 -38 -6 -130 -52 14 236
3905B36j43j39J14J20j12N5m1j56K13k65J24K9m9m0k1K17j91r6K33j84M1KJ76
$$ 236 93 -46 68 188 76 131 90 -66 147 -118 6 35 -14 -54 -75 142 -49 -145 88 -96 -55 -53 123
3928A23j8oJ14k23r9J73j47j16L04j58J52p0k2J2m9J95l17K41lm6oJ57j09q5J25
$$ 123 105 99 213 -10 -109 64 -83 -199 105 -53 99 29 7 19 -30 165 -152 89 86 40 34 191 82 -3 122
3953A22j84Q4q6j21M4N9J62k14P0p3O7m5J8R1j75K60k00N9K5K9m1O7Ro4P8lj28
$$ 122 -62 22 -64 -185 -141 -82 80 -134 -64 -137 -70 -115 -97 -6 -181 79 -121 -62 -37 -8 -49 18 27 -37 41 38 -90
3980i0o8R1J11J07j54N1J42m8j58k10M62k46k9m8K33k12O7mo7j4K0p2N1O4j10
$$ -90 -158 -67 44 151 -3 48 190 142 -16 -226 236 -10 -39 -87 146 -66 1 -3 -70 -84 -64 -136 -85 -21 -131
4005a31Q7Q0pQ0k83J3K65j73J11n6o0P0J31k51k17L13J96j82n2J95j45L4p9K09
$$ -131 -44 36 29 109 -174 -161 104 -69 42 -14 -74 -4 127 -124 -341 -28 168 -14 -66 129 -16 18 -61 148
4029A48J8j61k03q6L14k45M29k39P6J08k44o2R5R7k1O4j34M6N0rj56L3R2N6L3
$$ 148 166 5 -198 -284 30 -215 214 -25 51 159 -85 -147 -52 45 24 88 -46 0 50 41 -115 -82 10 66 99
4054I9m1k42M28j94q0j05J4J78k08L24j41j21J73j09J81K9k59J99j49O7p9k1J16
$$ 99 58 -184 244 50 -30 -135 -121 57 -151 173 32 -89 84 -25 156 185 -74 125 -24 43 -36 -57 59
4077E9q5L3r3J68j21N4L8n1P3k62K99k14L7J2J67k4J16k25j5J04j18JJ39j44K3
$$ 59 -26 7 -86 82 -39 15 53 2 75 -187 112 -102 -65 -53 114 90 206 -19 -34 70 -48 -47 92 -52 -29
4102b9Q3j79P2m4K49q9K2k16K20k27N7J76j85J96O2Rk94K17J9j38Q4L8m0jk81
$$ -29 54 -125 -53 -97 152 63 85 -131 89 -138 -81 95 -90 106 168 177 -117 100 119 -19 65 103 63 62 -219
4127b19L06r6p6K5kl7o6J21M5J3j29J84l99N12l05K20jj61P9L1j03j03J69R3l19
$$ -219 87 -9 -85 -60 -62 -99 -165 -44 1 14 -115 69 -330 182 -123 97 96 -65 14 45 -58 -161 8 101 -218
4152b18J31J45PK8m8Nj22p8J79kl28M17j31KJP1O8k47J11j1QJ82j56J5J5l02L21
$$ -218 -87 58 65 93 45 50 -72 -150 29 27 -301 116 -15 -13 -12 59 127 -120 -9 -20 -12 170 14 29 44 -258 63
4179F3k27R4O8j55M35k22n6o4J17K2p6Q0k28K05j16N8j21q1K21N3j66m0J08n9
$$ 63 -164 -70 -2 -157 278 56 0 -64 53 75 -1 79 -149 56 -60 -2 -123 -204 17 70 -96 -136 -28 -87
4203h7J17q5O1J54j91J33j33OJ85L2k62M3jJ79k13j14J27o7N8q6KK55k04L36j74
$$ -87 30 -55 6 160 -31 102 -31 -25 160 192 -70 -27 -28 151 -62 -176 -49 -116 -58 -144 -142 113 -91 245 71
4228G1k17K68l36L02k96L41k0k77J69kJ05M9j22P2j87J3OL2Lj08K13k8O0k22Q4
$$ 71 -146 122 -214 88 -208 133 113 -164 5 3 108 157 35 107 -80 -67 -61 -29 -26 -134 79 51 111 -111 -27
4253b7R2j73J40j81O7K84j93J6M4j81j05K96n1q5R5j63R8k9R9l6Q3j32oj67K94
$$ -27 65 -108 32 -149 -82 202 9 25 69 -112 -217 79 28 -57 38 -125 -27 -56 43 7 90 -42 -48 -215 79
4278G9j61K01Kk18J78L9j67Q6oMo7J2k9J69j49J11j94K00k97P1J98j64M0J43j53
$$ 79 -82 119 121 -97 81 120 -47 39 33 37 -30 -18 -47 122 -27 84 -110 90 -207 -136 62 -102 -62 81 -72
4303g2N6J10j88J12J21k75J30k0J69j41l2Q0l28K65K99q4j99l8J4P2j65N0J61
$$ -72 -16 94 -94 18 139 -136 -6 -26 143 2 -30 50 -278 -13 286 202 3 -35 -21 51 -114 -64 97
4326I7o8j22J44j07J55j37J72k91J34N5k31J46o3J48p4J20j89J52J9o4j03OJ08
$$ 97 29 -93 51 -56 99 -38 134 -157 -23 32 -199 -53 -116 32 -42 78 -111 41 60 -4 -107 -101 7
4349Gj95J64N4nl09L33j48J24k9q6J02r4J82j01L1K7M6q0r3K51j45MJ59l11P2
$$ 7 -188 -24 30 25 -284 49 -99 25 -4 -90 12 -82 100 -1 30 57 103 23 -70 181 36 40 199 -112 -40
$$ [...]
8191a47
##END NTUPLES=NMR FID
##END=
