##TITLE=C13cpd
##JCAMPDX= 6.0         $$ Bruker NMR JCAMP-DX V2.0
##DATA TYPE= NMR SPECTRUM
##DATA CLASS= NTUPLES
##ORIGIN= UXNMR, Bruker Analytische Messtechnik GmbH
##OWNER= root
$$ XWIN-NMR		Version 3.5
$$ Thu Oct 24 13:29:10 2019 Russian Standard Time (UT+4h)  servis@DPX200
##.OBSERVE FREQUENCY= 50.3277607988526
##.OBSERVE NUCLEUS= ^13C
##.ACQUISITION MODE= SIMULTANEOUS
##.ACQUISITION SCHEME= undefined
##.AVERAGES= 1762
##.DIGITISER RES= 17
##SPECTROMETER/DATA SYSTEM= spect
##.PULSE SEQUENCE= zgpg30
##.SOLVENT NAME= CDCl3
##.SHIFT REFERENCE= (INTERNAL, CDCl3, 0, 219.126)
##AUDIT TRAIL= $$ (NUMBER, WHEN, WHO, WHERE, WHAT)
$$ ##TITLE= Audit trail, XWIN-NMR		Version 3.5
$$ ##JCAMPDX= 5.01
$$ ##ORIGIN= Bruker BioSpin GmbH
$$ ##OWNER= servis
$$ F:\spectra/data/av/nmr/C13cpd/1/pdata/1/auditp.txt
$$ ##AUDIT TRAIL=  $$ (NUMBER, WHEN, WHO, WHERE, WHAT)
(   1,<2019-10-24 13:28:06.42 +0400>,<servis>,<DPX200>,
      <created by zg, POWCHK disabled, PULCHK disabled
       terminated by command 'halt'
       configuration hash MD5:
       00 E9 B6 7A A2 85 ED C7 34 08 36 98 17 FE 4E 26
       data hash MD5: 64K
       AD 4A 20 89 09 7B 36 71 D6 D6 F1 42 76 F2 DD 95>)
(   2,<2019-10-24 13:28:08.78 +0400>,<servis>,<DPX200>,
      <Start of raw data processing
       efp BC_mod = 2 LB = 1 FT_mod = 6 PKNL = 1 PHC0 = -316.5228 PHC1 = 26.76095 SI = 32K 
       data hash MD5: 32K
       38 DD A8 FE B7 F7 C2 2D 52 52 8B BD 09 1B FC 06>)
(   3,<2019-10-24 13:28:15.75 +0400>,<servis>,<DPX200>,
      <abs ABSG = 5 
       data hash MD5: 32K
       E2 AA 71 57 6E EA D3 23 A0 06 A2 4E 27 FB 55 1A>)
(   4,<2019-10-24 13:28:33.31 +0400>,<servis>,<DPX200>,
      <pk PHC0 = 5.6 PHC1 = 0 
       data hash MD5: 32K
       33 17 4C 53 87 99 75 33 13 21 41 69 98 CF E0 A2>)
$$ ##END=
$$ 
$$ hash MD5
$$ 41 BA 1F 05 BD 61 EA 24 97 0E 7E A5 EA FF 16 C9
##$RELAX= 
##$RELAX= 
##$RELAX= 
##$RELAX= 
##$RELAX= 
##$RELAX= 
##$RELAX= 
$$ Bruker specific parameters
$$ --------------------------
##$DU= <F:\spectra>
##$EXPNO= 1
##$NAME= <C13cpd>
##$PROCNO= 1
##$TYPE= <nmr>
##$USER= <av>
##$AMP= (0..31)
100 100 100 100 100 100 100 100 100 100 100 100 100 100 100 100 100 100 
100 100 100 100 100 100 100 100 100 100 100 100 100 100 
##$AQSEQ= 0
##$AQ_mod= 1
##$AUNM= <au_zg>
##$AUTOPOS= <>
##$BF1= 50.322729
##$BF2= 200.13
##$BF3= 50.322729
##$BF4= 50.322729
##$BF5= 500.13
##$BF6= 500.13
##$BF7= 500.13
##$BF8= 500.13
##$BYTORDA= 1
##$CFDGTYP= 0
##$CFRGTYP= 5
##$CHEMSTR= <none>
##$CNST= (0..31)
1 1 145 1 1 1 1 1 1 1 1 1 1 1 1 1 1 1 1 1 1 1 1 1 1 1 1 1 1 1 1 1 
##$CPDPRG= <waltz16>
##$CPDPRG1= <>
##$CPDPRG2= <waltz16>
##$CPDPRG3= <>
##$CPDPRG4= <mlev>
##$CPDPRG5= <mlev>
##$CPDPRG6= <mlev>
##$CPDPRG7= <mlev>
##$CPDPRG8= <mlev>
##$CPDPRGB= <>
##$CPDPRGT= <>
##$D= (0..31)
0 2 0.00345 0 0 0 0 0 0 0.06 0 0.03 2e-05 3e-06 0 0 0.0002 0 0 0 0 0 0 
0 0 0 0 0 0 0 0 0 
##$DATE= 1571909286
##$DBL= (0..7)
120 120 120 120 120 120 120 120 
##$DBP= (0..7)
150 150 150 150 150 150 150 150 
##$DBP07= 0
$$ [...]
##$SUBNAM3= <"">
##$SUBNAM4= <"">
##$SUBNAM5= <"">
##$SUBNAM6= <"">
##$SUBNAM7= <"">
##$SUBNAM8= <"">
##$SUBNAM9= <"">
##$SW= 238.246396889851
##$SWIBOX= (0..15)
0 1 3 0 0 0 0 0 0 0 0 0 0 0 0 0 
##$SW_h= 11990.4076738609
##$TD= 65536
##$TD0= 1
##$TE= 0
##$TE2= 300
##$TE3= 300
##$TEG= 300
##$TL= (0..7)
0 120 120 120 120 120 120 120 
##$TP= (0..7)
150 150 150 150 150 150 150 150 
##$TP07= 0
##$TPNAME0= <>
##$TPNAME1= <>
##$TPNAME2= <>
##$TPNAME3= <>
##$TPNAME4= <>
##$TPNAME5= <>
##$TPNAME6= <>
##$TPNAME7= <>
##$TPOAL= (0..7)
0.5 0.5 0.5 0.5 0.5 0.5 0.5 0.5 
##$TPOFFS= (0..7)
0 0 0 0 0 0 0 0 
##$TUNHIN= 0
##$TUNHOUT= 0
##$TUNXOUT= 0
##$USERA1= <user>
##$USERA2= <user>
##$USERA3= <user>
##$USERA4= <user>
##$USERA5= <user>
##$V9= 5
##$VALIST= <valist>
##$VCLIST= <CCCCCCCCCCCCCCC>
##$VD= 0
##$VDLIST= <DDDDDDDDDDDDDDD>
##$VPLIST= <PPPPPPPPPPPPPPP>
##$VTLIST= <TTTTTTTTTTTTTTT>
##$WBST= 1024
##$WBSW= 20
##$XGAIN= (0..3)
0 0 0 0 
##$XL= 0
##$YL= 0
##$YMAX_a= 19103461
##$YMIN_a= -6717805
##$ZGOPTNS= <>
##$ZL1= 120
##$ZL2= 120
##$ZL3= 120
##$ZL4= 120
##$ABSF1= 219.1257
##$ABSF2= -19.14452
##$ABSG= 5
##$ABSL= 3
##$ALPHA= 0
##$AQORDER= 0
##$ASSFAC= 0
##$ASSFACI= 0
##$ASSFACX= 0
##$ASSWID= 0
##$AUNMP= <proc_1d>
##$AZFE= 0.1
##$AZFW= 0.5
##$BCFW= 0
##$BC_mod= 2
##$BYTORDP= 0
##$COROFFS= 0
##$CY= 12.5
##$DATMOD= 1
##$DC= 0
##$DFILT= <>
##$DTYPP= 0
##$F1P= 99.9999945759776
##$F2P= -179.999992907048
##$FCOR= 0.5
##$FTSIZE= 32768
##$FT_mod= 6
##$GAMMA= 0
##$GB= 0
##$INTBC= 1
##$INTSCL= 0
##$ISEN= 30
##$LB= 1
##$LEV0= 0
##$LPBIN= 0
##$MAXI= 10000
##$MC2= 0
##$MEAN= 0
##$ME_mod= 0
##$MI= 0
##$NCOEF= 0
##$NC_proc= 1
##$NLEV= 6
##$NOISF1= 0
##$NOISF2= 0
##$NSP= 0
##$NTH_PI= 0
##$NZP= 0
##$OFFSET= 219.1257
##$PC= 1.4
##$PHC0= -310.9228
##$PHC1= 26.76095
##$PH_mod= 1
##$PKNL= yes
##$PPARMOD= 0
##$PSCAL= 0
##$PSIGN= 0
##$REVERSE= no
##$SF= 50.322729
##$SI= 32768
##$SIGF1= 0
##$SIGF2= 0
##$SINO= 80
##$SIOLD= 32768
##$SREGLST= <31P.CDCl3>
##$SSB= 0
##$STSI= 32768
##$STSR= 0
##$SW_p= 11990.4076738609
##$SYMM= 0
##$S_DEV= 0
##$TDeff= 65536
##$TDoff= 0
##$TI= <>
##$TILT= no
##$TM1= 0
##$TM2= 0
##$TOPLEV= 0
##$USERP1= <user>
##$USERP2= <user>
##$USERP3= <user>
##$USERP4= <user>
##$USERP5= <user>
##$WDW= 1
##$XDIM= 32768
##$YMAX_p= 304560951
##$YMIN_p= -9889103
$$ End of Bruker specific parameters
$$ ---------------------------------
##NTUPLES= NMR SPECTRUM
##VAR_NAME=  FREQUENCY,     SPECTRUM/REAL,   SPECTRUM/IMAG
##SYMBOL=    X,             R,               I
##VAR_TYPE=  INDEPENDENT,   DEPENDENT,       DEPENDENT
##VAR_FORM=  AFFN,          ASDF,            ASDF
##VAR_DIM=   32768,         32768,           32768
##UNITS=     HZ,            ARBITRARY UNITS, ARBITRARY UNITS
##FACTOR=    0.365929370215793, 1,           1
##FIRST=     11027.0033138647, 0,            0
##LAST=      -963.404359996184, 0,           0
##MIN=       -963.404359996184, -9889103,    0
##MAX=       11027.0033138647, 304560951,    0
$$ Real data points
##PAGE= N=1
##DATA TABLE= (X++(R..R)), XYDATA
$$ [...]
15807A051635j510519o70854N46613N57556m05813P54587J07877l42736l68428
15798b80082L79953J724197J329203k06470j506443r59694P20644K31674q1308
15789A351674N41567j414059j269548L7098j032798L1617M87266J76879j89690
15780a279994o56179o98993n72581K44174K292361J644386l2768n74836j84880
15771A80690j27312q88399j077976m88594M48778R68829J013145l8275j477873
15762a486987q62820J24736r30639j21487J964393J301990k87451r36195j951511
15753c185971j859848M9650J761401J578911L12539K87251j35963K24751o01118
15744a568397j330258j109743p5540j209641j891217Q43522J362882R12854J552068
$$ y = [1051635, -458884, -1129738, -583125, -25569, -431382, 323205, 431082, 88346, -280082, 99871, 1824068, 3153271, 2946801, 1440358, 480664, 1201308, 1432982, 1351674, 1893241, 479182, -790366, -753268, -1786066, -1754449, -1267183, -1090304, -1279994, -1936173, -2635166, -3207747, -2963573, -671212, 973174, 940406, 365570, 180690, 53378, -835021, -1912997, -2401591, -1952813, -983984, 29161, -9114, -1486987, -2349807, -2225071, -3155710, -3277197, -1312804, -10814, -298265, -1234460, -3185971, -5045819, -4996169, -3234768, -1655857, -1343318, -1056067, -1192030, -967279, -1568397, -2898655, -4008398, -4083938, -5293579, -7184796, -6341274, -4978392, -4065538, -2513470]
15735b513470J542369J137046J785233J215226j149176j061998L28850J85410
15727A469490q71155j379773j067226J61357K75519J171959L54165n72065l35111
15718g92840o51155M99771k1971K4310P61199J581981M62051m95628j743856j719573
15708b095711P90888P15819n17183K85028P71655O60611M65317K88390M68034
15699A832848o47781j367082j345938m13670L0451L80374j402243j365691J44742
15690d153990l48070O69389Q3401q31842J347992K173439J007952L35694k47753
15681C6212Q62400j57484P14484o6183k80117L98488j66056j022848j876706j995700
15671c553510l82647O50847J707505K185219O48775r87084j070649K86L65282
$$ y = [-2513470, -971101, 165945, 1951178, 3166404, 2017228, 955230, 1284080, 1469490, 598335, -781438, -1848664, -1687307, -1411788, -239829, 114336, -457729, -792840, -1443995, -944224, -966195, -941885, -180686, 1401295, 1863346, 1367718, -376138, -2095711, -1304823, -589004, -1106187, -821159, -49504, 611107, 1076424, 1364814, 1832848, 1185067, -182015, -1527953, -1941623, -1911172, -1530798, -2933041, -4298732, -4153990, -4502060, -3832671, -3749270, -4581112, -3233120, -1059681, -51729, 283965, 36212, 898612, 741128, 1455612, 1389429, 1109312, 1507800, 1341744, 318896, -1557810, -3553510, -3936157, -3285310, -1577805, 607414, 1256189, 269105, -801544, -801258, -435976]
15662d35976m43322j409338q90887j98256N71964J847308Q44741j87671O45324
15653C43887K66849P2402r43610l56651Q9158m83623j616963J14728J252033J095516
15643a66274j162624n38679Q37046P22110N69017J30286q66291r99414R7206n32733
15633a910350m29146J88719J041429J481874m88123j294772j552048n58121P41975
15624b778563J53171j62025J42181R4810p17716j17464Q05151o24478j030578
15615d235511J176390J465650j5796k4995Q97182m37590k258095j226981N80607
15606d079139J296146J336232K167164O41580j257042l98597L52122j84084j66570
15597b92188j51188Q37723J266495K53979j230218k093321j159782L05245k45192
$$ y = [-435976, -879298, -2288636, -3179523, -3377779, -2805815, -958507, -113766, -301437, 343887, 610736, 683138, -260472, -617123, -527965, -1011588, -2628551, -2513823, -1261790, -166274, -1328898, -1867577, -1030531, -308421, 260596, 390882, -475409, -1474823, -1377617, -1910350, -2339496, -2150777, -1109348, 372526, -115597, -1410369, -2962417, -3520538, -2778563, -2625392, -2787417, -2645236, -2550426, -3268142, -3385606, -2580455, -3204933, -4235511, -3059121, -1593471, -1609267, -1634262, -737080, -1174670, -3432765, -4659746, -4079139, -2782993, -1446761, 720403, 1361983, 104941, -293656, 58466, -125618, -292188, -443376, 394347, 1660842, 1914821, 684603, -1408718, -2568500, -2263255, -2508447]
15588b508447j92868j20554j035121j146575J23582J140452J024231l0047j881982
15579d627329l70232J361967M02447O43243J061922j404710k051207K93082N48679
15570d142138l2315L34455J786167n27774k516350j692397Q94873K319822M17941
15561c157716j464152p91879l2072K117955J280265K62686j50444j04665J77098
15552a862924J87164P83502k25553j483302o90712K76568K51813r10829j040490
15543d714763O00243L95077O24471j16833K41268j24743j028150j99018N39617
15534c782831M04787L08807P25644P63401J00284J330930J742630N73458j571173
15525E95937j505761m16858n40248P37077j89496M62308K293188Q90671j401087
$$ y = [-2508447, -2701315, -2821869, -3856990, -5003565, -4879983, -3739531, -2715300, -2745347, -4627329, -4997561, -3635594, -3233147, -2589904, -1527982, -2932692, -4983899, -4690817, -4142138, -4174453, -3839998, -2053831, -2581605, -5097955, -6790352, -5895479, -3575657, -3157716, -4621868, -5413747, -5445819, -3327864, -2047599, -1784913, -1935357, -2040022, -1862924, -1675760, -892258, -1117811, -2601113, -3291825, -3015257, -2763444, -3674273, -4714763, -4114520, -3719443, -3094972, -3211805, -2970537, -3095280, -4123430, -4322448, -3782831, -3378044, -3069237, -2343593, -1580192, -1479908, -148978, 1593652, 2167110, 595937, -909824, -1326682, -1866930, -1129853, -1319349, -857041, 1436147, 2326818, 925731]
15516I25731j679063l82593J735664K207200k60189j326524q82172p42497l71113
15507g75556j148008m90781J309453J133790J273145r38631k085924r04601j77820
15498b804933l87638N16039K164407J908559P98622j429252j461050r86655l59892
15489b041793n58788j03967K87521J407005R25489n71241q16411K18396O1220
15480a192569K49901p8399m10811J89042O81206N83881j387238l60411M38533
15471a286865J50718j035659m10895L32432R50580J527479J101293P13933n39663
15462A503353k20979Q92531j42246N3188Q01998P95600m45060l02062j85170l66815
15452B384338j141808j892414m00210M67883J924843J654477j70996m95951j646709
$$ y = [925731, -753332, -1135925, 599739, 2806939, 2546750, 1220226, 338054, -404443, -775556, -1923564, -2414345, -1104892, 28898, 1302043, 363412, -1722512, -2627113, -2804933, -3192571, -2676532, -512125, 1396434, 2195056, 765804, -695246, -1681901, -2041793, -2600581, -2704548, -2417027, -1010022, -84533, -655774, -1472185, -1253789, -1192569, -942668, -1021067, -1431878, -1242836, -561630, 22251, -1364987, -1725398, -1286865, -1136147, -2171806, -2582701, -2250269, -1299689, 227790, 1329083, 2043016, 1503353, 1282374, 2174905, 2032659, 2085847, 2887845, 3683445, 3238385, 2936323, 2751153, 2384338, 1242530, -649884, -1050094, -582211, 1342632, 2997109, 2826113, 2330162, 683453]
15443F83453j636369k385r32741n35873J462395J229894m9598k95654O5608k35308
15433b46578l14090Q0336O40687l41210o04572j83169q4014l46485m41110J20007
15423a720198k08851J96900j46141J13517J34385l38147k98191N75620N06592
15414a184514J036495J532915Q33350P49355o36555j095212o81957j223361j695870
15405b365354r06211Q48416J538816N19174M97934n56375p85052j073673o93246
15396b975571K38645J756676J725199J215226j259723k559186n84998L63478J42367
15387a937887M30330R32089L35190L85070P2390o83130j269767j102920j014721
15378c853356j843591o99304L62025N32463J191714J674762J383954l60918p48042
$$ y = [683453, -952916, -955301, -1888042, -2423915, -961520, 268374, 218776, -76878, -11270, -246578, -560668, -480332, 160355, -180855, -785427, -968596, -1052610, -1399095, -1840205, -1720198, -1929049, -1732149, -1878290, -1764773, -1630388, -1968535, -2266726, -1691106, -1184514, -148019, 1384896, 2218246, 2967601, 2331046, 1235834, 553877, -669484, -2365354, -3271565, -2423149, -884333, -365159, 132775, -423600, -1208652, -2282325, -2975571, -2736926, -980250, 744949, 1960175, 700452, -1858734, -2443732, -2080254, -1937887, -1507557, -575468, -240278, 144792, 217182, -465948, -1735715, -2838635, -3853356, -5696947, -6396251, -6034226, -5501763, -4310049, -2635287, -1251333, -1612251, -2360293]
15369b360293N39641M28577r2167Q45957J40586n06064j320354p68640M82507
15360b610250m0537o48205p01958O06491n63117p38700O2480M73002P84150m15843
15350c792487J18571K78170k37669J1203J147323N75582J47613J820632R85878
15341A054816j276850q66428M57675l61205J02545n23842j550812m47866O37490
15332b774477J095369N83584p81434N29030R52872j24713m30970j3656R03157
15323f1238o9395j046731k325533j927844r29725J012164K135815J358706O69313
15314a184468Q17476R39756l47395L0549n5442o20381j5578k58769k27434N03191
15304d18495J032966J081j197067j593997n38757J077062R19318Q19167P19840
$$ y = [-2360293, -1820652, -1392075, -1484242, -638285, -497699, -1003763, -2324117, -3092757, -2610250, -2650787, -3298992, -4000950, -3394459, -3957576, -4696276, -4633796, -4160794, -3376644, -3792487, -3673916, -3395746, -3633415, -3622212, -2474889, -1899307, -1751694, 68938, 1054816, -222034, -1088462, -630787, -991992, -889447, -1413289, -2964101, -3411967, -2774477, -1679108, -1095524, -1876958, -1347928, -395056, -519769, -950739, -964395, -61238, -130633, -1177364, -3502897, -5430741, -6360466, -5348302, -3212487, -1853781, -1184468, -366992, 572764, 225369, 255918, 200476, -419905, -435483, -694252, -921686, -418495, 614471, 615552, -581515, -2175512, -2714269, -1637207, -717889, 101278, 821118]
15295H21118k31020J27695J106751P2970j243395l72960j77147K3176l0874p65196
15285f68882p55656j59513J790799J236462N84981r83084k014583p13256K75438
15276a407294j1915j619510j312579M11250J73701o07572p71007J053923K316836
15267a774167P30771J208477J408928N91403o42943o20786p16161K64248P20867
15258A170637m03206j637475j284470K87900J834181R10010j026458r88694n72983
15249a710558L81945P69685L0769M16086n81440o39728j05368l70711M44204m63852
15239a828968j233021j428182k25480Q71640R37551O29441j28324J49795K9770
15230b225778j150708q47284J525440J902040O76689J257462K018918L34401o93034
$$ y = [821118, 590098, 717793, 1824544, 1897514, 654119, 281159, 104012, 127188, 96314, -668882, -1424538, -1584051, 206748, 1443210, 2028191, 1045107, -969476, -1682732, -1407294, -1419209, -3038719, -4351298, -3940048, -3766347, -4373919, -5144926, -4091003, -1774167, -1043396, 165081, 1574009, 2165412, 1522469, 901683, 185522, 449770, 1170637, 767431, -870044, -2154514, -1866614, -32433, 877577, -148881, -1137575, -1710558, -1328613, -558928, -528159, -112073, -693513, -1333241, -1438609, -1809320, -1365116, -1828968, -3061989, -4490171, -4715651, -3844011, -2906460, -2277019, -2405343, -2255548, -2225778, -3376486, -4223770, -2698330, -796290, -119601, 1137861, 3156779, 3491180, 2798146]
15221B798146j330966r52444j557508j770504j068470J60694O50465J021359R54936
15212a094292K15825R49607q64461j478278j40122P27900J290721m02053j889178
15203b684331M32007J086748k85998p54874O39705J904947J213135l95686o63739
15194D91914J04651L94694l472o69700R07694J026648j333095k289417o36331
15185b006414k91232N96048k48788l97168q0897p19248q71516l77242R55702P77943
15175b662812K97942O07333J217855K70470K78561M89856N10692P49777J039977
15166B799651M80133j23226o64303o47900j176231n37462R88885J073489L46789
15157B539825L85957n39508n84006q94657j173833J61971L96167J88979p74631
$$ y = [2798146, 1467180, 514736, -1042772, -2813276, -3881746, -3721052, -3070587, -2049228, -1094292, -878467, 71140, -793321, -2271599, -2411721, -1683821, -393100, -795153, -2684331, -2252324, -1165576, -1451574, -2206448, -1566743, 338204, 1551339, 1155653, 491914, 596565, 991259, 987787, 318087, 1225781, 2252429, 919334, -1370083, -2006414, -2297646, -1701598, -1950386, -2347554, -2428451, -3147699, -4019215, -4396457, -3440755, -2662812, -2364870, -1757537, -539682, -269212, 9349, 499205, 1009897, 1759674, 2799651, 3279784, 3156558, 2492255, 1844355, 668124, 130662, 1119547, 2193036, 2539825, 2925782, 2386274, 1802268, 907611, -266222, -104251, 291916, 480895, -293736]
15148b93736p65453O01793J037261P60849j586380k556004K55805J107105R25332
15139e13428J275806L92810n51803l3670j84076R87942n8530j380281L58292O07611
15129I00673J393451N45212q39143k97815j769719j432100R2570r35296m21552
15120b763719j305007M6270O57840J198411P55337j49748o75648n16511K33579
15111b519196J285075j021901m50085O25854M74695L01319l41450l84978p52665
15102b783332K20515J530616K236125J669682J035636M51115j203780k886652
15094B69925j496847k56066m98081n71672l87829j142223n86782j073299m97042
15085f239916J327529J913194K171479J61911j867505j222520J636905K138082
$$ y = [-293736, -1059189, -457396, 579865, 1340714, -245666, -2801670, -2545865, -1438760, -513428, 762378, 1155188, 603385, 569715, 385639, 1373581, 1315051, -65230, 293062, 900673, 2294124, 2839336, 2000193, 1702378, -67341, -1499441, -1406871, -2342167, -2763719, -4068726, -4022456, -3364616, -2166205, -1410868, -1560616, -2236264, -2752775, -2519196, -1234121, -2256022, -2706107, -2080253, -1605558, -1304239, -1645689, -2030667, -2783332, -2562817, -1032201, 1203924, 2873606, 3909242, 4360357, 3156577, 269925, -1226922, -1482988, -1981069, -2552741, -2940570, -4082793, -4669575, -5742874, -6239916, -4912387, -2999193, -827714, -665803, -2533308, -3755828, -2118923, 19159]
15077A9159L06854n41245L26556j66131O9893J688728M3994m60883j240308R08741
15067I55358J262801j954650l084406j81952K74844P86533K174734P88836j743120
15058g21022o95929M16356j07211m31045k60047J43251J51082l10958p01445J60763
15048b356205J177309P42762j233255p43928J102277Q36184j126792p22163j80860
15039b504671k168668r25965J84781J360470O87907L83963O68045M93445r26041
15030b746734q39345K25551O86660M85420p03865p7348L9122j091436l57425L2815
15020d346585P54578K316139J582995L95264r80976p17451J463845l95414L5982
15011A08377N94893r14393j410882j093372r9451M1775O39775O27716p83877r44697
$$ y = [19159, 326013, -215232, 111324, -54807, 15086, 1703814, 1747808, 1286925, 46617, 955358, 2218159, 263509, -2820897, -3002849, -2728005, -1941472, 233262, 1022098, -721022, -1416951, -1000595, -1107806, -1538851, -1798898, -1655647, -1504565, -1815523, -2516968, -2356205, -1178896, -436134, -1669389, -2413317, -1311040, -474856, -1601648, -2323811, -2504671, -4673339, -5599304, -5414523, -4054053, -3366146, -2982183, -2314138, -1820693, -2746734, -3586079, -3360528, -2673868, -2188448, -2892313, -2969661, -2930539, -4021975, -4379400, -4346585, -3592007, -1275868, 307127, 702391, -278585, -996036, 467809, 72395, 108377, 703270, -211123, -1622005, -2715377, -2814828, -2773053, -2133278, -1505562, -2289439, -3234136]
15001c234136j6113J1791l3198M79727K68812J266493M14333m32616n42804j47528
14991a965239n22858p80860M65276L91478L0858J096818R72681P46813j41028
14982B93939j281307j174666l85091l03695m75247k31255m11176K4042J724592
14973b219864J552267k63831N32769Q18097R99082J352287Q7821l42558O7436
14964B583506l2890j471516k395311j244901k35510L63486j118387K19734P33805
14955b597984J29357Q53594J041106l55623p63865q96966L8590K123488J813810
14946A385507P05221Q76547j220884k399023k050590l70674o6192l03707m921
14937c448716J10235M98624J268793J394391K13693j54917N07904K52379k312309
$$ y = [-3234136, -3250249, -3238458, -3271656, -2791929, -2523117, -1256624, -842291, -1274907, -1817711, -1965239, -2488097, -3268957, -2803681, -2412203, -2381345, -1284527, -311846, 434967, 293939, -987368, -2162034, -2547125, -2850820, -3326067, -3557322, -3968498, -3944456, -2219864, -667597, -931428, -398659, 419438, 1418520, 2770807, 2858628, 2516070, 2583506, 2550616, 1079100, -1316211, -2561112, -2796622, -2433136, -3551523, -3331789, -2597984, -2468627, -1615033, -573927, -929550, -1693415, -2590381, -2551791, -428303, 1385507, 2090728, 2967275, 1746391, -652632, -2703222, -3073896, -3140088, -3443795, -3448716, -3338481, -2839857, -1571064, -176673, 37020, -117897, 390007, 642386, -1669923]
14928a669923k374593n26591n08616j349359m50725O18247K179436K116263J202804
14919g63057K75771O58626R19922Q83432M90718J53842j72388o83308p45980o17248
14909D00330k133j38967M13810J82153l27586n18087r69262K341440K530659l91055
14899C521302L66957n2410j192145l8148J03019j04493j4801k13996j16142n50459
14889A708684m14404o91667n94523L74824J331082j29819J75171K50659j372364
14880F37643j935105j397647n01428J37615R82222J961932K097708J58289j914352
14871B26877j111415K55667p64870q15304m5995k58349p60712j143043j77489
14862d594633J052194Q13251Q63207R44806p53539r15682J500102J620294O06381
$$ y = [-1669923, -4044516, -4571107, -5079723, -6429082, -6879807, -6261560, -4082124, -1965861, -763057, -487286, 171340, 1091262, 1974694, 2465412, 2619254, 2446866, 1763558, 1017578, 400330, 398197, 259230, 673040, 855193, 527607, 9520, -959742, 1381698, 3912357, 3521302, 3888259, 3835849, 2643704, 2605556, 2708575, 2604082, 2589281, 2375285, 2259143, 1708684, 1294280, 602613, 8090, 382914, 1713996, 1584177, 1759348, 2010007, 637643, -1297462, -2695109, -3196537, -3058922, -2076700, -114768, 1982940, 2141229, 226877, -884538, -628871, -1393741, -2209045, -2255040, -2513389, -3274101, -4417144, -4594633, -3542439, -2729188, -1865981, -921175, -1674714, -2590396, -1090294, 530000, 1136381]
14853A136381J36684l47875j074712j219197j002696k16342l21678j46386j025
14844c056846O23749O1870j252338j201905R52255K019356J088246R07348j403976
14835a262241J4362Q04968L99882K33333O5020j220984j658861q89336N66204
14826b947653K143386J828253k06576j494393j132221J001767K035953M14392
14818A642908j098472j322997m79356J397374J772183p9505n50003J89757J2986
14809A484875j533532j749713j173770l59144J015794J292463J015995J00536
14801I3504l12603j06438P08709K35059Q69290J52699o02516k22177J98515J482096
14791B496138O97186j184507j865185j175273o84651k207349j277514K765184
$$ y = [1136381, 1273065, 925190, -149522, -1368719, -2371415, -2587757, -2909435, -3055821, -3056846, -2433097, -2371227, -3623565, -4825470, -3873215, -1853859, -765613, 141735, -1262241, -1247879, -442911, -43029, 190304, 255324, -965660, -2624521, -3513857, -2947653, -804267, 1023986, 817410, -676983, -1809204, -807437, 1228516, 1642908, 544436, -778561, -1257917, 139457, 1911640, 1832135, 1282132, 1471889, 1484875, -48657, -1798370, -2972140, -3331284, -2315490, -1023027, -7032, 93504, -219099, -325537, 383172, 618231, 1487521, 1640220, 1037704, 815527, 1014042, 2496138, 3193324, 2008817, 143632, -1031641, -1716292, -3923641, -5201155, -2435971]
14783b435971L303106Q05744q92185k017050j073681J483781J769008n70079j0516
14774C62157O07922m54812m05838n87432q79244m95897R40522J608437J943911
14765B639726J379888q39509j159980j167473k007141l96083R88133q62991j917328
14756c342758j623243L16466J174495K69165K36629J309713m85367k77806N4034
14747b368672k81051j69325m0811M64485J019196l29140p01572k43700N05183
14738b145407N64074J49229o8606J436099K284842J342844k6307o92275j117526
14729A726967j103847j72286j471379j433200J036520L099929N17175n94247j70878
14720A434754Q65401l04608j558101j25038J048004M46013k24783j019389j071006
$$ y = [-2435971, 867135, 1672879, 780694, -1236356, -2310037, -826256, 942752, 372673, 362157, 970079, 515267, 109429, -478003, -1357247, -1853144, -912622, 695815, 2639726, 4019614, 3180105, 2020125, 852652, -1154489, -1550572, -562439, -1425430, -3342758, -4966001, -4649535, -3475040, -3205875, -2969246, -1659533, -2144900, -2422706, -2368672, -2649723, -2819048, -2859859, -2395374, -1376178, -1705318, -2406890, -2650590, -2145407, -1581333, -1432104, -1500710, -64611, 2220231, 3563075, 3536768, 2844493, 1726967, 623120, 450834, -1020545, -2453745, -1417225, 1682704, 2199879, 1605632, 1434754, 2300155, 1995547, 437446, 312408, 1360412, 1806425, 1581642, 562253, -508753]
14711e08753k47820Q81027P31275O3016n62269k054463j559796j877509j810053
14702f945345m08625J158238K102328J800677J059009J37119N9445M67515K98293
14693b71346K27826N00269r8162p50763m24321J686895J904828O56126j96358
14684C234994k281517n91628P92908k19453r93856k14866J568960J712839N74716
14675C583097k43543J23442m48377m68245p71924J1246J222560J052091j88022
14666C872325r52665j998133j560354j557160P5614k50813m72875P92848O29676
14657a421537L09235P67735L9420q89421L3595P40731M96213q09334q56973m77606
14647b067942L70787j926944j988845j57288p83459Q7957J728831K018356J836684
$$ y = [-508753, -756573, 124454, 855729, 918745, 356476, -1697987, -3257783, -5135292, -6945345, -7353970, -6195732, -4093404, -2292727, -1233718, -1096599, -1037154, -569639, -271346, -43520, 456749, 358587, -392176, -816497, 870398, 2775226, 3431352, 3234994, 953477, 361849, 1154757, 935304, -58552, -273418, 1295542, 3008381, 3583097, 3339554, 3462996, 3014619, 2546374, 1774450, 1785696, 3008256, 4060347, 3872325, 2919660, 921527, -638827, -2195987, -2120373, -2371186, -2844061, -2051213, -1421537, -1112302, -344567, -305147, -1194568, -1160973, -420242, 75971, -733363, -1590336, -2067942, -1697155, -3624099, -5612944, -5770232, -6553691, -6465734, -4736903, -2718547, -881863]
14638h81863J009737l92818r89295q46848M1573J752520J354023n85569j485856
14629a024396l16616R42799L9310k199711j283896J393627R74205J472785K016933
14620B015040J151011Q48598j531394k066410o34839J019575R84343K82677q53609
14611A214992j469349k31906J195917J76250q54377J070474R16893j208392J20601
14602I31103J001022p05284j645213k47691K46035l23090m74131n17094j101445
14593b835788j72923o6214M94563j97728j341964J036750K119520J320303J896273
14584B252792M18359q62624k09610j476898j852429j282098n04657M67434J791384
14575a258347J205329L35187M03664M22002m12975K16231n3903N14335j45598
$$ y = [-881863, 127874, -264944, -1254239, -2101087, -2059514, -306994, 1047029, 461460, -1024396, -1341012, -398213, -358903, -2558614, -3842510, -2448883, -1474678, -1893, 2015040, 3166051, 4014649, 2483255, 416845, -217994, 801581, 1785924, 2068601, 1214992, -254357, -486263, 709654, 885904, 31527, 1102001, 2018894, 810502, 931103, 1932125, 1226841, -418372, -666063, -420028, -743118, -1217249, -1734343, -2835788, -3008711, -3074925, -2580362, -2778090, -4120054, -3083304, -963784, 356519, 2252792, 2671151, 1808527, 1598917, 122019, -1730410, -3012508, -3517165, -3049731, -1258347, -53018, 282169, 685833, 1107835, 694860, 911091, 857188, 1371523, 1225925]
14566A225925q79127J037293P35632k24176k858503j795442k94708K68852O3484
14557b720770J17098O18248O08955J057381J285502l9354j162609m08090p49622
14548a393261j311087j34506J076200P59622J43368m18477j085010m19141m69965
14539c252257N86299M31727J03827M02752j8502l91889q61300K92998K573142
14530a33203K541411K654460J567579m45924j534424k251235j636975N5843Q94426
14521A711958Q49461J045624O08185q39969j960353l92512K104215J828415J206268
14512F161292k04889k376459j487554j02703J083434Q81066J35805K17329L32936
14503D640257O3186j033975j482137j195834N2564p45674k636798k701612q19129
$$ y = [1225925, 346798, 1384091, 2119723, 1895547, -962956, -2758398, -3053106, -2784254, -2720770, -2603672, -1985424, -1376469, -319088, 966414, 927060, -235549, -643639, -1393261, -2704348, -2838854, -1762654, -1003032, -859664, -1278141, -2363151, -2782292, -3252257, -2665958, -2234231, -2130404, -1727652, -1746154, -2138043, -2999343, -2706345, -133203, 2408208, 5062668, 6630247, 6184323, 4649899, 2398664, 761689, 817532, 1711958, 2561419, 3607043, 4215228, 3375259, 1414906, 1022394, 3126609, 4955024, 6161292, 5956403, 3579944, 2092390, 1989687, 3073121, 3954187, 4089992, 4307321, 4640257, 4703443, 3669468, 2187331, 991497, 1044061, 298387, -2338411, -5040023, -5859152]
14494e859152J80719J506073K106546J108679m44071J177887K16773r9666j7314
14485a23526J325208P39055j023173j524069j126788J438288Q70735o87430m07764
14476e19464J50289K36756J613066O38385j330170k151680n58353k895176j230712
14467f047059N55156J607517J321891o48746p23631M45777K218067R70894O23730
14458C23596J278811J508124p65839j940851j477983p45097R97605J696350P21686
14449A596402Q12852L65551N22273P91027r51096j786515k109245j029761o31352
14440b419864j124354Q94034J280381R53856J470793N67944j087293n37065N50566
14431E48998j645156k832404j227793L20174R73153J468232P82918p56021r7757
$$ y = [-5859152, -5678433, -4172360, -2065814, -957135, -1401206, -223319, -6546, -106212, -123526, 1201682, 1940737, 917564, -606505, -1733293, -295005, 575730, -111700, -519464, -369175, -132419, 1480647, 2119032, 788862, -1362818, -1921171, -4816347, -6047059, -5491903, -3884386, -2562495, -3211241, -3934872, -3489095, -1271028, -300134, 323596, 1602407, 3110531, 2344692, 403841, -1074142, -1819239, -821634, 874716, 1596402, 2409254, 2774805, 3297078, 4088105, 3137009, 1350494, -758751, -1788512, -2419864, -3544218, -2650184, -1369803, -415947, 1054846, 1622790, 535497, -1568, 548998, -1096158, -3928562, -5156355, -4836181, -3863028, -2394796, -1611878, -2367899, -2465656]
14422b465656q70710k010949p42250P08420N45105P59664J490583P04728l065
14413a884130K168595J759966o31550k484581j345175L01009R20312O33719k79279
14404h41114j111684j150047m18751L12400Q43007J194446R21634j116777j081589
14395b448475j58414j48828K55794O99305p95519L89895Q25723j835426j363870
14386d579815R18838J350884J559217J233153L05007q5356j91334R2047J55833
14377G58474K08989n52526q98743K16211J54268j43163J16L09765O66988j701353
14367i80974j314218q13106J048663J371695J118434M36185M68979j807J37833
14358A471684Q57150q52255j336453r04347l21592k44740N038k45486j152558
$$ y = [-2465656, -3336366, -5347315, -6089565, -5381145, -4836040, -4076376, -2585793, -1881065, -1884130, 284465, 2044431, 1412881, -1071700, -2416875, -2115866, -1195554, -561835, -841114, -1952798, -3102845, -3521596, -3209196, -2366189, -1171743, -250109, -1366886, -2448475, -2606889, -2755717, -2499923, -1800618, -2596137, -2206242, -1380519, -3215945, -4579815, -3660977, -2310093, -750876, 482277, 787284, 701928, 510594, 602641, 758474, 967463, 414937, -483806, -267595, -113327, -256490, -256374, 53391, 720379, -980974, -2295192, -3108298, -2059635, -687940, 430494, 866679, 1335658, 1333851, 1471684, 2328834, 1476579, 140126, -764221, -1085813, -1330553, -1325515, -1571001, -2723559]
14349b723559j047874M74762O64623j94065M22471J398186O71732m62514o44224
14340a440462j323071k07387k63572J15228J225910J721889J279644r30644j312597
14331a135062N01357J288121L69357P16532J294829K85374k134084k141263m81480
14322a436319R93707R06105Q53349m33168n69928R34960L56232j1351m12214j73683
14312A007690j606415j276603q57058Q4622J158139O67274P28609k65989L73473
14303A3742m7025j688542j286341O99715P77058n81685o54658J149967R77055
14294f40714Q10727l77840j001209K10676J316961q77810j517180p70518n60246
14285c407153m82643p4118m18342p26064K11413o64508r88947j3175l13903P4029
$$ y = [-2723559, -3771433, -3296671, -2632048, -2826113, -2403642, -1005456, -333724, -796238, -1440462, -2763533, -2970920, -3234492, -3119264, -1893354, -171465, 1108179, 177535, -1135062, -633705, 654416, 1023773, 1740305, 3035134, 3320508, 1186424, -954839, -1436319, -442612, 463493, 1316842, 883674, 313746, 1248706, 1604938, 1593587, 1181373, 1007690, -598725, -1875328, -2732386, -2647764, -1489625, -822351, -93742, -359731, 13742, -33283, -1721825, -3008166, -2308451, -1531393, -2113078, -2767736, -1617769, -640714, 170013, -207827, -1209036, -998360, 318601, -559209, -2076389, -2846907, -3407153, -3889796, -3963914, -4382256, -5108320, -4896907, -5561415, -6550362, -6563537, -6877440, -6803411]
14275f803411J663152J753043O76463L87430J541258l92305j227815j91615J08983
14266b484817N70149R77966P44404J190419K509811Q81514K4065p97670k587248
14257A028593k460895p34563K2537K9093J499524L72652j070374q08405j15505
14248b237343j66465O32607J099582J284852l77123n69832J410461J317734J231478
14239C625951O9290k536185k794340j218410K79031J209077m96904j877654m196
14230c744340l86449N28348J749785J502493J353581m20397j827551j55190J290426
14221a09294P22187N16872K17121j059396j837642k700375M42612J219722n00516
14212c088709j25573N25437O36698J483608J088809J01918m29640j068364q55806
$$ y = [-6803411, -5140259, -3387216, -2710753, -2323323, -782065, -1174370, -2402185, -2593800, -2484817, -1914668, -936702, -192298, 998121, 3507932, 4389446, 4413511, 3615841, 1028593, -1432302, -2166865, -2144328, -2115235, -615711, -243059, -1313433, -2121838, -2237343, -2403808, -1771201, -671619, 613233, 236110, -333722, 1076739, 2394473, 3625951, 3695241, 1159056, -1635284, -2853694, -2574663, -1365586, -1862490, -3740144, -3744340, -4130789, -3602441, -1852656, -350163, 1003418, 583021, -1244530, -1399720, -109294, 612893, 1129765, 1346886, 287490, -1550152, -4250527, -3807915, -2588193, -3088709, -3214282, -2688845, -2052147, -568539, 520270, 622188, 192548, -875816, -1731622]
14203a731622l25379M84272J690272L60416j023231M17503P82044k43243j158514
14194g47482M93786K873323J745101j153470j398221j162607q57839o62159Q5742
14185g83826J538576M10758Q588r25313o62486o89756K26715N73873q74927k44995
14175a422793K95125l43333p33881m32199o84904j036719L14910J045633J084754
14166a913407R68298J628654J858066l27398j124740o1367J71206J73167J004260
14157B376739M82214j163352j450275j102651K81606J352231J45421m97430j601301
14148a176798j536047j96903q76238r70850Q67406J269988P44620N36921K10183
14139a127718o15262j922576r19053l61255J079472K289338J717651l00445r18109
$$ y = [-1731622, -2057001, -1572729, 117543, 477959, -545272, -127769, 654275, 411032, -747482, -253696, 2619627, 4364728, 3211258, 1813037, 650430, -207409, -869568, -783826, 754750, 1165508, 1174096, 248783, -413703, -1103459, -876744, -302871, -1177798, -1422793, -1127668, -1471001, -2204882, -2637081, -3321985, -4358704, -4043794, -2998161, -1913407, -945109, 683545, 2541611, 2214213, 1089473, 1028106, 1199312, 1372479, 2376739, 2858953, 1695601, 245326, -857325, -575719, 776512, 921933, 424503, -1176798, -2712845, -2909748, -3785986, -4756836, -3889430, -2619442, -1874822, -1337901, -1127718, -1742980, -3665556, -4584609, -4945864, -3866392, -1577054, 140597, -159848, -1077957]
14130a077957O21469O60641R1969q34801j323453j304808j016019l39394M76962
14121d045391N04568m19748N57207J426409M93991J317096R16160K93230K70904
14112A314426r02355P9433J307006k41175l74206K98036j297220n93652J114413
14103G04706M02981n483n0893l64566j15206N07530J62325o73663P99313J397756
14093B764800o22114q18526o57977j172821m38467j76222O5397J635793J014151
14084A594014K09299O21029K52850j179692k376209j855177n34172P83693J149585
14075a334780K83072r67122k270914o37235M94467J847628J607574p28579q54335
14066b560224l68697M95118K259125J372673R3206q64414M11898N92908p76106
$$ y = [-1077957, -456488, 204153, 296122, -538679, -1862132, -3166940, -4182959, -4522353, -4045391, -3540823, -3960571, -3403364, -1976955, -1482964, -165868, 750292, 1043522, 1314426, 412071, 491504, 1798510, 1557335, 1183129, 1481165, 183945, -409707, 704706, 1107687, 1102204, 1051311, 686745, 571539, 1079069, 1241394, 567731, 1367044, 2764800, 2142686, 1324160, 666183, -506638, -945105, -1121327, -1055930, 579863, 1594014, 1803313, 2424342, 2677192, 1497500, -878709, -2733886, -3268058, -2484365, -1334780, -1051708, -2018830, -4289744, -4926979, -4432512, -2584884, -977310, -1705889, -2560224, -2928921, -2433803, -174678, 1197995, 1291201, 426787, 838685, 1431593, 655487]
14057F55487q19471J23556R25782N24831J94901l86271o16340j169064j003989
14048a570578m70997o5736k78943k47793j13540M68272J917191J517861n37214
14039F18523j968560j390507L94356J115456j27825O92453m46567p84203k48008
14030b144882j43345N88212J62038l50215k11441K99385J102159J467082R95065
14021A764058l37944q36531l80774O2357l36347j537805j581665l19462N66105
14012b938008J017565K97092j83616m42670l70374Q4815J005266J69051k88946
14003a649825M36775Q18588J168073J444729j32501j168081l08932P14068Q34810
13994B157704r18252j102908k32366K58877m21485p25841j546687j354366O55594
$$ y = [655487, -163984, -40428, 885354, 1410185, 1605086, 1218815, 602475, -566589, -1570578, -2041575, -2107311, -2386254, -2634047, -2747587, -2279315, -362124, 1155737, 618523, -1350037, -2740544, -2346188, -1230732, -1358557, -666104, -1112671, -1896874, -2144882, -2288227, -1700015, -1537977, -1888192, -2099633, -1800248, -698089, 768993, 1764058, 1426114, 589583, 208809, 271166, -65181, -1602986, -3184651, -3504113, -2938008, -1920443, -1623351, -1806967, -2249637, -2620011, -2535196, -1529930, -1360879, -1649825, -1213050, -394462, 773611, 2218340, 2085839, 917758, 608826, 1322894, 2157704, 1239452, 136544, -95822, 163055, -258430, -984271, -2530958, -3885324, -3229730]
13985c229730J281386L97053q45253j227J38820P42546k39435j21010K03835J072547
13975f00468j38775j303394J68774J657430J118351m73356j228615k206161k10650
13966c216864P30884J272814M98711r23600m27485J161072J395342o41921q54050
13957a005097q40674j750163m52923J32906M23448J567786R6820q77527n47091
13948c252515J341499O95145P71787J224010J369846j35690j727076k267405J5465
13939a964934O92318R81706L75053q89033j57224k61394l8165K1325M10486R40508
13929A10646N48534l75318n6808l51173m77721L65177L53741M9886O25180J40711
13919I32855l90938j374201q31292L9832K95772k24305l95529J402417J558938
$$ y = [-3229730, -1948344, -1551291, -2396544, -2397771, -2258951, -1516405, -1755840, -1876850, -1673015, -600468, -739243, -2042637, -1873863, -216433, 901918, 428562, -800053, -3006214, -3216864, -2485980, -1213166, -714455, -1638055, -2065540, -904468, 490874, -151047, -1005097, -1845771, -3595934, -4048857, -3915951, -3492503, -1924717, -1827897, -2705424, -3252515, -1911016, -1215871, -444084, 779926, 2149772, 2014082, 287006, -1980399, -1964934, -1272616, -290910, 84143, -804890, -962114, -1223508, -1261673, -1240348, -829862, 110646, 659180, 283862, 227054, -124119, -601840, -236663, 117078, 166964, 792144, 932855, 541917, -832284, -1663576, -1623744, -1327972, -1552277, -1947806, -545389, 1013549]
13910A013549p58072j637346P9056P03729J3329n64931j655830N44637L66329
13901a895550l00205r7649J055481J418759P837r70360r85125p83317r24570m14480
13891c889179N00836M10412q73576J2689Q09400M02603J072897K157568J037038
13882A640688j935579l563164k380309k30365N83836R16353R3125r89196R34025
13873d930586J474033K05496O46129K539462J144669j085822j617591p90640N36230
13864a878620K18260j7358j45200j049389j971886r7315N65015k44732J175729
13855c445496J132741Q68846J512027J87117l2331O18073j92428j057406j231629
13846a640486L29270R40617L06769J068782J110255k31888N79054J073866l49364
$$ y = [1013549, 255477, -1381869, -1302813, -599084, -585755, -1150686, -2806516, -2261879, -1895550, -2195755, -2293404, -1237923, 180836, 188673, -781687, -1766812, -2550129, -3474699, -3889179, -3388343, -2977931, -3851507, -3838818, -3029418, -2626815, -1553918, 603650, 1640688, -294891, -3858055, -6238364, -6468729, -5884893, -4968540, -4875415, -5864611, -4930586, -3456553, -3251057, -2604928, -65466, 1079203, -6619, -1624210, -2414850, -1878620, -1660360, -1677718, -1822918, -2872307, -4844193, -4941508, -4376493, -4621225, -3445496, -2312755, -1443909, 68118, 255235, 222904, 840977, 648549, -408857, -1640486, -1311216, -370599, -63830, 1004952, 2115207, 1883319, 2462373, 3536239, 3186875]
13837C186875k882436j583280n46252p78436o41755m0713P66869J277453K23913
13828a017762k01619L88036O96942J057459K92037j005981j585197k251404P1619
13819c555870J268134J86751O17220j43319p55197J94718J472105J598870J422742
13810B306154O50917p65693o06018k43284M77292L70861J284631Q93580l41710
13801D026730j585591m75663l6528n96153j444631j194892J0556J770327L491624
13792C965779K331661p594r49869o17570p59316k212078j599584j338763l30686
13783a518020J71582M80075J215124R63960k71016j285789j412562m50760Q97738
13774a209668O13297N01444m94799l35253J255976J084588m46104l8434p42917
$$ y = [3186875, 304439, -1278841, -1825093, -2603529, -3245284, -3285997, -2519128, -1241675, -1017762, -1219381, -831345, -134403, 923056, 1215093, 209112, -1376085, -3627489, -3555870, -2287736, -2100985, -1483765, -1627084, -2382281, -2187563, -715458, 883412, 2306154, 2957071, 2191378, 1585360, 1342076, 1819368, 2190229, 3474860, 4368440, 4026730, 2441139, 1965476, 1928948, 1332795, -111836, -1306728, -1296172, 474155, 3965779, 6297440, 6289846, 5339977, 4722407, 3963091, 1751013, 151429, -1187334, -1518020, -1346438, -866363, 348761, 1312721, 1041705, -244084, -1656646, -2107406, -1209668, -596371, -94927, -589726, -924979, 330997, 1415585, 969481, 931047, 188130]
13765A88130o43419o1442j442778k120047j116234P98963Q08803k79241k96019
13756d163284Q35281J067783l0693L36242J045039R49359Q07289P79659l20429
13747A306246j741575o50539J004103N31153q26054r9981R18320N74878J12349
13738A128900j95672o41193j014602k68644k52210r03278n67474P56193R42506
13729a015474o14509j185129j650029k99067P68515P67378J068962J672116J372979
13720H85742l75692l16178M49587P07903m9942K7112p99385j737760j471511K8801
13710b651323J92099Q63958J496129n82813j075J553867L81762o27105N52278
13701A177777J180555p97948j371348j85915P51674o42778n96312M40109O89563
$$ y = [188130, -455289, -516731, -1959509, -4079556, -5195790, -4396827, -3588024, -3867265, -4163284, -3328003, -2260220, -2290913, -1954671, -909632, 39727, 847016, 1626675, 1306246, -435329, -1085868, -81765, 449388, -376666, -476647, 441673, 1016551, 1128900, 933228, 292035, -722567, -991211, -1243421, -2146699, -2714173, -1957980, -1015474, -1629983, -2815112, -4465141, -4764208, -3995693, -3228315, -2159353, -487237, 885742, 510050, 193872, 643459, 1351362, 1301420, 1328532, 529147, -1208613, -2680124, -2651323, -2459224, -1595266, -99137, -681950, -683025, 870842, 1252604, 625499, 1177777, 2358332, 1560384, 189036, 3121, 754795, 112017, -484295, -44186, 645377]
13692F45377j28077n91990O20777K9404j399132j405637j243974k72802P51169
13683b994885J821951O61729l73799J88388J36521k111886o27915J190127Q27472
13674a282297J244172r19731M0621N06567O61656J21390k035570j693894j018697
13665d375783L5937J115184J755825J820769L49899p22599O7098J2773n30779
13656d71676l72328M50181O98861J05546j45092l5772K76630L67913o87710j251204
13646a064651J15807R71595J262308O12294J31749k540332j800163M04379J447807
13637d59207l05555r22213Q50084N76125p31797p54516M19615O01171o7220M40877
13627c52636M23971r54611k72662L67061J4981j391181o52166n87870p20852M91308
$$ y = [645377, 517300, -74690, 546087, 575491, -823641, -2229278, -3473252, -3746054, -2994885, -1172934, -511205, -885004, -696616, -560095, -2671981, -3299896, -2109769, -1282297, -38125, -957856, -917235, -410668, 250988, 372378, -1663192, -3357086, -4375783, -4339846, -3224662, -1468837, 351932, 701831, -20768, 46330, 59103, -471676, -844004, -393823, 305038, 410584, 265492, 229720, 506350, 874263, 186553, -1064651, -948844, 22751, 1285059, 1897353, 2029102, -511230, -2311393, -1907014, -459207, -764762, -1686975, -836891, -260766, -992563, -1747079, -1327464, -726293, -793513, -352636, 71335, -883276, -1155938, -788877, -773896, -2165077, -2817243, -3405113, -4125965, -3634657]
13617c634657J230353J769594J784685N29904o08511m40218M83843N53731p14246
13608I54478P91673Q58750p3463n14835p8413l09669o89035M33242O44308j513999
13598E03037n46486m15525j163765o47991N21172M12467q36735m61779k06554
13589b842159l66484N80575J187348J414081P08720J067833J008649L27088q03888
13580B281763q72234K25626j157278r70418l71549j914831j924191K12897J638362
13571b851853K050367J131321N28134o61333o45461P62270J071604J589745N71978
13562C546772o40349j425819j464362o86802q54710o76878j33003R22591J866025
13553D53465J506285Q48818L60489k0074K20386Q51092J221437o70080j737142
$$ y = [-3634657, -2404304, -634710, 1149975, 1679879, 1071368, 631150, 1114993, 1668724, 954478, 1746151, 2604901, 2531438, 2016603, 1938190, 1628521, 939486, 1372728, 2017036, 503037, -43449, -458974, -1622739, -2270730, -1749558, -1337091, -2173826, -2635605, -2842159, -3208643, -2628068, -1440720, -26639, 682081, 1749914, 2758563, 3085651, 2281763, 1409529, 1635155, 477877, -492541, -864090, -2778921, -4703112, -4490215, -2851853, -801486, 329835, 857969, 196636, -448825, 313445, 1385049, 2974794, 3546772, 2906423, 1480604, 16242, -670560, -1525270, -2202148, -2335151, -1412560, 453465, 1959750, 2808568, 3169057, 3148983, 3369369, 4220461, 5441898, 4771818, 3034676]
13544C034676j113695j10182j21029p17223j652534j248620n82742m78295r34433
13535c924077J8065K48850r70638k220J720308J561549J47454P87491j16693r00934
13525a430845N29147K19804m02621L85017Q63723O25431j20049J455150L98774
13516B523531j088494q11417p52068j78765M46778j508423j135254N56477k74024
13507b221659j027985j813732N16903J487381R65418J204002J451597nq34841
13498b72921L92947Q15245L4669M72886l45738j338924j196586n74009L04777
13489a707654o06360j329153K90129J020115k40398J474771K511134J664487M90172
13480C567243p68630j536823j534962o60001k44144K824j98910N93887K599965
$$ y = [3034676, 1920981, 1810799, 1689770, 972547, -679987, -1928607, -2511349, -2989644, -3924077, -3906012, -3657162, -4627800, -4630020, -2909712, -1348163, -1200709, -413218, -529911, -1430845, -901698, -681894, -1084515, -699498, 164225, 789656, 669607, 2124757, 2523531, 1435037, 623620, -128448, -307213, 139565, -1368858, -2504112, -1947635, -2221659, -3249644, -5063376, -4546473, -3059092, -2093674, -889672, 561925, 561920, -272921, 120026, 935271, 969940, 1442826, 1097088, -241836, -1438422, -2012431, -1707654, -2314014, -3643167, -3353038, -2332923, -2573321, -1098550, 1412584, 3077071, 3567243, 2798613, 1261790, -273172, -933173, -1177317, -1174493, -1373403, -779516, 1820449]
13471A820449K851796J201532j244038l213599m81078P41255j124794j01492J445680
13462A895711K61210m40059j62431n29072k27432n24809j46466k87800O32670
13453D71522L99713p82425j233025L00805Q39265M84330N84449J16782J065498
13444B246914J52613J91046k94842o6334q3453q21622p36521J116561P51408l74588
13434B081182L92804o37082J67124Q50342k83843R6907J598058J709862k17461
13425E757893j790082j481435p70288j174096r29227m50301M56004J052111K399134
13416C069713Q27065o39215p19639j561817j25066J484796J69762k26372p33258
13407A545969r31451K12146K95761J12578J797190J893049J584618M69403j255728
$$ y = [1820449, 4672245, 5873777, 4629739, 1416140, 935062, 1676317, 551523, 450031, 1895711, 2156921, 1716862, 1554431, 1025359, 797927, 273118, 126652, -161148, 471522, 871235, 88810, -1144215, -843410, -4145, 480185, 1064634, 1181416, 2246914, 2399527, 2590573, 2295731, 2229397, 2145944, 1324322, 587801, 1704362, 2455770, 2081182, 2473986, 1836904, 2004028, 2854370, 2570527, 2667434, 4265492, 5975354, 5757893, 3967811, 2486376, 1716088, 541992, -387235, -837536, -381532, 670579, 3069713, 3896778, 3257563, 2537924, 976107, 851041, 2335837, 2505599, 2279227, 1545969, 614518, 826664, 1122425, 1235003, 3032193, 4925242, 6509860, 6979263, 5723535]
13398E723535j961383p30531L23826j114610j631423N36770J566150J894094J841923
13389F448351N58327O164L92164j479393l281215j002503N20553n74184J68749
13380A757013J088150J586726L85552n01727J046131J466407Q45654n41078j883090
13371E249738q85396Q6254R49276M55165l54593M87737j06440m91648Q837k31872
13361E167058J973540K392188J515001K05578k95939p29250p1834K92942l26299
13352A0122985K97158O91069J065821J739567J622421R19026P11864J765784K295326
13343B1231021K379193J971317K414565M008598N004040M937161L051914M148703
13335D9146512O239825Q027688P572372Q559332J0433572J2615601J5790331J7688740
$$ y = [5723535, 3762152, 3031621, 3355447, 2240837, 609414, 1146184, 2712334, 4606428, 6448351, 7006678, 7012842, 7405006, 5925613, 2644398, 1641895, 2162448, 1588264, 1757013, 2845163, 4431889, 4817441, 4315714, 5361845, 6828252, 7673906, 7132828, 5249738, 4364342, 4450596, 5399872, 5855037, 5500444, 5988181, 5881741, 5390093, 5398930, 5167058, 7140598, 9532786, 11047787, 11253365, 10957426, 10228176, 10156342, 10449284, 10122985, 10420143, 11111212, 12177033, 13916600, 15539021, 16458047, 17169911, 18935695, 21231021, 23610214, 25581531, 27996096, 32004694, 37008734, 41945895, 44997809, 49146512, 55386337, 63414025, 70986397, 79545729, 89979301, 102594902, 118385233, 136073973]
13327A36073973J9870713K2270186K4028897K4288701K3696225K3134279J7964131
13320B91327105P585013o583080k1079407l1735319l3833854k9947670k7251922
13313A48480866k3551902j8412675j4032180j0438428q351474q678162p920440
13306E7095605n964364m226843l083337l582542m023679l044978j179232r19458
13298C1071172j465271j455414p15799j465137j597371k715723l377051j098115
13290A7181291m57151j414473j563086J587558J147914O28943R179n20692p71899
13281A5827584j796063j973846m92043J741183J338236j96868k45254J326559
13273A5529488J164022m05826O51373N85151p11914n09268J275774J243893N42898
$$ y = [136073973, 155944686, 178214872, 202243769, 226532470, 250228695, 273362974, 291327105, 298912118, 292329038, 271249631, 239514312, 205680458, 175732788, 148480866, 124928964, 106516289, 92484109, 82045681, 73694207, 65016045, 57095605, 51131241, 46904398, 43821061, 40238519, 36214840, 33169862, 31990630, 31071172, 29605901, 28150487, 27434688, 25969551, 24372180, 21656457, 18279406, 17181291, 16724140, 15309667, 13746581, 15334139, 16482053, 17110996, 17120175, 16599483, 15827584, 14031521, 12057675, 11565632, 13306815, 14645051, 14448183, 14202929, 15529488, 16693510, 16287684, 16939057, 17524208, 16812294, 16303026, 17578800, 18822693, 19365591]
13264A9365591L77005J960376L796279K826904J616622R48996L02153Q40956K301908
13255C4336790K706601J894273O76121J645382K650657K933375M251209N985500
13247E7079908P702559Q512639R304007J0203962J1226115J3287884J6623842
13240A33940916J9695156J9553466J9846193K2762510K6704607K7380213K2339833
13233B92222894J2338057k066214j7424547k9573945l3688034l2954790k9078187
13226A59775234k4365866k0278288j6309536j3932641j0199753q381702p678628
13219E8628820n476852m314159m085137l956753j666708k50734o85450k209602
13211C5983425k387985k259400j652468k35853M60929j464996k022509j761518
$$ y = [19365591, 19742596, 21702972, 25499251, 28326155, 29942777, 30891773, 31193926, 32034882, 34336790, 37043391, 38937664, 39613785, 41259167, 43909824, 46843199, 51094408, 57079908, 64782467, 73295106, 82599113, 92803075, 104029190, 117317074, 133940916, 153636072, 173189538, 193035731, 215798241, 242502848, 269883061, 292222894, 304560951, 302494737, 285070190, 255496245, 221808211, 188853421, 159775234, 135409368, 115131080, 98821544, 84888903, 74689150, 66307448, 58628820, 53151968, 48837809, 44752672, 40795919, 39129211, 38878477, 38193027, 35983425, 33595440, 31336040, 29683572, 29447719, 29908648, 28443652, 26421143, 24659625]
13203B4659625k205774r43316j035197r45032L76097m42626j015833o65910p34331
13194A7047703p59984n17785m28183M45952J124304J095218n65287j392476o94180
13185A5355282Q27373J783124O22878l34914K84676J164345P58473P29540N28752
13176B1719529N62528k75855j335088J51863Q41279K011653J119596K607136K898702
13167C0301343J828361K538631K895105K383844J254840K340749M976857Q581649
13159E7101379R760467Q952187J0140947J2635895J2834661J4501944J6802814
13152A42730294K0685928K3018390K3214621K4432840K4459391K2240062J5650121
13145B96431647M872232j0367544k5252278l3427687l3694920l0435480k6036542
$$ y = [24659625, 22453851, 21510535, 20475338, 19530306, 19906403, 19463777, 18447944, 17782034, 17047703, 16287719, 15769934, 15341751, 15787703, 16912007, 18007225, 17441938, 16049462, 15355282, 16182655, 17965779, 18588657, 18253743, 18538419, 19702764, 20461237, 21190777, 21719529, 22282057, 22006202, 20671114, 20822977, 21664256, 23675909, 24795505, 27402641, 30301343, 32129704, 34668335, 37563440, 39947284, 41202124, 43542873, 48519730, 57101379, 66861846, 75814033, 85954980, 98590875, 111425536, 125927480, 142730294, 163416222, 186434612, 209649233, 234082073, 258541464, 280781526, 296431647, 301303879, 290936335, 265684057, 232256370, 198561450, 168125970, 142089428]
13138A42089428k0926064j7372371j4021223j1367665r550593o666660m961657
13131E7223195m466639m843953m313997m838747m897956k829826j115103j137248
13123B8779726k571182j147871p92296j900478k854148j865587j113508p58969
13115A5775687K64059k98102M99532j06686l021139k163476J081988K49229k05152
13106A2075940m04383j725073n77345q95645j157959j101786N8738J467023J241941
13097H981451j98668m59169r92089j534096M05735P49159J02144n12892r04172
13088E637403o08647j225046r79773k5454J53905j65801L38186J375829N16640
13079E017242j22163J23546J948167J058109q29986o01434q18047l99442Q06616
$$ y = [142089428, 121163364, 103790993, 89769770, 78402105, 68851512, 62184852, 57223195, 52756556, 47912603, 43598606, 38759859, 33861903, 31032077, 29916974, 28779726, 26208544, 25060673, 24268377, 22367899, 19513751, 17648164, 16534656, 15775687, 16039746, 15741644, 16241176, 16134490, 13113351, 10949875, 12031863, 12281092, 12075940, 11671557, 9946484, 9369139, 8473494, 7315535, 6213749, 6272487, 7739510, 8981451, 8782783, 8323614, 7331525, 5797429, 6203164, 6952323, 7054467, 6541575, 5637403, 5028756, 3803710, 2823937, 2798483, 2952388, 2786587, 3124773, 4500602, 5017242, 4895079, 5018625, 6966792, 8024901, 7194915, 6593481, 5775434, 5375992, 6182608]
13070F182608J94296j010849k81187r8664l24962P55626J974919m4521j698206
13061E649060j320939K97433O96465O11272p49547j369543L59232J226627p8213
13052E321847r71957M61268P21696J64292m06879j101907j740165j207686N61219
13043A801728R32625j59617J69815J6179M58885R48261J164648q1883p22685j013866
13033C514090k26544L99531K472851J266332j468126q94215r8371r31187j179803
13024B854558o34051j311673K59896K064756N53123K48883j024595O6586k2363
13015C055120j695018j76172K85148r62581p96218k90476J47464l60165J93066
13006e99832O50424l15888L13125Q71398L87226N37607R8714n9501k291374j567408
$$ y = [6182608, 6376904, 5366055, 5084868, 4986204, 4661242, 5416868, 7391787, 7347266, 5649060, 4328121, 4625554, 5322019, 5933291, 5183744, 3814201, 4173433, 5400060, 5321847, 4349890, 4811158, 5532854, 5697146, 5290267, 4188360, 2448195, 1240509, 1801728, 2734353, 2574736, 2744551, 2760730, 3219615, 4167876, 5332524, 5250641, 4527956, 3514090, 3287546, 3687077, 6159928, 7426260, 5958134, 5063919, 4965548, 4034361, 2854558, 2220507, 908834, 1168730, 3233486, 3786609, 4035492, 3010897, 3077483, 3055120, 1360102, 1183930, 1469078, 506497, -289721, -580197, -432733, -792898, -599832, 50592, -265296, 47829, 919227, 1306453, 1844060, 1942774, 1883273, -408101, -1975509]
12996a975509J159749K568849P31630q61158o30518m56210M65194J82862K84486
12987A469375p97496j066002j275554j864734r30404j697968K91244K737080L117999
12978a6460J414400k47632p52233K97741O43146L72828n50426r24611p69532o46844
12968a179623L50590p2950R5575L75057j877521n98991P20561J049193k70894
12959a409003J27769Q77998Q11255J704648J013361Q76976m91979j763783o60785
12950A086457k1623M8012m16989r23060m66294r9056j04962Q94679J122670J94769
12940A314603k82535L14918N43990K60869q95122o33112j06887j325837J18161
12931f90952K8966j14248N699J349364K84863p64264O29160J254510N15082m86705
$$ y = [-1975509, -815760, 1753089, 2484719, 1623561, 993043, 536833, 1002027, 1184889, 1469375, 671879, -394123, -1669677, -3534411, -4464815, -6162783, -5871539, -3134459, -16460, 1397940, 1150308, 398075, 695816, 1338962, 1711790, 1161364, 236753, -532779, -1179623, -829033, -901983, -806408, -431351, -2308872, -2907863, -2187302, -1138109, -1409003, -1281234, -403236, 408019, 2112667, 3126028, 4003004, 3511025, 1747242, 1086457, 1064834, 1112846, 695857, -227203, -693497, -792553, -897515, -2836, 1119834, 1314603, 1032068, 1346986, 1890976, 2151845, 1256723, 623611, 516724, -809113, -690952, -661986, -776234, -770535, 578829, 863692, 99428, 728588, 1983098, 2498180, 2011475]
12921B011475j88718p70511j031038m71353M98786M49274Q79424j296812n29215
12912d48688N12978o07701n20830n66874j11912P3076j53350J159797O6639j243273
12902a840138K03026Q69076M48518p25968j48993P35788Q61068P95581l71564
12893H26394j998101p93786J817825Q82341j55909j50519j29403Q82211Q46605
12884B027658R690J39662N33048N03451k84082q69457q44824R5386J551852J829769
12874D692153J28830k163111k502651j018345R41316K68306j53791l44070k56433
12865d07796J649071J266051k74837j123995j242476k179913p64330K376429J856147
12856A154351j97094l77335L37628K0612M46185J840989R01689q92121q06704
$$ y = [2011475, 1822757, 1052246, 21208, -450145, 48641, 497915, 1377339, 80527, -448688, 64290, -543411, -1064241, -1631115, -1743027, -1669951, -1823301, -663504, -596865, -1840138, -1637112, -768036, -319518, -1045486, -1194479, -458691, 402377, 1197958, 826394, -1171707, -1965493, -147668, 734673, 578764, 428245, 298842, 1181053, 2027658, 2037348, 2177010, 2710058, 3213509, 2929427, 2059970, 1215146, 1310532, 2862384, 4692153, 4820983, 2657872, 155221, -863124, 78192, 346498, 192707, -151363, -407796, 1241275, 2507326, 2232489, 1108494, -133982, -2313895, -3078225, -701796, 1154351, 957257, 579922, 917550, 938162, 1384347, 3225336, 4127025, 3234904, 2428200]
12847B428200j197313r08321n61938L61555n00089n99315P90702J121622m24494
12838E10609k29053J576650J45563p80130o98884o58648P06731K144188J983363
12829D700389l59966j061477L80834R56140l03963n13969j050927o87578r60666
12820A098817M86761J546519L26899r53085k015373j265450K66321O76750J526880
12811A695039q40322k558470j335583j78410K40382Q73580M16915n48872j418561
12802c654302k98425R37825J623332J708029J920456J793384p11664j856833o89393
12793G72409L21108j67447j33854O10645M05258m5731k74778P89681N84399P23314
12783C585004n0136q57199r99631M30049J125428K14001j187995m03749J161779
$$ y = [2428200, 1230887, 322566, -239372, 122183, -377906, -977221, -186519, 935103, 510609, 281556, 1858206, 2003769, 1223639, 524755, -133893, 572838, 2717026, 4700389, 4340423, 3278946, 3659780, 4615920, 4311957, 3797988, 2747061, 2059483, 1098817, 1585578, 3132097, 3458996, 2505911, 490538, -774912, -508591, 168159, 1695039, 854717, -1703753, -3039336, -3217746, -2977364, -2103784, -1686869, -2235741, -3654302, -3952727, -3014902, -1391570, 316459, 2236915, 4030299, 3318635, 1461802, 772409, 1093517, 926070, 792216, 1402861, 1808119, 1762388, 1487610, 2277291, 2861690, 3585004, 3534868, 2677669, 1678038, 2108087, 3233515, 3447516, 2259521, 1855772, 3017551]
12774C017551R75894N75970K24329r45256j671360j310811j556093j88815m4926
12765i23517j077844j04895O06996L68292Q8646l26710J350497K739597J765997
12756D487059R26272n48100j332194p64130k140593k786012p9793J589743P06124
12747E8376j360046j612284J59350Q81535N73533J565726J255257l78268O61812
12738A804991K15046p51715q97515o71586j537058k46648M91096R09149J714358
12729A030118n92502j180965n18729j132027J00611J503180N54809j583771j658662
12720c477938Q72001J576205J340222Q02900l36319p89253k49800M84063K30880
12711D52961j937322p46759J027910J425014J080481j359319j194002O3103r46887
$$ y = [3017551, 3993445, 4569415, 4793744, 3848488, 2177128, 866317, -689776, -878591, -923517, -2001361, -2106256, -1499260, -1130968, -1042322, -1369032, -18535, 2721062, 4487059, 5413331, 4865231, 3533037, 2768907, 628314, -2157698, -2237491, -647748, 58376, -1301670, -2913954, -2754604, -1873069, -1299536, 266190, 1521447, 1143179, 1804991, 2020037, 1268322, 370807, -300779, -1837837, -2084485, -1593389, -684240, 1030118, 437616, -743349, -1262078, -2394105, -2293494, -790314, -235505, -1819276, -3477938, -2605937, -1029732, 310490, 1113390, 777071, -12182, -261982, 222081, 452961, -1484361, -2231120, -1203210, 221804, 1302285, -57034, -1251036, -1187933, -2134820]
12702b134820J539L08578L64375L92094J85229N89512J145697R65262M39365N75038
12692B831869M4712j124392j938805r56774K89386K98640o62676j268253m03532
12683b889825Q38289J738458J264222Q60796m14079j291592j981069j260582L43688
12674b791694P45887j8724m20965q16828K99019K195668J597977J04907l48514
12665E46733j17260L2869J95797J56858j58196R2948L62566L77366q38082K4802
12655F76401j61504J92643L86832n66446p91497J831388J618603p78780j883633
12646E24007n11594O95977N77455j034189j417672j96467O23075j05995j519257
12637b364660q80861Q75333J499833R48703R64988P52028l8372j233381m33402
$$ y = [-2134820, -2133281, -1824703, -1460328, -1068234, -883005, -293493, 852204, 1817466, 2256831, 2831869, 2876581, 1752189, -186616, -1143390, -854004, -555364, -1218040, -2486293, -2889825, -2051536, -313078, 951144, 1811940, 1397861, 106269, -1874800, -3135382, -2791694, -2045807, -2064531, -2485496, -3302324, -3003305, -807637, 790340, 895247, 546733, 429473, 462342, 658139, 814997, 656801, 749749, 1112315, 1489681, 651599, 676401, 514897, 707540, 1094372, 527926, -263571, 1567817, 3186420, 2407640, 524007, 12413, 708390, 1285845, 251656, -1166016, -1362483, -739408, -845403, -2364660, -3245521, -2370188, -870355, 78348, 1043336, 1795364, 1756992, 523611, 90209]
12628I0209j88909O90305J873316L77114j060884o56141J146557j95200j180472
12619H95895m64857O86135J728834J606954K85772j801303j223457L39677P81094
12610B834744K41027o83794j331707j587619J99009J262224m66671r94815O55099
12601A27497R70983j065112j329803O77768J322057O78454j96813q04748j023939
12592f43656j55883R55489p63086j127483p86237J6182J603387J195978J47394
12583D42085l4045K54054N04100j024492q15548l52204J92846N79046R71684J733111
12573B450637K08197j699245j202539o89972K40104j43926j8395P14427P6032
12564f4680l34158K74820p6647k20351K22916M66970L03719L33956J110843J015434
$$ y = [90209, -98700, 591605, 2464921, 2842035, 1781151, 1125010, 2271567, 2076367, 895895, 431038, 1117173, 2846007, 4452961, 4738733, 2937430, 1713973, 2053650, 2834744, 3075771, 2391977, 1060270, -527349, -328340, 933884, 467213, -527602, 127497, 1098480, 33368, -1296435, -618667, 703390, 1381844, 1185031, 380283, -643656, -799539, 155950, -607136, -1734619, -2520856, -2504674, -901287, 294691, 442085, 408040, 662094, 1166194, 141702, -673846, -1026050, -833204, -254158, 717526, 2450637, 2658834, 959589, -242950, -932922, -692818, -836744, -855139, -140712, -64680, -398838, -124018, -200665, -421016, -198100, 268870, 572589, 906545, 2017388, 3032822]
12554C032822k83334k567637k394091k69345J427006Q29477R03757J178123J121458
12545B978236P82317k30198r5598l93406l109999k686224j233482R64541J882593
12536a141220P05091R21696J196056n43046j372805L28271l32956m2841K700326
12527B418572J842529K42734L09310j669940j663544j640254j653652p65191k0822
12518b600258k7531n99260p27345l85827K2462L01710N19248R45106R43651p73370
12508b381414n61499R8032M96486J377932M09835m30568R97676r8157j374912
12499a466589o33453J51495K30120p77808k34623L1684l99267K03400J42449M57354
12489b295238P16457o57937o55747q30026n63144J654185J485834L64435J430015
$$ y = [3032822, 2749488, 181851, -2212240, -2481585, -1054579, -225102, 678655, 1856778, 2978236, 3760553, 3530355, 3434757, 3041351, -68648, -2754872, -3988354, -3023813, -1141220, -436129, 485567, 1681623, 1138577, -234228, 94043, -238913, -281754, 2418572, 4261101, 4503835, 4813145, 3143205, 1479661, -160593, -1814245, -2579436, -2600258, -2627789, -3227049, -3954394, -4340221, -4317759, -4016049, -3496801, -2551695, -1608044, -2381414, -2942913, -2844881, -2348395, -970463, -560628, -991196, 6480, -91677, -1466589, -2100042, -1948547, -1718427, -2496235, -2730858, -2699174, -3098441, -2895041, -2752592, -2295238, -1578781, -2236718, -2892465, -3722491, -4285635, -2631450, -1145616, -781181, 648834]
12480F48834l86575j573464n20958P18920R71802n84179k61182j86507M5564P90100
12470c37645J678995Q73956j099403r55749o15439N22620L69817J08005n16617
12461B8540j484885n93183K57851L76762Q40295J212947j97021q92954J70692
12452b80956R70407n61705m65794o86566k052313M94638J060953n67801n52870
12443b642007O8009m49321k96455p00230O79584J127142M99806r8087K58808J073833
12433d78918O58365q99499p03473o82266K08735J676808K3611m4070J395994L44667
12423A499954r92258q96224N00315K79349p8042K43439o68484p07139J241876
12414D22786o96780j435921q18295J12833L67040M71310m21811J06488P50232
$$ y = [648834, 262259, -1311205, -1832163, -1113243, -141441, -725620, -986802, -1173309, -1127745, -337645, 1341350, 2215306, 1115903, 160154, -455285, 67335, 437152, 545157, 28540, -1456345, -2049528, -1791677, -1414915, -574620, 638327, 441306, -451648, -280956, 689451, 127746, -338048, -1024614, -3076927, -2582289, -1521336, -2089137, -2642007, -2573998, -3023319, -3319774, -4020004, -3340420, -2213278, -1713472, -1811559, -1552751, -478918, 179447, -720052, -1423525, -2105791, -1897056, -220248, -196637, -240707, 1155287, 1499954, 507696, -388528, 111787, 391136, 313094, 556533, -111951, -819090, 422786, -273994, -1709915, -2528210, -2415377, -2048337, -1577027, -1998838, -1892350, -1142118]
12405a142118Q65937O02494J51526p82626J36267J664270m37320j481075o75676
12396a098321m63426L75456J179757J070219q92486r67162J612456J360327O0152
12387B236972p3688j16559J89560l70101k427544k831749m44916J6996K0149L56185
12377c444695K87899j17818j35914l30775J568629R32864k43098n36719k2413
12368b042040Q5851M09M81483J399929O47605Q0037M29316O09658j07375j156326
12358D28547k4491J36340m1163K18146R20598M53072j769672l351787k823666
12349e854076o94588O61948Q18156p1063M49591j989687j088920J205677J780645
12340d782317J563043K64417p75029n0413R32512O03372R18989M74727l79679
$$ y = [-1142118, -276181, 326313, 477839, -304787, -168520, 1495750, 1058430, -422645, -1098321, -1561747, -1186291, -6534, 1063685, 171199, -795963, 816493, 2176820, 2236972, 2163284, 2046725, 2236285, 1866184, -561360, -3393109, -3838025, -3821029, -3800880, -3444695, -3156796, -3274614, -3410528, -3741303, -2172674, -1239810, -1482908, -2019627, -2042040, -1956189, -1955780, -1474297, -74368, 573237, 653274, 1082590, 1692248, 1584873, 428547, 404056, 540396, 499233, 717379, 1637977, 2091049, 321377, -3030410, -5854076, -6548664, -5886716, -5068560, -5139623, -4690032, -6679719, -7768639, -6562962, -4782317, -3219274, -2954857, -3729886, -3780299, -2847787, -2244415, -1325426, -850699, -1230378]
12331a230378p36832O48779K522094K377408K036335P29878o40929j646081j893612
12322B166662p70023n13900j328002p19717K66292L85377J058712j019995r48231
12313a422825R73604J335697K02524r02269j645730j435740j85698P12482J176502
12304a191453L35029O2424o3734r04884j374276j187123q04974M84228J77920
12295d466843q80359p71076K00162J556969J270765R57745O5236K10395K25160
12286a631846l09040K84598P37906l20955j093989q37517o14087K65689N6777
12277c462464L75967J468139Q55642J57587M80283m71456o91410j040512j219200
12268c547424L99719Q15564Q58374P08213m0339k70623K02293L39077k2547p20399
$$ y = [-1230378, -1967210, -1318431, 1203663, 3581071, 5617406, 6347284, 5706355, 4060274, 2166662, 1396639, 882739, -445263, -1164980, -898688, -513311, 545401, -474594, -1422825, -449221, 886476, 1089000, 186731, -1458999, -2894739, -3080437, -2367955, -1191453, -856424, -794000, -857734, -1762618, -3136894, -4324017, -5128991, -4644763, -4466843, -5347202, -6118278, -5918116, -4361147, -3090382, -2132637, -2067401, -1857006, -1631846, -1940886, -1656288, -918382, -1239337, -2333326, -3170843, -3784930, -3519241, -3462464, -3086497, -1618358, -762716, -605129, -124846, -596302, -1287712, -2328224, -3547424, -3147705, -2332141, -1473767, -765554, -805893, -1076516, -874223, -535146, -557693, -1278092]
12258a278092o56866K35185R51002L30080j093399m41586J61448N15013Q73417
12249d03798J029705O93227m62624l83048m01359p41874K52295J023514J116220
12240A722258K85177m73755P34481P52719n67164j430842J40126Q00175O48341
12231B611516J010957L63142J82800n19947j00943j070976k585751j272292k0344
12222a401838L83416P15655k78004m01308k69094m3778J140100Q36582J37812
12213H19543J13677Q76648n21419j459287J155919J367455q38829j719104L39257
12204A33860J705843J691092n03364p5413o9420j95624j229731j739376J51479
12195a30654J274491N30096L09756O88077L785j581330k161154O13161N67278
$$ y = [-1278092, -1934958, -1699773, -748771, -418691, -1512090, -1953676, -1792228, -1277215, -403798, 625907, 1319134, 856510, 473462, 72103, -669771, -417476, 606038, 1722258, 2007435, 1533680, 2268161, 3020880, 2453716, 1022874, 1163000, 1963175, 2611516, 3622473, 3985615, 4168415, 3648468, 3547525, 2476549, -109202, -1381494, -1401838, -1018422, -302767, -580771, -982079, -1251173, -1294951, -154851, 681731, 819543, 933220, 1809868, 1288449, -170838, 985081, 2352536, 1513707, -205397, 133860, 1839703, 3530795, 3027431, 2952018, 2882598, 2686974, 1457243, -282133, -130654, 1143837, 1673933, 1983689, 2671766, 2675551, 1094221, -1066933, -453772, 113506]
12186A13506j170016o40123j329447P77362R66007K86965j062318J442599J476927
12177H61462P10101j642906j706875m27241O24988J683676P92747J354389K56455
12168B506796r65779j393799L23118M15311P90255J143616j72356o05739R4245
12159B135668l41256l92875O00465Q66869N10408J048955L04746q52709n60406
12150C319865j713969p18143R24342K62058J068821J256112k11942q31751q8248
12141C267145r93383p74401L80621K48814k12686o32055j63547o1588n89314L88790
12131H58396L80526m8712j407963j343400k67056m8391j103192j5743K22937J76742
12121b595856q33152M87371K319391K430992J853135N91198l42321J015943m71340
$$ y = [113506, -1056510, -1696633, -3026080, -2248718, -1282711, -995746, -2058064, -615465, 861462, 1571563, -71343, -1778218, -2205459, -1580471, 103205, 895952, 2250341, 2506796, 1541017, 147218, 470336, 885647, 1675902, 2819518, 2647162, 2041423, 2135668, 1794412, 1401537, 2002002, 2868871, 3379279, 4428234, 4732980, 3880271, 3319865, 1605896, 887753, 1812095, 2074153, 3142974, 4399086, 4187144, 3355393, 3267145, 2273762, 1499361, 1879982, 2128796, 1916110, 1284055, 1120508, 1058920, 469606, 858396, 1238922, 1190210, -217753, -1561153, -1828209, -1876600, -2979792, -2995535, -2772598, -2595856, -3429008, -2941637, -622246, 1808746, 3661881, 4253079, 3910758, 4926701, 4455361]
12112D455361p13300j496634q77256m73495l94924p0074j76304j049793j931888
12103b728307L35571J336040j85058k178278n12946J089009P03858Q2791M06873
12094a650447R09307M1436r12537K50424K174392R26823p90007j106392j953451
12085b110452j051579J78883K76887R99492K317604R84808j841779q89736q74039
12076b009911k017184j017349J892814K033825M05196R19950N64462o28906m3652
12067I9245P09222L91967N11844j75805j740489l065001p85948J172250P37373
12058b145342M34103L27318J481631J403233K04459o47978o42353j082588j573018
12049b240535j101275q34846Q1108J208470J176914J771828Q23364J596327O55641
$$ y = [4455361, 3742061, 2245427, 1368171, 894676, 499752, 429678, 253374, -796419, -2728307, -2392736, -1056696, -1241754, -3420032, -3932978, -2843969, -2140111, -2057320, -1650447, -741140, -699704, -1612241, -1361817, 812575, 1739398, 949391, -157001, -2110452, -3162031, -2983148, -2706261, -1706769, 610835, 1595643, -246136, -1135872, -2009911, -4027095, -5044444, -3151630, -1117805, -712609, 207341, 771803, 142897, 99245, 808467, 1200434, 1712278, 1536473, -204016, -3269017, -4054965, -2882715, -2145342, -1711239, -1383921, 97710, 1500943, 1705402, 1057424, 415071, -667517, -2240535, -3341810, -4176656, -4095548, -2887078, -1710164, 61664, 885028, 2481355, 3136996]
12040C136996m62824n11516j190056j265658m50537p50765j877947k624325j555193
12031g551825J148029K566415K002826K279379J176661n07403J247085K63133
12023B624300j1812J49708r76091j821843k189889m12051J517306J303768k1470
12014A61926m13158j92983q71894o49191K01584M99132J302036N54771n39087
12005E3136o72081N79708m24382j576003L10675N09395k49444n70924J727o338
11995b044531m82504j079474R1232J723664J385876o939K16140K82875q7516m6943
11985d8120j387648j552448l62490o42755N67127J629701J567680M28092p79228
11976e80089Q05807J811339O4429j371457n64816N53955N30810l58071j47524
$$ y = [3136996, 2674172, 2162656, 972600, -293058, -743595, -1494360, -3372307, -5996632, -7551825, -6403796, -3837381, -1834555, 444824, 1621485, 1114082, 2361167, 2624300, 2612488, 2762196, 1786105, -35738, -2225627, -2637678, -1120372, 183396, 161926, -251232, -444215, -1316109, -1965300, -1763716, -1264584, 37452, 592223, 53136, -618945, -39237, -463619, -2039622, -1728947, -1219552, -1468996, -2039920, -2038193, -2044531, -2527035, -3606509, -3515277, -1791613, -405737, -412676, -196536, 86339, -1177, -48120, -1435768, -2988216, -3350706, -3993461, -3426334, -1796633, -228953, 199139, -580089, 225718, 2037057, 2101486, 730029, 165213, 719168, 1249978, 891907, 744383]
11967G44383J74619k79293j710606n45784Q11362K80529n64635J72377K916915
11958A999867J356860j65256l80765J7795n95239j9763J010866m15491j490954
11949A317920q17191m41150j86288p44751m7637O59356K32534q79608j58784P310
11939a058289J323900K099183n27020k322498j566180k33729J97157K61992l46590
11930b172074J352292J487393O31348O51750k66260k119664j659841K04647J157750
11921g32659P68891l92304j90714K44436k92421j166190l71865N45588J473360
11912a13878P19810m53300M74849L29756k83372K634M18172p0956K31617o68648
11902E86684q42310M09392J474830K057800L19979k325884j115016n51125J48856
$$ y = [744383, 919002, 639709, -1070897, -1616681, -805319, -524790, -1089425, -917048, 1999867, 3356727, 3191471, 2810706, 2828501, 2233262, 2213499, 3224365, 2808874, 1317920, 500729, 59579, -126709, -871460, -919097, -259741, -27207, -906815, -1065599, -1058289, 265611, 2364794, 1837774, -484724, -2050904, -2284633, -2087476, -1825484, -2172074, -819782, 667611, 1298959, 1950709, 1684449, -435215, -2095056, -1890409, -732659, 36232, -356072, -546786, -302350, -594771, -1760961, -2132826, -1587238, -113878, 605932, 152632, 627481, 957237, 673865, 676499, 1094671, 1023715, 1255332, 586684, -255626, 153766, 1628596, 3686396, 4006375, 1680491, 565475, 14350, 163206]
11893A63206K589011M65683j512512r03048k85171n88372K51922j54805p97128
11884g71214R2787l1502k60311O13069p34054j183006j141111O23049J572183
11875a220110J83245k37090J09592J107751P64831j263107n398K636205J657303
11866C733222p06898p81021n99142r5772l49907j824588m90428J14121n3657p7693
11856a131763k78033r8973P21077Q07153M65728Q57357Q35900p16133R5591j08516
11846A449388J11209N96912J508376K522520J223926O78897J324848J256120L51504
11837A1023700L78085L81572J642340K676216L922870M338604K777591K140558
11829B9281536L886993M964684N505989M071429L875381J845898Q95229j422977
$$ y = [163206, 2752217, 3217900, 1705388, 802340, 517169, -71203, 180719, 25914, -771214, -678427, -709929, -970240, -357171, -1091225, -2274231, -3415342, -2792293, -1220110, -1036865, -1273955, -1164363, -56612, 708219, -554888, -560286, 2075919, 3733222, 3026324, 2245303, 1646161, 1550389, 1200482, -624106, -1114534, -1000413, -1054070, -1131763, -1409796, -1508769, -787692, 19461, 485189, 1342546, 2178446, 1462313, 1557904, 1449388, 1560597, 2157509, 3665885, 6188405, 7412331, 8091228, 9416076, 10672196, 11023700, 11401785, 11783357, 13425697, 16101913, 20024783, 24363387, 27140978, 29281536, 33168529, 38133213, 43639202, 47710631, 51586012, 53431910, 54327139, 52904162]
11821E2904162l909670n878957p751843o324661l432065j929678k002275l619984
11813A8055029l285502k019057j212367j676164j043947j374599k069334k073172
11805C300887m57452Q80836N4244Q8391q56351j00190J861923N38878o39716m06478
11795D264972r5824o52133L22846J105586K05880j105477j549828j159308j013322
11786C23392q62241R3772R75506Q74275o17863j656604p14875j89096o84323J38926
11776b319131M48895k36558J433693K605071K165681M95281o77205j840060k554403
11767d78736q77950j90220K23190n86004o52319j136778P04753n75203j211292
11758d780559M05112P30253Q15090J495926J896140M94958m99441p98403O23314
$$ y = [52904162, 48994492, 43115535, 35363692, 29039031, 25606966, 23677288, 21675013, 18055029, 14769527, 12750470, 11538103, 9861939, 8817992, 7443393, 5374059, 3300887, 2843435, 3724271, 3778515, 3866906, 3010555, 2910365, 4772288, 5311166, 4671450, 4264972, 4169148, 3517015, 3839861, 4945447, 5151327, 4045850, 2496022, 1336714, 323392, -538849, -445077, 530429, 1404704, 786841, -869763, -1584638, -1773734, -2458057, -2319131, -1870236, -2106794, -673101, 1931970, 4097651, 4592932, 3915727, 2075667, -478736, -1356686, -1546906, -1323716, -1909720, -2562039, -3698817, -2994064, -3569267, -4780559, -4375447, -3645194, -2830104, -1334178, 561962, 1056920, 557479, -240924, 382390]
11749C82390J326695J076896l10049j331138o61917L63888Q55903n99124o38626
11740D64918m02018L29554J71322j004183n87773K164200K334958J32516j601975
11731B001519j861636q62099r75746J17273l95749j553154j304852m25249L65865
11722d893828R98624p08127k723331k562441N83616J895036P54398N00706O68241
11713e487106N59707m98016l84300Q82473J810136R91878k764352j512879J131681
11704e270778M96848p9359j54676m92863R40357J473100N85074J300616O72061
11695e29620j091171l74094m32666j842840k366045p1347L251082K298358q46569
11686b004912j265146n70430N57202J618456K455787J597384q28804k050535p44045
$$ y = [382390, 1709085, 2785981, 2475932, 1144794, 482877, 846765, 1702668, 1103544, 464918, 62900, 392454, 563776, -440407, -1028180, 1136020, 3470978, 3603494, 2001519, 139883, -722216, -1697962, -1580689, -1976438, -3529592, -4834444, -5259693, -4893828, -3895204, -4603331, -7326662, -9889103, -9305487, -7410451, -6656053, -6155347, -5487106, -4927399, -5425415, -5809715, -4927242, -3117106, -2125228, -4889580, -6402459, -5270778, -4773930, -4853289, -5007965, -5500828, -4560471, -3087371, -2502297, -1201681, -529620, -1620791, -1994885, -2427551, -4270391, -6636436, -6707783, -3456701, -1158343, -2004912, -3270058, -3840488, -3283286, -1664830, 790957, 2388341, 1559537, -490998, -1235043]
11677a235043P46659O9087J056146J118876k79282O31093J649032o02971j929155
11668A224442j235087n18399j21424l76064M48431J27244j438918j230178J422354
11659a697599J900743Q57576N07096K33412k78242j003181r7321L30807n53994
11650A99297K05795J096222o60188J50184N70181q46088l26567m29164j075159
11641a115487Q52895O08642j438376r05210j6458L83763J136809R43420P13676
11632A163674J37642n29201K93597O70514M86763J45196j504239j543582m82705
11623a162341K18335J49147Q78620r10636r18176p218N09253J701153J185328
11614A643465l29565j421741r13019N33291O08640p7265o70480j095718j295167
$$ y = [-1235043, -488384, -419297, 636849, 1755725, 1476443, 2107536, 3756568, 3153597, 1224442, -10645, -529044, -650468, -1026532, -578101, -450857, -1889775, -3119953, -1697599, 203144, 1060720, 1567816, 1801228, 1522986, 519805, 422484, 753291, 199297, 405092, 1501314, 841126, 991310, 1561491, 715403, 388836, -40328, -1115487, -262592, 346050, -1092326, -1997536, -2013994, -1630231, -493422, 449998, 1163674, 1301316, 772115, 1065712, 1736226, 2222989, 2368185, 863946, -679636, -1162341, -944006, -794859, 83761, -826875, -1745051, -1752269, -1243016, 458137, 1643465, 1313900, -107841, -1020860, -487569, 121071, 43806, -626674, -1722392, -3017559]
11605c017559k79628O30134K76459P81645J298634l81785L64628R96098J77763
11596H46389r11257j183819o50701J418143j82661K65011K176604O75876j446505
11587A007080j502032q09296m62494j067359l71716p13165l36361K256301K062782
11578F3740J183478J190880Q92055J71306k72819j885251j717702j652293l22951
11569b349557l0154K87941j1379M24603L15081M22868l5530Q98006M42759R07002
11559A271640K44549l01196n06095p17554r8099J256953J369287m46374p06694
11550A366417q55543p90012j128706Q43196J864082M82209p29344J08848n89868
11541E71279j148724J45882J233112J80275j448415k208721j351681L40331J535814
$$ y = [-3017559, -3297187, -2667053, -2390594, -1608949, -310315, -692100, -327472, 668626, 846389, -64868, -1248687, -1899388, -481245, -663906, -398895, 1777709, 2453585, 1007080, -494952, -1304248, -1766742, -2834101, -3205817, -3918982, -4255343, -1999042, 63740, 1247218, 2438098, 3330153, 3501459, 3228640, 1343389, -374313, -2026606, -2349557, -2379711, -2091770, -2103149, -1678546, -1363465, -940597, -976127, -78121, 364638, 1271640, 1516189, 1214993, 708898, -8656, -106755, 1150198, 2519485, 2073111, 1366417, 510874, -279138, -1407844, -564648, 1299434, 1781643, 1052299, 1161147, 571279, -577445, -431563, 801549, 981824, -466591, -2675312, -4026993, -3686662, -2150848]
11532b150848J345848M56284P11108M31939q4132q92492n44113J61862J162679
11523E98135M8370p1548J066804o62239N10609J977966P22693M2710j543402j566532
11513A123566j466277j088820k7034o9792K46104l57454r69712k67730J815966
11504a061183J302204K5487K03444K63726r72343k728458j166953J274291J242360
11495a617425l79918j84545n45251l18090P49209N24508n48223J000213J617071
11486B97549O8322j17782r74016p67780J461596J813113q65955k774599k104880
11477c964432j37195L0712R85508J287703P94349L61614q7154K1184l15226L2852
11467i90085J71794o29705P09954K064858R05060o41290j072891J84703Q10666
$$ y = [-2150848, -805000, -348716, 362392, 794331, 710199, -182293, -726406, -564544, 598135, 646505, 574957, 1641761, 979522, 1490131, 3468097, 4190790, 4233500, 2690098, 1123566, -342711, -1431531, -1458565, -1528357, -1282253, -1639707, -2609419, -2877149, -1061183, 241021, 266508, 469952, 733678, -238665, -2967123, -4134076, -2859785, -1617425, -1997343, -2181888, -2727139, -3045229, -2296020, -1771512, -2319735, -1319522, 297549, 365871, 248089, -725927, -1493707, -32111, 1781002, 915047, -1859552, -3964432, -4101627, -4070915, -3085407, -1797704, -1003355, -641741, -728895, -707711, -1022937, -990085, -818291, -1447996, -738042, 1326816, 2231876, 1590586, 517695, 702398, 1513064]
11458A513064j075841j098379J104142J517332J77778o03076l81494k47303r71759
11449f5536l9655j149451k153992p57563J232494J106359l23417l70214O55455
11440a865520k3958j20164J21564n0467j47451p29126R52867K156441M73836l82168
11430C85854R2625R91441J58917k50454j76409q60534m25335P58203R44628P48400
11420B367336M8966K40076K05677q16368j338276j133121R27742R91732q05501
11411F88263k333609j088082l73031l2278J086394J028612R04332J41607P23187
11402G45395j2374j269287j302535N64667J656996L18071R0860k63619r69687
11393d41513k42182m17140k47966P80657J165353Q85534N8972l77091R42210m61922
$$ y = [1513064, 437223, -661156, 442986, 1960318, 2138096, 1535020, 1153526, 906223, -65536, -105191, -1254642, -3408634, -4166197, -2933703, -1827344, -2150761, -2520975, -1865520, -1889478, -2009642, -1888078, -1938545, -2085996, -2815122, -1862255, 294186, 768022, 385854, 478479, 1469920, 1628837, 1378383, 1201974, 341440, -83895, 674308, 1618936, 2367336, 2416302, 2656378, 2862055, 2045687, 707411, -425710, 502032, 1493764, 688263, -1645346, -2733428, -3106459, -3138737, -2052343, -1023731, -119399, 22208, 745395, 733021, -536266, -1838801, -1274134, 382862, 700933, 791793, 528174, -441513, -683695, -1100835, -1348801, -568144, 597209, 1482743, 1541715, 1164624, 2106834, 1644912]
11383A644912j243581N15136P03901N27269J024984l42534j219895j756343q15308
11374i61459m14862r58282K837522k883221k724027R84365k77397K91343J945022
11365b160996Q99294J121403J267139j022002k036725j386018l43643N72711m55123
11356c543960Q34607K493968J697858p32235l28090R51152n6109r51044q22238
11347d56091q10506j384923j743059j218331N60399K421941J688360J095170j083807
11338i30847k109787p86889K57462j60774O35367q5814j106327j373680p98451
11329f459740R49106K047114J943811k82758M72288O3110j476502p19298R09902
11320b552967J567684P70144k36927j71234M47139r930r9785N318j78704R57546
$$ y = [1644912, 401331, 916467, 1620368, 2147637, 3172621, 2830087, 1610192, -146151, -961459, -1376321, -2334603, 502919, -2380302, -5104329, -4119964, -4397361, -4106018, -2160996, -1261702, -140299, 1126840, 104838, -1931887, -3317905, -3661548, -3088837, -3543960, -2709353, -215385, 1482473, 750238, 422148, 1373300, 1317191, 366147, -456091, -1266597, -2651520, -4394579, -5612910, -5052511, -2630570, -942210, 152960, -930847, -3040634, -3827523, -3570061, -3730835, -3095468, -3181282, -4287609, -5661289, -6459740, -5510634, -3463520, -1519709, -1802467, -1330179, -1267069, -2743571, -3462869, -2552967, -985283, -215139, -452066, -623300, -176161, -186091, -285876, -280558, -459262, 498284]
11310D98284P63673n9664n05480Q92110J372902J3748P57330q9922j190822m76887
11300A975272L59445J67009j664503k544351p0385K004366J436883o142M39855
11291B097449N83363l47949j51319k32168j045031q64622J75057J192437J018981
11282B426198J253469l47009k035377k198648n78674P55878N13886P2538R2611
11273d5128k79942p13373l73401k01992j68455k86140r33967K28281J46872K25342
11263b401903J167142Q78957l6269M2673O55274K68000L01399j014475q02528
11254i41730J059651k75597n48864J97227J403982K84059N54397R94903n26497
11245B201531j417297l3750q69310j270929l39893Q01701J775315P39194q38478
$$ y = [498284, 1261957, 1202293, 696813, 1588923, 2961825, 2975573, 3732903, 3642981, 2452159, 1975272, 2334717, 2501726, 837223, -1707128, -1777513, 226853, 1663736, 1657594, 2097449, 2680812, 2332863, 2181544, 1949376, 904345, 39723, 214780, 1407217, 2426198, 3679667, 3332658, 1297281, -901367, -1480041, -724163, -210277, -137739, -45128, -325070, -1038443, -1411844, -1613836, -1782291, -2068431, -3002398, -2774117, -2627245, -2401903, -1234761, -355804, -392073, -349400, 305874, 573874, 875273, -139202, -941730, 117921, -157676, -706540, -509313, 894669, 1178728, 1733125, 2728028, 2201531, 784234, 750484, -118826, -1389755, -1729648, -927947, 847368, 1586562, 748084]
11236G48084j313536p37940J282469K350674N86441j504022j211760j128631l5823
11227i64044K64840l8564R806M60228o6100j30340K67359j27887j14065j18071
11217e56838m46688l51020j066592q00119K77621K608661L75509k018110j629218
11208c606794j251467q15720J377249J975916j01646j000540R12617J711144P62251
11199c6990j247819j632368M40298Q78407R95309M54670j724989j738525M82565
11190c129442J236333R90266M27335k71302K20542M60122p67177j397217J86723
11181b043817J215685q45866j483586j037875n94657P90986J130153m3401M79500
11172b432878J015045l89665Q13552j76251j498543m47234l23429M85779M63552
$$ y = [748084, -565452, -1303392, -20923, 2329751, 2916192, 1412170, 200410, -928221, -964044, -699204, -737768, -727962, -267734, -333834, -464174, -196815, -324702, -438767, -556838, -1003526, -1354546, -2421138, -3221257, -2943636, -334975, 40534, -1977576, -3606794, -4858261, -5673981, -4296732, -2320816, -2422462, -3423002, -2510385, -799241, -36990, -1284809, -2917177, -2476879, -1598472, -603163, -148493, -1873482, -3612007, -3129442, -1893109, -902843, -475508, -746810, -526268, -66146, -833323, -2230540, -2043817, -828132, -1673998, -3157584, -4195459, -4790116, -3999130, -2868977, -2912378, -2432878, -1417833, -1807498, -993946, -1170197, -2668740, -3115974, -3439403, -2953624, -2490072]
11163b490072M24687K32387o48263k027241j547772O35248R80013K268967j76782
11154b348828N52745J891627N70095j876040j664844k39658k7099q2908N72328
11145b652582J601465Q49472l7628n77722q98731n69843k44439K3725M03732R60483
11135a142068J203325P37848o19545j429310M73010J323328r28685m87822l73685
11126a243604l39366K27522m51803O82976N40822J058576r15352k289838j430265
11117d160332K058133J722547Q76832j72273j338856j147338K58426J043740J757723
11108H98602K49025j215444j238453R09983N40881l93231j303508r67278J07950
11099b411473j32092j116445o6014j19921n51572R8175J327491J386912J283503
$$ y = [-2490072, -2065385, -1832998, -2481261, -4508502, -6056274, -5421026, -4441013, -2172046, -2348828, -1796083, 95544, 665639, -1210401, -2875245, -3114903, -3142002, -3224910, -2652582, -1051117, -201645, -239273, -816995, -1715726, -2285569, -2530008, -2506283, -2102551, -1142068, 61257, 799105, 179560, -1249750, -776740, 546588, -382097, -869919, -1243604, -1582970, -1355448, -1807251, -1124275, -583453, 475123, -440229, -2730067, -4160332, -2102199, -379652, 497180, 324907, -1013949, -2161287, -1902861, -859121, 898602, 1147627, -67817, -1306270, -396287, 144594, -248637, -1552145, -2519423, -2411473, -2543565, -3660010, -3726024, -3845945, -4397517, -4299342, -2971851, -1584939, -301436]
11090c01436M11224n4467J389224Q70992q52688q49818j011929K56386J045423
11081I02911k8832k27215k87263l56866q78601L64968J75652M78513j52960N9818
11071E0125N44737K64751O2550n87307l1815M47234J14387j027206k40805J91352
11061b11997N3276P70768K203278J510005M3952j119739k017968r46475J91667
11052D76767J46262N34252O19449j5160j530194j638721j41620P4264j59335J8137
11042a615899O02044M71358P57667l41093m21644j78107L85574L08608q37896
11033h69388j089690l26722R12909J320334J238467k45109j46374L75567J252274
11024B422268P98694n12517o8806o74125j394552q06371j62325m14321j3217Q61646
$$ y = [-301436, 109788, 55321, 1444545, 2315537, 1462849, 613031, -398898, -142512, 902911, 874079, 646864, 359601, 2735, -875866, -510898, -335246, 143267, -9693, 50125, 594862, 859613, 922163, 334856, 303041, 750275, 864662, -162544, -403349, -211997, -158721, 612047, 2815325, 4325330, 4369282, 3249543, 1231575, 285100, 476767, 623029, 1157281, 1776730, 1761570, 231376, -1407345, -1548965, -1474701, -1634036, -1615899, -1013855, -542497, 215170, -125923, -547567, -725674, -340100, -31492, -869388, -1959078, -2285800, -1372891, -52557, 1185910, 940801, 794427, 1169994, 2422268, 3220962, 2708445, 2639639, 1965514, 570962, -235409, -397734, -812055, -825272, 36374]
11014C6374R84703R18117J16550J07373j260359j639154j530490j25915J844999
11005e47802J338101P15384L75442r87709p33262J87937J014170k89229r72818
10996A00214o18312j67994l53107M42683O58705K55758L86510m03347j721701
10987a420591o39612R89024K52326Q98756J623932Q58164K47778r5387j214382
10978A500008j419852M23227N32831j09254J46805o04155r54498j090099j028223
10969b603210k69128K6051R16897K518948J749119J627299Q57761m7133j41019
10960D635585k030063j471453o71755j486600j600572J173280J633482L91764
10952E73668j173715J60850J446144m25413j111150k50120L50540J758087P76812
$$ y = [36374, 1021077, 1939194, 2055744, 2163117, 902758, -736396, -2266886, -2392801, -547802, 790299, 1505683, 1881125, 893416, 160154, 348091, 1362261, 1073032, 100214, -518098, -686092, -1039199, -596516, 62189, 317947, 704457, 301110, -1420591, -2060203, -1071179, -818853, 79903, 1703835, 2561999, 2809777, 2714390, 1500008, 80156, 503383, 1036214, 926960, 1073765, 469610, -484888, -1574987, -2603210, -2872338, -2846287, -1929390, 589558, 2338677, 3965976, 4823737, 4776604, 4635585, 2605522, 1134069, 462314, -1024286, -2624858, -1451578, 181904, 573668, -600047, -439197, 1006947, 581534, -529616, -779736, -429196, 1328891, 2105703]
10943B105703j361906o16006o25171N64937R41105K67656N06804J243058M74003
10934C500183j228907k791020m11880J046805P63911L51474n14937p98380j140001
10925a222752p69426J472471J158898J63214q70549l13917o92294O1273P94165
10916b18917J357403n33169l48679m1361m07119j73241k16375L86328O85229l71811
10906A18288j478997p07517M49130J317183J800348n26433j695939k83135L76685
10897f30387j180702j188242L19773J964985J178122o14979r3973M64651k87700
10888f8452j310628r16293J40779n43951N20106J444691N26381j749227r85220
10879b941814r4712J259627P63691j052817m02863J90921K01922J392849J45742
$$ y = [2105703, 743797, 127791, -497380, 67557, 1008662, 1276318, 1783122, 3026180, 3500183, 2271276, -519744, -931624, 115181, 879092, 1230566, 715629, -82751, -1222752, -1992178, -519707, 639191, 802405, -68144, -382061, -1074355, -1013082, -218917, 1138486, 605317, 256638, 215277, -191842, -365083, -581458, -195130, 490099, 118288, -1360709, -2068226, -1619096, -301913, 1498435, 972002, -723937, -1007072, -630387, -1811089, -2999331, -2679558, -714573, 463549, -151430, -245403, 219248, -68452, -1379080, -2295373, -2154594, -2698545, -2178439, -733748, -207367, -1956594, -2941814, -3036526, -1776899, -1013208, -2066025, -2468888, -2277967, -2076045, -683196, -537454]
10870e37454q79732J266434J724002O96633q80884j588460O3333j004945q54986
10861a996059J7346o24809O20034J567595J670131L2209j010325j450092o71264
10852a845234O44539J37841n61679j077557r07627m43765o37593J109931K105792
10843a475352M92146j68534Q24504J711931j41315j536751k244638j048909J145508
10834b441410K548272K179058K05635j072486r03098j267495K9313J242874J851543
10825B372206k68223j231561q98593j492950l85602O87344o12312j98436M89238
10816a538889J171192J063839j2379p37626j835354p09736J121677J615390O33486
10807G71600J194513P10053m91278j217428o71359L2752o3888j377437m44198
$$ y = [-537454, -1417186, -150752, 1573250, 2269883, 1388999, -199461, -136128, -1141073, -1996059, -1978713, -2603522, -1983488, -415893, 1254238, 1286447, 276122, -1173970, -1845234, -1200695, -1062854, -1624533, -2702090, -3609717, -4053482, -4691075, -3581144, -1475352, -983206, -1151740, -327236, 1384695, 1243380, -293371, -2538009, -3586918, -2441410, 106862, 2285920, 2491555, 1419069, 515971, -751524, -722211, 520663, 2372206, 2103983, 872422, -26171, -1519121, -1904723, -1217379, -1829691, -2028127, -1538889, -367697, 696142, 683763, -53863, -1889217, -2598953, -1477276, 138114, 771600, 1966113, 2676166, 2184888, 967460, 296101, 328853, 264965, -1112472, -1556670]
10798a556670k06157l27183P23480L65904M1075R48250K775075R56831j294666
10789B425939j817220j436596j197521k68647R808m59012o07556q0023J605103
10780a825725J397162M69231m72163K96956l36251J091022J763193j249352j547967
10771d13894P8503M49919k797o66325n21318o24033M356J188639P42870l35173
10761i9253L67720L87602l88764k96531j051863j335630q28807J138105m67798
10752b575219j488596Q31877J305315L38115J066241O73992o05237L0531O68335
10743B45354L28667N71285j365822p39679Q86283N28423O12325O82756P68002
10734B517594n95292j538203o48955Q15762J458413J746360n15055k254331k132219
$$ y = [-1556670, -1762827, -2090010, -1366530, -1000626, -959551, -11301, 2763774, 3720605, 2425939, 608719, -827877, -2025398, -2294045, -2284237, -2743249, -3350805, -3430828, -1825725, -428563, 40668, -431495, -134539, -470790, 620232, 2383425, 1134073, -413894, -335391, 114528, 111731, -554594, -1075912, -1699945, -1695589, -506950, 235920, -99253, 268467, 656069, 267305, -29226, -1081089, -2416719, -3245526, -2107421, -2575219, -4063815, -3231938, -1926623, -1588508, -522267, 151725, -453512, -422981, 245354, 574021, 1145306, -220516, -960195, -73912, 454511, 1066836, 1749592, 2517594, 1922302, 384099, -264856, 550906, 2009319, 3755679, 3240624, 986293, -1145926]
10725a145926K88656P89548N01161K41391p01186p46772p31512l15469k14655
10716b034764m73532N58385J471962o36243k19216J311720K75476j148073l7246
10707i31531K209488K304505P21768j078818o76399j244659k098640j508502p14422
10698c017210J660770K005929K52086j65986m02075o05422P38518P92375O17860
10689A876845L14613M39750Q0267n71870j646749p45334R09387l48390j400226
10680a091707p55693j374779p86697m5307J358905R67542K55294j97935K25443
10671a444934Q62356p83219j970998P84703J369733j114825j084221R8507n19398
10662c802296m31952j32656J423497O84486Q19408K715140L00899j145381k251594
$$ y = [-1145926, -857270, -67722, 433439, 674830, -26356, -773128, -1504640, -1820109, -2034764, -2508296, -1949911, -477949, -1114192, -1333408, -21688, 253788, -894285, -931531, 1277957, 3582462, 4304230, 3225412, 2549013, 1304354, -794286, -2302788, -3017210, -1356440, 649489, 901575, 735589, 333514, -271908, 466610, 1258985, 1876845, 2191458, 2631208, 2711475, 2139605, 492856, -252478, 656909, 308519, -1091707, -1847400, -3222179, -4008876, -4054183, -2695278, -1727736, -1472442, -1670377, -1444934, -582578, -1365797, -3336795, -2552092, -1182359, -2297184, -3381405, -3282898, -3802296, -4234248, -4366904, -2943407, -2258921, -1439513, 1275627, 1576526, 431145, -1820449]
10653a820449j167867j2468M63717l68747l1930J648355K36510o27631l03930
10644a984440o23056N35919M36797J286853J810076J935982P59713j325203j937433
10635H95208j865921r35013j56004j807932r38533K68784R45301J562794N28563
10626a502753l81496m88278L93275O89853j007702m94678k46002L23693J174149
10617a539939P15876J66043j639818o44773p54440j179935L24709O40064J23733
10608c788480J78724J06577J777841K056776p7132r64241k185780j727542j58706
10599d781963q04792j66925J160966J873987J167015o09236N57026J643144L01690
10590C40912r22697o95195l11287N78076J165884M28700O64084k36434q45242
$$ y = [-1820449, -2988316, -3000784, -2537067, -2905814, -2937744, -1289389, -1052879, -1680510, -1984440, -2607496, -2071577, -1634780, -347927, 1462149, 3398131, 4157844, 2832641, 895208, -970713, -1905726, -2061730, -3869662, -4808195, -4539411, -3594110, -2031316, -1502753, -1884249, -2372527, -1979252, -1289399, -2297101, -2791779, -3037781, -2714088, -1539939, -824063, -658020, -2297838, -2942611, -3697051, -4876986, -4552277, -3912213, -3788480, -3609756, -3503179, -1725338, 331438, 254306, -709935, -2895715, -4623257, -4781963, -5586755, -5753680, -4592714, -2718727, -1551712, -2160948, -1603922, 39222, 340912, -581785, -1276980, -1588267, -1010191, 155693, 584393, 1248477, 1012043, 166801]
10581A66801P77197K52850r88213p69030N44480O49705N12483p6566j068348q59634
10571h58275j616471M5370J355145J206046L18132O16329O4725K94786O19437
10562B045224n52272j655523n76422p68217j138342M96133J487128o21376k201755
10553c485422n63888J453027R01776p56585m73549K41153j1888O01543J409640
10544f84193J813021M86517k406672k666518m60567J402076J623364J073947M10998
10535E91973j477734k043594p27374N95062O03134L3377l6131J037765J635618
10526B12096N72114j008729j366222j571986r93131n5112J10144o2920M27077
10517c736669q94684j24334J032907J315892J181228J313810J006220Q83179J836114
$$ y = [166801, 943998, 1196848, 208635, -560395, -15915, 633790, 1146273, 1069707, 1359, -858275, -2474746, -2429376, -1074231, 131815, 449947, 1066276, 1131001, 1425787, 2045224, 1492952, -162571, -738993, -1507210, -2645552, -2149419, -662291, -1283667, -3485422, -4049310, -2596283, -1694507, -2451092, -2924641, -2683488, -2695376, -2093833, -684193, 1128828, 1615345, -791327, -3457845, -3918412, -2516336, -892972, 180975, 591973, -885761, -2929355, -3656729, -3061667, -2458533, -2425156, -2461287, -1423522, 212096, 784210, -224519, -1590741, -3162727, -4155858, -4210970, -4100826, -4163746, -3736669, -4631353, -4755687, -3722780, -2406888, -1225660, 88150, 1094370, 1977549, 3813663]
10508C813663K53453j542682k231402l121350j472354J038680M00767l29856M31086
10499b759995J44538J072773K003050P53757q18516j53696n0296j164764R7114
10490h76035O14235j77098r92502j089529j284372J581317J829038J20375j447909
10481a722480j437476K45078O69122j91302M3541J06404N77647P28195N60188
10472d21083K79484L87980p68476q67950j93370o20891J57859O64627L60603L00364
10462g20853m23504q84218o80367J44776J132262p69899q05543O17647J906047
10453d83652P97520o68739O53271K603887J262235L20634l46554j075453l92471
10444B670678P8325q83533j226357m42007K33210M6677K14745K08641J353986
$$ y = [3813663, 4067116, 2524434, 293032, -2828318, -4300672, -3261992, -2861225, -3191081, -2759995, -2615457, -1542684, 460366, 1214123, 395607, 241911, 191615, -973149, -876035, -261800, -438898, -1431400, -2520929, -3805301, -2223984, -394946, -274571, -1722480, -3159956, -2914878, -2245756, -2437058, -2393517, -2287113, -1709466, -981271, -421083, -141599, 246381, -522095, -1390045, -1583415, -2204306, -2046447, -1381820, -1021217, -720853, -1144357, -2028575, -2708942, -2564166, -1431904, -2201803, -3007346, -2389699, -483652, 313868, -354871, 298400, 2902287, 4164522, 4485156, 4138602, 3063149, 2670678, 2749003, 1865470, 639113, 197106, 430316, 476993, 691738, 900379, 2254365]
$$ [...]
##END NTUPLES=NMR SPECTRUM
##END=
