##TITLE=C13cpd
##JCAMPDX= 6.0         $$ Bruker NMR JCAMP-DX V2.0
##DATA TYPE= NMR SPECTRUM
##DATA CLASS= NTUPLES
##ORIGIN= UXNMR, Bruker Analytische Messtechnik GmbH
##OWNER= root
$$ XWIN-NMR		Version 3.5
$$ Fri Nov 12 10:27:53 2021 Russian Standard Time (UT+4h)  she@DPX200
##.OBSERVE FREQUENCY= 50.3277607988526
##.OBSERVE NUCLEUS= ^13C
##.ACQUISITION MODE= SIMULTANEOUS
##.ACQUISITION SCHEME= undefined
##.AVERAGES= 13698
##.DIGITISER RES= 17
##SPECTROMETER/DATA SYSTEM= spect
##.PULSE SEQUENCE= zgpg30
##.SOLVENT NAME= Acetone
##.SHIFT REFERENCE= (INTERNAL, Acetone, 0, 219.997)
##AUDIT TRAIL= $$ (NUMBER, WHEN, WHO, WHERE, WHAT)
$$ ##TITLE= Audit trail, XWIN-NMR		Version 3.5
$$ ##JCAMPDX= 5.01
$$ ##ORIGIN= Bruker BioSpin GmbH
$$ ##OWNER= she
$$ F:/spectra/data/she/nmr/C13cpd-4C1011SA/1/pdata/1/auditp.txt
$$ ##AUDIT TRAIL=  $$ (NUMBER, WHEN, WHO, WHERE, WHAT)
(   1,<2021-11-12 07:59:06.68 +0400>,<servis>,<DPX200>,
      <created by zg, POWCHK disabled, PULCHK disabled
       terminated by command 'halt'
       configuration hash MD5:
       00 E9 B6 7A A2 85 ED C7 34 08 36 98 17 FE 4E 26
       data hash MD5: 32K
       DC EC 42 C4 C6 48 E8 EA C6 EC A7 A0 4B BD F1 6B>)
(   2,<2021-11-12 07:59:09.56 +0400>,<servis>,<DPX200>,
      <Start of raw data processing
       efp BC_mod = 2 LB = 1 FT_mod = 6 PKNL = 1 PHC0 = -264.8868 PHC1 = 20.1187 SI = 32K 
       data hash MD5: 32K
       2C 65 E5 91 20 C8 D1 43 BF BF 3F 2E 94 76 D8 42>)
(   3,<2021-11-12 07:59:28.12 +0400>,<servis>,<DPX200>,
      <pk PHC0 = -11.86771 PHC1 = 4.6 
       data hash MD5: 32K
       41 4C 45 C6 15 B2 EC 6F 90 9F AE D5 1D 47 AD 32>)
(   4,<2021-11-12 07:59:30.81 +0400>,<servis>,<DPX200>,
      <abs ABSG = 5 
       data hash MD5: 32K
       2B 8D A9 52 E5 07 F0 0D 9C 24 EF B0 BF 27 28 86>)
(   5,<2021-11-12 10:21:37.50 +0400>,<she>,<DPX200>,
      <fromjdx created from
       c:\Documents and Settings\she\C13cpd-4C1011SA.dx
       data hash MD5: 32K
       2B 8D A9 52 E5 07 F0 0D 9C 24 EF B0 BF 27 28 86>)
$$ ##END=
$$ 
$$ hash MD5
$$ FB FE 8D 21 A1 F5 BB 5F 91 A7 0F AD D9 6F 56 2B
##$RELAX= 
##$RELAX= 
##$RELAX= 
##$RELAX= 
##$RELAX= 
##$RELAX= 
##$RELAX= 
##$RELAX= 
$$ Bruker specific parameters
$$ --------------------------
##$DU= <F:/spectra>
##$EXPNO= 1
##$NAME= <C13cpd-4C1011SA>
##$PROCNO= 1
##$TYPE= <nmr>
##$USER= <she>
##$AMP= (0..31)
100 100 100 100 100 100 100 100 100 100 100 100 100 100 100 100 100 100 
100 100 100 100 100 100 100 100 100 100 100 100 100 100 
##$AQSEQ= 0
##$AQ_mod= 1
##$AUNM= <au_zg>
##$AUTOPOS= <>
##$BF1= 50.322729
##$BF2= 200.13
##$BF3= 50.322729
##$BF4= 50.322729
##$BF5= 500.13
##$BF6= 500.13
##$BF7= 500.13
##$BF8= 500.13
##$BYTORDA= 0
##$CFDGTYP= 0
##$CFRGTYP= 5
##$CHEMSTR= <none>
##$CNST= (0..31)
1 1 145 1 1 1 1 1 1 1 1 1 1 1 1 1 1 1 1 1 1 1 1 1 1 1 1 1 1 1 1 1 
##$CPDPRG= <waltz16>
##$CPDPRG1= <>
##$CPDPRG2= <waltz16>
##$CPDPRG3= <>
##$CPDPRG4= <mlev>
##$CPDPRG5= <mlev>
##$CPDPRG6= <mlev>
##$CPDPRG7= <mlev>
##$CPDPRG8= <mlev>
##$CPDPRGB= <>
$$ [...]
##$SUBNAM3= <"">
##$SUBNAM4= <"">
##$SUBNAM5= <"">
##$SUBNAM6= <"">
##$SUBNAM7= <"">
##$SUBNAM8= <"">
##$SUBNAM9= <"">
##$SW= 238.246396889851
##$SWIBOX= (0..15)
0 1 3 0 0 0 0 0 0 0 0 0 0 0 0 0 
##$SW_h= 11990.4076738609
##$TD= 32768
##$TD0= 1
##$TE= 0
##$TE2= 300
##$TE3= 300
##$TEG= 300
##$TL= (0..7)
0 120 120 120 120 120 120 120 
##$TP= (0..7)
150 150 150 150 150 150 150 150 
##$TP07= 0
##$TPNAME0= <>
##$TPNAME1= <>
##$TPNAME2= <>
##$TPNAME3= <>
##$TPNAME4= <>
##$TPNAME5= <>
##$TPNAME6= <>
##$TPNAME7= <>
##$TPOAL= (0..7)
0.5 0.5 0.5 0.5 0.5 0.5 0.5 0.5 
##$TPOFFS= (0..7)
0 0 0 0 0 0 0 0 
##$TUNHIN= 0
##$TUNHOUT= 0
##$TUNXOUT= 0
##$USERA1= <user>
##$USERA2= <user>
##$USERA3= <user>
##$USERA4= <user>
##$USERA5= <user>
##$V9= 5
##$VALIST= <valist>
##$VCLIST= <CCCCCCCCCCCCCCC>
##$VD= 0
##$VDLIST= <DDDDDDDDDDDDDDD>
##$VPLIST= <PPPPPPPPPPPPPPP>
##$VTLIST= <TTTTTTTTTTTTTTT>
##$WBST= 1024
##$WBSW= 20
##$XGAIN= (0..3)
0 0 0 0 
##$XL= 0
##$YL= 0
##$YMAX_a= 72558799
##$YMIN_a= -28500034
##$ZGOPTNS= <>
##$ZL1= 120
##$ZL2= 120
##$ZL3= 120
##$ZL4= 120
##$ABSF1= 219.1257
##$ABSF2= -19.14452
##$ABSG= 5
##$ABSL= 3
##$ALPHA= 0
##$AQORDER= 0
##$ASSFAC= 0
##$ASSFACI= 0
##$ASSFACX= 0
##$ASSWID= 0
##$AUNMP= <proc_1d>
##$AZFE= 0.1
##$AZFW= 0.5
##$BCFW= 0
##$BC_mod= 2
##$BYTORDP= 0
##$COROFFS= 0
##$CY= 12.5
##$DATMOD= 1
##$DC= 0
##$DFILT= <>
##$DTYPP= 0
##$F1P= 99.9999945759776
##$F2P= -179.999992907048
##$FCOR= 0.5
##$FTSIZE= 32768
##$FT_mod= 6
##$GAMMA= 0
##$GB= 0
##$INTBC= 1
##$INTSCL= 0
##$ISEN= 30
##$LB= 1
##$LEV0= 0
##$LPBIN= 0
##$MAXI= 10000
##$MC2= 0
##$MEAN= 0
##$ME_mod= 0
##$MI= 0
##$NCOEF= 0
##$NC_proc= 3
##$NLEV= 6
##$NOISF1= 0
##$NOISF2= 0
##$NSP= 0
##$NTH_PI= 0
##$NZP= 0
##$OFFSET= 219.9973
##$PC= 1.4
##$PHC0= -276.7545
##$PHC1= 24.7187
##$PH_mod= 1
##$PKNL= yes
##$PPARMOD= 0
##$PSCAL= 4
##$PSIGN= 0
##$REVERSE= no
##$SF= 50.322685148084
##$SI= 32768
##$SIGF1= 0
##$SIGF2= 0
##$SINO= 80
##$SIOLD= 32768
##$SREGLST= <13C.CDCl3>
##$SSB= 0
##$STSI= 32768
##$STSR= 0
##$SW_p= 11990.4076738609
##$SYMM= 0
##$S_DEV= 0
##$TDeff= 32768
##$TDoff= 0
##$TI= <>
##$TILT= no
##$TM1= 0
##$TM2= 0
##$TOPLEV= 0
##$USERP1= <user>
##$USERP2= <user>
##$USERP3= <user>
##$USERP4= <user>
##$USERP5= <user>
##$WDW= 1
##$XDIM= 32768
##$YMAX_p= 419790431
##$YMIN_p= -5635583
$$ End of Bruker specific parameters
$$ ---------------------------------
##NTUPLES= NMR SPECTRUM
##VAR_NAME=  FREQUENCY,     SPECTRUM/REAL,   SPECTRUM/IMAG
##SYMBOL=    X,             R,               I
##VAR_TYPE=  INDEPENDENT,   DEPENDENT,       DEPENDENT
##VAR_FORM=  AFFN,          ASDF,            ASDF
##VAR_DIM=   32768,         32768,           32768
##UNITS=     HZ,            ARBITRARY UNITS, ARBITRARY UNITS
##FACTOR=    0.365929370215793, 1,           1
##FIRST=     11070.8548207854, 0,            0
##LAST=      -919.5528530755, 0,             0
##MIN=       -919.5528530755, -5635583,      0
##MAX=       11070.8548207854, 419790431,    0
$$ Real data points
##PAGE= N=1
##DATA TABLE= (X++(R..R)), XYDATA
32767B020745r58469k66589K98889j33382J92702M97808K55511J92839J97093
32758B297147m98773r91921j201742l26972O82980J78127n4085n52409j52526
32749f20174M98358J18637l38087K79666O77285K57250K88472m11317n54299M89314
32739F85105N12730R1080n31175P626J211289J493343O58578L01824p00086n25253
32729C205061j40570o77511m48393k39513K13937K56966K0798o1281j07742J78994
32719B200746N12630J54200K21330M3302j12010o8063P18463J06798p31548r4499
32709B951349m73385q32255q53202j33216J84924j00867j39132K80555L83637
32700A268408K86922k01532l86235p39169k91644P27833K85543j93070n4532L01926
$$ y = [2020745, 1062276, 795687, 1094576, 961194, 1153896, 1651704, 1907215, 2100054, 2297147, 1798374, 806453, -395289, -722261, -39281, 138846, 84761, -467648, -620174, -121816, -3179, -341266, -61600, 615685, 872935, 1161407, 750090, 195791, 685105, 1197835, 1288915, 757740, 765366, 1976655, 3469998, 4128576, 4430400, 3730314, 3205061, 3064491, 2386980, 1938587, 1699074, 1913011, 2169977, 2190775, 2129494, 2021752, 2200746, 2713376, 2867576, 3088906, 3132208, 3020198, 2952135, 3670598, 3777396, 3045848, 2951349, 2477964, 1645709, 792507, 659291, 844215, 743348, 604216, 884771, 1268408, 1555330, 1353798, 967563, 228394, -63250, 664583, 950126, 757056, 702524, 1004450]
32690A004450j68268K8411J78925q3679J81666R15627N16261r6672l9548l92812
32680B044361p31863o92902l94267K19305O26468r3436j23202L7188L27206K95750
32670A514608N9891J9788K72306J50654q25351p99186M70404M61835j31325n87229
32660F06395r89797k22542N08357J210659M4824o80494j39976J4696J53874N07778
32650A013774M6504r16422l80738M95052K86771L12713J032645J233582N27406
32641C651287j91174j215632j018458k51848K08715P46252P34006N66024o34461
32632B594711n77580q8570J47909L82498l55220p55533j227423l5225O45123p20579
32622A0111j566638o85522K38794P82648J454746J163137J082875J83232j432405
$$ y = [1004450, 836182, 864593, 1043518, 959839, 1141505, 2057132, 2573393, 2476721, 2437173, 2044361, 1312498, 619596, 225329, 444634, 1071102, 977666, 854464, 891652, 1218858, 1514608, 1574499, 1594287, 1866593, 2017247, 1191896, 392710, 863114, 1324949, 1193624, 606395, -383402, -605944, -97587, 1113072, 1157896, 477402, 337426, 352122, 505996, 1013774, 1060278, 143856, -236882, 258170, 544941, 857654, 1890299, 3123881, 3651287, 3460113, 2244481, 1226023, 974175, 1182890, 1929142, 2663148, 3229172, 2594711, 2017131, 1928561, 2076470, 2458968, 2103748, 1348215, 120792, 85567, 730690, 10111, -1556527, -2242049, -2003255, -1220607, 234139, 1397276, 2480151, 2663383, 1230978]
32613A230978j591224k66611P62149J560794R98072J22795m85017r78497l78886
32604I74553l76305Q07158O22626J52455Q91021j16821q12951o87651j08841k65077
32594A080167l77172m24150o63006n05282l68457O30454J328756P58340l19865
32585A139785L05031M49313j074529m82129P62696R89304L48346n57432m08076
32576A472309O5182n49548Q7873n43546n06371O96935R03343J179190p0089p53200
32566A982078j63094j57394O27l09869o19875O5900P40789O43839M4845p08036
32556A519810j109446j084474J35890K51178O76793Q56074M17280P62122q1998
32547B343229j096404r71835P7520L07493r5756J98217J58537M7765M05651N22852
$$ y = [1230978, -360246, -626857, 135292, 1696086, 2694158, 2816953, 2331936, 1353439, 974553, 598248, 1405406, 2028032, 2180487, 3071508, 2954687, 2141736, 1454085, 1345244, 1080167, 702995, 278845, -384161, -889443, -1257900, -627446, 701310, 1459650, 1139785, 1444816, 1894129, 819600, 337471, 1100167, 2089471, 2437817, 1880385, 1472309, 1537491, 987943, 1075816, 532270, 25899, 722834, 1626177, 2805367, 2735278, 1982078, 1818984, 1661590, 1662217, 1352348, 732473, 798373, 1539162, 2183001, 2227846, 1519810, 410364, -674110, -538220, -287042, 389751, 1245825, 1663105, 2425227, 2343229, 1246825, 274990, 352510, 660003, 564247, 762464, 921001, 968766, 1374417, 1897269]
32537A897269n84406j455863k23771R38673Q13963K78759J0575O20016M19838
32528B715053m2401k8108n52609q68532K1494N92579l05015n10366j101326l9935
32518a19166N54698L65406P31155k2779J49699l4357l78265M25165j33164n26298
32508A012094l14617q5461l94409m83205j23160J020476J161578L08160m82387
32499A619069n97514n09945o88933k18343N99751N22323r2655j18253l95303o24611
32489e04414k34619Q49071J086892J062131Q8945q91923p21653n22624K3280J15022
32479C50108L19754k06077j77623N27412K56792N70245M50902J176448N08398
32470C776359l40083j096253p86463j27025M20369R81485J86214p59444l69478
$$ y = [1897269, 1312863, -143000, -366771, 571902, 1385865, 1664624, 1675199, 2295215, 2715053, 2672652, 2644544, 2091935, 1223403, 1244897, 1837476, 1532461, 1022095, -79231, -119166, 435532, 800938, 1532093, 1509314, 1659013, 1624656, 1246391, 1671556, 1538392, 1012094, 697477, 612016, 217607, -265598, -388758, 631718, 1793296, 2101456, 1619069, 1021555, 511610, -177323, -395666, 204085, 726408, 633753, 515500, 120197, -504414, -739033, 110038, 1196930, 2259061, 2348006, 1456083, 734430, 211806, 235086, 350108, 669862, 463785, 286162, 813574, 1070366, 1640611, 2091513, 3267961, 3776359, 3436276, 2340023, 1553560, 1426535, 1846904, 2828389, 3014603, 2255159, 1885681]
32461A885681M50192j7048l16273O27135Q26872k08457j306930r71713l22749
32452F46710n98734O2836L71111N37315j83527o60814k40713m07370j61308K42044
32442c92450o98p76387O38912J248444M76462J42800P79248M11618p04795j75870
32432A647284O5599J32237q85776P4328J308292Q94132O0787o25781j592974q35513
32422B42615O08228Q93964N86797q04062m37731K11079J99599J027607J517263
32413D045359M10497L22134o43713j232212q59074p63071j15827J45004j59550
32404A149547n99820M62230R73210L61817M29351O99004q86099j594393l36055
32395F58792N29553O1881k04937j019391j149661L0905O68200q4501k70022K09018
$$ y = [1885681, 2335873, 2318825, 2002552, 2629687, 3456559, 3248102, 1941172, 969459, 646710, 47976, 110812, 481923, 1019238, 835711, 174897, -65816, -473186, -634494, -392450, -393148, -1169535, -530623, 717821, 1194283, 1337083, 2116331, 2527949, 1823154, 1647284, 1712883, 1845120, 959344, 1033672, 2341964, 3236096, 3296883, 2671102, 1078128, 242615, 850843, 1744807, 2331604, 1527542, 1089811, 1300890, 1500489, 2528096, 4045359, 4455856, 4777990, 4134277, 2902065, 2042991, 1279920, 1164093, 1309097, 1149547, 549727, 1011957, 1985167, 2346984, 2776335, 3475339, 2589240, 994847, 658792, 1188345, 1250226, 1045289, 25898, -1123763, -1092858, -424658, -509159, -779181, -570163]
32385e70163R9375P01535P46366R07102O51543R5465L87198l19501n88825L03959
32375B414054J19691L93889l92782n93250M20369l28088p114O3492o20818r49544
32365E19899L63931L32312k37070m810m17673j36473N27656J44340R550M74544
32355A576206L5409p97469k51668L45025K41713m71462o70082Q0758j94655J86144
32345G9919J609399J395535J3157L51916m98923j138223J9759K99549L82490L44533
32335B859111k91630n64517j171717j585687p21456O75208K251883Q57374j167113
32326A141456r52558M95815M10237o84040n42093r3898j003287j50092P90133
32317e88327O87124J125450N21167K65814K86239r72931k30876R01062J159538
$$ y = [-570163, -470788, 230747, 977113, 1884215, 2535758, 2631223, 3018421, 2698920, 2110095, 2414054, 2533745, 2927634, 2534852, 1941602, 2361971, 2033883, 2026769, 2090261, 1469443, 519899, 883830, 1216142, 979072, 974262, 556589, 420116, 947772, 1092112, 1101662, 1576206, 1611615, 814146, 562478, 907503, 1149216, 677754, 7672, 88430, -106225, 79919, 1689318, 3084853, 3098010, 3449926, 2951003, 1812780, 1832539, 2132088, 2514578, 2859111, 2567481, 2002964, 831247, -754440, -1475896, -800688, 1451195, 2308569, 1141456, 188898, 684713, 1094950, 410910, -131183, -225081, -1228368, -1378460, -588327, 98797, 1224247, 1745414, 2011228, 2297467, 1324536, 1093660, 1994722, 3154260]
32308C154260J356515j49474j425117r02421j359638r60582N28386J022376K31559
32299A495864k95979q00586N38668O75283L49308J173752N09109q63190n68876
32290B213353K59190k11811o87990o98895l37801p80572n06542L82334J397714
32281A028980M33401O4184L74472K78502l33066j13311L10350J87097n73849q24463
32271H32297l74799M44253M62463M2401K4680K46009l69028o55893n93074m3250
32261A6059N41750O0799k58383O39593J121475N63139k43515n29131J99106K58479
32251B369371J97582J21951n05904n26489n71337k67741j41645n8192O4632K86902
32241I69130n02920o19063n99891J06118Q43831K41153j004637j533036P11088
$$ y = [3154260, 4510775, 4361301, 2936184, 2033763, 674125, -286457, 241929, 1264305, 1495864, 1199885, 399299, 937967, 1613250, 1962558, 3136310, 3645419, 2782229, 2213353, 2472543, 2260732, 1572742, 873847, 536046, -244526, -751068, -368734, 1028980, 1462381, 1526565, 1901037, 2179539, 1846473, 1733162, 2043512, 2230609, 1656760, 832297, 457498, 901751, 1364214, 1406615, 1431295, 1677304, 1308276, 652383, 59309, 16059, 557809, 618608, 360225, 999818, 2121293, 2684432, 2440917, 1911786, 2110892, 2369371, 2566953, 2688904, 2183000, 1656511, 1085174, 817433, 675788, 617596, 682228, 969130, 466210, -152853, -752744, -646626, 197205, 438358, -566279, -2099315, -1388227]
32232a388227J959522R11802l55342m15079N15746J040898Q0421N23190j55069
32223B717862j115116l53173m06383l72614K88306Q71349L81472q35158l48410
32214H28135j9369N61118k06973j00660R2750L18994J27405p78234q87315m38784
32204e02933O26219K22291J47016k12820o71929j60021J061123J197158K99912
32195B006016j3956K9174l68811k50772K30074J244562Q46491k02400j554299
32186A966079j567974m66038J12324M79501P72502n07764M791J47770q17498k30942
32176a07249O97315N63294n4135l43757J02126p31653m74361P31379j12736n63464
32166b93241o40440L29804J08683q38836R1402J235375O70083Q17255M73597m50277
$$ y = [-1388227, 571295, 1483097, 1127755, 712676, 1228422, 2269320, 2349741, 2872931, 2717862, 1602746, 1249573, 843190, 470576, 758882, 1630231, 2011703, 1176545, 828135, 808766, 1369884, 1162911, 1062251, 1155001, 1473995, 1601400, 823166, -64149, -502933, 123286, 345577, 492593, 279773, -392156, -552177, 508946, 1706104, 2006016, 1992060, 2021234, 1652423, 1401651, 1631725, 2876287, 3722778, 3520378, 1966079, 398105, -67933, 44391, 523892, 1296394, 788630, 793421, 941191, 123693, -107249, 590066, 1153360, 1099225, 755468, 857594, 125941, -348420, 382959, 270223, -293241, -933681, -603877, -495194, -1334030, -1242628, -7253, 662830, 1480085, 1953682, 1503405]
32156A503405j265883j449393r62866J65437J132960J363285M78693K20275p27526
32147D58387n95511O63287K91958p5951m63780k17495P52241O86858j64722p98950
32137E36322m83087k02348k76439J90829O70771R50021L09748P00395J000861
32128C397073k94233j431677p73529n81775j09505P68970J207296P24450l65490
32119B541580p01182m9338J3449m89765o11315M82547J226940m2815j079244j06638
32109A184219L47180j14245k76686l75356k47044l35423l10538J36218J363637
32100A371962J142729K1899j089359j332030o93944L99079R34960O53098K59191
32091A667585J19525l47168l72688j60414O73015P78695m7438n19209j06453P0152
$$ y = [1503405, 237522, -1211871, -2174737, -2009300, -876340, 486945, 965638, 1185913, 458387, -137124, 526163, 818121, 742170, 278390, 60895, 813136, 1499994, 1335272, 536322, 53235, -149113, -425552, -234723, 436048, 1386069, 1695817, 2396212, 3397073, 3102840, 1671163, 897634, 315859, 206354, 975324, 2182620, 2907070, 2541580, 1840398, 1791060, 1804509, 1314744, 703429, 1185976, 2412916, 2370101, 1290857, 1184219, 1531399, 1417154, 1140468, 765112, 518068, 182645, -127893, 8325, 1371962, 2514691, 2536590, 1447231, 115201, -578743, -179664, 755296, 1408394, 1667585, 1787110, 1439942, 1067254, 906840, 1579855, 2358550, 2311112, 1791903, 1685450, 1755602]
32081A755602P68953k09378o68760j82448l06269l79992Q05518P19149m22986
32072A879389j007712m78890j64341m05227K14143K44556p88919l54175J303550
32063D42374J451236O45655o16124n36470K46423J74975M55935M26122j09592
32054B580534J4184j090579m54509O06192o77137j189162k97252O94764j67966
32045A9069j142453m98093M71962J224864M42958J356089J927048O54909j236584
32036C219769j706365L93800J531888m43026j004549M0874O7660J34593L93677
32027B628321r85662p40766q8774J06008M34513O99003N4250N662J35218m3227
32017B204546q14480r60772l85297P20824J905830J296002j06896p06566l50934
$$ y = [1755602, 2524555, 2315177, 1646417, 1463969, 1157700, 777708, 1583226, 2302375, 1879389, 871677, 392787, 228446, -176781, 37362, 281918, -507001, -861176, 442374, 1893610, 2539265, 1923141, 1386671, 1633094, 1808069, 2264004, 2690126, 2580534, 2594718, 1504139, 1049630, 1655822, 978685, -210477, -507729, 187035, 19069, -1123384, -1621477, -1149515, 75349, 518307, 1874396, 3801444, 4456353, 3219769, 1513404, 1907204, 3439092, 2996066, 1991517, 2032391, 2100051, 2234644, 2628321, 1642659, 901893, 813119, 919127, 1353640, 2052643, 2106893, 2112555, 2247773, 2204546, 1390066, 429294, 43997, 764821, 2670651, 3966653, 3859757, 3153191, 2802257]
32008B802257j038356o81469j35454o33646q36601m37504r5437K12110J726856
31999H82756K284416R49384o42051j038333M07720J681641P27498j020700j526890
31990B705441j357815j34503P38861K4808j050455j500850r41528O67718J763643
31981I15320k60315j084590M00184J145586J32806k83258Q2972Q70918j10003
31972A809620q78611M23412N9640l46744l70524o93374l62722J3438L4046P86338
31962D74519J351962R54689m4786q57010j566048j660491m51163P23337O06656
31953d68335M74774N12903r69747o54876R3611K77863m14872j263k29842p71844
31943b151628O8390J25006L77351L92214Q82365j28482p51216l43284N67844J214110
$$ y = [2802257, 1763901, 1082432, 946978, 313332, -523269, -960773, -1056210, -844100, 882756, 3167172, 4116556, 3474505, 2436172, 2843892, 4525533, 5253031, 4232331, 2705441, 1347626, 1213123, 1951984, 1976792, 926337, -574513, -1516041, -848323, 915320, 655005, -429585, -29401, 1116185, 1248991, 965733, 1048705, 1919623, 1809620, 931009, 1354421, 1414061, 1067317, 696793, 3419, -359303, -345865, -311819, 474519, 1826481, 2781170, 2736384, 1879374, 313326, -1347165, -1798328, -1074991, -468335, 6439, 519342, -450405, -1105281, -1011670, -733807, -1148679, -1149942, -1379784, -2151628, -2083238, -1958232, -1580881, -1188667, -306302, -434784, -1186000, -1529284, -961440, 252670]
31933B52670P69489j37460q00829m1619L69079N13865Q05398M18317J38999L55041
31923B642950K85543k45496j88147l15949r03886p87336j92432M78766M76093
31914A250106m27443p65174j38399K15236L30414k04468m53459m67994J2055N77343
31904g1783P51314J107248R89104j77246o21927O79826J590366N19322n73258
31895D192966j067393n42612o1590j898853j622208o67002Q2140J482680J727542
31886A625670l68992r34553j625338k74250O98192K75678J55727l40182o97078
31877a485126l6458O00109J058123R65192j35664j273666o40220M63897J025505
31868E41692J379965l539M90614N88267j164273j805466j217521n37254J340309
$$ y = [252670, 1022159, 884699, 83870, 42251, 411330, 925195, 1730593, 2148910, 2287909, 2642950, 2928493, 2682997, 2494850, 2178901, 1275015, 487679, 295247, 774013, 1250106, 822663, 57489, -80910, 134326, 464740, 260272, -193187, -661181, -649126, -71783, 679531, 1786779, 2775883, 2598637, 1976710, 2656536, 4246902, 4766224, 4192966, 3125573, 2582961, 2521371, 622518, -999690, -1666692, -1584552, -101872, 1625670, 1256678, 322125, -1303213, -1577463, -879271, -603593, -447866, -788048, -1485126, -1521584, -921475, 136648, 1101840, 966176, -307490, -947710, -483813, 541692, 1921657, 1918118, 2408732, 2996999, 1832726, 27260, -1190261, -1727515, -387206]
31859c87206J918264o15550j404000r95914K80357J902848J060611j137565j644046
31850a022201o72667M56147M22504j52824M0995K08927L04881M82363j72978N63500
31840D58647P43060r5416r01053j135673q23861o65951m03780K0654L48825J45365
31830b309183j70627j02732N9084m28303j59736k2612K0037O61529O54292M64004
31820a334247L28764Q91375L53427m55274k69033K59934q78241N41208J925602
31811A363515M07511j493718j304075J87730R06708l11663n11729J10454K27323
31802d17944J234220J467007P11866k49552o78762p82916n67336P7798N85508
31793A379889M66422j12164J10729M1191r28056l32964j84159Q9247L78327k85860
$$ y = [-387206, 1531058, 915508, -488492, -1484406, -1204049, 698799, 1759410, 621845, -1022201, -1694868, -1238721, -816217, -969041, -928046, -719119, -414238, 68125, -104853, 458647, 1201707, 1106291, 205238, -930435, -1754296, -2420247, -2824027, -2803373, -2454548, -2309183, -2479810, -2582542, -2523458, -2951761, -3111497, -3134109, -3114072, -2452543, -1798251, -1334247, -1005483, -114108, 239319, -215955, -484988, -225054, -1103295, -562087, 1363515, 1771026, 277308, -1026767, -839037, 67671, -243992, -755721, -645267, -417944, 816276, 2283283, 2995149, 2745597, 2066835, 1283919, 716583, 794381, 1379889, 1846311, 1734147, 1844876, 1886067, 958011, 625047, 440888, 530135, 908462, 622602]
31783F22602p8925L0237q34936j04152P65226r843j062532r81799L51992J242498
31773e9632R05561K92096o45713N5304O09319l73083K47970M17332n23394L06728
31763A232488J73433k88394L13141O81683j021094j686885K34045J166136N66353
31754A370906J95084p92758q06087j216061j067762O61552N57956P33539N61959
31745A98328J05798n05141p58330K20344k19462k13009K52689L30954O57602K54440
31735C24213j022010j538402m92980J000419J59304M51067J094227J127832Q19511
31726A923181q75536j360323k40825J03134j80822l39950p29342q72550P18328
31717a854705J176818J269788K318055j81890j594824m38567M32929K56313j21835
$$ y = [622602, 543677, 573914, -261022, -365174, 400052, 390209, -672323, -1654122, -1302130, -59632, 845929, 1138025, 492312, 547616, 1156935, 783852, 1031822, 1449154, 925760, 1232488, 1405921, 1117527, 1430668, 2112351, 1091257, -595628, -361583, 804553, 1370906, 1565990, 773232, -32855, -1248916, -2316678, -1655126, -1097170, -363631, 198328, 304126, -201015, -959345, -739001, -958463, -1171472, -918783, -587829, 69773, 324213, -697797, -2236199, -2729179, -1728760, -1569456, -1118389, -24162, 1103670, 1923181, 1047645, -312678, -553503, -450369, -631191, -971141, -1700483, -2573033, -1854705, -677887, 591901, 2909956, 2728066, 1133242, 694675, 1127604, 1383917, 1262082]
31708A262082l84324o13841l96370l02588o51156j030732l9794L24569J033467
31699g98687O08595L4371k71598K70237M056n0776M0780J16859n00043o25209
31689a171415J37831M91772J126917J069752j64967j189383m37136L24617m08449
31680b20461o73906N64358Q20316O66038l66085j40706O9612n68754m94538N5556
31670b88570q9600J79683M68808p54717M89108M93760O80559N94898m84261R4976
31660A384644J190466l23029j334964q41823p24017p06189o77236N09453L64286
31651a158409o65261k49910K72978J14881q1952O03940K92328o1527R74715K249087
31641B290870R50013j474726q28068M4775L08424j391046q37844j71850m17880
$$ y = [1262082, 877758, 263917, -132453, -435041, -1086197, -2116929, -2156723, -1832154, -798687, -190092, -155721, -427319, -157082, -153026, -203802, -163022, -46163, -546206, -1171415, -1033584, -541812, 585105, 1654857, 1489890, 300507, -136629, 187988, -220461, -894367, -330009, 490307, 1156345, 790260, 649554, 719166, 150412, -344126, -288570, -378170, -198487, 270321, -484396, 4712, 498472, 1179031, 1773929, 1289668, 1384644, 2575110, 2252081, 917117, 75294, -648723, -1354912, -2032148, -1522695, -1158409, -1823670, -2073580, -1800602, -1685721, -1767673, -1163733, -871405, -932932, 41783, 2290870, 3240883, 1766157, 938089, 982864, 1291288, -99758, -937602, -1109452, -1527332]
31632a527332K36046K31851j52492J06764M32110K24781J037091P82709j11357
31623A260171l3144l84793r76724k3740Q43646N22432O07761L37527L81610L41
31613B535087k09896q92448n53580j99r94906j268566q144J234981J21085r67236
31603a003822r2321k27669k2797K34468K80364N27639k21904l68422L13903J016682
31593D36121J98554r82573q18138l14617K68144L59316j17105J99348l00808j85759
31583a257517J089478Q50121J94567J277567N57866K27543N84114J454070K10501
31574E188310j412718j292360j543838r12477L04840l4722n74799J166997L00793
31565A190026j310450j298268j48508J9961j84727L34668Q81011K21622M73443
$$ y = [-1527332, -1291286, -1059435, -1211927, -1105163, -673053, -448272, 588819, 1371528, 1260171, 1227027, 842234, -134490, -158230, 685416, 1207848, 1815609, 2153136, 2534746, 2535087, 2325191, 1432743, 879163, 878964, -115942, -1384508, -1392652, -157671, -36586, -1003822, -1096143, -1323812, -1346609, -1112141, -831777, -304138, -526042, -894464, -580561, 436121, 634675, -347898, -1166036, -1480653, -1212509, -853193, -970298, -770950, -1071758, -1257517, -168039, 682082, 876649, 2154216, 2712082, 2939625, 3523739, 4977809, 5188310, 3775592, 2483232, 939394, 26917, 331757, 297035, -277764, 889233, 1190026, -120424, -1418692, -1567200, -1547239, -1731966, -1397298, -516287, -294665, 178778]
31556A78778k46309p07194J23300O43000k70586M298K07775l10384j56655M13624
31546a20353P07049K81705P2506j06375r54664p09341j154579p30024O2882J155960
31536a495234J204172K42120J68654k85639o70198q35020o81721N05858J059214
31527g87794J158168l1373q74716o48927L4354R78684R96152p27501j849767r21381
31517b674101q2303L08629o313o02874l52987J094790K42982L08138J042657K43175
31507d78207M58524J020495Q90564p7251o99255o79496j83722r00986n94273K20718
31497a022889J07224L9323o6959J93478P33260M78386J59912j04640r04985m30282
31487h18172J15066L99274J22322P06164K63021M28321J174234k83300j374584
$$ y = [178778, -67531, -774725, -651425, -8425, -279011, -274713, -66938, -377322, -533977, -120353, 586696, 868401, 940907, 834532, -120132, -829473, -1984052, -2714076, -2651194, -1495234, -291062, -48942, 119712, -165927, -836125, -1671145, -2352866, -1847008, -787794, 370374, 339001, -535715, -1184642, -1150288, -171604, 824548, 97047, -1752720, -2674101, -2756404, -2447775, -2454088, -3056962, -3409949, -2315159, -2072177, -1764039, -721382, -478207, -19683, 1000812, 1891376, 1814125, 1114870, 435374, 251652, -649334, -1243607, -1022889, -915665, -876342, -943301, -749823, -16563, 461823, 621735, 517095, -387890, -818172, -703106, -303832, -181510, 524654, 787675, 1215996, 2390230, 2106930, 732346]
31478G32346K28200L12177J573P39313K33904p48209L27765O30610p6731r88557
31468A392391j376284m7001J013790J074036L09060j142214o38208K76871K61645
31459A124086k24195o88329o69648o67475j29701J19839R88347J556955j93318
31450A216561j006237r29436k39004O41011J63807p08821m59248N26675M70642
31441c24050O82136N77804p74903l46463L68591k40331j26754k55431L67841N60141
31431D88581j86061o26690r43054M04154N28715n12878n4513m94966l58581l48568
31421b103861n25332L35806R49225R38453L39491N61508M90222l87535j366966
31412g68989k97411O5572j77212P8487Q30656O36907n34200j97692j35851O3423
$$ y = [732346, 960546, 1272723, 1274296, 2013609, 2247513, 1499304, 1827069, 2457679, 2380948, 1392391, 16107, -30894, 982896, 2056932, 2365992, 1223778, 585570, 862441, 1124086, 899891, 211562, -458086, -1125561, -1255262, -1135423, -147076, 1409879, 1216561, 210324, -719112, -958116, -317105, -153298, -862119, -1321367, -794692, -324050, 358086, 935890, 160987, -185476, 183115, -57216, -183970, -439401, -71560, 488581, 302520, -324170, -1267224, -863070, -334355, -847233, -901746, -1396712, -1755293, -2103861, -2629193, -2293387, -1344162, -405709, -66218, 495290, 985512, 597977, -768989, -1066400, -1000828, -1178040, -1099553, -268897, 368010, -166190, -363882, -499733, -436310]
31402d36310J58771j275503j166585n62055P73851O45386M57029P48697N65104
31393i1615J62206l76362L48247R53903m12743o39241J20581N49973k35842K86799
31383F65906J145802o873r93462q46741l42742M37074O84309n06251q78819q54468
31373a496265J37666O99755j56961k80505N69128J423757O6501m71094o36521
31364a44539q16505N9276N4234j24291m16617l54689L34344O88212N64500R95137
31354H39062K37090n01163j273989n56575j8453L28758Q29204O84809l3048n98634
31344f2939J71478J152588k37818j067121p95413J428075J298630l54674J73247
31335A706053K88222J89470k72385p28756j377579j263673k94761J150614P04725
$$ y = [-436310, -277539, -1553042, -2719627, -3281682, -2507831, -1862445, -1405416, -656719, -91615, 70591, -305771, 42476, 996379, 583636, -55605, 64976, 614949, 379107, 665906, 1811708, 1804835, 811373, -35368, -378110, 58964, 743273, 237022, -641797, -1496265, -1358599, -658844, -815805, -1096310, -527182, 896575, 963076, 491982, -144539, -961044, -901768, -847534, -971825, -1388442, -1743131, -1408787, -720575, -156075, 839062, 1076152, 574989, -699000, -1255575, -1274028, -945270, -116066, 568743, 535695, -62939, 108539, 1261127, 1023309, -43812, -839225, 588850, 1887480, 1532806, 1706053, 1994275, 2183745, 1911360, 1182604, -194975, -1458648, -1753409, -602795, 101930]
31326A01930N09110K1707j859l8985o42713M8432Q79338Q48785j78500p75510
31316G71735n32422m72882o79533Q47073L98323j164592j101970J25783J429377
31307c79108J147663M43118l26534m07076K52268n47723J0630K61877m7708N12058
31297I19465l62155j440103n76830P83819K38303r81048r09043r22238k3507M14009
31287b859328J041248J585175J064297K47432o91992l05760P15611L13037l84164
31278G25556L98324K54098q65698j151074p24311l64755p1892M64400J216335
31269a19017P40026n0588o39293p97431J77792M49353j65532m70289K65704N92830
31259a6445O73811R12278M95984l89835R4422M36008L88484O30708N34179l31310
$$ y = [101930, 611040, 632747, 630888, 591903, -50810, -2378, 876960, 1725745, 1547245, 771735, 239313, -233569, -913102, -66029, 332294, -832298, -1934268, -1808485, -379108, 768555, 1211673, 885139, 478063, 730331, 182608, 193238, 455115, 407407, 919465, 557310, -882793, -1459623, -675804, -437501, -1418549, -2327592, -3249830, -3273337, -2859328, -1818080, -232905, 831392, 1078824, 386832, 81072, 796683, 1109720, 725556, 1123880, 1377978, 512280, -638794, -1363105, -1727860, -1799752, -1335352, -119017, 621009, 570421, -68872, -866303, -688511, -239158, -404690, -874979, -609275, -16445, 657366, 1569644, 2065628, 1675793, 1770215, 2206223, 2594707, 3225415, 3759594, 3428284]
31249C428284j319622o19145j69596p3171j56074n69446j31824J59621k51581
31240B97446r71713l80883M75815K29697j159418j020447K07770R74015J026484
31231c21234L22242o65948O2155M77147Q0295r35051j001579Q11493L22476m28463
31221a276467m50726L78311R37378L50088M18940K93271k38736r779J319898P35249
31211B457427j38509l37924J78774L05881r79192m30881K79857R17537m3103q98776
31201A311091m26848M33606L10281M04007j86920j122956n17316j373623q16907
31192a985585Q59252Q81144M63182L71020o73087j586338l31534M68188l4621
31183a568379q28951l30913l2619J41752R59567O00878r39776j636640m15595
$$ y = [3428284, 2108662, 1489517, 1319921, 1246750, 1090676, 521230, 389406, 549027, 297446, -674267, -1055150, -579335, -349638, -1509056, -2529503, -2321733, -1347718, -321234, 1008, -664940, -602785, -125638, -45343, -980394, -1981973, -1170480, -848004, -1276467, -1727193, -1348882, -411504, -61416, 357524, 650795, 412059, 402280, 1722178, 2457427, 2318918, 1980994, 2159768, 2465649, 1486457, 1055576, 1335433, 2252970, 2209867, 1311091, 884243, 1317849, 1628130, 2032137, 1845217, 722261, 204945, -1168678, -1985585, -1126333, -245189, 217993, 589013, -84074, -1670412, -2001946, -1533758, -1568379, -2397330, -2728243, -2760862, -2619110, -1659543, -1058665, -1998441, -3635081, -4050676]
31174d050676Q88474J286354P82486M22812O23265n52745o52826j028548r26820
31165c208224J11144K53738N05886P94873J37904k08652m63113l7232J043396
31156a070280Q27275L84666p23551m0736M67308k76587j012286j071596j47133
31147b662920M29212Q14185Q30827J000489J123511M43880L24924k42116j024112
31138A037880o20920M856l3904J25883o78078j775170o09708P85853J267123J196544
31128G00359j89724l43360N44321q36535j204294k26197n46294p07800K53036
31119b556488M33227J85476L22001N12829R56912N24119l21796m25375m78367
31110h47462R7954k39789k31444J31994M01890J50274j7644R1236p83780q60970
$$ y = [-4050676, -3162202, -1875848, -1093362, -670550, -47285, -600030, -1252856, -2281404, -3208224, -3097080, -2843342, -2337456, -1542583, -1404679, -1613331, -2076444, -2113676, -1070280, -243005, 141661, -581890, -622626, -155318, -431905, -1444191, -2515787, -2662920, -2233708, -1419523, -588696, 411793, 1535304, 1979184, 2304108, 2061992, 1037880, 416960, 421816, 387912, 513795, -164283, -1939453, -2549161, -1763308, -496185, 700359, 510635, 167275, 711596, -124939, -1329233, -1555430, -2101724, -2809524, -2556488, -2123261, -1937785, -1615784, -1102955, -146043, 378076, 56280, -369095, -847462, -749508, -989297, -1220741, -1088747, -686857, -536583, -554227, -462991, -1246771, -2107741]
31100b107741R29680R81073l89424j1280Q46585M03191n50675L04010K10907K64402
31090H80728J032290L25277P05163k76338j546943n69070l60515k95662n47192
31081f52262j367122m05303J76549m23834j91677R78141J361502J11065L28077
31072h4864p70088p78229M00285K70699q134N90320L30378l73790l58694J78255
31062f03862M41102p8595o39990p68453m25527l26984J308070Q70373l65458L36279
31052b53045J248361N12929K15647j046108j945327o40520J154922J006574n4946
31043A98487o31773k64843L60138J288N70661N97174L96611j57559j07473o8932
31033H93779l61914P3210L91128R71826O34419j05442j173960j422714k61173
$$ y = [-2107741, -1178061, -196988, -586412, -597692, 248893, 652084, 101409, 405419, 616326, 880728, 1913018, 2238295, 2943458, 2667120, 1120177, 551107, 190592, -105070, -652262, -2019384, -2424687, -2248138, -2671972, -2863649, -1885508, -524006, -412941, -84864, -854952, -1633181, -1232896, -962197, -970331, -380011, -49633, -423423, -782117, -603862, -162760, -241355, -881345, -1649798, -2075325, -2402309, -1094239, -223866, -589324, -253045, 995316, 1508245, 1723892, 677784, -1267543, -1908063, -753141, 253433, 198487, -433286, -698129, -337991, -336703, 233958, 831132, 1227743, 1070184, 962711, 893779, 531865, 605075, 996203, 1968029, 2602448, 2497006, 1323046, -99668, -360841]
31024c60841L42107q72549p57728M18934L10865M47121J061479K24118n26424
31015B87082k28846K26736O23180J63184p73624j202186n35968L92770J497681
31006D50009N26825l22958q90970j260026p73040m98904L81792J053321P21552
30997f12399M54982k60531n65145K74600J706p9833P02388O96996m83957j074663
30987i45856k27144O22973J073488M61011o05384n12273n85587J7513O1458o62904
30977a302705L94484J123367L39608M28231J297937J077130o66243k326700j403013
30968a037904P312J456362J369276j313901k158240p79710J44265O85459Q66611
30959g60470l83332j266366j18996Q39517K2763o79131K25121O28229j34119q41766
$$ y = [-360841, -18734, -891283, -1649011, -1230077, -919212, -472091, 589388, 813506, 287082, 58236, 284972, 908152, 1071336, 297712, -904474, -1440442, -1047672, 450009, 976834, 653876, -237094, -1497120, -2270160, -2769064, -2387272, -1333951, -612399, -157417, -417948, -983093, -708493, -706787, -786620, -84232, 612764, 128807, -945856, -1173000, -550027, 523461, 984472, 379088, -133185, -718772, -701259, -639801, -1302705, -908221, 215146, 554754, 982985, 2280922, 3358052, 2691809, 365109, -1037904, -1030592, 425770, 1795046, 481145, -1677095, -2456805, -2312540, -1627081, -760470, -1143802, -2410168, -2529164, -1689647, -1666884, -2346015, -2120894, -1492665, -1626784, -2468550]
30949b468550p13027J136185o8651m19259L34913j57985p7900O2454l3765L24491
30939b081094K07231J93768O59877m54840p06976q17545p5134R15186R57883N55716
30929f45928O73358P00844R11553J174936Q46850R14440J059707K27085R51337
30920F814182J273327J69582o79829n29199m96262k88023L5388q96801o76140
30911D726225R17518J137952m7000r06527m42209q35491j555264j741688n07079
30902G46437R20506J015417l38652J13062P65581L74397M49390K06001J54596
30893D406735m37281o03277q81366l06278J160291J442884N55871j46252R6287
30884E287614J172168J742612J958089K375297M012946M564702M786228P404238
$$ y = [-2468550, -3181577, -2045392, -2114043, -2533302, -2198389, -2356374, -2434274, -2371820, -2405585, -2081094, -1873863, -1680095, -1020218, -1475058, -2182034, -2999579, -3074713, -2159527, -1201644, -645928, 27430, 728274, 1639827, 2814763, 3661613, 4576053, 5635760, 5862845, 6814182, 8087509, 8257091, 7577262, 7048063, 6551801, 6263778, 6299166, 5402365, 4726225, 5643743, 6781695, 6734695, 5828168, 5385959, 4550468, 2995204, 1253516, 746437, 1666943, 2682360, 2343708, 2456770, 3222351, 3596748, 4046138, 4252139, 4406735, 3969454, 3366177, 2484811, 2178533, 3338824, 4781708, 5337579, 5191327, 5287614, 6459782, 8202394, 10160483, 12535780, 16548726, 21113428, 25899656, 33303894]
30876C3303894R958204J3028420J6561202J9069207K3197762K8200726L1497255
30869A74816670L3783965L3284508L2915450L3701385K9742036K7239076K1697545
30862C87180635J4593378J1173663N100027J742728l100393p594153j1139851
30855C97956034j6869690k0163693k4722250k7516373k9465566l2032388l1248253
30848B15937821k9398738k8465368k6453425k3096691j8878291j5702378j3227453
30841F0715477j0997766q998428o757621m249000l126668k980690k378021j203948
30833B0023335j801506j460567j253181j558209j302020k265750j514113p5184
30825H792805k73776k91897l05422o36436r160O29999P08989k52207n64809M53443
$$ y = [33303894, 43262098, 56290518, 72851720, 91920927, 115118689, 143319415, 174816670, 208600635, 241885143, 274800593, 308501978, 338244014, 365483090, 387180635, 401774013, 412947676, 418047703, 419790431, 416690038, 409095885, 397956034, 381086344, 360922651, 336200401, 308684028, 279218462, 247186074, 215937821, 186539083, 158073715, 131620290, 108523599, 89645308, 73942930, 60715477, 49717711, 40719283, 33961662, 29712662, 26585994, 23605304, 21227283, 20023335, 18221829, 16761262, 15508081, 13949872, 12647852, 10382102, 8867989, 8792805, 8519029, 8227132, 7921710, 7285274, 7276114, 7906113, 8615102, 8362895, 7798086, 8251529]
30815H251529M99173n83198J38679K264l78268m08508j71994N18044j26907l44851
30805G395963L55360M94481j53250n91767k89640N92921P63917j99626m95236
30796G873123p98900j307502j293899p75018o66541o06625J17794O64389q8610
30787C118211o92301J42661J237622J459813J044209L24368k1537J09660j007851
30778E714855j154999n01454p04333l38480Q6501k92395m28039l70275o23261
30769A388120l96131K06404j51611r16121j853193j641428J64893J584243R89645
30760f25179n43557M51425R98130R05487l08205j078081k30241L7936k25108n8516
30750f75909l94278r5397O90756J147415Q84505J174107J260501m45389q99424
$$ y = [8251529, 8750702, 8167504, 8306183, 8308447, 7930179, 7521671, 7349677, 7867721, 7740814, 7395963, 7751323, 8245804, 8092554, 7500787, 7211147, 7804068, 8567985, 8368359, 7873123, 7074223, 5766721, 4472822, 3697804, 3031263, 2424638, 2542432, 3206821, 3118211, 2425910, 2568571, 3806193, 5266006, 6310215, 6634583, 6613046, 6722706, 5714855, 4559856, 4058402, 3354069, 3015589, 3102090, 2809695, 2381656, 2011381, 1388120, 991989, 1198393, 1046782, 130661, -1722532, -3363960, -3199067, -1614824, -625179, -1168736, -717311, 280819, 1186306, 878101, -199980, -430221, -392285, -617393, -675909, -1070187, -1165584, -474828, 672587, 1557092, 2731199, 3991700, 3546311, 2646887]
30741B646887o69812o83184n65989m0084K14404M37185L98586l91593r45921j266849
30731h66370p31807J218118J337134l90411K67450P94528J94520J87409L39424
30722B349995P37348m773p45986p11615o459O08198L83150l32063n71899j280429
30712D25467j80625P31441O9954m75716M55471Q91725M23547l41640j010519q72304
30702A16801l57598p3253R47146N13037n79560o73711j41354l30100N4165N55804
30692C1377n8655p20188J18316L72411n55322n77423K45957J209165Q16147N96845
30682A478630L15636N79939L53811O85820o10841q65864k37240q72270Q8704N30778
30672A447103J14171J22460r30031q34829k9186Q51338Q65424j60900j066540
$$ y = [2646887, 1977075, 1293891, 727902, 687818, 902222, 1339407, 1737993, 1346400, 400479, -866370, -1598177, -380059, 957075, 566664, 834114, 1628642, 1823162, 2010571, 2349995, 3087343, 3082570, 2336584, 1624969, 1618510, 2226708, 2609858, 2277795, 1705896, 425467, 244842, 976283, 1046237, 570521, 1025992, 1917717, 2341264, 1999624, 989105, 116801, -240797, -314050, 633096, 1146133, 566573, -107138, -248492, -578592, -524427, 31377, -27278, -747466, -629150, -256739, -812061, -1389484, -1143527, 65638, 881785, 1478630, 1794266, 2374205, 2728016, 3413836, 2802995, 1937131, 1699891, 827621, 916325, 1447103, 1561274, 1683734, 753703, -81126, -110312, 741026, 1606450, 1445550, 379010]
30663C79010j524266m09922N79371J080613R0182p14928k19614r4948j59613L936
30653i90179R42902M19674o29524p00835K38542J024670J356312J352275Q71239
30644C885076p62549j007816j282616n92486J3653k91259j038799n14534J016038
30635e75292J046994R06182N77665o69391J05654P49403n11024j4005k68167p9464
30625A268555o03882o21532j63668L70929k45672r25750m8877J34686K28547N44416
30615f2248J20718k20074M15557l04190q98515N18501M92286P8202M95413m67881
30605A67769p39979m26272o62837k06624M92917Q57188J019972O89256k18102
30596I73288k77748L78912J04202p13058p16147L56061R72294O09377q9430p22725
$$ y = [379010, -1145256, -1555178, -975807, 104806, 194988, -519940, -739554, -834502, -994115, -990179, -47277, 372397, -257127, -957962, -719420, 305250, 1661562, 3013837, 3885076, 3122527, 2114711, 832095, 239609, 253262, -37997, -1076796, -1591330, -575292, 471702, 1377884, 1955549, 1286158, 1391812, 2141215, 1630191, 1616186, 1348019, 1268555, 664673, 43141, -120527, 250402, 4730, -921020, -969897, -835211, -606664, -62248, 58470, -161604, 253953, -50237, -948752, -430251, 62035, 140237, 635650, 167769, -572210, -998482, -1661319, -1867943, -1375026, -517838, 502134, 1191390, 973288, 695540, 1074452, 1178654, 465596, -250551, 105510, 1077804, 1687181, 1597751, 875026]
30586H75026n28087j209776j213581R4725R52072P22068o66636j572066j16049
30577b662304Q05279j81478m54210P01507J077825k37614K60362P02820M92226
30568E04413P635p00912j008915r36133m06556K17440R68622J423183Q15057p33521
30558A50313j012749j13080l55932J2677M15941N34098O25023M66697K40706r87090
30548b3396m42739K37383Q56264K057224J186297o38778j259008l16760j57922
30539A498565j101111n0973M73902K86932N93687N8195M91098l8465q97013l50262
30529I64555N3560j284845r96852R68902J204020J066325K33649J09682K88777
30520B607773l16008j317344q84649L86669R56993Q93710O02968m43743j705396
$$ y = [875026, 346939, -862837, -2076418, -1981693, -1029621, -307553, -974189, -2546255, -2662304, -1857025, -2038503, -2492713, -1791206, -713381, -950995, -690633, 12187, 504413, 512048, -188864, -1197779, -2133912, -2540468, -2323028, -1354406, 68777, 883834, 150313, -862436, -975516, -1331448, -1318771, -902830, -368732, 256291, 722988, 963694, -23396, -466135, -228752, 627512, 2684736, 3871033, 3232255, 1973247, 1656487, 1498565, 397454, 346481, 820383, 1107315, 1701002, 1759197, 2250295, 2211830, 1314817, 964555, 1018115, -266730, -1263582, -294680, 909340, 1975665, 2209314, 2318996, 2607773, 2291765, 974421, 89772, 476441, 1433434, 2327144, 2930112, 2486369, 780973]
30511G80973j660337l08202r5202k7423M25630N69378j340807j445062j6655O21883
30501b495824N94185l73998P8315n87009l44743k5885Q43582J395913J402789
30492D87325K02622o71610j104714m55451N91231q1096n68713j15022M62427R99150
30482b53851M45783L27498L91335n74275K41272L68741k18787N24383R75881M9149
30472B277129l52447O95548J118580K71910K61810k57197o57995r66500r21018
30463A469820j259170j385378j279889L00364J061620R68113N13359l660M36465
30454H21644Q62998J58725J06810Q09662J20784o43202k32343j0858k12851L03986
30444B085355L20567Q55706J150460K24967l72111p8985q67295j157120q58658
$$ y = [780973, -879364, -1187566, -1282768, -1310191, -884561, -315183, -1655990, -3101052, -3117707, -2495824, -1901639, -2275637, -2197322, -2784331, -3129074, -3154959, -2311377, -915464, 487325, 689947, 18337, -1086377, -1541828, -950597, -1031693, -1600406, -1715428, -1253001, -253851, 191932, 519430, 910765, 336490, 577762, 946503, 727716, 1252099, 2227980, 2277129, 1924682, 2620230, 3738810, 4010720, 4272530, 4015333, 3357338, 2390838, 1469820, 210650, -1174728, -2454617, -2154253, -1092633, -124520, 388839, 385179, 821644, 1684642, 1843367, 1950177, 2759839, 2880623, 2237421, 2005078, 1994220, 1781369, 2085355, 2405922, 3261628, 4412088, 4637055, 4264944, 4185959, 3318664, 2161544, 1302886]
30435A302886N7771J005968K24166j382709j668841p16408J725823J374075k98077
30426A624654j029481j059520o94428P13678J234591O69968N00449J81802J61543
30417B303256r18692j012550J34048J015367P42665n83555j70839r94719j453682
30408i38701o20746p6816P54784n3259q18716m41647k11016N34231Q67360J212760
30398B08234N30735m36914o63881n95499P22366J083843L58646j93475j25324
30389H88731m69422J65082L98225j81018j131534j031948Q5020Q03198M60878
30380a2788L1890j55872p18187k60611J026Q43830P60052q43078r24975o96342
30370a975055L55431R08226L92070O34050M92236J77515j94386n9452P53608J195564
$$ y = [1302886, 1360657, 2366625, 2590791, 1208082, -460759, -1177167, 548656, 1922731, 1624654, 595173, -464347, -1158775, -445097, 789494, 1459462, 1959911, 2141713, 2303256, 1384564, 372014, 506062, 1521429, 2264094, 1680539, 1509700, 514981, -938701, -1559447, -1636263, -881479, -934738, -1753454, -2195101, -2406117, -1871886, -1004526, 208234, 738969, 302055, -361826, -957325, -234959, 848884, 1207530, 1014055, 888731, 419309, 584391, 982616, 801598, -329936, -1361884, -1276864, -473666, -12788, 19102, -136770, -854957, -1115568, -1114542, -270712, 489340, -353738, -1278713, -1975055, -1619624, -711398, -319328, 314722, 806958, 984473, 790087, 730635, 1484243, 2679807]
30360B679807j76875k152010j447965o16646Q86587M55173n27262P9092O02441
30351b17658J83955Q38847P97107l00875n09252l39217l3723Q18430k8144j280273
30341g0803j44242K57872L80612j29110o77130n18425p28563k29091M60979R18933
30331d78968M28763K22147K70666j91578n84936l67091J030002Q86250r4364q60344
30321B60547j094868j058563n26959J761011K241219J29525j23722M42014n8165
30312A972039m96271o58066o10482j51908J76793l13647K9036P80694J275380
30303B003568J471957K11921k20793l34108q50632r98297k99805j480912j372555
30294a869656m44288L91616J088420K66313p38886l80506K21290M66708J011984
$$ y = [2679807, 2502932, 350922, -1097043, -1713689, -827102, -371929, -899191, -820099, -217658, -33703, 805144, 1602251, 1301376, 792124, 452907, 419184, 1237614, 1209470, -70803, -215045, 42827, 423439, 294329, -382801, -901226, -1629789, -1858880, -1397901, -478968, -50205, 171942, 442608, 251030, -333906, -700997, 329005, 1215255, 1120891, 260547, -834321, -1892884, -2419843, -658832, 1582387, 1711912, 1588190, 2030204, 1972039, 1475768, 817702, 207220, 55312, 232105, -81542, -52506, 728188, 2003568, 3475525, 3687446, 3466653, 3132545, 2281913, 1283616, 983811, -497101, -1869656, -2313944, -1922328, -833908, -567595, -1306481, -1686987, -1465697, -998989, 12995]
30285A2995K59962p8176O414J220344k72382j480798o17585k07235L39392M45467
30275c71602O29354K47740j83999j41430j233062j400010q6099P53665Q89623
30266h95820J204128O65275J011159P49218O16988N93669o70300j382513q63647
30257A028157o75415N2763o9944n25071m30692k92432N57359K48661k3052k60963
30247c90629p94368N03504J9556j623953n50197P26276L34635r5349q8635o90800
30237b649960j06154L88263K21135O9978J558638J892593O45067p6519o90443
30228A252598j587140k54014Q00253M10438P54133K23609L51687m94722n81592
30219H75250O87120J042539p89212j428791p03464k20411Q5722M15089O45035
$$ y = [12995, 272957, 194781, 201195, 1421539, 1149157, -331641, -949226, -1156461, -817069, -371602, 257752, 505492, 321493, 180063, -1052999, -2453009, -2539108, -1785443, -895820, 308308, 973583, 1984742, 2733960, 3350948, 3944617, 3274317, 1891804, 1028157, 352742, 405505, 335561, -189510, -620202, -912634, -355275, -106614, -129666, -390629, -1184997, -681493, -661937, -2285890, -2836087, -2109811, -1775176, -1870525, -1959160, -2649960, -2756114, -2367851, -2146716, -2076738, -518100, 1374493, 2019560, 1943041, 1252598, -334542, -588556, 211697, 622135, 1376268, 1599877, 1951564, 1456842, 875250, 1562370, 2604909, 1815697, 386906, -316558, -536969, -451247, -36158, 608877]
30210F08877p44218j106563p09030J81632R26926J300885J664611m7778j318866
30201G56476j293041n08150j04853k40137L60899K93053m53717j32877J024850
30192b97497O90225j48769l54271O52257K56624J46416j35515m0241j34392M83364
30182A118201L14868n23347K9038J234830L33120j355679r91796r57034k14836
30173a012635O28514L9099j5983o8706p6010J79812M63374O91264r72547j537345
30163a681163n3649J481069R11661j85120q62460K96246M0055j268239k50942
30154a572542M21969m63274r8649J30998r8812J341995J793419k6902n83072K68689
30144A113819L57685J62711m17943n90473j006004q56654o38247k33703N11027
$$ y = [608877, -135341, -1241904, -1950934, -1769302, -842376, 458509, 2123120, 2075342, 756476, -536565, -1044715, -1149568, -1389705, -1028806, -735753, -1189470, -1322347, -297497, 392728, 243959, -110312, 541945, 798569, 944985, 809470, 769229, 634837, 1118201, 1433069, 909722, 938760, 2173590, 2506710, 1151031, 159235, -797799, -1012635, -384121, -345022, -361005, -429711, -505721, -325909, 137465, 828729, -143818, -1681163, -1734812, -253743, 657918, 472798, -389662, -93416, -53361, -1321600, -1572542, -1150573, -1613847, -1712496, -1581498, -1680310, -338315, 1455104, 1428202, 845130, 1113819, 1471504, 1634215, 1216272, 625799, -380205, -1236859, -1875106, -2108809, -1597782]
30135a597782J41046N80088K013462Q79112K79434J66361r77693m58839K46713
30126A271902l94022n52828m1459R22374K57137j93487j94664O16215m3749j242729
30116D04690j697799j228679n01156j18325J288348J269128N03179N24207K45956
30107F89549O82968M23691L26225J121050J49645j009426j101220m28608L74278
30098A228152n02757j358127r36588N28043O95930N56823K00696N87985J670716
30089B670873J496693N81117r97579k370569o31398J644696J076151j058306j490444
30080I21234J97128M01010P97951N71317Q9930J32971j10277r87035j529765j399467
30070i15003j508681l01439Q97157N3201M97397P18335N28376J050616O30482
$$ y = [-1597782, -1456736, -876648, 1136814, 2015926, 2295360, 2461721, 1484028, 1025189, 1271902, 877880, 325052, 283593, 1205967, 1463104, 1269617, 1074953, 1691168, 1647419, 404690, -1293109, -2521788, -3022944, -3141269, -1852921, -583793, -80614, 443593, 689549, 1372517, 1796208, 2122433, 3243483, 3393128, 2383702, 1282482, 853874, 1228152, 725395, -632732, -1569320, -1041277, -345347, 211476, 412172, 1000157, 2670873, 4167566, 4748683, 3751104, 1380535, 749137, 2393833, 3469984, 2411678, 921234, 1118362, 1519372, 2317323, 2888640, 2978570, 3111541, 3001264, 2014229, 484464, -915003, -2423684, -2725123, -1827966, -1774765, -1277368, -559033, -30657, 1019959, 1650441]
30061A650441O04048k24472j356518m70925Q51357p3151j149690j193375j38704
30052a500989Q86995R15690k12472n4873l60668k30081O11984j70211q23498j93643
30042a131766k83479j088956j085453l82565R65518P53560N1525p8755K17035
30033b063336j07420R64731J697649O81256K26897n35379r61843o06263L53532
30024c50176L32597P58949L11574J20673j05665m43673R76590O45707p27640q6090
30014A432846j63698q47282M28961J587169J046626j392215j279884N25282J131019
30005B468824l67620q32761p472l14828n55744M50216N03826R0320j02653m29813
29995I02295o21266m23425M28920R97129N46013M64953m83003l24410P19736q21072
$$ y = [1650441, 2254489, 2030017, 673499, 202574, 1053931, 980780, -168910, -1362285, -1500989, -613994, 301696, 89224, 34351, -326317, -556398, 55586, -114625, -938123, -1131766, -1415245, -2504201, -3589654, -3972219, -3006701, -2253141, -2201616, -2280371, -2063336, -2170756, -1206025, 491624, 1172880, 1399777, 864398, -97445, -703708, -350176, -17579, 741370, 1052944, 1173617, 1067952, 624279, 1600869, 2246576, 1518936, 1432846, 1269148, 421866, 850827, 2437996, 3484622, 2092407, 812523, 1337805, 2468824, 2101204, 1268443, 1260971, 946143, 390399, 840615, 1344441, 1434761, 1332108, 902295, 281029, -142396, 286524, 1283653, 1829666, 2294619, 1811616, 1487206, 2206942, 1385870]
29985A385870p79251Q54175q5259j072888j70944J09712j67829O69489K8513n37616
29975B33972n83922j76822j48617m56456K05505L76663J162452O35107k45091
29966A002791k18816q8476M63177M96779l45619o15074m11809o68768l10494l88755
29956a085064l98978k76027L35645R77260M95214j7119N9748q5434K30817l04140
29946f8078k46238j02761J47509L43892K07429N93806N72462r84377q84472k77637
29936f98465O84982K50359j51381J51458k69878l9099L30368p3957J93131J741405
29926B118923M52689k76971l46740j363656r52192N06427p7464M97304N80549
29917A138869l24435q37042j231231q15699j44985P32487J123080K13532j061861
$$ y = [1385870, 606619, 1460794, 1375535, 302647, 131703, 241415, 73586, 743075, 771588, 233972, -349950, -526772, -675389, -1131845, -926340, -549677, 612775, 1247882, 1002791, 783975, 695499, 1158676, 1655455, 1309836, 694762, 282953, -385815, -696309, -1085064, -1484042, -1760069, -1424424, -447164, 48050, 30931, 90679, 5245, 236062, -68078, -314316, -417077, -269568, 74324, 281753, 875559, 1448021, 463644, -420828, -698465, -13483, 236876, 85495, 236953, -32925, -72024, 258344, 184387, 377518, 2118923, 2571612, 2294641, 1947901, 584245, -367947, 138480, 61016, 558320, 1138869, 814434, -22608, -1253839, -2069538, -2214523, -1482036, -358956, -145424, -1207285]
29908a207285q6164J71081o5430J024736N73957r016P11790J60183m91782n17348
29898B64722j110864N6618K41943n81806m6220k09680j83544K45448M77316J60612
29888f85455j21830m54036l51019J83198N57015M98127M43469j31880j347756
29879a410167Q1190P15582M01840J074473J05913j018122j23464M08028m4414
29870A90859L97038q7476p01703r88678m56245N6449m82664k07333O31396K14997
29860a433360m45525J5943Q4877p38784L32089Q48098O96864N41303J053245J143720
29850B098470j08887j040191k05474M63573L7253L58407M99862K07354k09904
29841B100463j151062r60901m64965n04565p30081m82553J10962p66284j313176
$$ y = [-1207285, -1293449, -1122368, -1187798, -163062, 410895, 401879, 1113669, 1273852, 782070, 264722, -846142, -789524, -547581, -1129387, -1175607, -1385287, -1568831, -1323383, -846067, -685455, -807285, -1261321, -1612340, -1429142, -872127, -374000, 69469, -62411, -1410167, -1328977, -613395, -211555, 862918, 968831, -49291, -172755, 235273, 190859, 587897, 500421, -201282, -1189960, -1646205, -1589756, -2072420, -2279753, -1648357, -1433360, -1878885, -1862942, -1778065, -2516849, -2184760, -1336662, -639798, -98495, 954750, 2098470, 1989583, 949392, 743918, 1207491, 1244744, 1603151, 2103013, 2310367, 2100463, 949401, -11500, -476465, -981030, -1711111, -2193664, -2082702, -2848986, -4162162]
29832d162162l45906K32487J100255J221360J440464L10311p94001r91766p68816
29823b757774K16923R32487Q33478l4006K68877Q10690J064173J45945j013061
29814D67732l79771O77431m90865r17567l45946o09780J91887R53499R66089J51151
29804F63860n69517J07295J80181m83047l12174J9461P10652L85630o01485o67710
29794e66854p51328j00013Q7497L02662M05924J74350O06364J469272Q84417M12191
29784B924482J31981l73356l13093j88953k012502j958729K87657J076798K86039
29775a39676M76267M50191j00305K78331P93331k54564j156483j03544l42820
29766i9272j023191r46009K94818J060582L20574k0822J68414m0292K23167N67945
$$ y = [-4162162, -4508068, -4275581, -3175326, -1953966, -513502, -203191, -997192, -1988958, -2757774, -2540851, -1608364, -774886, -808892, -540015, 270675, 1334848, 1480793, 467732, 87961, 765392, 274527, -643040, -988986, -1598766, -1406879, -453380, 512709, 663860, 94343, 201638, 381819, -101228, -413402, -393941, 316711, 702341, 100856, -566854, -1318182, -1418195, -1330698, -1028036, -622112, -447762, 158602, 1627874, 2512291, 2924482, 3056463, 2683107, 2370014, 2181061, 168559, -1790170, -1502513, -425715, -139676, 336591, 786782, 686477, 964808, 1758139, 1503575, 347092, 243548, -99272, -1122463, -2068472, -1773654, -713072, -392498, -413320, -244906, -285198, -62031, 505914]
29756E05914Q19942k79128l70476J26552j6302J28205j60515p4425Q60017M19982
29746A959766o88198L37708R57999N70837q54590r31403M9236q4631n65828n74842
29736A76054p90497n65457q59046L14433O22860J025944P58165n45736p10769
29727e74049m43777r99023l827J140838J316762J365161K85436p79912p99457
29718E08152K99308M2093L57381j60123j301104j434691j058790N91308N40169
29709a616297l72490l50947J159095O10493j161163j305668M61308M15001q7904
29700b248572k85350n55718l20794O36953J548075J906763J723950L04668q19707
29691A890268j626918M3705K20268p51827J6669N32117l36096j529966r27329
$$ y = [505914, 1325856, 1046728, 676252, 802804, 786502, 914707, 754192, 679767, 1539784, 1959766, 1271568, 1609276, 2567275, 3138112, 2283522, 1352119, 1401355, 1316724, 750896, 176054, -614443, -1179900, -2038946, -1724513, -1101653, -75709, 682456, 136720, -574049, -1017826, -2016849, -2020676, -879838, 436924, 1802085, 2087521, 1307609, 508152, 807460, 849553, 1206934, 1046811, -254293, -1688984, -2747774, -2156466, -1616297, -1988787, -2339734, -1180639, -570146, -1731309, -3036977, -2575669, -2160668, -2248572, -2533922, -3089640, -3410434, -2773481, -1225406, 681357, 2405307, 2709975, 1890268, 263350, 307055, 527323, -224504, -207835, 324282, -11814, -1541780, -2469109]
29682b469109K07755J02123M23790J480021Q94609L0418p04864r43447j10440
29673a089144K96060J98431L18583m80209m86318K97045N07906J016466L43693
29664I22513r71096j122354k21868J30788k66051N6978O59907p3623Q13939J049225
29654I78358P89532Q17116k87093r22148r95382l71433R7716O38873Q64572j301968
29644C08143j183466P93229P87187K85229j09047j134325k039911o21043N13790
29635b400214L56079N99967M17641M63142O49048p1175l13198O3012k44740m41199
29625i21637M8979K22036M39202Q25774M82923P45774l13448r25954n60345k02224
29615a58920K90098M62876j74916p58249l02461J89180N97954P24562N48631K12639
$$ y = [-2469109, -2261354, -2159231, -1735441, -255420, 639189, 669607, -35257, -978704, -1089144, -793084, -594653, -276070, -756279, -1242597, -945552, -437646, 578820, 922513, -48583, -1170937, -1392805, -1262017, -1528068, -1471090, -811183, -884806, -70867, 978358, 1767890, 2585006, 2297913, 1375765, 380383, 8950, 106666, 745539, 1610111, 308143, -875323, -82094, 705093, 990322, 881275, -253050, -2292961, -2914004, -2400214, -2044135, -1444168, -1026527, -563385, 85663, 14488, -298710, -235698, -480438, -921637, -872658, -650622, -211420, 614354, 1097277, 1843051, 1529603, 603649, 43304, -158920, 131178, 594054, 419138, -339111, -641572, -452392, 145562, 870124, 1418755, 1631394]
29605A631394k57089k19778K74984r78920q97898M67255K18970K56538K45582
29596G41038m26072L16989k848n3329L65829L63268n02287r60849k57531N5189
29586c60603n49519q92391p01847J38379J469710J683882Q00968k85394j026374
29577B76811m52382l25423m34166o54140N9798j60954J52830O64037k335r6319
29567i72243P4617J0922J36343L00438L91618O32286J303318J84556j038253m93669
29557E29933P70834O91544J23973J06845o86254K19764j33226L47436P35249m089
29547B702009l15440l85009o31538J82710K79834j157060k100710r05258M65192
29538a865270q00612j535875O05648J026270R70708R98759Q81873n4619k92824
$$ y = [1631394, 1374305, 1154527, 1429511, 450591, -447307, 19948, 238918, 495456, 741038, 314966, 631955, 629107, 575778, 941607, 1304875, 802588, -158261, -415792, -360603, -910122, -1802513, -2504360, -2365981, -896271, 787611, 1588579, 1303185, 276811, -175571, -500994, -935160, -1589300, -1529502, -1690456, -1537626, -873589, -875924, -972243, -897626, -886704, -750361, -449923, -58305, 573981, 1877299, 2061855, 1023602, 529933, 1300767, 1992311, 2116284, 2223129, 1536875, 1756639, 1623413, 1970849, 2706098, 2702009, 2386569, 2001560, 1370022, 1552732, 1832566, 675506, -1425204, -2330462, -1865270, -2665882, -4201757, -3596109, -2569839, -1599131, -600372, 281501, 226882, -65942]
29529f5942L90947R09736j36467l49423r62136q96573L85050R25870L80260P07980
29519A289302J347137J27040l10490j506815j041440M94516L85744m15831q64331
29510d95168j93966R08603M69841K33100j81832j83947J0922p0425p81523r34257
29500a218652J346042J217007L2406o75943n7791K76356O85915K68782o95303
29491A178819m35287K50479K38093j09502J70537j14762L14761k112j55758J387365
29481B722633P42913j322548j992425q15663O2169p720m00823n36977n44983P91624
29471a301800J671018q8606m45186l23280q49435j48913Q41087J525527M70570
29462A350982n26522p88238l93606j05212k73294j101302q75307k1770J217354
$$ y = [-65942, 325005, 1234741, 1098274, 748851, -213285, -1109858, -724808, 201062, 581322, 1289302, 2636439, 2763479, 2452989, 946174, -95266, 399250, 784994, 369163, -495168, -689134, 219469, 689310, 922410, 740578, 556631, 567553, 497128, -284395, -1218652, 127390, 1344397, 1376803, 700860, 643069, 919425, 1605340, 1874122, 1178819, 743532, 994011, 1232104, 1122602, 1293139, 1178377, 1493138, 1491026, 1335268, 2722633, 3465546, 2142998, 150573, -665090, -602921, -610641, -1011464, -1548441, -2093424, -1301800, 369218, 280612, -164574, -487854, -1337289, -1486202, -645115, 880412, 1350982, 824460, 36222, -357384, -462596, -735890, -1837192, -2712499, -2734269, -1516915]
29453a516915J295405J78880J84317P43550M67681r11188p56382k419J33675j3326
29443a96722L93678m97212n56421J59075J9006N01551J49678k12712J9026L37993
29433A16940o14451n74196L55928M48655M91471j3822o85564m93378P97872P95475
29423F24930N63689k61357m16481j7521J40550l8998N85594n21876j629741q12265
29413a783476P49101P78759q87802q26801j25357k2190O34365P06159j55765j170878
29403b103885q91011K08942K16041N85295R60172N0115K220P5859R38037M65327
29393E07112L44064N78277K31722L3377m42024q34306j385406o46561L499K81059
29383a329187M23316R203M17536j81626p04654k71454P69472J006811J086105
$$ y = [-1516915, -221510, -42630, 141687, 885237, 1352918, 441730, -314652, -317071, -183396, -196722, 196956, -300256, -856677, -697602, -678596, -177045, -27367, -240079, -221053, 116940, -497511, -1071707, -715779, -267124, 224347, 210525, -475039, -968417, -170545, 624930, 1188619, 927262, 510781, 493260, 633810, 594812, 1180406, 658530, -971211, -1783476, -1034375, -255616, -1143418, -1970219, -2095576, -2117766, -1483401, -777242, -933007, -2103885, -2994896, -2785954, -2569913, -1984618, -1024446, -974331, -972111, -896252, 41785, 507112, 851176, 1429453, 1661175, 1694552, 1252528, 418222, -967184, -1613745, -1610246, -1329187, -905871, -896668, -479132, -660758, -1365412, -1636866, -867394, 139417, 1225522]
29374A225522N08567j02185K06862J81957m49419r58838L05697J338127j78591
29365B077699r16847m82395n53107r07970l36654J554357K207892J060339o18318
29356C084996j208278j147721m40389M51266J92814K85789P51216r93214j373712
29347c97233q82094p01522J75276m9088k14110P32127M81000N85175m407o49499
29337i24375J276991K042485l8244o32024n5197K9385l66675j94817M06659M48390
29327A992578m69167n26773N23901J212903O20003m35858j735346j024951l21884
29318a64594n85773N71239m04237m52719J305288J60526j230083o42321M67681
29309i74993o02562j471379m45812J310529R82640O71096J143748m02570n76945
$$ y = [1225522, 1734089, 1631904, 1838766, 2020723, 1571304, 612466, 918163, 2256290, 2077699, 1160852, 678457, 125350, -782620, -1119274, 435083, 2642975, 3703314, 3084996, 1876718, 728997, 288608, 739874, 932688, 1218477, 1969693, 976479, -397233, -1279327, -1980849, -1805573, -1854661, -2068771, -1336644, -855644, -270469, -274876, -924375, 352616, 2395101, 2356857, 1724833, 1669636, 1699021, 1332346, 1137529, 1544188, 1992578, 1523411, 996638, 1520539, 2733442, 3353445, 2917587, 1182241, 157290, -164594, -750367, -179128, -583365, -1036084, 269204, 429730, -800353, -1442674, -974993, -1577555, -3048934, -3494746, -2184217, -1201577, -530481, 613267, 210697, -366248]
29300c66248J03392N881q34526n87780j78021j234K70807O63454j35669j152029
29290b211973j031696k71887J142695J683316J065075M30983k10368q04790j016119
29281a224764q24516N86703J022379O27688k44900k70535M06768K09957m00050
29272a11270k41021O125p49945m19629R30945M86244j65865l19371L62970J4817
29262b06000N92906R27497N94421j62888p96498k64947k73952l55884q0869n72735
29252e98949j274361k17008J42736J34938N95358R79331L02805l58634n34856
29243h28640j57624J419898J375294P60763k96376q1509J75892q79072o09274
29234H79352j65432o8717j16902m20902m95504K72224J124l76480m54133j070112
$$ y = [-366248, -262856, -256975, -1091501, -1679281, -1857302, -1858536, -1587729, -924275, -1059944, -2211973, -3243669, -3515556, -2372861, -689545, 375530, 806513, 596145, -208645, -1224764, -2049280, -1462577, -440198, 187490, -57410, -327945, 78823, 288780, -111270, -352291, -346166, -1096111, -1515740, -584795, -98551, -264416, -583787, -220817, -206000, 386906, 1314403, 1908824, 1745936, 949438, 684491, 410539, 54655, -26214, -598949, -1873310, -2090318, -1947582, -1812644, -1217286, -237955, 64850, -293784, -828640, -986264, 433634, 1808928, 2569691, 2273315, 2191806, 2367698, 1488626, 879352, 713920, 645203, 528301, 107399, -388105, -115881, -114757, -491237, -945370, -2015482]
29224b015482J77751J193220J113671m56782j244613k68997m54264q50844K61314
29215b545026J129351M31020P26077M67823l61923q09503J52457J00576K44095
29206d65053J494514L70152j420845j064776J86181J261998P90645P10707n24662
29197A338861j390765m46307o2658j12645Q96165j45606q35567j206087k12299
29188b176908P16142K47319K37793j9767l78617k59245N74844J324985Q38104
29179A104650P59456J06643j278384k048216j911222o90348K78802R23040K51410
29170b504169M23256J523377R99331l04613j98495Q57405L18808o34488r99309
29161e18897j121817r34333l53358N39144J00625K45343L78024M97922P22818
$$ y = [-2015482, -1837731, -644511, 469160, 12378, -1232235, -1501232, -1955496, -2806340, -2545026, -1415675, -984655, -258578, 209245, -152678, -962181, -809724, -709148, -465053, 1029461, 1399613, -21232, -1086008, -899827, 362171, 1152816, 1863523, 1338861, -51904, -498211, -560869, -673514, 222651, 77045, -758522, -1964609, -2176908, -1460766, -1213447, -975654, -995421, -1374038, -1633283, -1058439, 266546, 1104650, 1864106, 1970749, 692365, -1355851, -3267073, -3957421, -3678619, -2755579, -2504169, -2080913, -557536, 441795, 137182, -61313, 796092, 1114900, 480412, -518897, -1640714, -2575047, -2928405, -2389261, -2288636, -2043293, -1665269, -1167347, -444529]
29152d44529j57306r47649j120576R5141J270180R15748Q67588J346381P40675
29143B565653p55096j970684n64512J275138P48209N22549j41783j44537K26210
29134A761147p77668j046615l22245o6763m0162o75778J61647N04334K7212k93537
29124g68428J150249J308307n29241o6879r73534j057560l26553J65176J08392
29115i90071j32650n25640j96967j32918k98461k44197K04715J030221M39728
29106h46240K0262J66219J60877J20990J101200P33429p03274p18716k36553o66654
29096h68460q36849L78150O58185n51901M85340P8277r19520j65154O46489J326292
29086B30849Q93966K28191J045383M3379j031060j34228r78388j290236Q95186
$$ y = [-444529, -601835, -1549484, -2670060, -2574919, -1304739, -388991, 478597, 1824978, 2565653, 1810557, -160127, -724639, 550499, 1298708, 1821257, 1679474, 1534937, 1761147, 983479, -63136, -385381, -452144, -492306, -1168084, -1006437, -502103, -474891, -768428, 381821, 1690128, 1160887, 1094008, 120474, -937086, -1263639, -1098463, -990071, -1122721, -1648361, -1845328, -1978246, -2276707, -2520904, -2316189, -1285968, -846240, -825978, -659759, -498882, -377892, 723308, 1456737, 753463, 34747, -201806, -868460, -1705309, -1327159, -668974, -1220875, -735535, -657258, -1576778, -1741932, -1095443, 230849, 1124815, 1353006, 2398389, 2441768, 1410708, 1276480, 298092, -992144, -96958]
29077i6958J103932R9205J11699J92999p30784j369838q53823j60317J92195k39958
29067a751648J002012J851832J176886j211668k341212q07375R08026J493328
29059C20181L97056J35385k87600o62441q30515L52750J208177Q64747K11788
29050A709528n6869N55520L9032l22744o94613j81198P8486m57519Q5303J07555
29040H62481n39013o15033J647Q02341O79197o66731r08307M02148N2022j78308
29030a07556n41450R2829Q36270P23390J9778M31147R57139m09621r22893l67432
29020G11601j062862j479208j284589q92406l2209P31631J075194J346594J185550
29011B99296N88405J04664n39580p16960j27165L55821p34823L01664J704851
$$ y = [-96958, 1006974, 1106179, 1217878, 1410877, 680093, -689745, -1543568, -1703885, -1511690, -1751648, -749636, 1102196, 2279082, 1067414, -1273798, -2081173, -1173147, 320181, 717237, 852622, 565022, -97419, -927934, -575184, 632993, 1497740, 1709528, 1652659, 2208179, 2247211, 1924467, 1229854, 1048656, 1127142, 669623, 754926, 862481, 323468, -291565, -289918, 512423, 1191620, 524889, -383418, 18730, 70752, -107556, -649006, -556177, 280093, 1003483, 1023261, 1454408, 2411547, 2001926, 1079033, 711601, -351261, -1830469, -3115058, -4007464, -4039673, -3308042, -2232848, -886254, 299296, 887701, 992365, 452785, -264175, -391340, -35519, -770342, -468678, 1236173]
29002A236173J464810P1837o10872j23722m63873j002133k83449N75309M16228
28993A280308N63414Q92086j27339r25242m5630q54498j340230m85009M01400
28984f40740M63309N22503k122M10514k58033j086559m25340N27787J209115l13433
28974D07001q12075O47387M28694Q00129N64629r40384n73673M583r82521q80651
28964a336881l61919N50193J274151R59552N29040j36614q78288q97005k54349
28955e52120L17561N20159L1594J69072Q90767Q23938l72197q32210M04205O33382
28945B034151k20323n15188j125695o78113m78187o07647J006851J464100M14226
28936A294175j79887j112123k22880Q30077Q34751L43220j184821j899176j067407
$$ y = [1236173, 2700983, 2772820, 2161948, 2038226, 1574353, 572220, 288771, 864080, 1280308, 1843722, 2735808, 2608469, 1683227, 1637597, 783099, -557131, -1042140, -640740, -177431, 345072, 342950, 753464, 495431, -591128, -1016468, -488681, 720434, 407001, -405074, 242313, 671007, 1471136, 2035765, 1095381, 521708, 526291, -456230, -1336881, -1698800, -1148607, 125544, 1085096, 1614136, 1477522, 599234, -297771, -552120, -234559, 285600, 317194, 486266, 1377033, 2200971, 1828774, 996564, 1400769, 2034151, 1813828, 1298640, 172945, -505168, -983355, -1591002, -584151, 879949, 1294175, 1114288, 2165, -220715, 609362, 1444113, 1787333, 602512, -1296664, -2364071]
28927b364071p45914l68415N95914R46345J045499j207j519524n63326J204836
28918a769863J252385l61403k87153j252658j149270P89644O22200M65376j29099
28909a819841m96075M99185J394060J32896r31605p83562l36127M15949Q87655
28900a037465K56978l76030L20669O03834J04478j75321N68983O65506n86958
28891C44674n75185j41663j83297N28691N35520J042784J075644K75889q23697
28882B079360r91375p94986j88783j14158K39866o14126m32877K11725M59343
28873a46011J088183O73278J42072O20953Q80976k20509j353767j380866J60089
28864D64398J733167o4937j474813j033947J75016R80049K20103p50510Q7165
$$ y = [-2364071, -3109985, -3478400, -2882486, -1936141, -890642, -891849, -2411373, -2974699, -1769863, -517478, -878881, -1166034, -2418692, -3567962, -2778318, -2156118, -1690742, -1819841, -2315916, -1816731, -422671, -289775, -1221380, -2004942, -2341069, -1925120, -1037465, -780487, -1156517, -835848, -232014, -127536, -302857, 266126, 931632, 344674, -230511, -372174, -555471, -26780, 508740, 1551524, 2627168, 2903057, 2079360, 1087985, 292999, 104216, -9942, 229924, -384202, -817079, -605354, -146011, 942172, 1615450, 1757522, 2378475, 3259451, 3038942, 1685175, 304309, 464398, 2197565, 2132628, 657815, -376132, -201116, 778933, 999036, 248526, 335691]
28855C35691J485112Q19116l26447k3536O24624J52150j523989k327950p90698
28846a575927J423325J185023K30596K77429k02945l42514m13047m10796l23428
28837a52284o77006L23055N52349j98819k63744p16058p66299Q73695O80360K25577
28827a19174j15246l64144q984M18683M0656j276513j095480O50372J609678J490153
28817A230001Q59199M94872k02996r72294o44644k14086o0629J38563j448o111
28807F20427p32512j041160k37751P91534J324262K27074n04749j341777r71122
28798a865774k25628M73198P59449L67727M46210K43838j304985j638078m64440
28789c208483J259193J020156M10802Q4640Q36199N94883q15086O6958J396795
$$ y = [335691, 1820803, 2639919, 2313472, 2289936, 2914560, 3066710, 1542721, -785229, -1575927, -152602, 1032421, 1263017, 1540446, 1337501, 994987, 581940, 171144, -152284, -829290, -506235, 46114, -152705, -416449, -1132507, -1898806, -1025111, -344751, -119174, -234420, -598564, -607548, -188865, -148209, -1424722, -2520202, -1869830, -260152, 1230001, 2089200, 2584072, 2381076, 1408782, 764138, 550052, 489423, 627986, 626538, 620427, -112085, -1153245, -1390996, -599462, 724800, 951874, 447125, -894652, -1865774, -2091402, -1618204, -858755, -491028, -44818, 199020, -1105965, -2744043, -3208483, -1949290, -929134, -518332, -433692, 402507, 997390, 182304, 249262, 1646057]
28780A646057J631110j21513j003107k65299J67750k52900o15644q96627J74033
28771D63860K3125r16353n05075N62775K77379L41434M57301p79704j387911q4238
28761a547407N00334L80416J125856J29458l17687o26116P62655N88084j62034
28752H33559n19913o37725o27956k93371P17526L65815q43511j21660M86337N18107
28742a22792o1998N66769Q82357l61409p48910m86201m40666N50660N90738J97710
28732E66258J03048P54810L02097j114110j196431j88754p4947m2557j37830M5755
28722i82661O21170J166J9680Q61056J191433K68383k26679q26360j216031p75954
28712a064797k95360P14581N57753l13283k99806l47329N20384J202093J70791
$$ y = [1646057, 3277167, 3155654, 2152547, 1887248, 2054998, 1802098, 1186454, 289827, 463860, 486985, -429368, -934443, -371668, -94289, 247145, 704446, -75258, -1463169, -1547407, -1047073, -666657, 459199, 588657, 270970, -355146, 407509, 995593, 833559, 313646, -324079, -952035, -1245406, -527880, -162065, -1005576, -1127236, -640899, -122792, -184790, 381979, 1264336, 902927, 154017, -332184, -772850, -222190, 368548, 566258, 669306, 1424116, 1726213, 612103, -584328, -773082, -848029, -890586, -1028416, -982661, -361491, -360325, -340645, 520411, 1711844, 1980227, 1753548, 927188, -288843, -1064797, -1360157, -645576, -87823, -401106, -700912, -1048241, -527857, 674236, 845027]
28703H45027j316803j460160L75475J720964J653225J021845r16687j622887k16765
28694H3234P47910k86070j96865K03338L38619n5973L20010L46828l39206L9121
28684A200946J68138K45626L29213n66170n89619M60099n28775n34501N81792
28675G66749L56029k84944N88420N87926J031632J349813n67919j739412n52596
28666A535698O00485O9986k51543m15839p23216N44245P96298q46221j164383
28657A45510p73042l46860O8798K81512o96672n70089O6162L55768J290787J694233
28647A516107R82552K40116j27269j122252j959913j314063K60498k2848Q5546
28638a461526K03514K5092m00953P22597J871781O63447m99743p03266q23566
$$ y = [845027, -471776, -1931936, -1556461, 164503, 1817728, 2839573, 1922886, 299999, 83234, 831144, 545074, 348209, 551547, 890166, 834193, 1154203, 1501031, 1161825, 1200946, 1369084, 1614710, 1943923, 1377753, 788134, 1248233, 719458, 184957, 766749, 1122778, 837834, 1426254, 2014180, 3045812, 4395625, 3827706, 2088294, 1535698, 2136183, 2206169, 1954626, 1538787, 815571, 1359816, 2156114, 1309893, 145510, -627532, -974392, -905594, -624082, -1320754, -1890843, -1824681, -1468913, -178126, 1516107, 2498659, 2738775, 2611506, 1489254, -470659, -1784722, -1524224, -1547072, -1461526, -1258012, -1232920, -1633873, -911276, 960505, 1623952, 1124209, 420943, -402623]
28629d02623r30312l40990j2533M85532Q50962m0965j1266J24825l224j86843
28619d67437m02443q46122o21345k00829r294J207144J891391K14444o79775k4263
28609F1471j2607n70070k95775Q91260l1920P689k90261q96889j10424k13908
28599a461434N42120O95135M90061j10589o90727k21455J019139K14215l27618
28590A48847N48641l40459M80951O78292Q5433K54837j44513j089818M9791Q40351
28580A512353k76888l78124n11587o93556j098577q91805k66405O96995J103682
28571h03912K06092l32260r61399r13820J8293J252542P54699m42951M53125J994501
28561A224910J423602m88786l80961j145145j052117J87930J27803J09890n06476
$$ y = [-402623, -1332935, -1673925, -1686458, -1200926, -349964, -390929, -402195, -277370, -280594, -467437, -869880, -1716002, -2337347, -2538176, -2547470, -1340326, 551065, 765509, 85734, 61471, 48864, -521206, -816981, 74279, 42359, 50048, -240213, -1137102, -1247526, -1461434, -919314, -224179, 265882, 155293, -535434, -756889, 262250, 476465, 148847, 697488, 357029, 837980, 1516272, 1601705, 1856542, 1712029, 622211, 672002, 1512353, 1235465, 857341, 345754, -347802, -1446379, -2338184, -2604589, -1907594, -803912, -597820, -930080, -1891479, -2805299, -2787006, -1534464, -779765, -1222716, -769591, 1224910, 2648512, 2159726, 1778765, 633620, -418497, -230567, -102764, 7126, -499350]
28552d99350k59078j3557P62898L87786J92656k49435j295846K76454Q69486P13536
28542H85550P72540j83164m21493o93719q49937o24505j29546O35196R24223L99196
28532G14341o91128j84996o6268k87075M16806P15309J05866Q59083l64589k681503
28522a464154j662332k14329P54891Q61658R13882M75314K97474q2013l39546
28513d59155m99807L27462M66067N98888j16881O74045J015518l05735n04271
28504A196131l19179n00941q13016m65017O01122J333490R03851R12066k01373
28495B647134j022528k3890J52184p08284l88157n0082l86281p06811p65623m44155
28485a696493J37828L2707Q93108J306264J045826m26781j158257p05689j291703
$$ y = [-499350, -758428, -771985, -9087, 378699, 571355, 321920, -973926, -697472, 172014, 885550, 1658090, 1474926, 1053433, 359714, -490223, -1114728, -1244274, -609078, 315145, 714341, 23213, -161783, -228051, -515126, -98320, 616989, 722855, 1581938, 1217349, -1464154, -3126486, -3340815, -2585924, -1724266, -810384, -335070, -37596, -119609, -459155, -958962, -631500, -165433, 433455, 316574, 990619, 2006137, 1700402, 1196131, 876952, 376011, -437005, -902022, -300900, 1032590, 1936441, 2848507, 2647134, 1624606, 1600716, 1752900, 1044616, 656459, 606377, 220096, -486715, -1252338, -1696493, -1558665, -1525958, -632850, 673414, 1719240, 1292459, 134202, -571487, -1863190]
28476a863190L35643P67399N71066L01083m8423M64711J048359L57867l04153
28467A630362j033983l24395m59752j128682o51660L65375j73508k68674Q36266
28458a208651n812k326P16867O93394N33298j58220j143507j339716p31482J8304
28448b627851L12453k57977L30779P38666J516406J593907m92851q92047l2872
28439A88613R33811j55294j52909K82655O29823L13736L06011j111911j520067
28430b85532j236281k98674J294675J108688O84072K54831m26122l77390O78110
28421A396377M7559l64253p68114j129797P0383N43278K70030k92928L76405O32601
28411G81541M44079l1899k35786M10130N81686P778j001500m87562q6764r52577
$$ y = [-1863190, -1527547, -760148, -189082, 112001, 63578, 528289, 1576648, 1934515, 1630362, 596379, 271984, -187768, -1316450, -1968110, -1602735, -1776243, -2044917, -1208651, -1214463, -1216789, -499922, 193472, 726770, 568550, -574957, -1914673, -2646155, -2627851, -2315398, -2573375, -2242596, -1503930, 12476, 1606383, 1113532, 221485, 188613, 1122424, 967130, 814221, 1096876, 1726699, 2040435, 2346446, 1234535, -285532, -1521813, -1820487, -525812, 582876, 1266948, 1521779, 1095657, 718267, 1396377, 1443936, 1079683, 311569, -818228, -747845, -204567, 65463, -227465, 148940, 781541, 1225620, 1193721, 957935, 1368065, 1949751, 1957529, 956029, 468467, 381703, -570874]
28401e70874N56344J246759P83691L39709m92093j154760q22582j03783M29898
28392B12309N67027j54034j235845o59372L08548O45537L09496Q04766Q15671
28383A614103o85099j58763l41981N76017P21820O8097M0630J57502j83229j372551
28373D36546j399516j02693M52474N66699N19824n70758j076692K56459Q27852
28364h9805O98450N0998o26432j246281K79170P92876l85575r39214k81976j63035
28354a910824n19999p0057O38975J04497n14908j96384L66326J034149P48635
28345c19590P83955J169750N3029j769824j125157M91937J299638M92489p76508
28336B99719m58121N34255O51k52039L52709k77980j124823l73916R98161J856800
$$ y = [-570874, -14530, 1232229, 2015920, 2355629, 1863536, 708776, -113806, -217589, 212309, 779336, 625302, -610543, -1269915, -961367, -315830, -6334, 798432, 1614103, 929004, 770241, 428260, 1004277, 1726097, 1794194, 1834824, 1992326, 1809097, 436546, -962970, -1065663, -613189, -46490, 473334, -97424, -1174116, -917657, -89805, 608645, 659643, 33211, -1213070, -933900, -141024, -526599, -1465813, -1747789, -1910824, -2430823, -2500880, -1861905, -1757408, -2272316, -2468700, -2102374, -1068225, -319590, 464365, 1634115, 1687144, -82680, -1207837, -715900, 583738, 1076227, 299719, -158402, 375853, 376504, 124465, 477174, 199194, -925629, -1299545, -301384, 1555416]
28326A555416J418759P01293J09689o97086j225861j819552m67561L33858J41455
28317E0410r95196j716047L49437O93786O20624J078946N13368P40023Q10861
28308B146212l90270j217530m70052j96617k45193p21586j243242l73230L50301
28299b361207J138484J299819L02918l15706l88523R3230l88052l70374j61737
28290a151148K66137K05401j00448R6465n91907p36188J52626O44524M65182J065489
28280C16133j5233j161427L6717P37089O696j263041j32246P10859K51238J0947
28270e02268p16369M03252R8978p89434J94173O60433j80801J04146R2232M13375
28260b22283J110317j90126r36990M77279M30246k28802l2439J00734L19789K09767
$$ y = [1555416, 2974175, 3675468, 3785157, 3088071, 1862210, 42658, -424903, -91045, 50410, -944786, -2660833, -2311396, -1617610, -996986, 81960, 595328, 1335351, 2146212, 1755942, 538412, 68360, -128257, -373450, -1095036, -2338278, -2711508, -2361207, -1222723, 77096, 380014, 64308, -324215, -230985, -619037, -989411, -1151148, -885011, -679610, -780058, -683593, -1275500, -2011688, -1859062, -1214538, -749356, 316133, 300900, -860527, -823810, -86721, -80025, -1343066, -1475312, -764453, -513215, -502268, -1218637, -815385, -716407, -1505841, -1311668, -651235, -832036, -727890, -635658, -222283, 888034, 697908, -239082, 238197, 668443, 439641, 407202, 507936, 827725, 1037492]
28250A037492n511j157650q5211M396m05575O56618M9283p80323J8914K92106
28240c75461J71863k15995j20164j44053l4423m53236J47586O87087J1837l06569
28230f31528M98261J17633o18686j59337O61567J018730P64219m46390k365407
28221a160938k036231K05968J158810m60326K23594P53099J502858J879899N85416
28212B652149q83734k90829N99798K08457j84166o45178o74596N84087J60217
28203A526205n43281q99457l15948J321887P58431n66948j536036j046047l50880
28194a652074N59631J096709J258526J625404J013404n53153q92956j024962r14847
28185E15682n91651l71374K1052P4317L75110N66577Q35054k17872P04110j24672
$$ y = [1037492, 1031981, -125669, -210880, -206484, -612059, 44559, 93842, -686481, -667567, -375461, -203598, -419593, -539757, -683810, -718233, -1171469, -1023883, -336796, -324959, -631528, -133267, -15634, -634320, -793657, -132090, 886640, 1650859, 1204469, -1160938, -3197169, -2991201, -1832391, -2292717, -2069123, -1316024, 186834, 2066733, 2652149, 1768415, 1477586, 2077384, 2285841, 2101675, 1456497, 781901, 1365988, 1526205, 982924, 83467, -232481, 1089406, 1847837, 1280889, -255147, -1301194, -1652074, -1092443, 4266, 1262792, 2888196, 3901600, 3348447, 2455491, 1430529, 515682, -75969, -447343, -426291, -351974, 23136, 589713, 1424767, 1206895, 1911005, 1786333]
28175A786333j673583n50197J123931J054639P78984L7585r32090k79929j23078
28166A222595O23814J722123J029327o04366j141081m30087q38733j290872p65959
28157d73239r6375m67093q46875r23356j77393j94273k46823p70117j92544M36742
28147c951346O99925O16757Q34614O46432J425640J265751l92003j416301r19620
28138a190151J61932k18884m24935J19530J512442K247446J269745n40927j015872
28129A920326n34384q8062N66994L22148L07493N83543j19799j265627j149473
28120E43159o96754p72196j61256N56548Q59209N7130o05644J48762K61109K90528
28110D80595M17303L74659J11850j358067r39664j191195p41915J66133K92355
$$ y = [1786333, 112750, -437447, 686484, 1741123, 2520107, 2557692, 1625602, 1345673, 1222595, 1846409, 3568532, 4597859, 3993493, 2852412, 2422325, 1583592, 292720, -473239, -569614, -1036707, -1883582, -2806938, -2984331, -3178604, -3425427, -4195544, -4388088, -3951346, -3251421, -2634664, -1800050, -1153618, 272022, 1537773, 1145770, -270531, -1190151, -1028219, -1247103, -1672038, -1552508, -40066, 2207380, 3477125, 2936198, 1920326, 1385942, 1297880, 1864874, 2187022, 2494515, 3078058, 2958259, 1692632, 543159, -153595, -925791, -1087047, -530499, 328710, 385840, -219804, -71042, 190067, 480595, 897898, 1272557, 1384407, 26340, -913324, -2104519, -2846434, -2680301, -2387946]
28101b387946N35597J037613N34092j25264j538576r16676P01811O79075O05679
28092h74595J240374J010447j58187l5954Q02912P30834q08555j905630q32905
28083h31259Q82936P97776o47897j868483r49313K97444M42698O08528J095882
28074a71688M39149J04605J558307M26015m41260r0966N79627m79771j250562
28065F73456o03389N70047R51525q19397p90071M40787M28798O41873P49107Q910
28055B251646k60796j11010j52875o68987j267561j85397O65357k74338o45608
28046f49569P42620P51025L55697l22424P97704O92648p00769L16843K85476J17765
28036B387016N45748Q92750n30605n65042Q46491J48849j103478j98701M07387
$$ y = [-2387946, -1852349, -814736, -280644, -405908, -1944484, -2861160, -2159349, -1480274, -874595, 365779, 1376226, 1218039, 1182085, 1984997, 2715831, 1907276, 1646, -831259, 51677, 849453, 201556, -1666927, -2616240, -2318796, -1876098, -1267570, -171688, 267461, 372066, 1930373, 2356388, 1915128, 1824162, 2403789, 1924018, 673456, 70067, 640114, 1591639, 772242, -17829, 422958, 851756, 1493629, 2242736, 2251646, 1990850, 1879840, 1726965, 1057978, -209583, -394980, 270377, -3961, -649569, 93051, 844076, 1199773, 877349, 1675053, 2367701, 1666932, 1983775, 2269251, 2387016, 2932764, 3825514, 3294909, 2729867, 3576358, 3725207, 2621729, 2423028, 2830415]
28027B830415M11602k12597q08735p81443m11374N07112R23520l122J30382l80747
28017B205013j77055o8412o56710n42620k51541N26140j15528p29681m71676L3022
28007b49048O45890L74189n37465j272443l33170L56847k69127o05807n82420
27998b472554n62993k46040Q14146M30652P86512O70361Q05948N5015j118870
27989h37823n41673M82623J005536Q46094J50870o72029n12353k02470K12984
27980f8241K05038m33525K37980K54265J216513J597626o20333j422367m91258
27971D75698Q448j38736n60580j154156r81695L84412J102194J781559J310051
27962B227195j46q8417l08887M298M08279o4202l05819j099575m28912Q50197
$$ y = [2830415, 3242017, 3029420, 2220685, 1439242, 1027868, 1534980, 2458500, 2455378, 2585760, 2205013, 2027958, 1959546, 1302836, 760216, 508675, 1034815, 919287, 189606, -282070, -249048, 396842, 771031, 233566, -1038877, -1372047, -1015200, -1284327, -1890134, -2472554, -3035547, -3281587, -2467441, -2036789, -1250277, -579916, 226032, 281047, -837823, -1379496, -896873, 108663, 954757, 1105627, 433598, -78755, -281225, -68241, 136797, -296728, -58748, 195517, 1412030, 3009656, 2389323, 966956, 475698, 484146, 345410, -215170, -1369326, -2351021, -1966609, -864415, 917144, 2227195, 2227049, 2138632, 1829745, 1834043, 2242322, 2178120, 1872301, 772726, 343814, 1194011]
27952A194011m50203p13221j170108n90763j051953p97188j51814M80127J051030
27943b200082Q57207K01246j256191p40669K13149R94495r82315j479719J187614
27934c205265J424053P38534J127417n17662j747085m39996M26624J013160J587951
27925D07731K09729j392079j900711l97667J316826K293583J425542J24786r04461
27916A183279j519023j666591n04667K72656j46427N12330J89512K36233M50149
27907i92549k65453q0544O46669J029864R52092R35370K30108m20346j07003M90194
27897B418402R28363k34887n72665l19726k64880q91470j471430j079023r78204
27888b465520O39509J492121J57290m29913l88862M31355L23675N9484M51638
$$ y = [1194011, 743808, 30587, -1139521, -1730284, -2782237, -3579425, -3731239, -3251112, -2200082, -1342875, -1141629, -2397820, -3138489, -2925340, -1930845, -2913160, -4392879, -3205265, -1781212, -1042678, 84739, -432923, -2180008, -2620004, -2193380, -1180220, 407731, 617460, -774619, -2675330, -3072997, -1756171, 537412, 1962954, 2087740, 1183279, -335744, -2002335, -2507002, -2234346, -2380773, -1868443, -1678931, -1442698, -992549, -1258002, -1338546, -691877, 337987, 1290079, 2225449, 2455557, 2035211, 1928208, 2418402, 3346765, 3111878, 2539213, 2219487, 1954607, 1063137, -408293, -1487316, -2465520, -1826011, -333890, -176600, -606513, -995375, -564020, -240345, -180861, 270777]
27879B70777K94073J025920J328663l1566m61807k06082p49287j783727j689690
27870b002726k8369J292603M84992N17542J049673J76343o25588m74238P9128
27861D69360O93348J2564o5273K37386k00678M22511L82080o40637j396357j631483
27851a717179K90229J512612Q60076J808m78120K06105J7724l5042O3839n14339
27841B07713m84450l81519J76478J08750K55794M87381K56825O92600O30725L88535
27831B338832l38170m79587j264062l52355L6377p2157L80092k6228l55690n42790
27821f75738j93035l65207K42601Q42338R68841L86823m66595p9386M51961q77377
27811B35226q42344K83921J14376o09963j165600m86222k79918o00415J02947
$$ y = [270777, 564850, 1590770, 2919433, 2887867, 2426060, 2219978, 1470691, -313036, -2002726, -2031095, -738492, -253500, 264042, 1313715, 1490058, 864470, 390232, 469360, 1162708, 1175272, 1109999, 1347385, 1146707, 1569218, 1951298, 1310661, -85696, -1717179, -1426950, 85662, 945738, 947546, 469426, 675531, 693255, 658213, 722052, 207713, -276737, -658256, -481778, -373028, -117234, 370147, 626972, 1319572, 1950297, 2338832, 2000662, 1521075, 257013, -95342, -58965, -131122, 248970, 222742, -132948, -675738, -868773, -1233980, -991379, -149041, 819800, 1206623, 740028, 660642, 1112603, 235226, -607118, -323197, -208821, -818784, -1984384, -2470606, -2750524, -3350939, -3247992]
27802c247992l5788M91879J602650J284074P4232K97525J43513p24794P56308
27793F41607K48899o63591J8441l00152K15045N64277k58245m40745O85562M25799
27783A136897K57315R2637o37873k89843l93784j522112p82859J022812R48802
27774a68008J01095l6603r71149l69839N42866Q35543J014437N70683L42324j04762
27764A756587j370188o46124k8165K06558N36715l65179l37369j23314R07909
27755E37430R44227q23442k224715k88700K74546P06695J410321j56028q70416
27746d90082J19417O34590j71880r47635M14065J568033m4500r52813K61353j62886
27736B27662o12054M9246J20815n7938N34673p4168j292060o31870N67761l13072
$$ y = [-3247992, -3283780, -2791901, -1189251, 94823, 169055, 466580, 610093, -114701, 641607, 890506, 226915, 245356, -54796, 160249, 724526, 466281, 25536, 711098, 1136897, 1394212, 1486849, 848976, 559133, 165349, -1356763, -2139622, -1116810, -168008, -66913, -103516, -1074665, -1444504, -901638, -66095, 948342, 1519025, 1861349, 1756587, 386399, -259725, -287890, -81332, 455383, 90204, -247165, -370479, 537430, 1481657, 658215, -1566500, -1855200, -1580654, -873959, 536362, 380334, -490082, -370665, 263925, 92045, -855590, -441525, 1126508, 1082008, 129195, 390548, 227662, -384392, -335146, -214331, -272269, 262404, 188236, -1103824, -1735694, -1167933, -1481005]
27726a481005k34061J062865J101936N49048K73218J32277p47979n26301J25528
27717B55526J19827k97149l95067Q738J6256j26347j37477J115089R88161k9112
27707A518445r00776j345242j122038j85878J342430P63545M40481R31892N95383
27698B038242q20821j207938M57150J582328Q26083l57595p44457K93673Q70174
27689B936839K97608q0511j091314o50846o0177J36008J16668j24807l31252n7280
27679A090936K77732k22714q31467o61709k01827K88264p84295n25362N88125
27670i82317M18357J80031n13309n68926k09370L40211k21285n88345K33383R02868
27660a008702Q68922P39652P5581j071994m75110N17075J241288J084509J50797
$$ y = [-1481005, -1715066, -652201, 449735, 998783, 1272001, 1404278, 656299, 129998, 255526, 375353, 78204, -316863, -308125, -291869, -418216, -555693, 559396, 1547557, 1518445, 617669, -727573, -1849611, -2035489, -693059, 70486, 510967, 1442859, 2038242, 1217421, 9483, 466633, 2048961, 2875044, 2517449, 1772992, 2066665, 2936839, 3234447, 3153936, 2062622, 1411776, 1351599, 1487607, 1604275, 1479468, 1148216, 1090936, 1368668, 1145954, 314487, -347222, -549049, -260785, -1045080, -1570442, -982317, -563960, -383929, -897238, -1466164, -1675534, -1335323, -1556608, -2144953, -1911570, -1008702, -139780, 599872, 675453, -396541, -871651, -354576, 886712, 1971221, 2122018]
27651B122018K88123N77449n92745j454279p24892m93832K20853J17657O09858
27642F70210K020680J545452L14430J72183o00815n78591j414633p36598L04022
27633A696340m88480r52556J68704L89842j84872o35210j226863p34017R11833
27624a055279J540638O27927J84238o9911J99731O11635O16915l1685Q6609o99425
27614B011393j289114q6894q1728O50930J066167j13200q7485L17865L99958l46612
27604B441280j155865j367118o21349j64276p10219K07185R75133P80411L05187
27595F90369o0503p23636o80310P54705J560227n65028o48432m12787j90587K64610
27585a1372N21712m0884n71135j85254r01224q19768j8304P08667l99779l12253
$$ y = [2122018, 2410141, 2987590, 2394845, 940566, 215674, -278158, -57305, 60352, 670210, 2690890, 4236342, 4550772, 4722955, 4122140, 3543549, 2128916, 1392318, 1696340, 1207860, 255304, 424008, 813850, 628978, -6232, -1233095, -1967112, -1055279, 485359, 1113286, 1297524, 1227613, 1427344, 2038979, 2655894, 2624209, 2710818, 2011393, 722279, 635385, 553657, 1204587, 2270754, 2157554, 2070069, 2387934, 2787892, 2441280, 1285415, -81703, -703052, -867328, -1577547, -1370362, -395229, 385182, 690369, 629866, -93770, -774080, -19375, 1540852, 975824, 327392, -85395, -275982, -11372, 510340, 469456, -101679, -286933, -1188157, -2007925, -2026229, -1317562, -1717341, -2029594]
27575b029594O89951R2320l4211J040197r9014J56598J224279O74822n81048o73596
27565D60704k12653Q1707K40473m95904m9667N47506K05141m22109j315226n63137
27555a523165J80094J03418M5026k38630m02865O651k49724J69312K75588n7794
27545a692089N86370l6367k57424L79198R10598n16265j223231j13329m97121
27536b459660K77542R54105M88747l46637J59671J51426K89635Q03662M18331
27527G36822L41215q3139o76629m57440j2621k29652K54906m11670q49354O50911
27517g36651J754113M79648m49406r09223m716J370271O40046p25105p88840R48403
27507A578540N33966p19011j056615m07635q51632r22360o67480q37101K38939
$$ y = [-2029594, -1339643, -1247323, -1281534, -241337, -340351, -183753, 1040526, 1715348, 1134300, 460704, 248051, 329758, 570231, 74327, 24660, 572166, 777307, 355198, -960028, -1523165, -1343071, -1239653, -1194627, -1433257, -1836122, -1829471, -2079195, -1909883, -1634295, -1692089, -1105719, -1142086, -1399510, -1020312, -109714, -625979, -1849210, -1962539, -2459660, -2182118, -1228013, -739266, -1085903, -926232, -774806, -485171, 318491, 736822, 1078037, 994898, 318269, -139171, -151792, -381444, -126538, -538208, -1387562, -736651, 1017462, 1497110, 1047704, 138481, 133765, 1504036, 2144082, 1418977, 630137, 1578540, 2112506, 1393495, 336880, -70755, -922387, -1844747, -2512227, -3349328, -3110389]
27498c110389J636696J984820N43465r86993j362137k55296P0760M22642Q17529
27489b38903O93739N82446L3904k7442m54050q90094q82803J36273Q04314J271412
27479A028796J010201q3483q07592m73784j84022o83241r75375k63856J234183
27470a98173J554619K77813k74545J36942J95635j22157J30512q23906j440524
27461e63784n56449R53285M32027j35890p0842l72825r02246j239663o1010K14913
27451b302484O87953N86158j55716m78854Q74286Q83527k76372o55215Q01579
27442c5138P78500L73348M62607n78705r88260k51836J96108L24277N95172P46879
27432A622952k48311p75644r78958l64196m8097J775608J364251r99755j291445
$$ y = [-3110389, -1473693, 511127, 1054592, 67599, -1294538, -1549834, -1479074, -1056432, -238903, 454836, 1037282, 1071186, 1043744, 589694, -300400, -1183203, -1046930, -242616, 1028796, 2038997, 1955514, 1147922, 674138, 490116, -193125, -1168500, -1432356, -198173, 1356446, 1634259, 1359714, 1496656, 1692291, 1570134, 1700646, 876740, -563784, -1120233, -166948, 265079, 129189, 58347, -314478, -1216724, -2456387, -2517397, -2302484, -1614531, -1028373, -1184089, -1662943, -788657, 94870, -181502, -836717, -35138, 743362, 1116710, 1579317, 1000612, 12352, -239484, -43376, 280901, 876073, 1622952, 1374641, 598997, -379961, -744157, -792254, 983354, 2347605, 1347850, 56405]
27423E6405j019522l94038l36801p39957j53092J136462J805482M11742j21658
27414F45023k61719p5066p1038j486949l05423J674183N80089M08586N50530o4549
27404A593667l96010l63944l39389J10041j79584n34157j98669j16087k22490
27395f46622l88896P77773R55161m58466n00417j32249j226749n18733O86818
27386a452380L67446K32725Q8775M78304O15491P11146Q39320m37101j156717
27377B87009m83941K83864r5275j016890q45119L55505Q63780J34467n83193J90952
27367i08841q120K75607J056346K77673r08q4732L64925P30458N10006j05535
27357B106879o66769k16202J61390l60229m93483r8905p30424q70599m50074J00437
$$ y = [56405, -963117, -1357155, -1693956, -2433913, -2587005, -1450543, 354939, 766681, 645023, 383304, 308238, 237200, -1249749, -1555172, 119011, 699100, 1107686, 1658216, 1593667, 1197657, 833713, 494324, 604365, 424781, -109376, -308045, -424132, -646622, -1035518, -257745, 697416, 238950, -261467, -393716, -1620465, -2139198, -1452380, -1084934, -852209, -763434, -285130, 330361, 1041507, 1880827, 1443726, 287009, -196932, 86932, -8343, -1025233, -1870352, -1514847, -651067, -516600, -1099793, -908841, -916961, -641354, 414992, 692665, 691757, 607025, 971950, 1702408, 2212414, 2106879, 1440110, 1223908, 1385298, 1025069, 531586, 432681, -297743, -1168342, -1618416, -1517979]
27347a517979P65715O54376k02169J72449P19097J110511J463711m4259j554153
27338A567299n12164m40761r63061m81436J032726Q48746L40009j087322j080449
27329g76413l89731j06691l3909l9458o7484p61443j012456P33304J395633J232203
27319A73555J863704J429659P9082n28500l48457M13767J61721q56640P1667J43994
27309B603552L53081M07846q6294j665836j610955K22185P55191M1577o85587
27300C34760O00488R01057J067192Q70398m33813j647674j968429j142815k72602
27291a691438L86973R69235n47478r64977R1648M38656n98678j405077n52076
27282c873212J381841J339944P66279K87839r20979p16076k88220J42962J50024
$$ y = [-1517979, -752264, -97888, -300057, -127608, 591489, 1702000, 3165711, 3121452, 1567299, 1055135, 614374, -348687, -830123, 202603, 1051349, 1391358, 304036, -776413, -1166144, -1272835, -1306744, -1346202, -1413686, -2175129, -3187585, -2454281, -1058648, 173555, 2037259, 3466918, 3546000, 3017500, 2669043, 3082810, 3244531, 2387891, 2459558, 2603552, 2956633, 3364479, 3278185, 1612349, 1394, 223579, 978770, 1020347, 334760, 935248, 1836305, 2903497, 3773895, 3340082, 1692408, -276021, -1418836, -1691438, -1304465, -335230, -882708, -1847685, -1756037, -1317381, -1916059, -3321136, -3873212, -2491371, -1151427, -385148, -97309, -1018288, -1734364, -2022584, -1879622, -1729598]
27273a729598K97959J067027p27443q05313k09101K70761P51774k77963P81704
27264e80193J40405m18984q42303K0858R97610N34729k17760M2127P85046P91314
27254A252849l26570n84668O3646M205L58984L77106N69717l75638j553327n89839
27244h03535l548r96151m68166R85263J229922N1459m60936m52702J19889P30359
27234f8146Q70770J68318l14671m41115r61383m07574J14358m63417p56304m40883
27224b700047j82534O04690L16457R25708R78987j15793r98315o67357J65025
27215a673179N80642L12695k27265O1889q5298L9806K68953N57695M51166P95825
27205A082929J240134O08246p2068m72674n84170j281349n14765K21316l68799
$$ y = [-1729598, -1431639, -364612, -1092055, -1897368, -2106469, -1835708, -1083934, -1361897, -580193, -439788, -858772, -1701075, -1680217, -682607, -147878, -365638, -323511, 461535, 1252849, 926279, 341611, 405257, 409462, 768446, 1145552, 1715269, 1339631, -213696, -803535, -807083, -1803234, -2271400, -1286137, -56215, -4756, -465692, -918394, -798505, -68146, 802624, 970942, 656271, 215156, -746227, -1153801, -1039443, -1502860, -2259164, -2700047, -2882581, -2277891, -1961434, -1035726, -56739, -172532, -1170847, -1838204, -1673179, -1092537, -779842, -1007107, -945218, -1030516, -990710, -721757, -164062, 287104, 1082929, 2323063, 2931309, 2859241, 2386567, 1802397, 521048, 6283, 227599, -141200]
27196a41200l02284N18663J16019L34188m83743j009592k60324M57258J388173
27187F17158j90796j203149k64691n11479J5929J89837j50793k07774j70023j4883
27177a890664L30011L4211m07570l35279m04866K04691K24051j67949p05355k28166
27167c346885J004284J888179J901452L85262j267265j169389M46377P73868o99739
$$ y = [-141200, -443484, 75179, 191198, 525386, 41643, -967949, -1228273, -771015, 617158, 426362, -776787, -1041478, -1552957, -1537028, -1347191, -1497984, -1705758, -1875781, -1890664, -1560653, -1526442, -1934012, -2269291, -2674157, -2469466, -2245415, -2413364, -3118719, -3346885, -2342601, -454422, 1447030, 1832292, 565027, -604362, -157985, 615883, -83856]
$$ [...]
##END NTUPLES=NMR SPECTRUM
##END=
