##TITLE=C13_UR2810TFA
 aceton-d6, 21000sc

 8.11.2021
##JCAMPDX= 6.0         $$ Bruker NMR JCAMP-DX V2.0
##DATA TYPE= NMR SPECTRUM
##DATA CLASS= NTUPLES
##ORIGIN= UXNMR, Bruker Analytische Messtechnik GmbH
##OWNER= root
$$ XWIN-NMR		Version 3.5
$$ Tue Nov  9 10:29:59 2021 Russian Standard Time (UT+4h)  she@DPX200
##.OBSERVE FREQUENCY= 50.327896
##.OBSERVE NUCLEUS= ^13C
##.ACQUISITION MODE= SIMULTANEOUS
##.ACQUISITION SCHEME= undefined
##.AVERAGES= 20901
##.DIGITISER RES= 17
##SPECTROMETER/DATA SYSTEM= spect
##.PULSE SEQUENCE= zgpg30
##.SOLVENT NAME= D2O
##.SHIFT REFERENCE= (INTERNAL, D2O, 0, 223.62)
##AUDIT TRAIL= $$ (NUMBER, WHEN, WHO, WHERE, WHAT)
$$ ##TITLE= Audit trail, XWIN-NMR		Version 3.5
$$ ##JCAMPDX= 5.01
$$ ##ORIGIN= Bruker BioSpin GmbH
$$ ##OWNER= she
$$ F:/spectra/data/she/nmr/c13/1/pdata/1/auditp.txt
$$ ##AUDIT TRAIL=  $$ (NUMBER, WHEN, WHO, WHERE, WHAT)
(   1,<2021-11-09 10:27:22.12 +0400>,<she>,<DPX200>,
      <created by zg, POWCHK disabled, PULCHK disabled
       terminated by command 'halt'
       configuration hash MD5:
       00 E9 B6 7A A2 85 ED C7 34 08 36 98 17 FE 4E 26
       data hash MD5: 32K
       5A F8 26 45 1C C1 36 53 D7 B3 97 8D 3D D5 CD C2>)
(   2,<2021-11-09 10:28:36.17 +0400>,<she>,<DPX200>,
      <Start of raw data processing
       efp BC_mod = 2 LB = 1 FT_mod = 6 PKNL = 1 PHC0 = -327.2152 PHC1 = 25.56237 SI = 32K 
       data hash MD5: 32K
       01 48 C3 B4 D0 CE 2F BF B0 76 FA AF 4C 30 CA 76>)
(   3,<2021-11-09 10:28:39.65 +0400>,<she>,<DPX200>,
      <abs ABSG = 5 
       data hash MD5: 32K
       8C 83 91 58 9B 1F 65 11 95 43 43 00 5B 8B 02 2E>)
(   4,<2021-11-09 10:29:09.06 +0400>,<she>,<DPX200>,
      <pk PHC0 = 0.1738522 PHC1 = -0.2000002 
       data hash MD5: 32K
       C2 99 2B 20 86 A7 A2 26 39 38 F1 A5 18 EC B8 DC>)
(   5,<2021-11-09 10:29:12.42 +0400>,<she>,<DPX200>,
      <abs ABSG = 5 
       data hash MD5: 32K
       A0 EB 65 1F 5A D9 3F B2 66 45 43 18 4F B8 9B A4>)
$$ ##END=
$$ 
$$ hash MD5
$$ 48 B6 BE 3C 91 4E D8 72 74 6C 55 5B 27 AA 43 82
##$RELAX= 
##$RELAX= 
##$RELAX= 
##$RELAX= 
##$RELAX= 
##$RELAX= 
##$RELAX= 
##$RELAX= 
$$ Bruker specific parameters
$$ --------------------------
##$DU= <F:/spectra>
##$EXPNO= 1
##$NAME= <c13>
##$PROCNO= 1
##$TYPE= <nmr>
##$USER= <she>
##$AMP= (0..31)
100 100 100 100 100 100 100 100 100 100 100 100 100 100 100 100 100 100 
100 100 100 100 100 100 100 100 100 100 100 100 100 100 
##$AQSEQ= 0
##$AQ_mod= 1
##$AUNM= <au_zg>
##$AUTOPOS= <>
##$BF1= 50.322709
##$BF2= 200.13
##$BF3= 50.322709
##$BF4= 500.13
##$BF5= 500.13
##$BF6= 500.13
##$BF7= 500.13
##$BF8= 500.13
##$BYTORDA= 1
##$CFDGTYP= 0
##$CFRGTYP= 5
##$CHEMSTR= <none>
##$CNST= (0..31)
1 1 145 1 1 1 1 1 1 1 1 1 1 1 1 1 1 1 1 1 1 1 1 1 1 1 1 1 1 1 1 1 
##$CPDPRG= <waltz16>
##$CPDPRG1= <>
##$CPDPRG2= <waltz16>
##$CPDPRG3= <>
##$CPDPRG4= <mlev>
##$CPDPRG5= <mlev>
##$CPDPRG6= <mlev>
##$CPDPRG7= <mlev>
##$CPDPRG8= <mlev>
##$CPDPRGB= <>
##$CPDPRGT= <>
##$D= (0..31)
$$ [...]
##$SUBNAM4= <"">
##$SUBNAM5= <"">
##$SUBNAM6= <"">
##$SUBNAM7= <"">
##$SUBNAM8= <"">
##$SUBNAM9= <"">
##$SW= 239.972175391363
##$SWIBOX= (0..15)
0 1 3 0 0 0 0 0 0 0 0 0 0 0 0 0 
##$SW_h= 12077.2946859903
##$TD= 32768
##$TD0= 1
##$TE= 0
##$TE2= 300
##$TE3= 300
##$TEG= 300
##$TL= (0..7)
120 120 120 120 120 120 120 120 
##$TP= (0..7)
150 150 150 150 150 150 150 150 
##$TP07= 0
##$TPNAME0= <>
##$TPNAME1= <>
##$TPNAME2= <>
##$TPNAME3= <>
##$TPNAME4= <>
##$TPNAME5= <>
##$TPNAME6= <>
##$TPNAME7= <>
##$TPOAL= (0..7)
0.5 0.5 0.5 0.5 0.5 0.5 0.5 0.5 
##$TPOFFS= (0..7)
0 0 0 0 0 0 0 0 
##$TUNHIN= 0
##$TUNHOUT= 0
##$TUNXOUT= 0
##$USERA1= <user>
##$USERA2= <user>
##$USERA3= <user>
##$USERA4= <user>
##$USERA5= <user>
##$V9= 5
##$VALIST= <valist>
##$VCLIST= <CCCCCCCCCCCCCCC>
##$VD= 0
##$VDLIST= <DDDDDDDDDDDDDDD>
##$VPLIST= <PPPPPPPPPPPPPPP>
##$VTLIST= <TTTTTTTTTTTTTTT>
##$WBST= 1024
##$WBSW= 4
##$XGAIN= (0..3)
0 0 0 0 
##$XL= 0
##$YL= 0
##$YMAX_a= 110570562
##$YMIN_a= -44319540
##$ZGOPTNS= <>
##$ZL1= 120
##$ZL2= 120
##$ZL3= 120
##$ZL4= 120
##$ABSF1= 223.6203
##$ABSF2= -16.37674
##$ABSG= 5
##$ABSL= 3
##$ALPHA= 0
##$AQORDER= 0
##$ASSFAC= 0
##$ASSFACI= 0
##$ASSFACX= 0
##$ASSWID= 0
##$AUNMP= <proc_1d>
##$AZFE= 0.1
##$AZFW= 0.5
##$BCFW= 0
##$BC_mod= 2
##$BYTORDP= 0
##$COROFFS= 0
##$CY= -3
##$DATMOD= 1
##$DC= 0
##$DFILT= <>
##$DTYPP= 0
##$F1P= 0
##$F2P= 0
##$FCOR= 0.5
##$FTSIZE= 32768
##$FT_mod= 6
##$GAMMA= 0
##$GB= 0
##$INTBC= 1
##$INTSCL= 4.134877e-10
##$ISEN= 128
##$LB= 1
##$LEV0= 0
##$LPBIN= 0
##$MAXI= 10000
##$MC2= 0
##$MEAN= 0
##$ME_mod= 0
##$MI= 0.1934396
##$NCOEF= 0
##$NC_proc= 3
##$NLEV= 6
##$NOISF1= 120.0001
##$NOISF2= 80.00006
##$NSP= 0
##$NTH_PI= 0
##$NZP= 0
##$OFFSET= 223.6203
##$PC= 1.4
##$PHC0= -327.0414
##$PHC1= 25.36237
##$PH_mod= 1
##$PKNL= yes
##$PPARMOD= 0
##$PSCAL= 0
##$PSIGN= 0
##$REVERSE= no
##$SF= 50.3226814732359
##$SI= 32768
##$SIGF1= 140
##$SIGF2= 120
##$SINO= 11.81781
##$SIOLD= 32768
##$SREGLST= <13C.CDCl3>
##$SSB= 0
##$STSI= 32768
##$STSR= 0
##$SW_p= 12077.2946859903
##$SYMM= 0
##$S_DEV= 0
##$TDeff= 32768
##$TDoff= 0
##$TI= <>
##$TILT= no
##$TM1= 0
##$TM2= 0
##$TOPLEV= 0
##$USERP1= <user>
##$USERP2= <user>
##$USERP3= <user>
##$USERP4= <user>
##$USERP5= <user>
##$WDW= 1
##$XDIM= 32768
##$YMAX_p= 444783054
##$YMIN_p= -2698905
$$ End of Bruker specific parameters
$$ ---------------------------------
##NTUPLES= NMR SPECTRUM
##VAR_NAME=  FREQUENCY,     SPECTRUM/REAL,   SPECTRUM/IMAG
##SYMBOL=    X,             R,               I
##VAR_TYPE=  INDEPENDENT,   DEPENDENT,       DEPENDENT
##VAR_FORM=  AFFN,          ASDF,            ASDF
##VAR_DIM=   32768,         32768,           32768
##UNITS=     HZ,            ARBITRARY UNITS, ARBITRARY UNITS
##FACTOR=    0.368581032318806, 1,           1
##FIRST=     11253.1731425924, 0,            0
##LAST=      -824.121543397872, 0,           0
##MIN=       -824.121543397872, -2698905,    0
##MAX=       11253.1731425924, 444783054,    0
$$ Real data points
##PAGE= N=1
##DATA TABLE= (X++(R..R)), XYDATA
$$ [...]
14106b81502q9354K06913K01450P1530n5910k53730j6382J06759J98965N6083
14096A44822m9293p6277o628K152j41925m3743L2780k38302j21346J32322J06702
14085b58736j76242p2730L0678k2089r9559N2555J83898j66860n1474M20866K04478
14074D4785j90341L7085m014k31890N2021J24227J68620K47018J30192N8443j5541
14063D20605j90933j31630k49641l05749R8252K5743Q5861O7192q4736Q6853Q6773
14052i1410q632j32864k03710j13218J10893K09151L07450P6077j92081q7384
14042a25728O0966J2441j10963J68480L57457N1767k18848j90370l7130m3697
14032g5625R5756J87650J57874J19741p7037k14918R1393J65000j15620k61638
$$ plain form
14106 -281502 -370856 -163943 37507 109037 53127 -200603 -216985 -110226 88739 144822
14096 144822 95529 19252 12624 14776 -127149 -170892 -138112 -376414 -497760 -365438 -258736
14085 -258736 -434978 -507708 -477030 -499119 -598678 -546123 -362225 -529085 -580559 -159693 44785
14074 44785 -145556 -108471 -112485 -344375 -292354 -168127 493 247511 377703 436146 420605
14063 420605 229672 98042 -151599 -457348 -359096 -333353 -247492 -180300 -265036 -178183 -91410
14052 -91410 -100042 -232906 -436616 -549834 -438941 -229790 77660 153737 -38344 -125728
14042 -125728 -64762 -52321 -163284 5196 362653 414420 195572 5202 -31928 -75625
14032 -75625 20131 207781 365655 485396 408359 193441 284834 449834 334214 72576
14022G2576J7747K64925k0438m0733M109N0023Q5570j15582p2041j07627j67924
14011b9395j76652p1816J19847J45664K49495J00192N114j59241l33628k55536
14001d05956r3920j3425j3788K16260J44870k25962r2922K9032K10956J02554
13991a42301P9058K62662K06077L2660l8510o7634l05733r7428J5394n109j5683
13980g6547P2042P0371L0134R2327l7171j44764J0483M5591p4545l4506p8365
13969a24950k1833J23548K32027J91094R2141p2442k2554k16540l16649j57381
13959b93539j7878m19o0590q6443L3366K44592J63246j94932l36067j62750m8778
13948g60192J01646K78174K90338K06232K56480K00763l45184k84058P9303J97310
$$ plain form
14022 72576 90323 355248 334810 294077 298186 348209 433779 318197 246156 138529 -29395
14011 -29395 -206047 -277863 -158016 -12352 237143 337335 342449 183208 -150420 -405956
14001 -405956 -499876 -513301 -527089 -310829 -165959 -391921 -484843 -455811 -244855 -142301
13991 -142301 -63243 199419 405496 438156 399646 332012 26279 -71149 -55755 -60864 -76547
13980 -76547 -4505 65866 96000 188327 151156 6392 16875 62466 -12079 -46585 -124950
13969 -124950 -146783 -23235 208792 399886 492027 419585 397031 180491 -136158 -293539
13959 -293539 -311417 -311836 -372426 -458869 -425503 -180911 -17665 -212597 -548664 -711414 -760192
13948 -760192 -658546 -380372 -90034 116198 372678 573441 228257 -55801 23502 220812
13938B20812L5264j33553k6867K7614P7467K9216L3740J21541N4349J4904j31097
13927C23390j09117K32j65384k17523r5206j4979l0018J3379j19026j4563K99396
13916a29419L01527l024j50963j77804N1097J43771L2144l8320J12501P6015j21895
13905I5630j38474j93554K533n2378j16060Q3962J84732J16369N8389l7593j25025
13894a21469Q913K3734j03410q6417J903J72363J05989J79155K11258J15090j86236
13883C20873l19081j43791J25349Q0138j44990k34470p233N8370l8994Q1523J78387
13872d3919J21273j42467p2925R7187J91824O0140m6163j89875q7529o0658j35598
13861c08710K9193k2511o8202Q2800q5518M8449J95590K90229R5029j7463o7105
$$ plain form
13938 220812 256076 122523 95656 123270 200737 229953 263693 385234 439583 454487 323390
13927 323390 214273 214505 49121 -168402 -263608 -278587 -308605 -295226 -414252 -428815 -129419
13916 -129419 172108 169084 18121 -159683 -108586 35185 67329 29009 141510 217525 95630
13905 95630 -42844 -236398 -233865 -286243 -402303 -318341 -133609 -17240 41149 3556 -121469
13894 -121469 -112556 -88822 -192232 -278649 -276746 -104383 1606 180761 392019 507109 320873
13883 320873 1792 -141999 -16650 63488 -81502 -315972 -323205 -264835 -303829 -222306 -43919
13872 -43919 77354 -65113 -138038 -40851 150973 211113 164950 -24925 -112454 -173112 -308710
13861 -308710 -279517 -302028 -370230 -287430 -372948 -324499 -128909 161320 256349 238886 171781
13850A71781q3925j19086q2989K40717J13559j62185k7132K1778j39904J30602
13840F3216K82386R1600o1143j24025j73127k83506j13472L8930P9606P9134Q7095
13829c3306J50204J18325K15750J52380r1422q3488R0783K22144M0794j01372
13819F80792q3133j62342k82118j43221O5378R7427j55623j14458J42081J18306
13809A63089j66013l69896k25173J23751K00952R6576L3720J11945R0826k6481
13799C3296J64034J25306q8847q3073J32929R5836L1730j50662k03814J5175K51154
13788C23064J88582j07782n3704k5486q168k8253r441N3741k24554j58359O8001
13777A7641K28800J27701L5790Q565j23535l52163l26712j94506J52606L86247
$$ plain form
13850 171781 87856 -31230 -114219 126498 240057 77872 50740 72518 -67386 63216
13840 63216 345602 437202 376059 252034 78907 -204599 -318071 -279141 -199535 -120401 -33306
13829 -33306 116898 235223 450973 603353 511931 428443 519226 741370 782164 680792
13819 680792 597659 435317 153199 9978 75356 172783 17160 -97298 44783 163089
13809 163089 -2924 -372820 -597993 -474242 -273290 -176714 -142994 -31049 59777 33296
13799 33296 197330 322636 233789 150716 283645 379481 411211 260549 56735 71910 323064
13788 323064 511646 403864 350160 324674 316506 288253 278812 332553 107999 -50360 17641
13777 17641 246441 374142 409932 418497 294962 -57201 -383913 -578419 -425813 -39566
13767c9566K93004K3809k03763k97683j41779J33366M5787o3519k01134k08392
13757f59870L5592J73902K70405L38420J59635m2175k4005m0051j12486r7878
13747A489p4051k57355j8569K63704J56830M9321p4383m3417J22547O7972j54705
13736C9383l03155j15002J03685K8216j86672K4450J67556P767Q756Q7682K8595
13725a08739j15777r7419r08p1882k23068j63975Q531K56545K52385J83978K25062
13714A44733J2874m583R4726R5703L3868j65523l802L046j26162j39034L8875
13703a5279j50598j95552Q8389J66023J4826N0532R2797k74239n74323k14608
13693a012032L10550N36721L69007R2090j6314l57173k43674M6731P3872j00917
$$ plain form
13767 -39566 253438 277247 73484 -224199 -365978 -232612 -186825 -250344 -451478 -659870
13757 -659870 -624278 -450376 -179971 158449 318084 275909 251904 211853 99367 1489
13747 1489 -72562 -329917 -348486 -84782 72048 121369 46986 3569 126116 194088 39383
13736 39383 -263772 -378774 -275089 -246873 -433545 -409095 -241539 -233772 -225016 -137334 -108739
13725 -108739 -224516 -321935 -322843 -394725 -617793 -781768 -773237 -516692 -264307 -80329 144733
13714 144733 157607 153024 247750 343453 377321 211798 207996 211042 84880 -54154 -15279
13703 -15279 -165877 -361429 -273040 -107017 -92191 -41659 51138 -223101 -797424 -1012032
13693 -1012032 -701482 -164761 204246 296336 280022 -77151 -320825 -274094 -200222 -301139
13683c01139j38076q8833k8110J7289l4673J66618J34549N3404J52020O5118k56350
13672b58183k54524o997n7614q1130Q3182J41969K8715k0208j15966p9869M5285
13661e75340J19721J41894O4778Q3270K1003j12871j82902J1086J5351N8737J44021
13650b11252R0394J47824R735m1880J53540J31940L8878j55394p2700J07972j47232
13639E1825j60453J07911K99696J92537k3013O654k1681j41715k25935J2362N5210
13628A53398k75901l45895r3323J70451J90424R6871k3711M7990J14734K9879
13618F4917k4082J56697J66912r0983k34765k38811j3057J83758J54360K10762
13608C35708O268j40822o1411O6078J63195J71901O4847k96391l64791l4306K64234
$$ plain form
13683 -301139 -439215 -528048 -556158 -538869 -573542 -406924 -272375 -218971 -66951 -1833 -258183
13672 -258183 -512707 -519704 -577318 -658448 -575266 -433297 -404582 -424790 -540756 -620625 -575340
13661 -575340 -455619 -313725 -248947 -165677 -144674 -257545 -440447 -429361 -414010 -355273 -211252
13650 -211252 -120858 26966 36701 -5179 148361 280301 319179 163785 91085 199057 51825
13639 51825 -108628 -717 298979 491516 468503 475157 453476 311761 85826 98188 153398
13628 153398 -122503 -468398 -561721 -391270 -200846 -103975 -127686 -79696 35038 64917
13618 64917 40835 197532 364444 273461 38696 -200115 -213172 -29414 124946 335708
13608 335708 341976 201154 139743 205821 369016 540917 605764 309373 -55418 -89724 174510
13597A74510J76697j36289l52673k75342Q1451J37411P1468J40117J19673o2213
13587G4810j65416j77314j25987O9871J28876J0709j22199J11514P1846k06062
13577c29352k461K85196R2796O9162O4448o7762n9238o8601k7085j11208r0643
13566b44748j7867j12153J7406O7234K98260K02534j49731j28502l3870K52304
13556A50867P5891j86046j9285q3909n8113q775l6878P3734J11915J00726k6603
13545I3524J06902J07607N9620K09198K25616N2751k46139k20413P172O4184k1241
13534D38781j71559n8178J65777J62279J02890m9400j60648k90865l40137j84298
13524c85358n1449J8668o8121j2674J77061P3711J37740L41543K7505q0208J21199
$$ plain form
13597 174510 351207 214918 -137755 -413097 -331646 -194235 -122767 17350 137023 74810
13587 74810 -90606 -267920 -393907 -324036 -195160 -184451 -306650 -195136 -123290 -329352
13577 -329352 -331813 -46617 46179 115341 179789 112027 52789 -15812 -42897 -154105 -244748
13566 -244748 -262615 -374768 -357362 -290128 8132 210666 60935 -67567 -101437 150867
13556 150867 226758 40712 21427 -62482 -120595 -129370 -166248 -92514 19401 120127 93524
13545 93524 200426 308033 367653 576851 802467 855218 609079 388666 395838 460022 438781
13534 438781 267222 209044 374821 537100 639990 590590 429942 139077 -201060 -385358
13524 -385358 -436807 -418139 -486260 -498934 -321873 -248162 -110422 231121 258626 178418 299617
13513B99617r2835k67282R3062J94292O7224O9728m9412l7787n667j5383j1367
13502B44190q7458j82044r9044k8778j6147L2797k4141p3954N1585J05655P9869
13491B530K5515K74108L53209L02390J11386j72565j64926k36606k69211j65389
13481F0441l9319P912J34896k6690q0685l7432J5772J04871L8105M3566Q6554
13470C07991K00741J59348O1405r3725j04252m3460j23806m1170M3249j54825
13460B11496j72677O2338Q2033L5778J85561K52507k7393j27020k71968j63422
13450F7233K6782n4141j22722l7285J80898J64490Q3038L0951n184j37120l5996
13439A60944L4556R6599L388k82250k94202j88211j68363k2612K7946J93096L77527
$$ plain form
13513 299617 206782 -60500 32562 226854 294078 363806 314394 276607 270940 255557 244190
13502 244190 156732 -25312 -124356 -153134 -169281 -136484 -160625 -234579 -182994 -77339 2530
13491 2530 28045 302153 655362 957752 1069138 896573 731647 495041 225830 60441
13481 60441 21122 29034 163930 137240 56555 19123 34895 139766 177871 221437 307991
13470 307991 508732 668080 729485 635760 531508 488048 364242 323072 366321 211496
13460 211496 38819 101157 183190 218968 404529 657036 629643 502623 230655 67233
13450 67233 94015 39874 -82848 -120133 60765 225255 308293 339244 334060 196940 160944
13439 160944 195500 292099 295487 13237 -280965 -469176 -637539 -660151 -632205 -439109 -61582
13428f1582J02784m4074j38633k9543J47703r776k36624j53297M9430K64611J33386
13417B4385p0544j57564l8463j06672N7012J35612l27297l54571j20684M3962
13407i14824K17019K22841J90651K43562J53991Q3342L3873l6948k190k00768
13397i451k71364j35372l2753J6332J17358J57918M9954m8358Q5172N5534r9076
13386a14106j24694K3776N6138m3204L8557K45051J77897R0714r4901k65248k01325
13375b11345O1513J55300J61083J92574J73693O8163N1874K8041j54088j86598
13365C40210q9695j65547o112J34098o0o8453p480L2427J03031L7417j40875j60432
13353H529j33018P0227J58704J91416J7228p7353p958k7704l4049o1122K7310
$$ plain form
13428 -61582 41202 -2872 -141505 -171048 -23345 -33121 -269745 -423042 -373612 -109001 24385
13417 24385 -46159 -203723 -242186 -348858 -291846 -156234 -483531 -838102 -958786 -914824
13407 -914824 -697805 -474964 -284313 -40751 113240 196582 230455 193507 191317 -9451
13397 -9451 -280815 -416187 -448940 -432608 -315250 -157332 -107378 -155736 -70564 -15030 -114106
13386 -114106 -238800 -215024 -158886 -202090 -163533 81518 259415 350129 255228 -10020 -211345
13375 -211345 -149832 5468 166551 359125 532818 600981 652855 680896 526808 340210
13365 340210 250515 84968 78856 212954 212894 144441 136961 169388 272419 309836 168961 8529
13353 8529 -124489 -54262 104442 295858 313086 235733 227775 200071 166022 104900 132210
13342A32210M8753j41575k89325q8510Q8460P4072q4783q5973L837J60640K08221
13331B6027j96938j72325k0129O8761L5748q2898o4848q7335J02499J10772M0068
13320b40598J8159j95668k40875p0604J82176J26265P2927L081Q8285R1928J10699
13309e4225P9986J00689o6923J7281j62218j44969J48638J57933l7357K4597J02238
13298A65670L0696n2076k24523j01790K9404N5852J9453L0987q6865j7139J59925
13287I594J37691l498j06339j75319q6649L625l4639Q0414J28905J44642k3690
13276G4737M6815j6271M5726J97142Q3995o5949k48774k35048l6968J08113J53034
13265A06552q5543k8388J07830J42243M8342M1830j19672n5498Q8204r2003j58275
$$ plain form
13342 132210 180963 39388 -249937 -338447 -249987 -175915 -260698 -346671 -342834 -182194 26027
13331 26027 -170911 -343236 -363365 -294604 -258856 -341754 -406602 -493937 -391438 -280666 -240598
13320 -240598 -222439 -418107 -658982 -729586 -547410 -421145 -348218 -345137 -256852 -164924 -54225
13309 -54225 25761 126450 59527 76808 -85410 -230379 -81741 76192 38835 63432 165670
13298 165670 196366 144290 -80233 -182023 -152619 -96767 -77314 -46327 -133192 -150331 9594
13287 9594 147285 143787 37448 -137871 -224520 -220895 -255534 -175120 -46215 98427 74737
13276 74737 121552 105281 151007 348149 432144 366195 117421 -117627 -154595 -46482 106552
13265 106552 21009 -7379 100451 242694 291036 332866 213194 157696 245900 153897 -4378
13254d378K2524K11855J18654o0857k31887k39505o1429J7487P256J41872j04978
13243a83386j66010j50642p2546K5077K39202K24398P0217j00284k31279J2275
13233c32978J72969K49582M5001r8576M6993J72744j6j53669k3905J0057j01700
13222a3498j28811Q7846R293j96969r2928l6469K2012J30217J61149K3078J20714
13211H5634J22944j29700j44589k6482j36412n9738J43871J31852j41010k01634
13201c55264k1160p2392m1241M6105K14566m812k14205P1290J67460Q1805J78854
13190E1006J33952J0357k00691j09788o3079j08982J05839L99468J85566N8076
13180D61724j10857j90740k2251N6748J31682J08990J17018o6712l82674j84206
$$ plain form
13254 -4378 18146 230001 348655 287798 55911 -183594 -245023 -227536 -220280 -78408 -183386
13243 -183386 -349396 -500038 -572584 -547507 -308305 -83907 -13690 -113974 -345253 -332978
13233 -332978 -160009 89573 134574 35998 82991 255735 255719 102050 78145 88202 -13498
13222 -13498 -142309 -54463 -45170 -242139 -335067 -371536 -349524 -219307 -58158 -35080 85634
13211 85634 208578 78878 -65711 -92193 -228605 -288343 -144472 -12620 -153630 -355264
13201 -355264 -376424 -448816 -490057 -443952 -229386 -234198 -448403 -377113 -209653 -127848 51006
13190 51006 184958 195315 -5376 -115164 -178243 -287225 -181386 218082 403648 461724
13180 461724 350867 160127 137876 194624 326306 435296 552314 485602 102928 -81278
13170h1278N4275J10734P6328p4627k15383L8568J92498J62717J03489p9746k40562
13159D7013j94024R79K59557J17911m2762k7766j55319j12209N4716J58666L33026
13148D39788J41991j67055q5641j63101l74469j91946M8794J21197J28060J25502
13138B3120K00615j4750k62965j77391j69280q0351J49528M0333Q1282R0084J08833
13127a0942K11693K21925M4555l26529k70287j4525k7516l6328P1623K0948j55635
13116b71018j32067P6308J94223J59131Q8334j34917k34239j18091O8167J82585
13106a21584K16077K74071K87503m8337k74214j81603n2255j83840j12981j7472
13096b14635r0037M6714L32047J64922q1293M036j65670j53061j16789j02312
$$ plain form
13170 -81278 -27003 83731 160059 85432 -129951 -91383 101115 263832 367321 287575 47013
13159 47013 -147011 -146032 113525 231436 188674 160908 5589 -106620 -51904 106762 439788
13148 439788 581779 414724 329083 165982 -208487 -400433 -351639 -230442 -102382 23120
13138 23120 223735 208985 -53980 -231371 -400651 -481002 -331474 -291141 -209859 -119775 -10942
13127 -10942 200751 422676 467231 140702 -129585 -144110 -171626 -207954 -136331 -115383 -271018
13116 -271018 -403085 -326777 -132554 26577 114911 -20006 -254245 -372336 -304169 -121584
13106 -121584 94493 368564 656067 607730 333516 151913 99658 -84182 -197163 -214635
13096 -214635 -304672 -257958 74089 239011 157718 161754 -3916 -156977 -273766 -376078
13086c76078m4573j4037k03759j94309p7600j7698J67216M36551M16306J65952
13076B57971j4537p6280Q1797O0401k7094L7287J14281J271j38373j81868n0096
13065F4760p5782k274L4356M7419J41830J93674J85020J53425J12771o1999k70161
13054E23039j32776P2928R741j64314q8376J74588P693l31711l01843J0527k0816
13043b41320l3360N5761J60440j12080j41778J87165L28760J53444r4626j38963
13033A23443k6778P7492n5899j40069M2310J32680M6342J00339o2719j89682O3788
13022A11247K72030O3190K7529J7321r8484j57287p4518j55893q8151j30158j29251
13011c42425q0380k97164K8209K84697J79815J23719k9755l5561o8414j87634
$$ plain form
13086 -376078 -420651 -434688 -638447 -832756 -910356 -928054 -760838 -324287 92019 257971
13076 257971 243434 167154 248951 309352 282258 319545 433826 435097 296724 114856 64760
13065 64760 -11022 -13296 21060 68479 210309 403983 589003 742428 855199 793200 523039
13054 523039 390263 463191 472932 308618 220242 394830 402523 70812 -231031 -220504 -241320
13043 -241320 -274680 -218919 -58479 -170559 -312337 -125172 203588 357032 262406 123443
13033 123443 96665 174157 118258 -21811 20499 153179 199521 299860 237141 47459 111247
13022 111247 383277 446467 473996 491317 392833 235546 161028 5135 -83016 -213174 -342425
13011 -342425 -422805 -719969 -691760 -407063 -227248 -103529 -133284 -168845 -237259 -424893
13001d24893K2202J80077j51771k11815J74928M6733r6630Q1748J63219M0611
12991a75591k09911m2347Q6745O4845K5408Q8444J57891J06051o1789N510J6235
12980F1491P762J31310O5847q0292j57288j22991L879m7051n2364Q767J26819
12969e4111J59404K22605K02761r9460k87895P154N5527n1414j06804p073N4286
12958I4980M7977K7785M6227N739o184l6982j43649j64697j57178j29526j18655
12947e34163J90535K82923P7495j18203j42409j10649r274J13712L60334K51300
12937C61601j24289k36204k1894J88099J31588k9247n6301L189O1415K06115r621
12926D74451j80422r0167j82138k41073j0040K00779K9224N6238O6530J5691j30630
$$ plain form
13001 -424893 -402691 -222614 -374385 -586200 -411272 -364539 -461169 -379421 -216202 -175591
12991 -175591 -385502 -427849 -341104 -276259 -250851 -162407 -4516 101535 39746 45256 61491
12980 61491 69253 200563 266410 186118 28830 -94161 -90282 -137333 -189697 -180930 -54111
12969 -54111 105293 327898 530659 431199 143304 150458 205985 154571 47767 40694 94980
12958 94980 142957 170742 216969 222708 216524 179542 35893 -128804 -285982 -415508 -534163
12947 -534163 -343628 -60705 16790 -101413 -243822 -354471 -363745 -250033 110301 361601
12937 361601 237312 1108 -20786 167313 298901 269654 213353 216542 277957 484072 474451
12926 474451 294029 203862 21724 -219349 -229389 -28610 614 56852 123382 139073 8443
12915H443k0882J13948J3280j00807l6688j6699j3502j94629j41942R8344Q8983
12904b02151j13102j17395o9796k8535j784M161q1667R3999Q8016k24065m417
12893f56736P1490j18152j2233J24973K37678K27575L2375n2782J06658K83081
12883B43927P6696k10106k05086j18874k9681j517j49675j46547O3142K02129
12873b75592J06430Q0958k0785J10161J60099q8018m8797J6611k3072k07189j21778
12862c10972J37167P3924j29965j6980J21418J36318K5925q8694j54652J2110
12852a94401J42360P7445Q9592o8039l01046j72623j69550p3571K99577L04294
12842f5962J47382K5704q3910j39759p0356J44576J21263O5924J35109K25552
$$ plain form
12915 8443 -12439 101509 114789 13982 -22706 -39405 -52907 -247536 -389478 -291134 -202151
12904 -202151 -315253 -432648 -502444 -530979 -532763 -528602 -610269 -516270 -428254 -652319 -656736
12893 -656736 -585246 -703398 -715631 -590658 -352980 -125405 -93030 -145812 -39154 243927
12883 243927 320623 110517 -94569 -213443 -243124 -244641 -394316 -540863 -477721 -275592
12873 -275592 -169162 -88204 -108989 1172 161271 73253 24456 41067 17995 -189194 -310972
12862 -310972 -173805 -99881 -229846 -246826 -125408 10910 36835 -51859 -206511 -194401
12852 -194401 -52041 25404 114996 46957 -254089 -426712 -596262 -669833 -370256 -65962
12842 -65962 81420 107124 23214 -116545 -186901 -42325 78938 144862 279971 505523
12832E05523j0042k24693p2570j90178k31163O4420O8909j4708N1137R4207J5069
12821E5911l14880k50654R0834K46444K13558N5353j12314K15660J30502r4455
12811B35959l0938n1309m1620L4864J2655j89487q5225J32616q9354j29783J95425
12800f197K59425m1294m26686k83628P3458J05823R2358J16811L800O010N4100
12789d6020O9616K09496K06388j79378j29824N0745j16322j14746L3455L0588
12779A3998k6286L5034n9884j00646J34597K18535L1628Q5835K41164K1161k92444
12768C02692k61159j57296j24271j7646m1851j6978J00996J29272l534J4030J3532
12757f2213j95165j88597o9951q1692j25801J25017J54416m4390M8829J32953
$$ plain form
12832 505523 495481 270788 198218 8040 -223123 -158703 -89794 -104502 -53365 40842 55911
12821 55911 -258969 -509623 -418789 -172345 41213 96566 -15748 199912 330414 235959
12811 235959 205021 153712 112092 146956 159611 -29876 -115101 17515 -71839 -201622 -6197
12800 -6197 253228 211934 -214752 -498380 -424922 -319099 -226741 -109930 -106130 -100120 -46020
12789 -46020 23596 233092 439480 260102 130278 181023 64701 -50045 -16590 13998
12779 13998 -12288 22746 -37138 -137784 -3187 215348 246976 332811 573975 595136 302692
12768 302692 41533 -115763 -240034 -257680 -299531 -316509 -215513 -86241 -89775 -75745 -62213
12757 -62213 -257378 -445975 -515926 -597618 -723419 -598402 -443986 -488376 -439547 -306594
12747c06594J68173K8984l2115J22508J77030R2496p2159q8943m8265l846j23557
12736h6288j21228J41191j14112l18723l7218P9525N3866O1611K56459M80164
12726C95247J64791j04076k9647q2312k13073k37151p9281J79978J34026k0388
12716A08114l8201o934L7492J59929J99499K0372P095M9545Q2150k3329K0432
12705F16164j58317k54818Q458n1325k26132m7194J1767n5945j26716k02024j68173
12694f54255M9872J88805p998j07013K47863J93605j12324q9370M6054O6509M4327
12683a33925k22947k10075l5793j4387J13197J23689J80812L08422K63922L3096
12673D06011n1988M7050J27381j32680l9376J11372n2090k0359K3876K224l2026
$$ plain form
12747 -306594 -138421 -109437 -141552 -19044 157986 250482 178323 89380 41115 37269 -86288
12736 -86288 -207516 -66325 -180437 -499160 -536378 -456853 -402987 -341376 -84917 395247
12726 395247 560038 455962 426315 344003 130930 -106221 -185502 -5524 128502 108114
12716 108114 69913 62979 100471 260400 459899 480271 487366 536911 619061 595732 616164
12705 616164 457847 203029 211487 160162 -65970 -113164 -101397 -157342 -284058 -486082 -654255
12694 -654255 -604383 -415578 -423576 -530589 -282726 -89121 -201445 -290815 -244761 -178252 -133925
12683 -133925 -356872 -566947 -602740 -617127 -503930 -380241 -199429 108993 372915 406011
12673 406011 354023 401073 528454 395774 356398 467770 415680 395321 419197 421421 389395
12662C89395r3274j76822j21885M1540j1687j23757k65542k13654n6465J84518
12652d47633K05592J75072J69887K1498q6760r9127M4972J26450n883k40530q7652
12641b24114j22216j63004q8809Q4374J16794J85149K13793J36163J76648k9231
12631B85547j30511p6177m759L2626j31331k19818k0022J42258O2332M7315N1014
12620C8474J89511J48314j17412j91938J6540J49750J40886L6650j58241o4820
12610A87714n272j04922j43175j63632j11621r788N9700J54279Q357k731J36114
12599E023o8380k30909k23972P2999J51399J83060K01210P6064j58279k20775
12589b12560R2439J60930j1884m033N0046J63919K17020P9471k1300q3123j47094
$$ plain form
12662 389395 296121 119299 -2586 38954 27267 -96490 -362032 -575686 -632151 -447633
12652 -447633 -242041 -66969 102918 124416 37656 -61471 -16499 109951 104068 -136462 -224114
12641 -224114 -346330 -509334 -598143 -513769 -396975 -211826 1967 138130 314778 285547
12631 285547 155036 78859 74100 106726 -24605 -244423 -264445 -122187 -59855 -12540 38474
12620 38474 227985 376299 258887 66949 83489 233239 374125 410775 252534 187714
12610 187714 182442 77520 -65655 -229287 -340908 -350696 -290996 -136717 -128360 -131091 5023
12599 5023 -63357 -294266 -518238 -445239 -293840 -110780 90430 166494 8215 -212560
12589 -212560 -120121 40809 28925 24892 74938 238857 455877 535348 514048 430925 283831
12578B83831j85644j13561J697j0993j93876j73877M4583r178j2404J81652R7157
12567i0613l0839K8644M3582J62836K35633j2819k11690j05568K21520J17664
12557C58350l0731J6122J24633j6970k07248k59234k14441r7010K447J02864J67603
12546e3615K42547J83705p4678j78599q878j3119j07035J02783K69571K61845
12536F24527R4032j22275j66945j61254k47741k45281q0312K5571J57510J61385
12526C9217K2261L3837p9523q9505j6444K10289K80115Q9288r7523j08201l6423
12515B47388j96761n827R7487n8359j28293n0653k5824r547M1845n6330j0571
12504a55445J20186J80514K8516J5505P528o8794m0086O595P7481N2251P8924
$$ plain form
12578 283831 98187 -15374 -13677 -24670 -218546 -392423 -347840 -357018 -369422 -187770 -90613
12567 -90613 -121452 -92808 -49226 113610 349243 336424 124734 19166 240686 358350
12557 358350 327619 343741 468374 451404 244156 -15078 -229519 -326529 -324082 -221218 -53615
12546 -53615 188932 372637 297959 119360 110482 97363 -9672 93111 362682 624527
12536 624527 718559 596284 429339 268085 20344 -224937 -305249 -279678 -122168 39217
12526 39217 61478 95315 15792 -73713 -90157 120132 400247 489535 392012 283811 247388
12515 247388 50627 44800 142287 83928 -44365 -95018 -120842 -130389 -88544 -144874 -155445
12504 -155445 -35259 145255 173771 189276 196804 128010 87924 94519 172000 224251 303175
12493C03175N7511R5804l3378q960r6180k00416m3491j47664K12776K13712j16216
12482B36673k42199j14579K10013J93183J35710J2547j92578j2342K989j18643
12472A10774O0314J4093k73724k25036r4617P2720L29325J29236p8224M0739K0653
12461A06253p1887j13023M1670j6159m2971O5109m2775m3474L69779j08764k87252
12450a43494M1976R5872K39744J5947j86750o3236P5939J17802K6414r6521j63881
12439d0188n1484L3690j8969l2576p1481j53511j15765O134J26329O1526j19451
12428c75746m4541J67384J93562J85131p817m22028m46653R4172L25098Q7268
12418b44170N5314J71138j02599L6017J74388J9397q2149k28485j24174j83366
$$ plain form
12493 303175 360686 456490 423112 414152 317972 117556 74065 -73599 139177 352889 236673
12482 236673 -5526 -120105 89908 283091 418801 431348 238770 226428 229417 110774
12472 110774 171088 185181 -88543 -313579 -408196 -335476 -6151 123085 44861 85600 106253
12461 106253 34366 -78657 -36987 -53146 -96117 -31008 -73783 -117257 252522 143758 -143494
12450 -143494 -101518 -5646 234098 250045 63295 59 75998 193800 220214 123693 -40188
12439 -40188 -91672 -57982 -76951 -109527 -181008 -334519 -450284 -444150 -317821 -256295 -375746
12428 -375746 -420287 -252903 -59341 125790 117973 -304055 -750708 -656536 -331438 -244170
12418 -244170 -188856 -17718 -120317 -84300 90088 109485 27336 -201149 -325323 -508689
12408e08689j49196j49145j00854l4460O3649J37098J83810J45639J35308j24983
12398d01823k49022K4898K80096K91031P2737P8464J27153K4070N8920N9989n8432
12387C08081j09161j76907l57386j88289N4455J84915K19919J28831n6740k10692
12377b02974l1536R2045k3676j21924k22817n0696J47826Q6757q1430j19451j8477
12366e46353K3513L9099P3676J65095K17454K40719l0764k72622j86642q1549
12356c58374O792q5311l0099N8654K0852o1363N1192J31087L7957k64493j26067
12345f19173J57010L75088L0009n8126P4613j52729k38959j90982R165K9693J74307
12334d10084P4762k47376r1160J2824L7649J53621N4841J7987J9922M4494M9739
$$ plain form
12408 -508689 -657885 -807030 -907884 -942344 -878695 -741597 -557787 -412148 -276840 -401823
12398 -401823 -650845 -625947 -345851 -54820 17917 96381 223534 247604 306524 366513 308081
12387 308081 198920 22013 -335373 -523662 -469207 -284292 -64373 64458 7718 -202974
12377 -202974 -234510 -142465 -166141 -288065 -510882 -561578 -413752 -326995 -408425 -527876 -546353
12366 -546353 -522840 -483741 -410065 -244970 -27516 213203 182439 -90183 -276825 -358374
12356 -358374 -351582 -436893 -466992 -408338 -387486 -448849 -397657 -266570 -228613 -493106 -619173
12345 -619173 -462163 -87075 -57066 -115192 -40579 -193308 -432267 -623249 -614084 -584391 -410084
12334 -410084 -335322 -582698 -673858 -661034 -623385 -469764 -414923 -396936 -377014 -332520 -282781
12323b82781n1292k38767R6820M53479R9106k17295J8466J59092m5427j49214
12313a57813j67328l1740K25987K21247j3311j45019r3088J49425J25476L1952
12303A45788l1876J90618P3413j49922j81829p2554m2594n8935n8125r7507O7580
12292b15943O1480N0362q6979l11933J58069L89344J75308Q9087n5493q9304l8656
12281A25342p1834n4767m2231j61138k1073q5319p6108J46765K36422J01495J10628
12270B08182l4575j58440j29341J00507Q0258l9131r1208j61106N908J30748R5243
12259G045O3368Q2745k0153p1166j2935r6060L6092j6857j79787r8319J47637
12248a58390j7094j12576P0641L60333M16298N6993o0910j99988k25271m1564
$$ plain form
12323 -282781 -334073 -572840 -476020 -22541 76565 -140730 -122264 36828 -8599 -157813
12313 -157813 -325141 -356881 -130894 90353 77042 -67977 -161065 -11640 113836 145788
12303 145788 113912 304530 377943 228021 46192 -26362 -68956 -127891 -186016 -283523 -215943
12292 -215943 -154463 -104101 -191080 -503013 -344944 44400 219708 308795 253302 163998 125342
12281 125342 53508 -1259 -43490 -204628 -225701 -311020 -387128 -240363 -3941 97554 208182
12270 208182 173607 15167 -114174 -13667 66591 27460 -63748 -224854 -218946 -88198 7045
12259 7045 70413 153158 133005 61839 48904 -47156 -11064 -27921 -207708 -306027 -158390
12248 -158390 -175484 -288060 -217419 142914 559212 616205 555295 355307 130036 88472
12238H8472n5426o5047j03378q9050R351o5822j35763L5251J08272J39120P2732
12227f1288l7941J4467N5139l8906j37115l3846j35629k18164N9658L05409K84733
12216E6517K84554O981j04853O5084J36837q3538j13549k0308P7177k1280o4403
12205B19219o73n3297m4689r9938k6449M7773R4998r5563j83052q6458j63509
12194c91638J20154K16944r847K8607K5686J37971R6761O7238j84961l28284k00526
12183d21895r7813j11553q3207m7347O1984J64041J90286J23167m1762r076J69296
12172a03879L7440p5406L2563O1710J14526k35915k37511O4132J63430J84699
12162E789M2126j53320k32585r0647L2628j9625J03149J73241K9094J55709l3362
$$ plain form
12238 88472 33046 -32001 -135379 -224429 -215078 -280900 -416663 -381412 -273140 -134020 -61288
12227 -61288 -99229 -84762 -29623 -68529 -205644 -239490 -375119 -593283 -533625 -228216 56517
12216 56517 341071 348052 243199 308283 445120 361582 248033 227725 304902 283622 219219
12205 219219 218546 165249 120560 20622 -5827 41946 136944 41381 -141671 -228129 -391638
12194 -391638 -271484 -54540 -64387 -35780 -10094 127877 224638 291876 106915 -221369 -421895
12183 -421895 -519708 -631261 -714468 -761815 -699831 -535790 -345504 -222337 -264099 -273175 -103879
12172 -103879 -66439 -141845 -109282 -47572 66954 -168961 -406472 -342340 -178910 5789
12162 5789 47915 -105405 -337990 -428637 -396009 -415634 -312485 -139244 -110150 45559 12197
12151A2197k14124J5789L855j33634j17848l9805j15982j105M6481J21213K62097
12140a60866J29980k16870j47691K21067P6184j15314J9985J28310r6841K2469
12130a39587J67961J98895J95312N096L0622R1158K4535m5139Q357j02354r9801
12119C35055j51687r3653k11696K0088K79247J35769j13543j60745p6480K36275
12109A98630M61133j3437k43771k32723k13156q6180R7164J26544j92775k53565
12099c52136K8433R3333N4232k0894p5619o5327J06768L21047R2380q3932j71747
12088g3462o4073l2863j83557p0904o3693J22320K71846k1199j45367j7432L1118
12077b47266q3280L2461N0532P8948O8911O200Q3820J02750m6287L7589J25506
$$ plain form
12151 12197 -201927 -186138 -182283 -315917 -433765 -473570 -589552 -590657 -544176 -422963 -160866
12140 -160866 -30886 -247756 -395447 -174380 -98196 -213510 -193525 -65215 -162056 -139587
12130 -139587 28374 227269 422581 427677 458299 549457 573992 528853 537210 434856 335055
12119 335055 183368 89715 -121981 -101893 177354 313123 199580 38835 -37645 198630
12109 198630 659763 646326 402555 169832 -43324 -129504 -32340 94204 -98571 -352136
12099 -352136 -323703 -230370 -176138 -197032 -272651 -337978 -231210 89837 182217 98285 -73462
12088 -73462 -137535 -170398 -353955 -424859 -488552 -366232 -94386 -115585 -260952 -278384 -247266
12077 -247266 -330546 -298085 -247553 -168605 -99694 -93494 -9674 93076 46789 84378 209884
12066B09884R7391K2883J30877q7831K0178J86949k364j34366k11956k67241j29091
12055a64687o9162k33875N4101P6475R6510l9405k18035M0241K36294J46694L2145
12044d2704o4995J1989J11391j6756j48434J15717J49350N7464k1979m6426q4466
12033B0151j25746k94988j29840J72308L13329L07448m7328j79644j24287r1371
12023a79968O1225K2656j40632l3824K40011J43732L833q9054j91172j70561R0801
12012b42953N2272l3827N0326k9008j19258J35848J7539k19246j68421q928j5261
12001e80917L9214J20025K11822N7528j09231o1380r8915J66781Q2654O1546K53076
11990A42203J74901N337o7166K5304l0835k1046J10486j5121k41243k39932m8676
$$ plain form
12066 209884 307275 330158 461035 373204 393382 580331 577967 443601 231645 -35596 -164687
12055 -164687 -233849 -467724 -413623 -337148 -240638 -280043 -498078 -457837 -221543 -74849 -42704
12044 -42704 -107699 -95710 15681 -1075 -149509 -33792 115558 173022 151043 104617 20151
12033 20151 -105595 -400583 -530423 -358115 -44786 262662 215334 35690 -88597 -179968
12023 -179968 -118743 -96087 -236719 -270543 -30532 113200 117033 27979 -163193 -333754 -242953
12012 -242953 -190681 -224508 -174182 -203190 -322448 -186600 -169061 -388307 -556728 -565656 -580917
12001 -580917 -541703 -421678 -209856 -152328 -261559 -322939 -421854 -255073 -172419 -110873 142203
11990 142203 317104 322441 255275 280579 249744 228698 339184 324063 82820 -157112 -205788
11979b05788r8609j2148k7164j57164K9217K44112P3629j3151j3870m1354j44717
11968c67007j03360N4315o9021J4391J96741J97245o6999q3449q7m4953l10352
11957e82536j33294O216J38316K90497J59635j42118k90065j16298J59538K72683
11947b37426J28220p1375p9090P1955K28622K03141Q8078m0135n3256r6707q2437
11936E9590K05802m6178j43269j17967k4343L2922J274n3239q2689k2545j7428
11925b08070m1616j3217J23903J06837q5671k13244l48522j73688l176J71117
11915f85347K52211K42510N3797l2072j29631j2868K06988L3507K37093J04062
11905B70250j39339k25324p9150K3699J32772N6368o6613j02098Q1120K42778
$$ plain form
11979 -205788 -304397 -316545 -343709 -500873 -471656 -227544 -153915 -167066 -180936 -222290 -367007
11968 -367007 -470367 -416052 -485073 -470682 -273941 -76696 -143695 -227144 -227231 -272184 -582536
11957 -582536 -715830 -709614 -571298 -280801 -121166 -263284 -553349 -669647 -510109 -237426
11947 -237426 -109206 -180581 -259671 -187716 40906 244047 332125 291990 238734 142027 59590
11936 59590 265392 219214 75945 -42022 -66365 -33443 -32169 -85408 -168097 -190642 -208070
11925 -208070 -249686 -262903 -139000 -32163 -117834 -331078 -679600 -853288 -856464 -685347
11915 -685347 -433136 -190626 -136829 -168901 -298532 -311400 -104412 -70905 166188 270250
11905 270250 130911 -94413 -173563 -149864 -17092 39276 -27337 -129435 -48315 194463
11895A94463J48076J420k21988j64865j72739l6537m6828j69632j79413L7736
11885f10307J22734K92197K70519N2821L762j65382r1969J39112J57781l1036
11875A40232p8959p6879j5574j8574n3144O6829J85k4420O5299R0183j51799k81207
11863c37828N4218K02377Q7343O9601j04604j34970l9599O3929J73009J52406
11853A85882N5127N5120j6043j48600m3676J2708m7630M6203K21884J15490r9190
11842C37275k65696k72930L4673K01239J92952O3580p086m8506J08947K57301
11832F01749n7114l91070k83672K2682K40123K4991m6572Q8203J45438J61521
11822E06279q7941j45808k53089j87312p074m8782K4688O1240n7226J6256J40335
$$ plain form
11895 194463 342539 343959 121971 -42894 -215633 -252170 -298998 -468630 -648043 -610307
11885 -610307 -487573 -195376 75143 127964 131726 -33656 -125625 13487 171268 140232
11875 140232 61273 -15606 -31180 -49754 -102898 -36069 -35884 -60304 4995 95178 -56621 -337828
11863 -337828 -283610 -81233 6110 75711 -28893 -163863 -203462 -139533 33476 185882
11853 185882 241009 296129 280086 131486 87810 100518 52888 99091 320975 436465 337275
11842 337275 71579 -201351 -166678 34561 227513 291093 284007 235501 344448 601749
11832 601749 544635 153565 -130107 -107425 132698 157689 111117 199320 344758 506279
11822 506279 418338 272530 19441 -167871 -174945 -223727 -199039 -137799 -195025 -178769 -38434
11811c8434J3938j5993J4518J3566J41344N9008p5793j49958J3308J61096o1450
11800G5150p0450j7978r1679J11045K79441J28734j25115j81732j9787J37286
11790B24915J13861N2215P4613J66914O4711j04722j27260j66167o6748m5536
11780A86796j58517j61644J14045l5640r3624K43137K70286L2802j49383j31351
11770A16907M7683J74950k7930r4304N3818j15337l32891k60303n7837J90320
11760c04924K8337L5699J61105Q2q4675K7945K14671J71674j6122j62834j29194
11749e8236p8662r7999j05554N0867N3610j9599K679j15470K8434Q9040k5361
11738b76251l4507k65027l42160J89663M12729j15528k29765K2721L76331J53077
$$ plain form
11811 -38434 -24496 -40489 -25971 -12405 128939 187947 112154 -37804 -24496 136600 75150
11800 75150 4700 -13278 -104957 6088 285529 414263 289148 107416 87629 224915
11790 224915 338776 390991 465604 632518 697229 592507 465247 299080 232332 186796
11780 186796 28279 -133365 -19320 -54960 -148584 94553 364839 397641 248258 116907
11770 116907 164590 339540 311610 217306 271124 155787 -177104 -437407 -495244 -304924
11760 -304924 -276587 -240888 -79783 -79701 -164376 -136431 78240 249914 233792 70958 -58236
11749 -58236 -136898 -234897 -340451 -289584 -235974 -255573 -252894 -368364 -339930 -250890 -276251
11738 -276251 -310758 -575785 -917945 -728282 -315553 -431081 -660846 -638125 -261794 -108717
11728a08717j17153j52897o8248r4253j80190O2415L05872M09046K31858j64789
11718A22944j43456J7719L4695J62987K35908K4263k76532j82799n9381j1080
11708g4732n6221o9170n133K614n0037K154n1052N4659Q9792J65509N0134p6742
11696a8225n5518K1925J6911j58955j90346O4153P0021n8388O5621K13671M6271
11685A7141j2787K61552L53024J16691j64294k48726j50139K0367k9052l8806
11675A24971k6753j56967j04070Q0395R8641j06823m7011r0775J44725J56833
11665G3166m4366J1728J50053J81600J42559R4219q2036q2102n4846j5531q1438
11654B93006k34745j80295j3311J60771m535o3460j05346k1606n0797q244k8763
$$ plain form
11728 -108717 -225870 -378767 -447015 -541268 -721458 -659043 -353171 55875 287733 122944
11718 122944 -20512 -2793 31902 194889 430797 455060 178528 -4271 -63652 -74732
11708 -74732 -130953 -200123 -205256 -202642 -252679 -250525 -301577 -246918 -157126 8383 58517 -18225
11696 -18225 -73743 -51818 -34907 -193862 -384208 -320055 -250034 -308422 -242801 -29130 17141
11685 17141 4354 265906 618930 735621 571327 322601 172462 192829 163777 124971
11675 124971 98218 -58749 -162819 -82424 16217 -90606 -137617 -228392 -83667 73166
11665 73166 28800 40528 190581 372181 514740 608959 526923 444821 389975 374444 293006
11654 293006 58261 -122034 -135345 25426 20891 -42569 -147915 -169521 -220318 -228562 -257325
11643b57325l11281l38048j66200K87353K82172J99207n4429q7353k40974k12056
11633h98934n693K43475L27282N4583r8354K07433J14444j37474j29715L0180
11623b92773K33975K03003n2370j13476O1087K87067M8508j99494j14167R5345
11613A56705r5836l26508j40395J07123l2902j07762j151m4367L2896J80979J1556
11602b59662o6320J31612K66305J46392j897r4836L2205J33486L2152j76198j28590
11591A4649K7733M0093p5831j25321J05576J45370o339J381M0525j39833p3187
11580d5184j788q1799j23186o3861j23135j48392m7511P4463P0247J28791M5237
11569c16118J44294J19562p1607j83214j7242L2301M1199k28571k86178K49176
$$ plain form
11643 -257325 -568606 -906654 -1072854 -785501 -503329 -304122 -358551 -445904 -686878 -898934
11633 -898934 -904627 -661152 -333870 -279287 -377641 -170208 -55764 -193238 -322953 -292773
11623 -292773 -58798 144205 91835 -21641 39446 326513 375021 175527 61360 156705
11613 156705 60869 -265639 -406034 -298911 -331813 -439575 -440726 -485093 -452197 -271218 -259662
11602 -259662 -325982 -194370 71935 218327 216430 121594 153799 287285 319437 143239 14649
11591 14649 42382 82475 6644 -118677 -13101 132269 125930 127311 167836 28003 -45184
11580 -45184 -46972 -128771 -251957 -315818 -438953 -587345 -634856 -560393 -490146 -361355 -316118
11569 -316118 -171824 -52262 -123869 -307083 -324325 -292024 -250825 -479396 -765574 -516398
11559e16398L05117J4725j05004J00075K28742k1837j81535j02741J57727J91354
11549G0225o7644N7718J05690J06679J70136o2145j19908q1564j1300J23962P8829
11538C70678j90306j62856K8137j10935l34049L3685Q6333r234L5890J32378j824
11527a22103J9071K5423q3138J6091J3141j48392q6980P4799J09164L4288J34602
11516a4034J38077j680p9025k51412k49716j60104m7029J26204J38909J74722
11506b25088K26253K72591K49994J30743O1202j33379j51364k20163j54050M8216
11496A04955K55874K44105j06481m48804j71857K11667J0081r5626r896K03932
11486A97950K39847K5055n1897j8631k28946j33571P196Q539K9075k0502m981
$$ plain form
11559 -516398 -211281 -196556 -301560 -201485 27257 5420 -176115 -278856 -121129 70225
11549 70225 2581 60299 165989 272668 442804 380659 260751 179187 167887 291849 370678
11538 370678 180372 17516 45653 -65282 -399331 -365646 -279313 -288547 -252657 -120279 -122103
11527 -122103 -103032 -77609 -160747 -144656 -131515 -279907 -366887 -292088 -182924 -148636 -14034
11516 -14034 124043 122363 43338 -208074 -457790 -617894 -664923 -538719 -399810 -225088
11506 -225088 1165 273756 523750 654493 715695 582316 430952 210789 56739 104955
11496 104955 360829 604934 498453 49649 -122208 89459 99540 3914 -5982 197950
11486 197950 437797 462852 410955 392324 163378 29807 37003 45542 74617 54115 49134
11475D9134q8192j39146J4550J36211j57403k06007l7540J38910J97569J51648
11465E9734L35994K47917j74661j44600n8714j42322k09092j17327k10669J5253
11455c98487K8479k6985J18729K3486j65189J01918L40552J12042o4767L6716
11445A06494J93329K66660j03039j30345J76792m1949l8758J1693j23222q9333
11435B28322l3615L5131M38235K76577m51761m44073j50700m9833P329M4311N8123
11424d1954L9575L1774K2918L06j25443R059J06474P5434P2025M4536K5789j01110
11412A59383j81645q0392j09406P027J09805J33614o7972n5994j08378P368R2044
11401i4546m2805j30517J7086Q9159k7212k9085K26006K79994J92295J41690o4981
$$ plain form
11475 49134 -39058 -178204 -163654 -27443 -184846 -390853 -428393 -289483 -91914 59734
11465 59734 395728 643645 468984 324384 265670 123348 -85744 -203071 -413740 -398487
11455 -398487 -370008 -396993 -278264 -254778 -419967 -318049 22503 134545 69778 106494
11445 106494 299823 566483 463444 333099 509891 467942 429184 440877 317655 228322
11435 228322 194707 229838 668073 944650 492889 48816 -101884 -151717 -144388 -100077 -41954
11424 -41954 -2379 29395 52313 52619 -72824 -63765 42709 118143 190168 234704 260493 159383
11412 159383 -22262 -102654 -212060 -205033 -95228 38386 -29586 -85580 -193958 -186590 -94546
11401 -94546 -137351 -267868 -250782 -161623 -188835 -217920 8086 288080 480375 622065 557084
11390E57084j08566J16882J44964P093n2652j11206j10394r9911K1283n7944l0842
11379B75791Q2091r758j13844j84267M1818R1297p6726r2873K9966N9174J25974
11368B28643L9849M4715K36839J4750j2459j65327k15572L6325J67928r0431l8649
11357B46611q1795j17146R8054K1033p2447o827k04185j23122n2305j23120n5339
11346d70588k6465R6971J54096J05801K11252J73042J48585j1671n5557j28950
11336A96516j24269j22590j53983K3858J69766O1212l4966r6933N1795J25174
11326I5580J7826K386J18818r8332j57909Q5599J06835M7798J24446j52256J5290
11315B06081L68510O3981k21927j53127K003m8586J33410P9634k65260l63677
$$ plain form
11390 557084 448518 565400 710364 717457 664805 553599 443205 343294 364577 306633 275791
11379 275791 357882 348124 234280 50013 91831 183128 106402 13529 43495 102669 228643
11368 228643 268492 313207 550046 564796 552337 387010 171438 207763 375691 285260 246611
11357 246611 164816 47670 145724 166757 94310 87483 -116702 -239824 -292129 -415249 -470588
11346 -470588 -497053 -400082 -245986 -140185 71067 244109 392694 381023 325466 196516
11336 196516 72247 -50343 -204326 -180468 -10702 50510 15544 -81389 -29594 95580
11326 95580 113406 115792 234610 136278 -21631 63968 170803 218601 343047 190791 206081
11315 206081 574591 638572 416645 263518 265521 216935 350345 429979 164719 -198958
11305a98958J9052K34941J21179J8276K30813K71446N6189k13918l36040j84537
11295A8443L9168R2309N8238L5785J79175K03687R6279j49805j54162j28377k46662
11284D4078k16624k7564J00652J26196o3554L6766k2241j82275j29711J1916J75218
11273a47143J79949J85995J54541j30171k3374J69297N6613o1189k16913j31340
11263C6265P691j72548p1692N2815L8258K8408m0477K1982J20785j55856p5889
11252b10258K36769J47420K9284K4313n2443m5046L9194N1522P0346j57723o1090
11241G2288J58883R8089J01966J02826j28338j48393K8627j28617K2558J79601
11231C59490k9600k41937l5620J53143J81027Q6210k3905j97628j82489L7706
$$ plain form
11305 -198958 -179906 55035 176214 194490 425303 696749 752938 539020 202980 18443
11295 18443 57611 149920 208158 243943 423118 626805 723084 573279 419117 290740 44078
11284 44078 -172546 -200110 -99458 26738 -36816 -50 -22291 -204566 -334277 -322361 -147143
11273 -147143 32806 218801 373342 243171 219797 389094 445707 384518 167605 36265
11263 36265 43956 -128592 -200284 -147469 -109211 -80803 -121280 -99298 21487 -134369 -210258
11252 -210258 26511 173931 203215 227528 175085 130039 169233 220755 291101 133378 72288
11241 72288 231171 329260 431226 534052 405714 257321 285948 157331 179889 359490
11231 359490 329890 87953 52333 205476 386503 472713 448808 251180 68691 106397
11221A06397l5351p3182r0314J857M19951K98006j81315j58155j77815j13430
11211c351k6762P259N2773J71692K57726K93476K84573J13998k75100k11012l0704
11200F34568j93057k09821j03931R9705J16472J7182O3132J13045J34323K0190
11190F91808j89306o7183J91344O2561J36807n2155l14491p1790J99920j676k33002
11179C52837k09481k17284p5228M8387K94263M3297j02193j20047m7747K24755
11169A91559K17474K11870J21366J33432K7285N2084K33427M02222M11668K94558
11159B296945K19512O54488J137785Q65780K10890k91497q81768j210174r99390
11150B002571m41047j84538k55241j60339J08040j3801R0069q4290j56311J487
$$ plain form
11221 106397 71046 -2136 -92450 -90593 329358 627364 446049 287894 110079 -3351
11211 -3351 -30113 -22854 29919 201611 459337 752813 1037386 1151384 876284 665272 634568
11200 634568 441511 231690 127759 227464 343936 361118 424250 537295 671618 691808
11190 691808 502502 435319 626663 689224 826031 773876 459385 387595 587515 585839 352837
11179 352837 143356 -73928 -149156 -100769 193494 236791 134598 14551 -33196 191559
11169 191559 409033 620903 742269 875701 902986 955070 1188497 1590719 2002387 2296945
11159 2296945 2516457 3170945 4308730 5174510 5385400 5093903 4212135 3001961 2002571
11150 2002571 1561524 1376986 1121745 961406 1069446 1055645 1145714 1061424 905113 906600
11140I06600n0520q4368k6690j5076j065m2361r9713p7403k91810j53559J46017
11129B10052M2043q9283p499P3168M1177o1792j60875p4754p1303j61761j49764
11118d10591j64171n4656K52565J37918j3709K69877M16368Q2158K2337J54149
11108F92245J32232L4923l39872k16186k9577P8346J5544j20853k9137j3136n3887
11097A50642J47835J43839Q3689o5958k56210m1895r561M563j34166k8003K82604
11086B77379J35055P6211N5864K9191P3949M9079k2225j52139l27915k23989J64193
11075A34653J47664Q4465J51557J91237R2631J46116J30413P1880Q4491q7002
11065A148105k79918j95265p1664k100q179m3426j76263q9934J46611K36468J59723
$$ plain form
11140 906600 856080 771712 745022 729946 728881 686520 586807 509404 217594 64035 210052
11129 210052 252095 162812 155313 228481 269658 207866 46991 -27763 -99066 -260827 -410591
11118 -410591 -574762 -629418 -376853 -238935 -252644 17233 433601 515759 538096 692245
11108 692245 824477 859400 519528 303342 273765 352111 367655 246802 217665 204529 150642
11097 150642 298477 442316 526005 460047 203837 161942 152381 156944 22778 -5225 277379
11086 277379 412434 488645 544509 573700 647649 696728 674503 522364 194449 -29540 134653
11075 134653 282317 366782 518339 709576 802207 948323 1078736 1150616 1235107 1148105
11065 1148105 868187 672922 601258 599158 590979 547553 371290 281356 427967 664435 824158
11054H24158J1272L9748K18686J40730j35980N5152K05762L05989J40910L61506
11044B167933P59100M29652J763j01467j85889l02154l20353l22263l3500p7714
11034B015108k14091j40588r5702J95227K95062J15682J93562k512J92077N04777
11024C058602K31225j74165j37200m0059K05545K71339L30726L12007K72726K54157
11014D584903N36656P96136Q58865Q84440J069604J239571J338206J747479K270825
11005A5326685K719074L605961M490728N894805P898041R738237J1874414J4944059
10997G6492004J8837331K4839560L4528804M8059376O0183022O0636143M4333566
10990C67909806J9620474j8787643p0188863q4516207o2592822m0269072k6225827
$$ plain form
11054 824158 835430 875178 1093864 1234594 1098614 1153766 1359528 1665517 1806427 2167933
11044 2167933 2927033 3356685 3358448 3256981 3071092 2768938 2448585 2126322 2092822 2015108
11034 2015108 1801017 1660429 1564727 1759954 2055016 2170698 2364260 2361748 2553825 3058602
11024 3058602 3289827 3115662 2978462 2938403 3143948 3415287 3746013 4058020 4330746 4584903
11014 4584903 5121559 5917695 6776560 7661000 8730604 9970175 11308381 13055860 15326685
11005 15326685 18045759 21651720 26142448 32037253 39935294 49673531 61547945 76492004
10997 76492004 95329335 120168895 154697699 202757075 262940097 323576240 367909806
10990 367909806 387530280 368742637 298553774 214037567 151444745 111175673 84949846
10983H4949846j8152246j3334345j0164813p496870n696484m500474l703819k928975
10975A8971820k481008k076702j612044j323648j151729r95035r50384q23112
10967G558158n23563n66836p60306n68679l83043l39796k30634q4951l07825m02942
10957C389583k85190k58927k50346n3135k76086j80292J0223j55271k32677P1951
10947A779833J34189J53385J1678o6389J60378L41958L74407J69052J00423N0147
10937C209061q6457l75697n68605m84952l79463j84146q1954L7665k5913k84919
10927G74620k54409j86775p1245j84098j84051q643J80670K09881K17410K58316
10917G51676Q4771J11410J1380k98504k56032j67577K5691L08271P9242j0656
$$ plain form
10983 84949846 66797600 53463255 43298442 35801572 30105088 25604614 21900795 18971820
10975 18971820 16490812 14414110 12802066 11478418 10326689 9331654 8381270 7558158
10967 7558158 7034595 6467759 5707453 5138774 4755731 4415935 4185301 4100350 3792525 3389583
10957 3389583 3104393 2845466 2595120 2541985 2265899 2085607 2095830 1940559 1707882 1779833
10947 1779833 1914022 2067407 2079085 2012696 2173074 2515032 2889439 3058491 3158914 3209061
10937 3209061 3122604 2746907 2178302 1693350 1313887 1129741 1047787 1085452 1059539 774620
10927 774620 520211 333436 262191 78093 -105958 -114601 66069 275950 493360 751676
10917 751676 836447 947857 959237 660733 404701 237124 262815 571086 650328 639672
10907F39672k55312l66555k83535P8495K70812J02731m3246J0200j02540q3152
10897c2430J51308L41920L64581K05787j63378m35996j11207P3904J77032J91526
10887G63047R0578r6726q7071p0499k15884k19013Q5485P5993m7699J1073J24281
10876D13565K46234J98087N2866l93635l54652p1694p1409N6387j01694k38000
10866b63945j51319R7725K49738L82402L00045Q0876k5609n1522J62387j4027
10856G66751k14749j78008j12305m9011J2001o2758k35605j46345R6130K23467
10846I9568J16364r4912j74678L2038Q4303O329q0497o3555J0087J39345m9619
10835B4773o5428O3344M5567J15677J7979o0963J15312J55263L1208k43136j63862
$$ plain form
10907 639672 384360 17805 -265730 -187235 83577 186308 143062 153262 50722 -32430
10897 -32430 118878 460798 825379 1031166 867788 431792 320585 394489 571521 763047
10887 763047 853625 756899 669828 599329 383445 164432 249917 325910 278211 289284 413565
10876 413565 659799 857886 910752 517117 162465 90771 19362 75749 -25945 -263945
10866 -263945 -415264 -317539 -67801 314601 614646 695522 669913 618391 780778 766751
10856 766751 552002 373994 261689 212678 224679 161921 -73684 -220029 -123899 99568
10846 99568 215932 121020 -53658 -21620 62683 69012 -11485 -75040 -64953 74392 24773
10835 24773 -40655 22689 68256 183933 201912 140949 256261 411524 442732 199596 35734
10824C5734p5947j75478K46889K07318K8552j51109q5937O3855K9573J7638P1490
10813B12578j2487m0387r1867r6417j11496P0939J24149j2859O1469K98157J81190
10802E82969Q0288m1846j92466l73953j74695K3572m9936l6626k9787o6325k00586
10791d79391q3924J4280R8770J16423N9051J03240l5171k15032j07537K19756
10781c09535L45394J82276K8154l261K3213n4677j27448J63909R2057l2041j31588
10770A76453k03006o5707j8304m9603j7814P2678R0061J61563O5464m2460N9929
10759B29254J54835J91045P4303j07920k28974j34184n0749j31310j40261J6665
10749a27296M6249N5348M2347L08274L29976R9273j26138j11913j08557j31876
$$ plain form
10824 35734 -40213 -215691 31198 238516 267068 115959 30022 93877 123450 141088 212578
10813 212578 200091 159704 67837 -28580 -140076 -69137 55012 42153 103622 401779 582969
10802 582969 663257 621411 428945 54992 -119703 -96131 -146067 -182693 -212480 -278805 -479391
10791 -479391 -563315 -549035 -450265 -333842 -274791 -171551 -206722 -421754 -529291 -309535
10781 -309535 35859 218135 246289 243028 266241 211564 84116 248025 340082 308041 176453
10770 176453 -26553 -92260 -110564 -160167 -177981 -105303 -15242 146321 211785 169325 229254
10759 229254 384089 575134 649437 541517 312543 178359 127610 -3700 -143961 -127296
10749 -127296 -81047 -25699 16648 324922 654898 754171 628033 516120 407563 275687
10739B75687P498J57600j3430k59717k83746j470K07444N2030k96769k41850l9152
10728d35875K06299L04853J956k32594j89476j47150j01972K6340j06128J26304
10718e47443L37265J24204l0190K747n2969j75482j27341R1370K46007K32242
10708A00410J6920r3406J40486K49772L01087M7260j01381o0895j07663J3823
10698E06413M8041j01791m18n6956o6213O6268J03675J8249k06931k63366k2030
10687B4941J41958P0490n742j95680m32441j38003N4182k00861q3211K12180K33043
10676c19144L00244K78540J46214J4669k62832k00482q8528N3658k1400o8862
10666a67923l5209J8414O4856P4410J68948K296j28252o8990K8924o7382j56511
$$ plain form
10739 275687 283185 440785 427355 167638 -116108 -117578 89866 141896 -154873 -396723 -435875
10728 -435875 -229576 75277 77233 -155361 -344837 -491987 -593959 -567619 -673747 -547443
10718 -547443 -210178 -85974 -116164 -113417 -166386 -341868 -469209 -377839 -131832 100410
10708 100410 117330 23924 164410 414182 715269 762529 661148 600253 492590 506413
10698 506413 554454 452663 452245 395289 329076 395344 499019 517268 310337 46971 24941
10687 24941 166899 237389 231647 35967 -396474 -534477 -480295 -681156 -764367 -552187 -319144
10676 -319144 -18900 259640 405854 420523 157691 -42791 -131319 -77661 -99061 -167923
10666 -167923 -203132 -184718 -119862 -45452 123496 125792 -2460 -71450 -42526 -109908 -266419
10655b66419J16071k6845j34319M3305j7047j01587N2002J91200J45504J07178
10645A09043J07962M8734N2560j5398j33712j44928k78088k29292L5663J14753
10635c32703J56921Q5748J18924R0971n2142j77368P8557J38067p356L7817Q9029
10624B26465J58083L8206j97270J6964J26650J18465J23064o653n7115q7587j18769
10613C40503p7323Q176j24830l02930j87357J08642K55772K39152j486k8176J17820
10602C47963l07854k83048n6269j63540j75068l1879K4277r733k7003Q1066K25194
10591c75894K54655K78825J7832k88934j88207q9952l5422r167J13476l1867M2610
10580c12045o7707j1927P9765K49764K32141R123j27174j48340R2636O5169j78537
$$ plain form
10655 -266419 -150348 -177193 -311512 -268207 -285254 -386841 -334839 -143639 1865 109043
10645 109043 217005 265739 318299 302901 169189 24261 -253827 -483119 -447456 -332703
10635 -332703 -175782 -90034 28890 119861 67719 -109649 -31092 106975 99619 137436 226465
10624 226465 384548 422754 225484 242448 369098 487563 610627 603974 546859 459272 340503
10613 340503 263180 271356 146526 -156404 -343761 -235119 20653 259805 258319 230143 347963
10602 347963 40109 -242939 -299208 -462748 -637816 -669695 -645418 -655151 -682154 -601088 -375894
10591 -375894 -121239 157586 175418 -113516 -301723 -391675 -427097 -436264 -322788 -354655 -312045
10580 -312045 -379752 -391679 -311914 -62150 169991 179114 51940 -96400 -3764 61405 -117132
10569a17132l5451p9123n0130J14451J60995K3549j14359j12672k04173M3350
10559c70695K56626J35477j05460k64195k53273J51088K22474j18413j44841J46731
10549c44481M02823M6390j02893j34048j39033j0040K0061r5553m0910j11558
10539e09242p3856P5284J92894K48194J57557q2445j56709P9744J60873j09200
10529a6906j37900k26503J0041J85121n5721j81124k65474l132K10169J13539
10519c67890K5072O8578O2146J04883K77200K87387j15759j36633r7345j70688
10509f3049p5741J44912R943k84184j83498J73569J14380p3158n8145J20976R4788
10498g9207K6527j1100J47153L1554N7399m1414R1794L5892j91846j40197n9685
$$ plain form
10569 -117132 -152583 -231706 -281836 -167385 -6390 17159 -97200 -209872 -414045 -370695
10559 -370695 -114069 21408 -84052 -348247 -601520 -450432 -227958 -346371 -491212 -344481
10549 -344481 58342 104732 1839 -132209 -271242 -281282 -261221 -356774 -397684 -509242
10539 -509242 -583098 -507814 -314920 -66726 90831 8386 -148323 -68579 92294 -16906
10529 -16906 -154806 -381309 -371268 -186147 -241868 -422992 -688466 -691598 -481429 -367890
10519 -367890 -342818 -274240 -212094 -107211 169989 457376 341617 204984 107639 -63049
10509 -63049 -138790 6122 16065 -268119 -451617 -278048 -163668 -236826 -294971 -173995 -79207
10498 -79207 -52680 -63780 83373 114927 172326 130912 222706 258598 66752 -73445 -133130
10487a33130L4413n010R8367r7614j50374J6053j5211O9290m8930l8051O3640
10476b06557m6740j10650J50257L73210P9998O2415P0839o8877p5993j40105o3060
10465B4737j77328l5041J65307J16168l7106n8081J47386N0430k69898l06945
10455c80371j26133j33970j10000K8995K84035M48354K05551J44959J21462l6069
10445D46813j69464l57912j56864J03056j04480k50753P1906K04764J02421J3307
10435i7206n9028m4363O296n7166j88874o0813J40222o8606j73591Q3951J48262
10424c70916J8455L6493R7245O8315p9289j26296R6887N0928P504k3126N6179
10413a67621j01253n6366J64708N5093P4854Q6615n5405j78851n1570K3875N5113
$$ plain form
10487 -133130 -98717 -103727 -5360 -102974 -253348 -237295 -252506 -183216 -232146 -270197 -206557
10476 -206557 -253297 -363947 -213690 159520 239518 301933 372772 303895 227902 87797 24737
10465 24737 -152591 -187632 -22325 93843 56737 -1344 146042 196472 -73426 -380371
10455 -380371 -506504 -640474 -750474 -721479 -437444 10910 216461 361420 482882 446813
10445 446813 277349 -80563 -237427 -134371 -238851 -489604 -417698 -212934 -110513 -97206
10435 -97206 -156234 -200597 -194301 -251467 -440341 -501154 -360932 -429538 -603129 -519178 -370916
10424 -370916 -352461 -315968 -218723 -150408 -229697 -355993 -259106 -208178 -200674 -223800 -167621
10413 -167621 -268874 -325240 -160532 -105439 -30585 56030 625 -178226 -229796 -205921 -150808
10402a50808q439l7737k6714J10382J40316j85794l53594p2565L58638K85957
10392E9642J21858o0776J4589N6349j28953j50948L8821O6499n7786k9041K0259
10381d9487J74450J45112k0532l2211J08982J42111j39805k43616j02402K18551
10371B01153K16617k5011p1585k02444o9395j8521l3775P6586J14361o6743k83311
10360a62068k8505K0284o4723O5203M2647l1762j04134k16851o211O3143Q0962
10349c42015M0669o6910k0128m4801j3069K24908J98357m1893j64032p0177O4414
10338b34677n3824j1359O6857J05036m545J72248J86097Q8334o8132k42086k86245
10327b82296j01496n9677P7988L09593J25777J6445P8027J02712j08620p7031
$$ plain form
10402 -150808 -159247 -196984 -223698 -113316 27000 -158794 -512388 -584953 -226315 59642
10392 59642 181500 120724 135313 191662 62709 -88239 -49418 17081 -40705 -69746 -49487
10381 -49487 124963 270075 249543 217332 326314 468425 328620 85004 -17398 201153
10371 201153 417770 392759 321174 118730 49335 30814 -2961 73625 187986 121243 -162068
10360 -162068 -190573 -170289 -235012 -169809 -127162 -158924 -263058 -479909 -486120 -422977 -342015
10349 -342015 -301346 -368256 -388384 -433185 -446254 -221346 -22989 -64882 -228914 -299091 -234677
10338 -234677 -288501 -299860 -233003 -127967 -132512 39736 225833 314167 246035 3949 -282296
10327 -282296 -383792 -443469 -365481 -55888 69889 86334 164361 267073 158453 81422
10317H1422J19574j65004k31380j42499k5963J27301J95553n961j06652J20777
10307c2832M639j57060J3867J47754J23656p729r2521q8761j48550j07077K5270
10296c19344J69647J07707O8295J16098M9972j48908j40759R8782K02081n9302
10286A44269o5126L8456j2497k2782k6759j56308p2369J08380l0187j34302K8006
10275b01219L2027k7239p0559p3481n4639p5747r7923M149K36336K23993J30385
10264B6083K8940O6906J78560n6255j07897J1949J2191n9275J8544J01810O5503
10253B87059P8722O5809j29745l9081Q5185N4162r029J6992k9829j13781j97081
10242F9383k91950l46427r2856l5618k11473O199K23043K39490K7237J7566K04729
$$ plain form
10317 81422 200996 35992 -195388 -337887 -363850 -236549 -40996 -46957 -153609 -32832
10307 -32832 -28193 -185253 -171386 -23632 100024 92295 -226 -88987 -237537 -344614 -319344
10296 -319344 -149697 -41990 26305 142403 192375 43467 -97292 1490 203571 144269
10286 144269 79143 117599 105102 82320 55561 -100747 -173116 -64736 -94923 -229225 -201219
10275 -201219 -169192 -196431 -266990 -340471 -395110 -470857 -568780 -564631 -328295 -104302 26083
10264 26083 55023 121929 300489 244234 136337 148286 160477 101202 119746 221556 287059
10253 287059 365781 431590 301845 262764 347949 402111 393082 410074 380245 266464 69383
10242 69383 -222567 -568994 -661850 -697468 -908941 -902742 -679699 -440209 -412972 -395406 -190677
10231a90677J98922r8091k94882k51222j58674M3813J42050J15886J94847N5177
10221b42851r9988M0725K00400K07048J69869L2994j6500p3401m8188j27106j95219
10210a52217M0480K15824K68258K12696L9850j53418k28656j54630r51N7183N3214
10199A97633K457n6348k77001j48579J86448K5099j01415Q934q7157k3271N6890
10188b16310l3140J07754K3402M6035j22850j88625K6514M389R5525J14708J57275
10177A4677J21678l2885l4917Q220o4325j63011m3713K29953M25544J31625m24566
10166A68280l05420k9452M3292M0738J07781M5668j1518Q1982j16492J66389O976
10155A98224k13226j14458K01642L54849P5893j91627k13178m7733J76873J30999
$$ plain form
10231 -190677 8245 -89846 -384728 -635950 -794624 -750811 -608761 -492875 -298028 -242851
10221 -242851 -342839 -302114 -101714 105334 275203 308197 291697 218296 170108 43002 -152217
10210 -152217 -111737 104087 372345 585041 624891 471473 242817 88187 87236 144419 197633
10199 197633 200090 143742 -133259 -281838 -95390 -70291 -171706 -162772 -249929 -273200 -216310
10188 -216310 -249450 -141696 -118294 -72259 -195109 -383734 -357220 -352831 -257306 -142598 14677
10177 14677 136355 103470 68553 76773 12448 -150563 -194276 35677 461221 592846 168280
10166 168280 -137140 -166592 -123300 -82562 25219 70887 59369 141351 24859 191248 198224
10155 198224 -15002 -129460 72182 427031 502924 311297 98119 50386 227259 358258
10145C58258j33696l9156J06120J61120J07997L4178M7036j22928k22515l26647
10135c0233j60742l3381j24171K20533J31862J26669K34667Q918Q027j05865p0084
10124B06200L9692j13280j72807r0212o0839O5146P5377J6863p4296J2639O125
10113h9392K2064K01701O6873j47957j29805L3869K1015j66567j80594k44594
10103f13387o1913P4678R3148J01976n4466l0396N1334J23637J98836M867m5938
10092a57624P3356J82629R5953j82455r7020K03233O8555j11353j06869r1904
10082a23499M5360r9632m8703j59520r2443J47351J60749Q4192J12706O5271K5341
10071A17173O6731o0896j86344k12960J8820R7423L14978K10239r6634n029J06242
$$ plain form
10145 358258 224562 185406 291526 452646 560643 594821 641857 518929 296414 -30233
10135 -30233 -190975 -224356 -348527 -127994 3868 130537 365204 374122 382149 276284 206200
10124 206200 245892 132612 -40195 -130407 -191246 -126100 -50723 -33860 -108156 -95517 -89392
10113 -89392 -67328 134373 201246 53289 -76516 -42647 -21632 -188199 -368793 -613387
10103 -613387 -675300 -600622 -507474 -405498 -459964 -490360 -439026 -315389 -116553 -111686 -157624
10092 -157624 -84268 98361 194314 11859 -85161 118072 186627 75274 -31595 -123499
10082 -123499 -78139 -177771 -226474 -385994 -478437 -331086 -170337 -86145 26561 91832 117173
10071 117173 183904 123008 -63336 -276296 -257476 -160053 154925 365164 268530 263501 369743
10060C69743o400l63252j66672J5397j62055j6377K65228P3407q2660N7796j02662
10049a18507j54293n1653J18685K65492O8043r7546Q9017Q453k3313k42393l01206
10038d39221M1500J20462K41827J78126J21019J30143K94813J9667k85385k38902
10028A84049P0477R8661n6821j25480N6838R4246K0323J59157P6240j4966k7027
10017E35697R2770k02469l56068l7335J32193l1752L6272o0645j27638j3662R915
10006b2722N4923L4761O06k27341J6528K94291L45846J29291l41409j93770k8599
9995F2405q7339J1352J7686J2805j5720J10896J50803R9353j08503k47231n7412
9984e0905J49233j9740j65304p0767N180l5934j935J22065P7321M1398M5452O5064
$$ plain form
10060 369743 363343 91 -166581 -151184 -313239 -329616 -64388 9019 -73641 -15845 -118507
10049 -118507 -272800 -324453 -205768 59724 127767 30221 119238 127691 104378 -138015 -439221
10038 -439221 -397721 -277259 -35432 142694 263713 393856 688669 708336 422951 184049
10028 184049 254526 353187 296366 170886 227724 321970 342293 501450 577690 562724 535697
10017 535697 628467 425998 69930 32595 164788 133036 169308 108663 -18975 -32637 -22722
10006 -22722 32201 66962 67568 -159773 -143245 151046 496892 626183 284774 91004 62405
9995 62405 -24934 -13582 4104 16909 1189 112085 262888 362241 253738 6507 -50905
9984 -50905 98328 78588 -86716 -157483 -152303 -188237 -190172 -68107 9214 50612 96064 161128
9972A61128m5365j06991j61219n0800O1068N6127M2665R506j20808j79402m942
9961c39033J78777J53908R3398l8876p8265L0969q9453j46830k6843K6766k80455
9950e15937K503K73105j32814K4266J52744O9024J43491P8357j61080l4450p3751
9939a74542j95406k4145R2821j07501j55329J94690L16124K72437R1523k34743
9929G5929j58370N267j91377j17190J05515J67120J35375O8619q538r4647j00081
9918a12378k6271P8954J74806J00645o0273O662j06321k56056j24450j69144M9900
9907d43926P2807J17499J82351N0562Q3465J62438K4516j83018l84079j78376
9897d95761J84363K65929K19519J06071j96368r6035J17125j25634j57774k1958
$$ plain form
9972 161128 115763 8772 -152447 -203247 -142179 -86052 -43387 -33881 -154689 -334091 -339033
9961 -339033 -160256 -6348 87050 48174 -30091 878 -88575 -235405 -262248 -235482 -515937
9950 -515937 -513434 -240329 -373143 -348877 -196133 -127109 16382 94739 -66341 -100791 -174542
9939 -174542 -369948 -394093 -301272 -408773 -564102 -369412 -53288 219149 310672 75929
9929 75929 -82441 -77174 -268551 -385741 -280226 -113106 22269 90888 82350 -12297 -112378
9918 -112378 -138649 -59695 115111 215756 155483 162145 55824 -200232 -324682 -493826 -443926
9907 -443926 -371119 -253620 -71269 -20707 62758 225196 249712 66694 -317385 -495761
9897 -495761 -311398 -45469 174050 280121 83753 -12282 104843 -20791 -178565 -200523
9887b00523m1038N8496Q3493K8822N8592K33793K60355j095j87507j33703M5339
9876B05024j31083j15945j09033l4971M6171m4777n9638p4854J08528L21455j8305
9865I2572p3997O3387n9301k84355j9863P3308N6733J59546J62429j388m0738
9854A28333N9405O2554J43676j72149k67767o8688m4738k65790j53488J54666
9844d23986M61091K99383J148n452J08691P0185J15525j94764l48808J7538J90160
9833B90711r8736j79763O6829J33702k4701j09387m6439k75985k02388J65648
9823b80509q02j52958o8151M7238L3094n8327K96343M38585L9908j21819j32722
9812C9880K6625J52085K3805k3577p8614k36671m21051k36113R7180M23035K55120
$$ plain form
9887 -200523 -241561 -183065 -99572 -70750 -12158 221635 481990 480895 293388 159685 205024
9876 205024 73941 -42004 -151037 -186008 -139837 -184614 -244252 -319106 -210578 110877 92572
9865 92572 18575 81962 22661 -261694 -281557 -208249 -151516 8030 170459 169071 128333
9854 128333 187738 250292 393968 221819 -45948 -114636 -159374 -425164 -578652 -423986
9844 -423986 37105 336488 337636 332184 440875 511060 626585 431821 83013 100551 290711
9833 290711 191975 12212 79041 212743 188042 78655 32216 -243769 -446157 -280509
9823 -280509 -281311 -434269 -502420 -455182 -422088 -480415 -184072 254513 294421 172602 39880
9812 39880 66505 218590 242395 218818 140204 -96467 -517518 -753631 -656451 -233416 21704
9801B1704j88388l07070j8488J72251K85408L02481J25072M5108j46920l31895
9791d0737q5229J59998r248j67543K797O8122L1369m6158n1771J2099J6483p6194
9779a86012l8365o6935m7871J0713J9353j02790q7415N5765K00705K47912K33095
9768B38155R2550J4107m8456j08417j58317l96180j17163K87566K05968J05634
9758A15447J0131O5412M9565p8715p6731L8299j03036k60847k17533r3562j32358
9747f83928J12273K72424Q7171L9010j0846p1945J30637K40991K29460R7466k06556
9736B36157j90733O1460J50249N5310J87815J80148J0744k17611l45101j77227
9726d8789O2149O0697o823o8157Q0572J01360j97092j37886P1004M7442j0816
$$ plain form
9801 21704 -166684 -473754 -492242 -319991 -34583 267898 392970 438078 291158 -40737
9791 -40737 -125966 34032 24784 -142759 -139962 -71840 -40471 -86629 -138400 -126301 -109818 -186012
9779 -186012 -224377 -291312 -339183 -328470 -309117 -411907 -499322 -443557 -242852 5060 238155
9768 238155 330705 344812 296356 187939 29622 -366558 -483721 -196155 9813 115447
9758 115447 125578 190990 240555 161840 85109 123408 20372 -240475 -458008 -551570 -683928
9747 -683928 -571655 -299231 -212060 -173050 -183896 -255841 -125204 115787 345247 442713 236157
9736 236157 45424 106884 257133 312443 500258 680406 691150 473539 128438 -48789
9726 -48789 13360 74057 67234 -923 79649 181009 -16083 -153969 -82965 -35523 -46339
9715d6339j08981q6272L8622L8864O1397J05312k01n7954j9472R170R5992J46566
9703A76704j59628j00047q0008j76489j24876o8453K46292L82136K43669r4225
9693B45075k58957j30265p3892O110m8673J0784J02475K6429p3429j33139J14201
9682b13281M23042J00618p2870L2058j98181k99130r1476l3831K2931J73292J68218
9671A1390J11012j13240j13605J86022R2022o3058K7026K41614O21638N72239
9661A573060K45610K02695K49317J24191k79194m99587l98225l39538l57412k73047
9651B47870P5233K09220J4823r0468j17528q2273n7700j62796j00797J31180J09919
9640A76683M239k490k2505j49036r4462R1100K15953J3485o3032J09829P2502
$$ plain form
9715 -46339 -155320 -241592 -202970 -164106 -102709 2603 2402 -55552 -75024 -65854 30138 176704
9703 176704 17076 -82971 -162979 -339468 -464344 -532797 -286505 95631 339300 245075
9693 245075 -13882 -144147 -218039 -211929 -260602 -249818 -147343 -120914 -194343 -327482 -213281
9682 -213281 209761 310379 237509 269567 71386 -227744 -319220 -353051 -330120 -156828 11390
9671 11390 122402 9162 -104443 81579 173601 110543 137569 379183 1000821 1573060
9661 1573060 1818670 2021365 2270682 2394873 2115679 1616092 1217867 878329 520917 247870
9651 247870 323103 532323 547146 456678 339150 256877 199177 36381 -64416 66764 176683
9640 176683 180922 178432 155927 6891 -87571 3529 219482 232967 169935 279764 352266
9629C52266q4354p5510p7608l8391n8123j5727P8910P5465o4357j46961J55774
9618A01384L12670Q7268k3742k24703k31854N0627Q6021j65808n5146j71198k03140
9607d37621j42799j86355O7564L75686K61676q2215n8350R7057J99608J50398
9597B44649J9628J99741N0500j38082r0429j29634k04441j84008q0164J19996
9587a92244k4024R9001J42389K0941L1452j60599Q1866K12030J09196j9022k28405
9576G2581m0001L1742J16936L1172l19480k28130j38662p6210J40706K26508M8171
9565a34667K2366r6478j86758M2380J51617J07152l1222n1574O9703J14503K22399
9554B29421K42627n7408j22987l8022r570j22343m148J59648J45216o5941k58679
$$ plain form
9629 352266 267912 192402 114794 76403 18280 2553 81463 156928 92571 -54390 101384
9618 101384 414054 501322 477580 252877 21023 71650 157671 -8137 -63283 -234481 -437621
9607 -437621 -580420 -766775 -699211 -323525 -61849 -144064 -202414 -105357 94251 244649
9597 244649 264277 464018 514518 376436 286007 156373 -48068 -232076 -312240 -192244
9587 -192244 -216268 -117267 25122 46063 77515 -83084 -1218 210812 320008 300986 72581
9576 72581 32580 64322 181258 212430 -107050 -335180 -473842 -550052 -409346 -182838 -134667
9565 -134667 -112301 -208779 -395537 -353157 -201540 -94388 -125610 -177184 -107481 7022 229421
9554 229421 472048 414640 291653 253631 244061 121718 117570 277218 422434 356493 97814
9543I7814K2550M3914L4693N3990Q1265J64526k9484j50946j24934R2740O0992
9532C47120j36468l8896p0912r8917m5671Q9552J61083O6875J57482K06463m6097
9521E91614m9842j63406k27971k13350J7113P710p6961r5513K17004P7542j90509
9510a06569j51551k3008j83153j23148j04437j08944K54441L20323J45511O5269
9500a5266j37794j82078J37675J95531p0810L3681J39647J95296m8725k13483
9490C3674R3101N3730K5362M55280K02823k35467k25096j21564J14234J53851
9480E49928K2382k0017M9666o2055j63686k14026l36940k60667j03980Q994L2949
9469d97452K13255O9062K02771K61483p2301J9113K912j46727k88862m1522J37716
$$ plain form
9543 97814 120364 164278 198971 252961 334226 498752 469268 318322 193388 286128 347120
9532 347120 210652 171756 100844 1927 -43744 45808 206891 273766 431248 637711 591614
9521 591614 541772 378366 150395 -62955 -45842 -38132 -115093 -210606 6398 83940 -106569
9510 -106569 -258120 -281128 -464281 -587429 -691866 -800810 -546369 -226046 -80535 -15266
9500 -15266 -153060 -335138 -197463 -1932 -72742 -39061 100586 295882 247157 33674
9490 33674 126775 180505 205867 661147 863970 628503 403407 281843 396077 549928
9480 549928 572310 552293 601959 539904 376218 162192 -174748 -435415 -539395 -530401 -497452
9469 -497452 -284197 -215135 -12364 249119 176818 195931 198843 52116 -236746 -278268 -140552
9458a40552j270m6614r7153J07877K25479P3139q3358n8657j25766j06218J61363
9447i1730K17264J14590m7671j75758j33450J37299J42388q7665M7213n3513j96916
9436a27949m79166l43830j7725J24685K62899L35340J31669j9524n5934j19516
9426c09051J33804J74813O1081P9231q569o9862r1245j61681K957J84011P2525
9415F8014j43509j34013j5449L6458j84438n4605K20151O6692J20952P0604j11880
9404f1023p4452N6651J27832K58898K4540l22606q8545L09856K21473R282j58335
9393C03571j93021q9170o5056j8225q5275j28996j18450j71912L0191K45955J24666
9382a65722j13999j78286L9000O9907P0087J47638J567L3931L3869K8639K96794
$$ plain form
9458 -140552 -141822 -188436 -285589 -177712 47767 120906 37548 -21109 -146875 -253093 -91730
9447 -91730 125534 240124 192453 16695 -116755 20544 162932 75267 122480 68967 -127949
9436 -127949 -607115 -950945 -968670 -843985 -581086 -245746 -114077 -133601 -189535 -309051
9426 -309051 -175247 -434 60647 139878 131309 61447 -29798 -191479 -188522 -4511 68014
9415 68014 -75495 -209508 -224957 -188499 -372937 -427542 -207391 -140699 -19747 50857 -61023
9404 -61023 -135475 -78824 49008 307906 332446 9840 -78705 231151 452624 461906 303571
9393 303571 110550 21380 -43676 -61901 -147176 -276172 -394622 -566534 -536343 -290388 -165722
9382 -165722 -279721 -458007 -419007 -349100 -279013 -131375 -129808 -95877 -62008 -33369 263425
9371B63425J87155j7772p2842j20289o0566O6773O944m5833j21145P2269J19217
9360B77336j23697j08810J30886J58983J43265K8378j19070m06770l44963J052
9350c63410J94787k231J27087K34152J15637K52610K45049J05390n4801p2260
9340G82010q8097m9681n7452o7002N8936r386j18554p0215O8826J6530j12239
9329C53676j98687m0112L2258l7621o9159k365M0947K1769j71980r2761q147P9173
9317i3009K58515M5848o2017O5401O9327K3537q4927R5403p3349K1313Q1286L8686
9305C86014j2794j87126j50388j5549L2276p7615l5452M1838J50578K73455j19199
9294B86038l91169j9664J92214J13024j1036j6179j4903R8380l278j40272O0341
$$ plain form
9371 263425 450580 432808 359966 239677 179111 245884 252828 206995 85850 158119 277336
9360 277336 153639 44829 175715 334698 477963 506341 387271 -19499 -364462 -363410
9350 -363410 -168623 -170854 -43767 190385 306022 558632 803681 909071 854270 782010
9340 782010 693913 644232 586780 519778 578714 569328 450774 380559 449385 465915 353676
9329 353676 154989 114877 147135 109514 40355 37990 78937 100706 -71274 -164035 -172182 -93009
9317 -93009 165506 211354 149337 214738 284065 307602 222675 318078 244729 266042 347328 386014
9305 386014 373220 186094 35706 20157 52433 -25182 -60634 -18796 131782 405237 286038
9294 286038 -105131 -124795 67419 180443 169407 153228 138325 236705 233427 93155 153496
9283A53496k7770p3862L409J74682R0044j01581k72433k53095K1881J14005M7305
9272a23919j25331J9702P2016p6926j21583k01314n4260L02844J34812j12982
9262b86941r232J32920N0271J29793K40219r567n8634o8769k69667j79171p025
9251c35803J54579J02750j19568r0997m4718Q0037L55872R5070j02784o8030o5560
9240c9152k1292r3448n2484R1069M7639j09711j07312J9408q017J10880K27336
9229F4916O878j30131k28537j24047J14905K38421K35144k4961k14926q0215P020
9218a35533L5558J1220j315Q2520Q3208j3604l6481o6405p1668J02832k3608p2423
9206a05699J05579Q833j7416J01963M905J5543O3610K9606j0279k39494k45046
$$ plain form
9283 153496 125726 51864 55273 229955 319999 218418 -54015 -307110 -285229 -171224 -123919
9272 -123919 -249250 -229548 -157532 -234458 -356041 -557355 -611615 -308771 -173959 -286941
9262 -286941 -296173 -163253 -112982 16811 257030 247463 188829 120060 -149607 -328778 -335803
9251 -335803 -181224 -78474 -198042 -289039 -333757 -253720 102152 197222 94438 26408 -39152
9240 -39152 -60444 -153892 -206376 -115307 -67668 -177379 -284691 -265283 -273300 -162420 64916
9229 64916 71794 -58337 -286874 -410921 -296016 -57595 177549 152588 -62338 -142553 -135533
9218 -135533 -99975 -88755 -90070 -7550 75658 62054 25573 -40832 -112500 -9668 -33276 -105699
9206 -105699 -120 8713 -8703 93260 98165 113708 177318 206924 196645 -42849 -287895
9195b87895k00407o7040P455J04073M18177M16783J58627j68341m74317m27292
9185e20177J04955L13957J22188p4002m9364K73252L20007J12238j0888j82348
9175D09818l01113j25629J33040K84500M2249r5869j34669k15619j19244M0803
9165h1733j60131k51480r1751J62403K49501k0390J0642J26555n3598o0654K35337
9154F4701K24557M9800N4191l8586n8396j16407l97559k67799Q5170L9290m4743
9143d05781j66662j23332O4896J51976N5439R0627P8458L0283J21852J57636K04848
9132B60240L3346k31498q3901l9926j27973O0330K10970N3191j68177k12923j17388
9121c63709K69021K21213j6515j17274j39431j2963M2043k8895k4999N135k7030
$$ plain form
9195 -287895 -488302 -555342 -547887 -443814 -25637 391146 549773 381432 -92885 -520177
9185 -520177 -415222 -101265 20923 -53079 -102443 170809 490816 603054 592166 409818
9175 409818 108705 -16924 116116 400616 442865 346996 212327 -3292 -122536 -81733
9165 -81733 -241864 -493344 -585095 -422692 -173191 -193581 -182939 -56384 -109982 -170636 64701
9154 64701 289258 339058 393249 354663 296267 179860 -217699 -485498 -400328 -361038 -405781
9143 -405781 -572443 -695775 -630879 -478903 -423464 -332837 -254379 -224096 -102244 55392 260240
9132 260240 293586 62088 -21813 -61739 -189712 -129382 81588 134779 -33398 -246321 -363709
9121 -363709 -94688 126525 110010 -7264 -146695 -159658 -117615 -146510 -171509 -166374 -193404
9110a93404Q6762J94462P1382J9700j1206J60160j05664k66856j38296M0225J11751
9099c0984Q5708j11946r2262J42097K50227N8691j34368k4008M601l8483j43820
9088c4547j99489K05980K60275J2813k93115l46566J23701K60842K79591Q3844
9078C53329n5838j79544J14249K12725m1392j53096j00412q1173r9056k3737r2016
9067a45961M1149k3142J2553P6705r1826K1350Q2950k12438j19887r5962o5842
9056e20351K73148L99384L66133R1028j64181n5530J75300K1904l70887k97477
9046h1529j57782n9968j62517J29592Q0155k8182N0225L6610o0096l3953J18319
9035a69126K00718J50998K21290P9651o8930L718j9467J0383k1308n5480m1953
$$ plain form
9110 -193404 -106642 87820 159202 178902 167696 327856 222192 -44664 -182960 -142735 -30984
9099 -30984 54724 -57222 -149484 -7387 242840 301531 167163 143155 147756 109273 -34547
9088 -34547 -234036 -28056 232219 245032 -48083 -394649 -270948 -10106 269485 353329
9078 353329 297491 117947 232196 444921 403529 250433 150021 68848 -30208 -53945 -145961
9067 -145961 -104812 -127954 -115401 -38696 -130522 -109172 -26222 -238660 -358547 -454509 -520351
9056 -520351 -247203 152181 518314 609342 445161 389631 564931 586835 215948 -81529
9046 -81529 -239311 -299279 -461796 -332204 -252049 -280231 -230006 -193396 -253492 -287445 -169126
9035 -169126 31592 182590 403880 483531 414601 418319 398852 409235 387927 332447 290494
9024B90494j56664l2158P4963J4032j14778j64304j64952J9041K97135J97120
9014B59929j15572L6806Q3958p3716k95276k00527m8172k62990k25189J18378
9004g22371L11961J35561O7602P7484r7514K7711K30548M1604p18j1023K9538
8993I0383J08169K05870J50378n0249j37067j89667j94673N9373J78674R5461
8983C16652m3014o9280j07719J877j48786l11304Q9177K49374J020J60370J33229
8972B71596P7150N8647r8598j03257j65699j88765p8220Q6811Q1393o8098Q1455
8961d5585K96896J21896j87547k37180j41314O3234J6001m4787J3892R3162o8634
8950a19966K0336K1579j23342m5511j0771j5753R2117k958N2712J91284n737r768
$$ plain form
9024 290494 133830 101672 176635 190667 75889 -88415 -253367 -234326 62809 259929
9014 259929 144357 181163 265121 191405 -103871 -304398 -352570 -615560 -840749 -722371
9004 -722371 -410410 -274849 -207247 -129763 -227277 -199566 30982 72586 71868 60845 90383
8993 90383 198552 404422 554800 504551 367484 177817 -16856 42517 221191 316652
8983 316652 273638 204358 96639 98516 -50270 -361574 -272397 -23023 -22003 138367 271596
8972 271596 348746 407393 308795 205538 39839 -148926 -227146 -140335 -58942 -127040 -45585
8961 -45585 251311 373207 185660 -51520 -192834 -129600 -113599 -158386 -144494 -51332 -119966
8950 -119966 -99630 -78051 -201393 -246904 -257675 -273428 -181311 -184269 -131557 59727 53990 44222
8938D4222p4343j12105P4050M1549j2573J09501N5959J6451N4826J04345j44688
8927A57194j98812r9372q5564r1011j40375J70684K97757J61190l3632O870J41054
8916B85983k6852j76037j05873j14244O1642N5060M295o2873j10296J442P0920
8905a16833M9492K18013K75524r5471k38287l2641J04794j84798p9275K53317
8895A53835K15920J1292j60513o3495O7223q2767O8883J93010J54161r8359K9620
8884D88810J70110j74344j77338k52194k23795j78476O478J53971J76664k9733
8874c9847n7410P125k00021j03503J87950K16854K63680j1407l89581l99398J6673
8863e08885J38896M1455J61405J99193J03985r768n3562J4537q5739j4008L37014
$$ plain form
8938 44222 -30121 -142226 -68176 -26627 -39200 70301 126260 142711 197537 301882 157194
8927 157194 -41618 -140990 -226554 -317565 -457940 -287256 10501 171691 138059 144929 285983
8916 285983 259131 83094 -22779 -137023 -75381 -20321 -16026 -78899 -189195 -187753 -116833
8905 -116833 -67341 150672 426196 330725 92438 59797 164591 -20207 -99482 153835
8895 153835 369755 381047 220534 157039 224262 141495 210378 403388 557549 459190 488810
8884 488810 658920 484576 307238 55044 -168751 -347227 -340749 -186778 -10114 -39847
8874 -39847 -97257 -90132 -290153 -393656 -205706 11148 274828 263421 -126160 -525558 -508885
8863 -508885 -369989 -328534 -167129 32064 136049 126281 72719 87256 1517 -12491 324523
8852C24523L26734j12612k85780j05041Q841p4196N7045P496p1163k30075j35179
8841b89407Q2657J55917J24644k8389n6527j30381j04373J21403K42795K23393
8831C41732K73384J2245j35489q8633j8675L2486M3663j20948j68048j92247n7733
8820g8263r9684q5236J29611K79421J71212J12387M0429J04430O1395Q4800n506
8809G14996j38700P3222P7715N4178L5277j0418j67343j34153p7830j18655k06549
8798A01740k61948o6288j55008j90828k25722k9803K99164L37585K39281K06291
8788B54464R1366r4190j92932m56885k61335L3418M95k6330J51622K79294P3233
8777a47780k5588J24374N0524j41174q2908O0335J64697L77790L37474l4405r7367
$$ plain form
8852 324523 651257 538645 252865 147824 156665 82469 139514 147010 75847 -154228 -289407
8841 -289407 -206750 -50833 73811 45422 -11105 -141486 -245859 -124456 118339 341732
8831 341732 615116 627361 491872 403239 384564 417050 460713 339765 171717 -20530 -78263
8820 -78263 -177947 -263183 -133572 145849 317061 429448 469877 574307 635702 720502 714996
8809 714996 576296 649518 727233 781411 816688 806270 638927 504774 426944 308289 101740
8798 101740 -160208 -226496 -381504 -572332 -798054 -827857 -528693 -191108 48173 254464
8788 254464 345830 251640 58708 -398177 -659512 -626094 -625599 -651929 -500307 -221013 -147780
8777 -147780 -173368 -48994 1530 -139644 -222552 -162217 2480 380270 717744 683339 585972
8766E85972Q2757k854j5268k9794p0981k26953j17712r8075r4954L26196R2479
8755D30813j55995o0634J03657r907l22517j99176L7987J6661Q8166K16561J78330
8744C23946M7702M8112R8241l0717J14851L4782o1517r984j39389j28485o9189
8733B28353Q4544K58909J0157k26388K6407J72977j44043l00773j60379j735j7756
8722f9727J69867K57945q121n8628j65417r5144j61388j11587J58693K58847J52175
8711C27515J70697J30714j41560j19175p7254L2933L2445j14065j23138q7388
8701C1724l7400K08982K36063j62481k76710k75337K6741K18896j16548k53414
8691c99484q3487J95938J48838L799J4111Q2349o9294k69391j39200J82112J80523
$$ plain form
8766 585972 668729 665875 650607 620813 549832 322879 205167 107092 12138 338334 430813
8755 430813 274818 214184 317841 307934 -14583 -213759 -175772 -159111 -70945 145616 323946
8744 323946 371648 419760 518001 487284 602135 636917 575400 565416 426027 297542 228353
8733 228353 312897 571806 581963 355575 381982 554959 410916 110143 -50236 -51971 -69727
8722 -69727 100140 358085 349964 291336 125919 30775 -130613 -242200 -83507 175340 327515
8711 327515 498212 628926 487366 368191 290937 323870 356315 242250 119112 31724
8701 31724 -5676 203306 439369 276888 178 -275159 -248418 -29522 -146070 -399484
8691 -399484 -482971 -287033 -138195 -134396 -120285 -37936 -107230 -376621 -515821 -333709 -153186
8680a53186N5021J23654J23574L5980m0084j23678k25635j87742p9378K24474
8670b47000J45904k72062j57213r8207J9098K32758J66644R7562L3260J10021
8660C0765J33953J18211r7344k31559k8982K07020J52260J16517n6197k11436
8650A33208k67250j09163N1738R3969J25395n2050j57707l6972R4321K19527L8191
8639A33207j48850M012K10489J63521r4085m43946k73813O1550K13042K09615
8629C4742K1783J11293K06341O2261P154o4887k26885j63046K15616J08253n5546
8618B57079k84488k11535n2977P0750K13369K44861J84207k08223j72070R237
8608E0210j4072l2410k30725k11756J53610R6224J48657J62644J14214J94004
$$ plain form
8680 -153186 -98165 25489 149063 185043 144959 21281 -204354 -392096 -471474 -247000
8670 -247000 -101096 -373158 -530371 -628578 -609480 -376722 -210078 -112516 -79256 30765
8660 30765 164718 282929 185585 -45974 -74956 132064 284324 400841 344644 133208
8650 133208 -134042 -243205 -191467 -97498 27897 -24153 -181860 -218832 -124511 95016 133207
8639 133207 -15643 -11631 198858 362379 268294 -175652 -449465 -387915 -174873 34742
8629 34742 56525 167818 374159 436420 443574 378687 151802 -11244 204372 312625 257079
8618 257079 -27409 -238944 -291921 -221171 -7802 237059 421266 213043 40973 50210
8608 50210 36138 3728 -226997 -438753 -285143 -188919 -40262 122382 236596 430600
8598D30600L8551j31738k0618k69163j59487J39092N6483q4596k50302r1873K10177
8587a32874R6320n5466p2945K091J56581Q5183j29791k07578j39581o4095M4585
8576d17570R7429j26810j16210n1088O0672R1463J03652q5385j86065m6411K12800
8565d63523P8990N6540J42557O2599J92523J15439k12230n8301J15319R51J26790
8554A57654R4401K3402l2642l3819j31036q9202n5995m1898K4394N5808M806r7831
8542a21958m860J93052J34778m6902J4807K13398J95286j26495j71707o7334n1978
8531A60087q7667j74997o1208k5340j54652N7756K29948M1739J6827M2609m5000
8520A02l11381k79138J1006J27051J12677l6169K012J68249O1111J44122K86890
$$ plain form
8598 430600 469151 337413 316795 47632 -111855 27237 83720 -876 -251178 -343051 -132874
8587 -132874 -36554 -92020 -164965 -162874 -6293 78890 -50901 -258479 -398060 -462155 -417570
8576 -417570 -320141 -446951 -563161 -614249 -553577 -462114 -358462 -443847 -629912 -676323 -463523
8565 -463523 -384533 -327993 -185436 -122837 69686 185125 -27105 -85406 29913 30864 157654
8554 157654 252055 275457 242815 208996 77960 -11242 -67237 -109135 -84741 -28933 -24127 -121958
8542 -121958 -126818 66234 201012 154110 168917 382315 577601 451106 279399 212065 160087
8531 160087 72420 -102577 -163785 -189125 -343777 -286021 -56073 -14334 2493 45102 102
8520 102 -311279 -590417 -579411 -452360 -339683 -375852 -373840 -205591 -144480 -358 286532
8509B86532M8113p2665M9268J12798J39003p3046k15653k78342l00290j2050J34245
8498a82087l1204o6116o8484J423n777j30474n330J69277J94023K36255J95841
8487C07347l0872k07770k47706j76426k66090N8470L57756J10462J32396L10631
8477C48198J56818j27148j37788j48724j1867J23505j20491k09003j56590l3308
8467c16398O131j34667R4213K42810o6237p6440J80943L31383J28260k00686o8717
8456A20595J631l3696n1791k6717Q0534J59130M6297J2555R7075L9560n849L3156
8444D72480J11442J5508P9822k0311q8612Q8126j72387k45280p4092j51516k54090
8433b38910k15793J0447O1515J2664J17093N014k82142k49070j8988J57244j722
$$ plain form
8509 286532 334645 261980 311248 424046 563049 490003 274350 -3992 -304282 -316332 -182087
8498 -182087 -213291 -279407 -347891 -346468 -352245 -482719 -488049 -318772 -124749 111506 307347
8487 307347 276475 68705 -179001 -355427 -621517 -563047 -205291 -94829 37567 348198
8477 348198 505016 377868 240080 91356 79489 202994 82503 -126500 -283090 -316398
8467 -316398 -310267 -444934 -350721 -107911 -174148 -250588 -69645 261738 389998 189312 120595
8456 120595 122226 88530 36739 10022 90556 249686 295983 308538 405613 445173 439324 472480
8444 472480 583922 599430 679252 658941 570329 658455 486068 240788 166696 15180 -238910
8433 -238910 -454703 -444256 -382741 -370077 -252984 -247970 -530112 -779182 -798170 -640926 -642648
8422f42648L4791P1540J67857L00427M9662j17407l0762n3322n441N5593j33968
8411c03678j06186Q3189J23996n3358j36073n4167J57364K30941J12219J91690
8401B45937N1882l5105j20237k08980K5603K03975R7409o7447j47672M501R6872
8390A46738R7808K649l2830l8688j4495j73062j69856O780j1813N462K6921J9735
8378a34651l2552j41632j74753j2838L5750j48496n0364K56343N6064Q1005J41929
8367a24195J55169K99321J28259j58213k65482j09676m727J49942n4734j12749
8357i7085Q2553J30927p095m6101j46459k17196o2875J17006q3597j11004K06101
8346b34825J66772R4544j34107r8583K96045L57947P650j36461j78559j99115
$$ plain form
8422 -642648 -607857 -536317 -368460 -68033 -18371 -135778 -166540 -219862 -225303 -169710 -303678
8411 -303678 -409864 -326675 -202679 -256037 -392110 -446277 -288913 -57972 54247 245937
8401 245937 297819 262714 142477 -66503 -40900 163075 260484 193037 45365 49866 146738
8390 146738 244546 247195 214365 175677 161182 -11880 -181736 -174956 -186769 -181307 -154386 -134651
8378 -134651 -167203 -308835 -483588 -496426 -460676 -609172 -659536 -403193 -347129 -266124 -124195
8367 -124195 30974 330295 458554 300341 34859 -74817 -79544 70398 15664 -97085
8357 -97085 -14532 116395 109300 63199 -83260 -300456 -363331 -246325 -329922 -440926 -234825
8346 -234825 -68053 26491 -107616 -206199 89846 447793 455443 318982 140423 -58692
8336e8692j96571o479O6478M8412j74580j80439J2463k8095r9618j14030m1501
8325g72652j01874O6822L45297L16431P0291q8570q0226o146l4055P6819K58946
8314E1083J03502N8253Q3269j94010k59392K1107J14015L6043J64587K01937L4997
8303D15391n8990j07315r1986j40320k14716p7713J12462m7341L0642j03319j55110
8292d38315o1376K0958j7587K5344L0495J07380J47780K22084J08881J93836J67545
8281E07025L6840k09388k20848k7434q2266L1366N1711j05397n3837j4389j0193
8270i6810L9025O871P0353J98422L34266J26435j36560Q6095K96885J57319j78912
8259I03389j43459j68542k0369m7515r7578p339O2447J46072M242j70147l52190
$$ plain form
8336 -58692 -255263 -261742 -195264 -146852 -321432 -501871 -489408 -517503 -617121 -731151 -772652
8325 -772652 -874526 -807704 -462407 -145976 -75685 -164255 -244481 -250627 -284682 -207863 51083
8314 51083 154585 212838 296107 102097 -157295 -136188 -22173 13870 178457 380394 415391
8303 415391 356401 249086 157100 16780 -197936 -275649 -163187 -210528 -179886 -283205 -438315
8292 -438315 -499691 -478733 -496320 -470976 -440481 -333101 -185321 36763 145644 339480 507025
8281 507025 543865 334477 113629 86195 3929 35295 87006 -18391 -72228 -86617 -96810
8270 -96810 -57785 -50914 19439 217861 552127 678562 542002 628097 924982 1082301 903389
8259 903389 759930 591388 571019 523504 425926 418587 481034 627106 631348 461201 109011
8248A09011l77887j16684j5373J5835K10391K60256R5238J22763J89881O7057
8238E60488k04047k55269l8315M8272m4402k9867L9961O1465m1332j95484j87488
8227b86018j10916J44433J03561J85122N2876J21667R7303M9572j25130k74444
8217d1974j12578j4245k789N4140j61832q5762J69159K19758K14502r1739m29045
8206b82405j98670J41578J88155j07232m434J18644q6674m3086L23724J67222
8196B16822M3932J09317P1651O6922j97933o3134J95758o7009j97733r0389K8697
8185A16901k40610k18385Q4109P0175R2094M8633n5949N6759R6192n8142j83582
8174a91805j47641r6292P3523J71940R9917l5940j24620k38969j24375J45055
$$ plain form
8248 109011 -268876 -385560 -400933 -385098 -174707 85549 180787 303550 493431 560488
8238 560488 356441 101172 62857 111129 66727 36860 76821 138286 96954 -98530 -286018
8227 -286018 -396934 -252501 -148940 36182 89058 210725 308028 357600 232470 -41974
8217 -41974 -154552 -168797 -171586 -117446 -279278 -365040 -195881 23877 238379 146640 -282405
8206 -282405 -481075 -339497 -151342 -258574 -263008 -144364 -231038 -274124 49600 216822
8196 216822 260754 370071 441722 508644 310711 247577 443335 376326 178593 88204 116901
8185 116901 -123709 -342094 -257985 -187810 -95716 -47083 -103032 -46273 49919 -8223 -191805
8174 -191805 -339446 -435738 -362215 -190275 -90358 -126298 -250918 -489887 -614262 -469207
8164d69207K3308J81759J22873J35192L02450O4716j25441j71350R4396K88862
8154D47558L01415J31798k41421l71790j96189j56035j34203J6187K47262P7778
8144A22360p1212k882l9506K0533J1864M8039J33289J7776j39332R9143K16879
8133D16951J18849j2401j18598k62979k27987j93519r8429L93160K36430m4095
8123B07382k19991k84798j80913J52518L26301J50790O0093K17013J52939j1076
8113E70258j93534j21741o7530r3866M3408Q3352K8424J20523J57034j02737j9118
8102D04473M9685K00396J49048q7359j57260J05763N6992l00284l06284r9453
8092A5717j15371r5002J5232O8470j68587j85660n6614K37551J08225O1741K13425
$$ plain form
8164 -469207 -445899 -264140 -141267 -6075 296375 361091 235650 64300 158696 447558
8154 447558 748973 880771 639350 267560 71371 -84664 -218867 -202680 44582 122360
8144 122360 51148 48266 8760 29293 41157 89196 222485 240261 100929 200072 416951
8133 416951 535800 523399 404801 141822 -86165 -279684 -378113 15047 251477 207382
8123 207382 -12609 -297407 -478320 -325802 499 151289 211382 428395 581334 570258
8113 570258 376724 254983 187453 93587 136995 220347 248771 369294 526328 423591 404473
8102 404473 454158 654554 803602 716243 558983 664746 721738 421454 115170 15717
8092 15717 -99654 -194656 -179424 -110954 -279541 -465201 -521815 -284264 -176039 -114298 99127
8081I9127K83103J6878j74483j6727J01314J20063k8250j72584j96337J28838
8071A60942N6858p9845j40665r3723K8067J10979J8210k456j46962k98769M5456
8060c41908J16335N3059n0712m4680J41799J23618q1494k93827l22012J12936
8050e86886L39298J74413p5012j03923r882q3125J70120J72623k67492j68145
8040d38011K8518L30629M59031J15786J57387L4333k07968m27008j57164J44091
8030C9624k51150j80301J97463J59419p5264j82752P0629n458L8057J25960J14438
8019E0665M1430P1772J52127K5337j27586j4727N1188j7877j22294j19890o8804
8008g8659j33528M8786K06623K1744M1404p6593j04130q0776J8892L2208M7620
$$ plain form
8081 99127 382230 399108 224625 207898 309212 429275 401025 228441 32104 160942
8071 160942 217800 137955 -2710 -96433 -68366 42613 60823 58367 -88595 -387364 -341908
8060 -341908 -225573 -172514 -223226 -267906 -126107 -2489 -83983 -377810 -699822 -586886
8050 -586886 -247588 -73175 -148187 -252110 -261992 -345117 -174997 -2374 -269866 -438011
8040 -438011 -409493 -78864 380167 495953 653340 687673 479705 52697 -104467 39624
8030 39624 -211526 -391827 -194364 -34945 -110209 -292961 -222332 -227790 -189733 -63773 50665
8019 50665 92095 163867 315994 341331 213745 199018 250206 232329 110035 -9855 -78659
8008 -78659 -212187 -163401 43222 64966 106370 29777 -74353 -155129 -136237 -104029 -56409
7997e6409r2242j42940n4047j06654J52621L00902N1597q4522K3150r5209j27496
7986b31249k8841J26316K15083L3242L272j5036j42596O5613K1120l66037l31492
7975f50605O2396J08292j7686m6007N7893J65702O0423j86498r1078J49046L21214
7964f6908J31689K30458J30505j3973j2997m1539j61158j21070n791j44841k03270
7953b78895Q4219L03109R0562O7580J19512J1817j20005q9456M5774j8586m399
7942B11232j72361k41274k0713J17389m9733j75117J22675K35422j7258m7351
7932c7089n4172j61834k2594l4249k03212n0761R5325K09938J82611O9344R7012
7921I0319R2041j43254k21489j05401J79614J17970j23611m9637l2810q5920J8229
$$ plain form
7997 -56409 -148651 -291591 -345638 -452292 -299671 1231 52828 -31694 -8544 -103753 -231249
7986 -231249 -260090 -133774 81309 114551 117823 102787 -39809 25804 46924 -319113 -650605
7975 -650605 -588209 -479917 -497603 -543610 -485717 -320015 -259592 -446090 -537168 -388122 -66908
7964 -66908 64781 295239 425744 411771 398774 357235 196077 75007 69216 -75625 -278895
7953 -278895 -194676 108433 198995 266575 386087 397904 277899 188443 234217 215631 211232
7942 211232 38871 -202403 -223116 -105727 -155460 -330577 -207902 27520 10262 -37089
7932 -37089 -91261 -253095 -275689 -309938 -513150 -563911 -468586 -258648 -76037 -6693 90319
7921 90319 182360 39106 -182383 -287784 -108170 9800 -113811 -163448 -196258 -282178 -263949
7910b63949j8483K35042J92196j97554j83716k6744K1044K0946Q3750K79903J83334
7899C25769r319m3920n9953M3164l2775J45295J82196j10149k30204P93J74198
7888C85095J54034L26448M0520l31069j92277j14037j72983k56801k19029j30846
7878e10945O7345N4575K13821J56726J36649K82422J0588j35124J012o7800p1849
7867A37420J62890M9478k83725k75202K644K23778j8376n5539Q6365K07794R8389
7856C35916n8379m2714r6317J68976P1110j52017k76913j51959M5823o0849k05367
7845d22690k01760o7432J49841K20007r8252j2281J87000L2136L0978R889R0192
$$ plain form
7910 -263949 -282432 -47390 144806 -52748 -236464 -263208 -242164 -221218 -137468 142435 325769
7899 325769 316450 272530 212577 255741 222966 368261 550457 440308 210104 210897 385095
7888 385095 539129 865577 906097 575028 382751 268714 95731 -161070 -380099 -510945
7878 -510945 -443600 -389025 -175204 -18478 118171 400593 411181 276057 277069 209269 137420
7867 137420 300310 349788 66063 -209139 -206495 17283 -1093 -56632 29733 237527 335916
7856 335916 277537 234823 138506 307482 378592 226575 -50338 -202297 -156474 -217323 -422690
7845 -422690 -624450 -691882 -542041 -322034 -420286 -432567 -245567 -213431 -182453 -172564 -82372
$$ [...]
##END NTUPLES=NMR SPECTRUM
##END=
