##TITLE=C13_TBC2702
 CDCl3, 1700 sc

 3.3.2020
##JCAMPDX= 6.0         $$ Bruker NMR JCAMP-DX V2.0
##DATA TYPE= NMR SPECTRUM
##DATA CLASS= NTUPLES
##ORIGIN= UXNMR, Bruker Analytische Messtechnik GmbH
##OWNER= root
$$ XWIN-NMR		Version 3.5
$$ Tue Mar  3 16:32:14 2020 Russian Standard Time (UT+4h)  she@DPX200
##.OBSERVE FREQUENCY= 50.327896
##.OBSERVE NUCLEUS= ^13C
##.ACQUISITION MODE= SIMULTANEOUS
##.ACQUISITION SCHEME= undefined
##.AVERAGES= 1700
##.DIGITISER RES= 17
##SPECTROMETER/DATA SYSTEM= spect
##.PULSE SEQUENCE= zgpg30
##.SOLVENT NAME= D2O
##.SHIFT REFERENCE= (INTERNAL, D2O, 0, 222.624)
##AUDIT TRAIL= $$ (NUMBER, WHEN, WHO, WHERE, WHAT)
$$ ##TITLE= Audit trail, XWIN-NMR		Version 3.5
$$ ##JCAMPDX= 5.01
$$ ##ORIGIN= Bruker BioSpin GmbH
$$ ##OWNER= she
$$ F:/spectra/data/she/nmr/c13/1/pdata/1/auditp.txt
$$ ##AUDIT TRAIL=  $$ (NUMBER, WHEN, WHO, WHERE, WHAT)
(   1,<2020-03-03 16:31:07.60 +0400>,<she>,<DPX200>,
      <created by zg, POWCHK disabled, PULCHK disabled
       terminated by command 'halt'
       configuration hash MD5:
       00 E9 B6 7A A2 85 ED C7 34 08 36 98 17 FE 4E 26
       data hash MD5: 32K
       56 36 DE 5C 02 CF EA DC AB AD C5 FD F4 43 E7 F0>)
(   2,<2020-03-03 16:31:10.03 +0400>,<she>,<DPX200>,
      <Start of raw data processing
       efp BC_mod = 2 LB = 1 FT_mod = 6 PKNL = 1 PHC0 = -224.6615 PHC1 = 26.00638 SI = 32K 
       data hash MD5: 32K
       99 58 5A A3 C8 FB 7F 70 D3 EB 47 68 30 AC DF AB>)
(   3,<2020-03-03 16:31:12.82 +0400>,<she>,<DPX200>,
      <abs ABSG = 5 
       data hash MD5: 32K
       49 93 5D 15 4B CE 63 3A 37 97 9E E5 3D A0 DE 4F>)
(   4,<2020-03-03 16:31:37.14 +0400>,<she>,<DPX200>,
      <pk PHC0 = 1.094088 PHC1 = 0 
       data hash MD5: 32K
       1D 40 C4 D6 BA 1D 87 60 11 30 80 B6 77 0C 33 E8>)
(   5,<2020-03-03 16:31:41.57 +0400>,<she>,<DPX200>,
      <abs ABSG = 5 
       data hash MD5: 32K
       C3 54 F8 88 37 D8 46 84 3D 1D B0 B4 4F 44 B7 2D>)
$$ ##END=
$$ 
$$ hash MD5
$$ 7A AE 1D 11 AC F1 F7 E1 45 C8 BB 07 BB 13 AC 6C
##$RELAX= 
##$RELAX= 
##$RELAX= 
##$RELAX= 
##$RELAX= 
##$RELAX= 
##$RELAX= 
##$RELAX= 
$$ Bruker specific parameters
$$ --------------------------
##$DU= <F:/spectra>
##$EXPNO= 1
##$NAME= <c13>
##$PROCNO= 1
##$TYPE= <nmr>
##$USER= <she>
##$AMP= (0..31)
100 100 100 100 100 100 100 100 100 100 100 100 100 100 100 100 100 100 
100 100 100 100 100 100 100 100 100 100 100 100 100 100 
##$AQSEQ= 0
##$AQ_mod= 1
##$AUNM= <au_zg>
##$AUTOPOS= <>
##$BF1= 50.322709
##$BF2= 200.13
##$BF3= 50.322709
##$BF4= 500.13
##$BF5= 500.13
##$BF6= 500.13
##$BF7= 500.13
##$BF8= 500.13
##$BYTORDA= 1
##$CFDGTYP= 0
##$CFRGTYP= 5
##$CHEMSTR= <none>
##$CNST= (0..31)
1 1 145 1 1 1 1 1 1 1 1 1 1 1 1 1 1 1 1 1 1 1 1 1 1 1 1 1 1 1 1 1 
##$CPDPRG= <waltz16>
##$CPDPRG1= <>
##$CPDPRG2= <waltz16>
##$CPDPRG3= <>
##$CPDPRG4= <mlev>
##$CPDPRG5= <mlev>
##$CPDPRG6= <mlev>
##$CPDPRG7= <mlev>
##$CPDPRG8= <mlev>
##$CPDPRGB= <>
##$CPDPRGT= <>
##$D= (0..31)
$$ [...]
##$SUBNAM4= <"">
##$SUBNAM5= <"">
##$SUBNAM6= <"">
##$SUBNAM7= <"">
##$SUBNAM8= <"">
##$SUBNAM9= <"">
##$SW= 239.972175391363
##$SWIBOX= (0..15)
0 1 3 0 0 0 0 0 0 0 0 0 0 0 0 0 
##$SW_h= 12077.2946859903
##$TD= 32768
##$TD0= 1
##$TE= 0
##$TE2= 300
##$TE3= 300
##$TEG= 300
##$TL= (0..7)
120 120 120 120 120 120 120 120 
##$TP= (0..7)
150 150 150 150 150 150 150 150 
##$TP07= 0
##$TPNAME0= <>
##$TPNAME1= <>
##$TPNAME2= <>
##$TPNAME3= <>
##$TPNAME4= <>
##$TPNAME5= <>
##$TPNAME6= <>
##$TPNAME7= <>
##$TPOAL= (0..7)
0.5 0.5 0.5 0.5 0.5 0.5 0.5 0.5 
##$TPOFFS= (0..7)
0 0 0 0 0 0 0 0 
##$TUNHIN= 0
##$TUNHOUT= 0
##$TUNXOUT= 0
##$USERA1= <user>
##$USERA2= <user>
##$USERA3= <user>
##$USERA4= <user>
##$USERA5= <user>
##$V9= 5
##$VALIST= <valist>
##$VCLIST= <CCCCCCCCCCCCCCC>
##$VD= 0
##$VDLIST= <DDDDDDDDDDDDDDD>
##$VPLIST= <PPPPPPPPPPPPPPP>
##$VTLIST= <TTTTTTTTTTTTTTT>
##$WBST= 1024
##$WBSW= 4
##$XGAIN= (0..3)
0 0 0 0 
##$XL= 0
##$YL= 0
##$YMAX_a= 2876513
##$YMIN_a= -11318888
##$ZGOPTNS= <>
##$ZL1= 120
##$ZL2= 120
##$ZL3= 120
##$ZL4= 120
##$ABSF1= 222.624
##$ABSF2= -17.3728
##$ABSG= 5
##$ABSL= 3
##$ALPHA= 0
##$AQORDER= 0
##$ASSFAC= 0
##$ASSFACI= 0
##$ASSFACX= 0
##$ASSWID= 0
##$AUNMP= <proc_1d>
##$AZFE= 0.1
##$AZFW= 0.5
##$BCFW= 0
##$BC_mod= 2
##$BYTORDP= 0
##$COROFFS= 0
##$CY= -3
##$DATMOD= 1
##$DC= 0
##$DFILT= <>
##$DTYPP= 0
##$F1P= 0
##$F2P= 0
##$FCOR= 0.5
##$FTSIZE= 32768
##$FT_mod= 6
##$GAMMA= 0
##$GB= 0
##$INTBC= 1
##$INTSCL= 4.134877e-10
##$ISEN= 128
##$LB= 1
##$LEV0= 0
##$LPBIN= 0
##$MAXI= 10000
##$MC2= 0
##$MEAN= 0
##$ME_mod= 0
##$MI= 0.1934396
##$NCOEF= 0
##$NC_proc= 1
##$NLEV= 6
##$NOISF1= 120.0001
##$NOISF2= 80.00006
##$NSP= 0
##$NTH_PI= 0
##$NZP= 0
##$OFFSET= 222.624
##$PC= 1.4
##$PHC0= -223.5674
##$PHC1= 26.00638
##$PH_mod= 1
##$PKNL= yes
##$PPARMOD= 0
##$PSCAL= 0
##$PSIGN= 0
##$REVERSE= no
##$SF= 50.3227315989248
##$SI= 32768
##$SIGF1= 140
##$SIGF2= 120
##$SINO= 11.81781
##$SIOLD= 32768
##$SREGLST= <13C.CDCl3>
##$SSB= 0
##$STSI= 32768
##$STSR= 0
##$SW_p= 12077.2946859903
##$SYMM= 0
##$S_DEV= 0
##$TDeff= 32768
##$TDoff= 0
##$TI= <>
##$TILT= no
##$TM1= 0
##$TM2= 0
##$TOPLEV= 0
##$USERP1= <user>
##$USERP2= <user>
##$USERP3= <user>
##$USERP4= <user>
##$USERP5= <user>
##$WDW= 1
##$XDIM= 32768
##$YMAX_p= 314932825
##$YMIN_p= -1901753
$$ End of Bruker specific parameters
$$ ---------------------------------
##NTUPLES= NMR SPECTRUM
##VAR_NAME=  FREQUENCY,     SPECTRUM/REAL,   SPECTRUM/IMAG
##SYMBOL=    X,             R,               I
##VAR_TYPE=  INDEPENDENT,   DEPENDENT,       DEPENDENT
##VAR_FORM=  AFFN,          ASDF,            ASDF
##VAR_DIM=   32768,         32768,           32768
##UNITS=     HZ,            ARBITRARY UNITS, ARBITRARY UNITS
##FACTOR=    0.368581032318806, 1,           1
##FIRST=     11203.0474431902, 0,            0
##LAST=      -874.247242800138, 0,           0
##MIN=       -874.247242800138, -1901753,    0
##MAX=       11203.0474431902, 314932825,    0
$$ Real data points
##PAGE= N=1
##DATA TABLE= (X++(R..R)), XYDATA
$$ [...]
9362E40868O0237P2840j82920l65230j10920R7335L37623Q1813j79950l0473N7072
9351C78295q0661k13722j83121k9572J92372J95577m9900J57015K25696O1154
9341F53133l87105l44296J09358J26550Q441l4395q495r8701p4440j4008p3179
9330a37137j90508j74549j27132j26959p0852k4562N1364K03399L6465m7145J3694
9319e93922J29925J57844R9943J55908r5077r4657K698J83439J57405P7647J09481
9308B90634K7776j72716p2578K1430J11458j98357k69670n1591k22355r3023J67952
9297d61040L50495Q9748k6292J11169M8603q4889j49336k68011k00357J09256
9287d80654J85181k18223l87261j14441J61992M9863j7990J70182K72223J56162
$$ y = [540868, 601105, 673945, 491025, 125795, 14875, 112210, 449833, 531646, 351696, 321223, 378295, 297634, 83912, -99209, -128781, 63591, 259168, 209268, 366283, 591979, 653133, 266028, -78268, 31090, 157640, 166081, 131686, 123191, 24490, -49950, -63958, -137137, -327645, -502194, -629326, -756285, -827137, -851699, -800335, -596936, -560471, -607616, -593922, -463997, -306153, -206210, -50302, -145379, -240036, -237338, -53899, 103506, 181153, 290634, 318410, 145694, 73116, 94546, 206004, 7647, -262023, -313614, -535969, -628992, -461040, -110545, -20797, -47089, 64080, 112683, 27794, -121542, -389553, -589910, -480654, -295473, -513696, -900957, -1015398, -853406, -803543, -821533, -651351, -379128, -222966]
9277b22966K1156R1045k9039j42726n6253j1457P032P0114j92709j30107K22493
9266c73417K71085R9957o5126k11553j345L32766J88070J29749J80618o7463j82809
9255C00532k27942r8343k657J12502Q9965j4908L23595K88850J35433J57857j70325
9244H94559k32475k15666j27497J55597J54657j5521r8966k30766j77535O3039
9234A69426J11258k1275j6460J03917M0945k68087k09977p8242k01714r5510k591
9223d68310J11306L18542L32420K845l17198Q789N4493k58499j46881Q756P4806
9212b78931J32076J82420J44900m9172k57759k21459p7254Q6419J43190J06066
9202h9504O9595j3368j55451J2904K647l8255J03423J47747L23577J16935m17763
$$ y = [-222966, -201810, -110765, -139804, -282530, -338783, -350240, -343208, -273094, -465803, -595910, -373417, -102332, -2375, -67501, -279054, -280399, 52367, 240437, 370186, 550804, 483341, 300532, 72590, -25753, -28410, 84092, 174057, 159149, 482744, 771594, 907027, 1064884, 894559, 662084, 446418, 318921, 474518, 629175, 613654, 514688, 283922, 106387, 169426, 280684, 259409, 242949, 346866, 387811, 119724, -90253, -168495, -370209, -465719, -468310, -357004, -38462, 293958, 296803, -20395, -11606, 42887, -215612, -362493, -353737, -278931, -146855, 35565, 180465, 131293, -126466, -347925, -425179, -338760, -195570, -89504, -19909, -33277, -188728, -175824, -173177, -211432, -108009, 39738, 363315, 480250, 62487]
9191F2487k44864L9551L1969k0998O6047K63561R3086o7546j0287k59105l50360
9180c96459j00742K89544J70892p361q7532K6259J9995p6907l0086o0182o9013
9169c21592p3506J60587m7713J5749J68761j64755k00619J6060J0882K5797j64763
9158e75112j16874K66514M16680K06511r1595p4545K7315j5406J05609J43733
9148B92830r6636m5094J6807j48392j06035R4497N1488P8239o5420j42267j87190
9137b57173k2369P0612j55958j15332p2445K25293J96871j84881k42678O7823
9127d90237L51741K46640M6382j50120L5922K32020j29082j62970J73023J62277
9117C15596j14643j60703j94813k24465J98789M21174J98916j10123Q2788j508
$$ y = [62487, -182377, -142826, -110857, -131855, -65808, 197753, 290839, 223293, 213006, -46099, -396459, -497201, -207657, -36765, -44126, -131658, -105399, -85404, -162311, -192397, -252579, -321592, -395098, -234511, -282224, -266475, -97714, -262469, -463088, -447028, -436146, -410349, -575112, -691986, -425472, -8792, 197719, 106124, 31579, 58894, 43488, 149097, 292830, 196194, 151100, 167907, 19515, -86520, 7977, 59465, 137704, 72284, -69983, -257173, -279542, -208930, -364888, -480220, -552665, -327372, -130501, -315382, -558060, -490237, -138496, 108144, 154526, 4406, 40328, 272348, 143266, -19704, 153319, 315596, 200953, 40250, -154563, -379028, -180239, 240935, 439851, 329728, 412516, 411008]
9107D11008m6955j34656j05084n9974r2014q2950K1170Q2696J12719L3863k0457
9096A19366n3486j90389k24054q3656L9611K6657o1613J58501J02204O8832J28530
9085C0503l5450k1651N7395K17221J22774J69839k3387j98553k27430j83813O3071
9074b9481J2896J05888J43603M8039O4567J4792l2436l47m8553k45486j80781
9063a47299q1449M2185K20208Q083j90408j5325j94256j09862J01830K85351O2930
9052a8012m5454n3990k989J15341K11395L19742P1383k51556O827R8168j73886
9041B76969k06369N3152N0845l01655k53800K01854M78370K86262j41705j68331
9031B75592p7317R534R5875j55640j60109K3147J13468N7679n0840p3741m2229
$$ y = [411008, 364053, 229397, 124313, 64339, -27675, -110625, -89455, -6759, 105960, 139823, 119366, 65880, -124509, -348563, -432219, -392608, -365951, -427564, -269063, -166859, -98027, 30503, -4947, -26598, 30797, 248018, 370792, 540631, 517244, 318691, 91261, -92552, -29481, -16585, 89303, 232906, 280945, 345512, 360304, 327868, 327521, 278968, 33482, -147299, -228748, -186563, 33645, 41728, -148680, -164005, -358261, -468123, -366293, -80942, -18012, -63466, -117456, -120445, -5104, 206291, 526033, 597416, 345860, 352687, 450855, 276969, 70600, 123752, 174597, -127058, -380858, -179004, 299366, 585628, 443923, 275592, 198275, 207809, 303684, 148044, -12065, 11082, 124550, 182229, 131389, 57648, 15419]
9020A5419p3040j33499n8832j5428l0275m8738N2080j02131l2067R7038J7001
9009c12472k0210J41472K10346N7777p868j4597p6733q8869j25158J77K43429
8998G294J81093k14972k38703P9627K68890L02312l6504l17041r7729m3003o891
8987a15627K4668K52092P1154l27535m70284l90475Q5537M24295N09003J92490
8977B55318m6645j34002j23971p8589r1664p632J2053K74488J44024j31952k3229
8966D8199n6119l1075m1081K11252j5563n6868K184M5853M0740k91278k29438
8955c73194J03088K94038J77935J32559q4269j99805M4069o9098o2811m0008K64971
8944A87475L74524J56688m5895j83514j11266R0569K62675J903j84357q4638m7604
$$ y = [15419, -57621, -191120, -249952, -265380, -295655, -344393, -292313, -394444, -426511, -329473, -312472, -332682, -191210, 19136, 76913, 69045, 54448, -22285, -111154, -236312, -236135, 7294, 188387, -26585, -265288, -185661, 83229, 385541, 349037, 31996, -65733, -108736, -115627, -90959, 161133, 232287, -95248, -565532, -956007, -870470, -446175, 62828, 255318, 208673, 74671, -49300, -127889, -219553, -227185, -215132, 59356, 203380, 71428, 48199, -7920, -38995, -80076, 131176, 115613, 58745, 60929, 106782, 147522, -143756, -373194, -270106, 23932, 201867, 334426, 250157, 50352, 94421, 25323, -37488, -77496, 187475, 561999, 718687, 672792, 489278, 378012, 468581, 731256, 733159, 548802, 464164, 416560]
8933D16560J99577J10167j21679k34973J4210K37121J62362r7981j99016M7611
8923E33959o0238P2290K72788l6102l86227j61677K40250m8701j62714O0580P2858
8912C97066q7725q7212j51578k45768q2654J8552L5330J20768M2063k9379J05862
8901C5325n8084j50154k8573k8020J08044J24377j7960Q2172K6059o7580N4694
8890H0300J50041J56997P6111o5306k46650j42989R2508l1913j75918L1249K86125
8879B10555J88956O4188m2247q3165q9312p1318k07260m8383J27707l0356l2012
8868a2647J33354L15525K9017p1019l1610O4292L7861k23423m9610o5257l3403
8857I3080P7917K8963k50801j96659K02165k3560p1193J87221k9252j78403j82592
$$ y = [416560, 616137, 726304, 604625, 369652, 383862, 620983, 783345, 685364, 486348, 533959, 473721, 546011, 818799, 782697, 396470, 234793, 475043, 426342, 263628, 324208, 397066, 309341, 222129, 70551, -175217, -257871, -239319, -203989, -83221, -41158, -70537, 35325, -22759, -172913, -201486, -229506, -121462, 2915, -15045, 67127, 93186, 25606, 80300, 230341, 387338, 463449, 398143, 151493, 8504, 101012, 69099, -106819, -75570, 210555, 399511, 463699, 421452, 338287, 248975, 177657, -29603, -77986, 49721, 19365, -12647, 120707, 436232, 465249, 394230, 362620, 426912, 464773, 241350, 191740, 126483, 93080, 170997, 199960, -50841, -247500, -45335, -68895, -140088, 47133, 17881, -160522, -343114]
8846c43114q9024K06029K85545L36251l0318j43564j9316j29128m0866m3276N1059
8835D0278L9232n8302j30843j55737n0025K6383J67799L88163P4765k3585j39379
8824A78749j28775j85769j14931m4233R6165J72131j44437j78953N6560K20934
8814g2559P1610k7697m6756k4511K84699O8982k39739l22201k91315O6249J94441
8803c38797O9941J17671N3446J9503p8619n2109k6190l8252K49023K13487r438
8792A79666K14188J96783L7399k6237j00654L3313P1628k10073j79572J30926
8782C47367k67653l46011p963R8199K27461R0524J32007r430k4109j0475j64312
8771F5605n3538j9274m6553k6101L40452J97376k66483l11951J29210K17800R4450
$$ y = [-343114, -432138, -226109, 59436, 395687, 365369, 221805, 202489, 73361, 32495, -10781, 40278, 79510, 21208, -109635, -265372, -315397, -289014, -121215, 266948, 341713, 318128, 178749, 49974, -135795, -250726, -294959, -198794, -26663, -171100, -350053, -293493, -72559, -949, -28646, -75402, -99913, 184786, 253768, 14029, -308172, -599487, -533238, -338797, -268856, -151185, -97739, -78236, -156855, -208964, -235154, -273406, -24383, 189104, 179666, 393854, 590637, 628036, 601799, 501145, 534458, 606086, 396013, 216441, 347367, 79714, -266297, -274260, -176061, 51400, 141924, 273931, 264501, 240392, 229917, 65605, 12067, -7207, -53760, -79861, 260591, 457967, 191484, -120467, 8743, 226543, 320993]
8760C20993k2847L7227P5460M0324j10558j03003j04005j11633q3849o6348o8159
8749a96398j7484J74710J54267J33970L6544j79462l8106J2633j72932N5610L71699
8738C35051J93571j22156r3797k6206l6761R4576L7188J30113m89m05167r8233
8727G690J3696o7425j16550l7370J36373J5185M5951j28273j46902J60999P6936
8716c9690l1830J51728N0722p4446l00317j45725K49185L52728J74078j32758
8706B53675k9016K67447J48158m8179j23778k05574j73439m8674J05201K30617
8696C76438J09206j52226j26387k90402l49863k65230k40736N190K33162K41878
8686d58970q2620k74975N5089K16886K23155K87502O591r748m1557M5294J63971
$$ y = [320993, 298146, 335373, 410833, 451157, 340599, 237596, 133591, 21958, -61891, -128239, -196398, -213882, -39172, 115095, 249065, 285609, 106147, 68041, 80674, -92258, -36648, 335051, 528622, 406466, 312669, 286463, 249702, 344278, 381466, 511579, 511090, 105923, 7690, 21386, -46039, -162589, -199959, -63586, -48401, -2450, -130723, -277625, -116626, -39690, -71520, 80208, 130930, 56484, -243833, -389558, -140373, 212355, 386433, 253675, 224659, 492106, 640264, 592085, 468307, 262733, 89294, 40620, 145821, 376438, 485644, 333418, 207031, -83371, -433234, -698464, -939200, -934010, -700848, -458970, -541590, -816565, -761476, -544590, -321435, -33933, -27342, -37090, -78647, -33353, 130618]
8675A30618j8789r2694q494Q7237J80630n5988j91339j70029o767J09320j71690
8664b07985k81278J37311J71879m4511L0532K14934L28719J1551j84830q9104
8654H7218J7103p8874l1354L0727Q5592j64923r9182L5294j80067r9236R7130
8643c00572J59336p7446o1443L3624J29028k0665J3739j4582j46989J37858J68969
8632B0857k4873k4759j13998q7068O4825N4692L8713O3284K5937J8081m079l2551
8620i39P2410K4323K1381J28732P2548J5862j17296j74155n0418J57558K63239
8609D13245R0934j57680r3686K4304j28630k57841j00094L7112J35088J03696
8599F6448j14442n0612J74130J84067J07213j42294n3325L2574L384j35154l40311
$$ y = [130618, 111829, 19135, 10641, 97878, 278508, 222520, 31181, -138848, -145615, -36295, -207985, -489263, -351952, -180073, -224584, -194052, 20882, 349601, 361152, 176322, 87218, 104321, 25447, -5907, 24820, 110412, -54511, -153693, -118399, -298466, -397702, -300572, -141236, -218682, -280125, -246501, -117473, -138138, -124399, -138981, -285970, -148112, 20857, -4016, -28775, -142773, -229841, -165016, -110324, -71611, -8327, 17610, 35691, 31612, -939, 71471, 95794, 117175, 245907, 318455, 334317, 217021, 42866, -7552, 150006, 413245, 504179, 346499, 252813, 277117, 148487, -109354, -209448, -172336, -37248, 66448, -47994, -98606, 75524, 259591, 366804, 224510, 171185, 203759, 207143, 71989, -268322]
8588b68322j30122P2280J7774N8225J4379o5061K09443J86998o396k31099r1509
8577b33410K0436J74544J22033j25318j67550j22949M7021J74805J9704k58538
8567c49222R8082P1910k51927n0706K90219K10963N8461l6452k71806o1316K16940
8556g4854K2437r1657j10640l1504K70039K35997j99722l43436k21359p7601K30121
8545c92179L98897J35757j42462l87076j86515J74821J78423J97476P2104P037
8535E6283j856j51545j75295l2903q7740p5846k052J82359J1728k31824n2920
8524e61611K37600J76578J6241l8808O4267K25488J38943n6872L6006o4533k06205
8513c2906j29018M3309p700J35261J55638l2290Q1089J41717l6464J07353M296
$$ y = [-268322, -398444, -326164, -308390, -250165, -235786, -300847, -91404, 95594, 89198, -141901, -233410, -212974, -38430, 83603, -41715, -209265, -332214, -285193, -110388, -90684, -349222, -251140, -179230, -431157, -481863, -191644, 19319, 77780, 41328, -230478, -291794, -74854, -52417, -144074, -254714, -286218, -16179, 219818, 20096, -323340, -544699, -622300, -392179, 6718, 142475, 13, -387063, -573578, -398757, -220334, -22858, 49246, 56283, 54427, -97118, -272413, -305316, -393056, -468902, -470954, -288595, -276867, -508691, -561611, -324011, -147433, -131192, -170000, -105733, 119755, 258698, 201826, 237832, 173299, -32906, -161924, -118615, -126315, 8946, 164584, 132294, 213383, 355100, 318636, 425989, 430285]
8502D30285j89622j48573J03735l9919j25005j06526j8235Q8721j57004j44374
8492c06517O8104R8709K4074M7938j19167j44706R2130K77063J97016M6671k9068
8481B52247l9275p3665k45631k7981J56971P3244Q2387j65887l81088o7168J59467
8470b76379R8966K21480O7348r9414Q6000N080q1053o7812L3849O7671k3496J29215
8458A61455J25146j82827k48036j96710j46170p7156r8158j7080K73217L91252
8448a5067J22635M4407j6014j31187j32903q1279n8949R3818L8494r6172r0500
8437c22717j961R0883j6404j05907j36684m3766J00739J24874Q5275M3626K2667
8426a59375L28122K3456j42198J41065M7368k66229k18576K81884K40088P7647
$$ y = [430285, 240663, 92090, 195825, 155906, 30901, -75625, -93860, -5139, -162143, -306517, -238413, -139704, -115630, -67692, -186859, -331565, -239435, 37628, 234644, 281315, 252247, 212972, 139307, -106324, -134305, 22666, 95910, 178297, 12410, -368678, -435846, -276379, -177413, 44067, 111415, 12001, 98001, 103081, 22028, -45784, -11935, 55736, 32240, 161455, 286601, 103774, -144262, -340972, -487142, -564298, -662456, -679536, -406319, -15067, 107568, 151975, 135961, 4774, -128129, -209408, -268357, -174539, -136045, -232217, -322717, -324678, -233795, -250199, -356106, -492790, -536556, -435817, -310943, -225668, -182042, -159375, 168747, 192203, 50005, 191070, 238438, -27791, -246367, 35517, 275605, 353252]
8416C53252j25841j52613J23203K12991Q8277q4279j53158m2160K6601m8062M8466
8405B46677j4990j85367k95039j44432o5321j31630l7050O0152R6340J55874K58999
8394e5787J81965m272k20006k74540k19270j1201J6051j17529N2833L04923K23260
8383a23573K0081J19861J98097J6335k88525r6036j43527k16478M6365J87928
8373b79472N535q8845j6754J6580Q3344J59007J75079j18693q7503j24236J5528
8362b60430R525o8413J56320P2775j11535r2507k08480j95265J7975J62483J16095
8351d01457J13970j93236j17761J81503M64277L85848O2485j95108j94729j26501
8341b0709Q996J41085P5977k4115j20983k5050N0505O2709J38442K61405J37885
$$ y = [353252, 227411, 74798, 198001, 410992, 499269, 414990, 261832, 219672, 246273, 198211, 246677, 231687, 46320, -248719, -393151, -458472, -590102, -627152, -567000, -470660, -314786, -55787, 126178, 121906, -98100, -372640, -591910, -603111, -587060, -704589, -651756, -346833, -123573, -103492, 16369, 214466, 230801, -57724, -153760, -297287, -513765, -467400, -279472, -273937, -362782, -379536, -362956, -279612, -120605, 54474, -64219, -151722, -275958, -260430, -250905, -319318, -162998, -90223, -201758, -294265, -502745, -698010, -680035, -517552, -401457, -287487, -480723, -598484, -416981, 47296, 433144, 495629, 300521, 105792, -20709, -11713, 129372, 205349, 181234, 60251, 35201, 85706, 148415, 286857, 548262, 686147]
8330F86147J3724j07526j26190J42037J0097j61312L5861N7665R4070p5154k39888
8319C29531r4876l2256k14218j71840J31054L18485O1011j42419o9260o3142j3112
8308C8958K4408n0114J46202L21301l7564n10810l09102R2204K52223O9796j24965
8297h7463j01893j18978q0789J41162l2783j22452K56895L35928M9249j82491
8287E6385j45021m6904k0944q4397j97904j25318N4605R3737m9231j63446J96163
8276d32275J14252j9198l394L7441J83727L85897L96637j0772k84067m31089l85200
8265d48041j43638k07033j1657J98172K3042J71037L37964R1928k8529o2629j19843
8254a99227j37674j55026j15705j45980l5588J41901J69702j8822Q5619R6167
$$ y = [686147, 699871, 592345, 466155, 608192, 618289, 456977, 492838, 550503, 644573, 569419, 329531, 234655, 202399, -11819, -183659, -52605, 265880, 326891, 184472, 115212, 52070, 38958, 63366, 13252, 159454, 480755, 443191, -67619, -376721, -284517, -32294, 37502, -87463, -189356, -308334, -389123, -247961, -280744, -403196, -146301, 189627, 238876, 56385, -88636, -135540, -156484, -240881, -438785, -564103, -509498, -415761, -464992, -628438, -432275, -318023, -337221, -340615, -303174, -119447, 266450, 663087, 652315, 368248, -62841, -448041, -591679, -798712, -810369, -612197, -589155, -418118, -80154, 11774, -16755, -79384, -199227, -336901, -491927, -607632, -753612, -789200, -647299, -477597, -496419, -410800, -314633]
8244c14633J09116J39777J20857J38638O3088l0410r4041O5794J52671K5759k21754
8233A54862j33679K59076K73220j54153r4058j50774k63576j81451m6642M6861
8223b90314J36359m1635k57031j37966n2405K46996L32294K59183K87607j87198
8213B95890k39074O2043o4685l47319q8422J82330K27232K4842j0801K1787j61555
8202i7732j33705n637p584j113R9545J15016J24441N9824j4074J90191K38288
8191E67460J58264j22100k44661p4693o6704k64378j23035J89254K47913M0302
8181C07622j05915l59257m74886k14227J87885K11466R9425K36811L9155r7397
8171a69318m9883J8614M2784O0702J103j17451k42389k1166j44085p6389J07182
$$ y = [-314633, -205517, -65740, 55117, 193755, 256843, 226433, 132392, 198186, 350857, 376616, 154862, 21183, 280259, 553479, 399326, 305268, 154494, -109082, -290533, -337175, -290314, -153955, -195590, -452621, -590587, -642992, -395996, -63702, 195481, 483088, 295890, 56816, 118859, 54174, -293145, -381567, -199237, 27995, 52837, 42036, 63823, -97732, -231437, -237074, -244658, -245771, -146226, -31210, 93231, 153055, 138981, 329172, 567460, 725724, 603624, 358963, 284270, 217566, -46812, -169847, 19407, 267320, 307622, 201707, -157550, -632436, -846663, -658778, -447312, -347887, -111076, -71921, -169318, -219201, -200587, -157803, -97101, -95998, -213449, -455838, -477004, -621089, -697478, -590296]
8160e90296J96908J10767m3773n1921j23964j56040n2140K18021K82976J73444
8150c6018K6165r9275O0820K54295j14017k54492J08870L10853J71871R0851J56463
8139F76386q2430l1172j01898m1517q3633k1864p3750k62050l08394k01531M3617
8128d88236L1108j660K91873L18213l1028q0323k6782M3543K53827K22403J22898
8117F55836j19228k49248k14370l5010J21629J15694j49843p4370R7674Q5964
8107B34728k60181k51209o2297J73931R9330j7883J12720P1470J74572J37735
8097D12916j85053j86274p6711k4453o9447j4387J01775K974J80998K05216K03318
8086E50872J28593k52997l51708p8503j61396j32533M5181K7004J3441J44802
$$ y = [-590296, -393388, -282621, -326394, -378315, -502279, -658319, -710459, -492438, -209462, -36018, -9853, -109128, -48308, 205987, 91970, -162522, -53652, 257201, 429072, 519923, 676386, 593956, 562784, 460886, 419369, 335736, 313872, 240122, -21928, -330322, -531853, -488236, -457128, -458788, -166915, 151298, 120270, 39947, 13165, 56708, 310535, 532938, 655836, 536608, 287360, 72990, 37980, 159609, 275303, 125460, 51090, 148764, 234728, -25453, -276662, -338959, -165028, -65698, -83581, 29139, 100609, 275181, 412916, 227863, 41589, -35122, -59575, -129022, -143409, -41634, -38660, 142338, 347554, 550872, 679465, 426468, 74760, -3743, -165139, -297672, -252491, -225487, -212046, -67244]
8076f7244l4742j58021j27903Q3326K52798j88365r5748K53092K70173N0529j16788
8065A21107j4402J42904P9575j72134p5277j4600k88711j97409K0083J73203J13310
8054a12351j66850j6496o3340o430K18698K96370J35352j59568j70710r8563k1613
8043a65501O4371J16558p7225m8481J19394r2877k09783j3534J39683K47488J90673
8032B70766K7591L11775L39032j95277n06402l12170o4458J1920P1544O1518k58262
8021b42423k8557K30886l9881n7316K701N1246J49934k07504k27251q4261J79882
8010b72544J43556j7363j61545k23631k48402r8326J83964K48161J70194P2545
8000b03391L0692M9907K2999K3664J42384j1191O7456k9152l2016J41212m7869
$$ y = [-67244, -101986, -260007, -387910, -304584, -51786, -240151, -335899, -82807, 187366, 237895, 121107, 106705, 249609, 329184, 157050, 81773, 67173, -221538, -418947, -398864, -225661, -112351, -279201, -295697, -359037, -365467, -146769, 149601, 284953, 125385, -45325, -143888, -165501, -101130, 15428, -61797, -110278, 9116, -83761, -293544, -307078, -167395, 80093, 270766, 298357, 610132, 949164, 753887, 247485, -64685, -129143, -117223, -45679, 15839, -242423, -270980, -40094, -79975, -137291, -134590, -83344, 66590, -140914, -368165, -452426, -272544, -128988, -146351, -307896, -531527, -779929, -878255, -694291, -446130, -275936, -203391, -172699, -122792, -99793, -76129, 66255, 55064, 122520, 93368, 61352, 202564, 154695]
7989A54695k83990J2127K85540l6988j58753Q3706P0056M922n2478j63699k26577
7978c11439j53610P5960j26725k29585l3245L40467L58694R3241K5648J88168
7968B27574r1810k91022k47680j50288r5513p5939K62257L53506J58758R1211
7958A41054Q7829j32991j65276p6004J41194J8854j13192l8543K29089J45087
7948B37101p5771K4118q0305j09275N046L7914k62909j17017O9128J55154O7673
7937d9143l1167J78071p0115k42164k21993j3586K0287n3323q8631N6169K77092
7926b38503J44152R3643m7495q5617q4462o9458n7421J0544K54138K09684P7578
7915B06783K3731j2285j18944k59526j22791J32056J79873K48524K14675j09272
$$ y = [154695, -129295, -117168, 168372, 131384, -27369, 56337, 126393, 131315, 78837, -84862, -311439, -465049, -389089, -515814, -745399, -778644, -438177, -79483, 13758, 39406, 227574, 135764, -155258, -402938, -553226, -648739, -724678, -462421, -108915, 49843, 141054, 228883, 95892, -69384, -145388, -4194, 14660, -98532, -137075, 92014, 237101, 161330, 185448, 105143, -4132, 914, 38828, -224081, -341098, -271970, -116816, -49143, -80310, 97761, 27646, -214518, -436511, -450097, -429810, -483133, -571764, -515595, -238503, -94351, -708, -48203, -133820, -218282, -287740, -345161, -334617, -80479, 129205, 206783, 230514, 218229, 99285, -160241, -283032, -150976, 28897, 277421, 492096, 382824]
7905C82824k01385j4768q8635k60424k28244M7342K27761r3991o2426j84531k64267
7894g40744Q7478L34464L14005Q2399m3312R0958k44351k16402P8844J29357J20047
7883g257J53179J12817j24242k56015l70473k01264K53175L13986P9254j28807
7873a75647q0226K50145J12544j64474N2277L15141J3651j38454q6199j51842
7863e3084L9425k6542j36662j3876O6453J28137N5290J0582K8091p0451J15594
7852A42957J63154j19947k09121j23334j10950j17827J79171R9913o5401l8666
7842b00051J76901L34432J83042J1069j78973l0248L03254P9455j10072k32349
7832C36460m09381l24063k00273K8716J91219K20666J14992J1709K13171j01703
$$ y = [382824, 181439, 166671, 78036, -182388, -410632, -363290, -135529, -229520, -291946, -476477, -740744, -653266, -318802, -4797, 77602, 34290, 125248, -119103, -335505, -256661, -127304, -7257, 145922, 258739, 134497, -121518, -491991, -693255, -440080, -126094, -46840, -175647, -255873, -5728, 106816, -57658, -5381, 309760, 323411, 184957, 98758, -53084, -13659, -40201, -176863, -190739, -124286, 3851, 59141, 69723, 97814, 27363, 142957, 306111, 186164, -22957, -146291, -257241, -375068, -195897, -95984, -161385, -200051, -23150, 311282, 494324, 505393, 326420, 296172, 599426, 678881, 568809, 336460, -72921, -396984, -597257, -568541, -377322, -156656, -41664, -29955, 183216, 81513]
7822H1513j38906o0518l19591l30305K06223O05179K86920k72511j43356m4047
7812a29399l0813J03112K3160j37266J40921J7887j75663n5969o5611P8761L0113
7801b00767Q7277K60252J44413r053k21550j12723J54754N2558j81612q9656N8005
7790e8102J09175J9542j21741k7252r7630J07208K62688k7252k75691o5741R158
7779a65638l40719k38379O1971J20411K38771L66502J02199J24051J16158L9110
7769D24437Q863j10258j00527j5326l551o4660M6199k9267N6678J67180J3979
7758C93747k7601m4641j31809j36819K26302K42980k07704k50688m3866J43206
7748A63107P5883J2626j2656m5225J86944J74098l9353l52363k78443p1739n4522
$$ y = [81513, -57393, -117911, -437502, -767807, -561584, 43595, 330515, 58004, -85352, -129399, -160212, -57100, -33940, -171206, -30285, -12398, -188061, -244030, -309641, -230880, -200767, -113490, 146762, 291175, 282122, 60572, -52151, 102603, 155161, -26451, -116107, -58102, 51073, 70615, -51126, -78378, -176008, -68800, 193888, 166636, -109055, -174796, -165638, -506357, -744736, -682765, -562354, -323583, 42919, 145118, 269169, 385327, 424437, 433300, 323042, 222515, 207189, 203638, 138978, 185177, 155910, 212588, 379768, 393747, 366146, 321505, 189696, 52877, 279179, 522159, 314455, 63767, 19901, 163107, 238990, 251616, 238960, 193735, 380679, 554777, 515424, 163061, -115382, -187121, -241643]
7737b41643J40172P8122j5451p3472j11325j16918k21129o2342J79233K59603
7727a85150l2439j89004Q0266L56571K02125j32148r4436J74468l3833j63963
7717a7543M7887L24507K32711k32512j64216J00645J22219Q3546m5285j91444
7707B60515k14962k09929l487L4600l22209M9553M37160K22141J61256J08263
7697E22901J7089k16498m29042k37934j08684K2036L20006J63720j34008o8054
7687a48468J20276P3940j67203j40002K78041K33071M0759m5871M3544J17290
7677D05377J00410l4250O5430J58777j29695l04842j26165R4919J01877J82893
7667E14731P3402k10905k67994n6719m0830p8900j71929L5899L03333j7624k35500
$$ y = [-241643, -101471, -23349, -38800, -112272, -223597, -340515, -561644, -623986, -444753, -185150, -217589, -406593, -326327, 30244, 232369, 100221, 5785, 180253, 146420, -17543, 30344, 354851, 587562, 355050, 190834, 291479, 413698, 497244, 451959, 260515, 45553, -164376, -167863, -133263, -455472, -405919, 31241, 253382, 414638, 522901, 539990, 323492, -105550, -343484, -452168, -430132, -110126, 53594, -80414, -148468, -28192, 45748, -121455, -261457, 16584, 249655, 290414, 244543, 288087, 405377, 505787, 471537, 536967, 695744, 566049, 261207, 135042, 229961, 331838, 514731, 588133, 377228, 109234, 52515, 11685, -67215, -239144, -203245, 100088, 82464, -153036]
7656a53036p1609J45303P8454J41614m6729j02637K83263J48898k94379M9189
7646A78331J06895L6518m2174j44756M4335L2740m7300J2834j78214j20887L3294
7635h8384P7660J76739J62362n2674k27583j83228J0123q6728r8497J72394J00102
7624c7714j70192n9610J01075K80491J26220j56687k99105n7201L85856P5602
7614A88735k66190L9108k5938O8050K27920Q7905q5596j90509Q799J31044o9443
7603A13885q8196J13112j06371j54805K6308j3698J70199K61752J41065O0987
7593E24238Q7933k24514j80490R1761l7624o4805j70039n9495J9265l16106p1446
7582d01322J97755J74960K35550J69380k57219m56596q5600j22211o921m508J23557
$$ y = [-153036, -224645, -79342, -888, 140726, 93997, -8640, 274623, 423521, 129142, 178331, 285226, 321744, 279570, 134814, 179149, 211889, 164589, 177423, -791, -121678, -88384, -10724, 166015, 328377, 275703, 48120, -135108, -124985, -211713, -310210, -137816, -37714, -207906, -267516, -166441, 114050, 240270, 83583, -215522, -272723, 113133, 188735, -77455, -38347, -64285, 3765, 231685, 319590, 233994, 43485, 52284, 183328, 113885, 25689, 138801, 32430, -122375, -96067, -109765, 60434, 322186, 463251, 524238, 612171, 387657, 207167, 298928, 261304, 196499, 26460, -33035, -13770, -329876, -401322, -203567, -28607, 206943, 376323, 119104, -337492, -423092, -545303, -552224, -556732, -433175]
7571d33175J68171k5546j30614P1805J33144J01928n748j43653k65451n5655K93130
7560b91664K14929m5409l2051N0859j52554j96105r245k0170J49718L18825R7947
7549H5080m12239l98660j51867k6337L46174L71035J36108J7356j27441l20071
7539d80862l38586k7748K67045K34570J16630j24831r3872M7809j32781j07530
7529f40156J90379K09817P972j09453j6468K7344P5406J88542J37339R9828L2212
7518B02762r6654o1184j65251n5418o6762k02257j46787n4797J89831L26814J93134
7507F3431M7456l25187k53911J9094O891K44862L77497J99553K3871J2688k7242
7496C89003J49051J09589j27108k44614j9724n4586j32518j10408P6101P496j42305
$$ y = [-433175, -265004, -290550, -421164, -349359, -216215, -114287, -120035, -263688, -529139, -584794, -291664, -76735, -122144, -154195, -103336, -255890, -451995, -461240, -481410, -331692, -12867, 85080, -327159, -725819, -877686, -904023, -557849, -186814, -50706, -33350, -160791, -480862, -819448, -847196, -580151, -345581, -228951, -353782, -447654, -399845, -532626, -640156, -449777, -239960, -231988, -341441, -357909, -330565, -255159, -66617, 70722, 170550, 202762, 106108, 44924, -120327, -175745, -242507, -444764, -591551, -646348, -456517, -129703, 63431, 110887, -214300, -468211, -449117, -442226, -197364, 180133, 379686, 403557, 416245, 389003, 538054, 647643, 520535, 275921, 256197, 201611, 69093, -41315, 34786, 42282, -100023]
7485a00023j20529J07741K59278J00471J36944m3690k64951k68058k0701J56306
7475e7212R3942m5934L5602k5424n2396P2767K12171m3181J25904J55458j25585
7464C46112j69266o1589J51287p3998k62679j05651Q4622K80049J93450J85077
7454E67414J75046p0411j94779k30171k18210k93971j44265R2374J29399L5418
7444a52156k15601l24341l6757J03972K24822K91114L4542P6174Q7267j33444
7434d4408j42943n5421J02207l53j39321P096j5698L0731J27243m2735p1987q3182
7422c28771K23260K71130o7564k76388k76059q9268L36394J38539N1599O5801
7412D8673J00416j40124k03795O5515J68791K00190K46535K1600n4250n4791l2646
$$ y = [-100023, -220552, -112811, 146467, 246938, 383882, 340192, 75241, -192817, -213518, -57212, 36730, -9204, 26398, 974, -51422, 21345, 233516, 190335, 316239, 471697, 346112, 176846, 115257, 266544, 192546, -70133, -175784, -91162, 188887, 382337, 567414, 742460, 672049, 477270, 247099, 28889, -265082, -409347, -316973, -187574, -152156, -367757, -692098, -728855, -624883, -400061, -108947, -74405, 1769, 89036, -44408, -187351, -242772, -140565, -140918, -280239, -273143, -288841, -258110, -130867, -173602, -245589, -328771, -105511, 165619, 98055, -178333, -454392, -543660, -207266, -68727, -17128, 48673, 149089, 8965, -194830, -129315, 39476, 239666, 486201, 507801, 453551, 398760, 366114]
7401C66114j5498j68323k76582r1914K38889J26126j70197j61477n8585m4801
7391b56248J29625j27670j85138J07893K67935K35960k9311k39419o6556N5427
7381a07502j20307j82572P8579K96816L43197J48238j04769L7308n5532j28774
7371B04682j98508m05444o0078J51230K36648N0955k17159j82141J9344j5907
7361d16378Q6599N2245n3820K24229J50550Q4952J0530k75220j20370P4735q236
7350a90184k99261j15777J46625P2497J5995r7035k4259P8006k7059J43540L35744
7339C8832L1079J9754J01203K54579J54652l2629j69289k30300r7880m3490k26562
7328b00051l68363j53393J48312K14925K59820L18563P4202l07786k29836M9273
$$ y = [366114, 350616, 182293, -94289, -186203, 52686, 178812, 8615, -152862, -211447, -256248, -126623, -254293, -439431, -331538, -63603, 172357, 143046, -96373, -162929, -107502, -227809, -410381, -331802, -34986, 308211, 456449, 351680, 388988, 333456, 204682, 6174, -399270, -459348, -308118, -71470, -20515, -237674, -419815, -400471, -416378, -329779, -277534, -331354, -107125, 43425, 128377, 138907, -136313, -256683, -181948, -190184, -489445, -605222, -458597, -386100, -370105, -467140, -491399, -413393, -440452, -296912, 38832, 69911, 89665, 190868, 445447, 600099, 567470, 398181, 167881, 70001, 26511, -200051, -568414, -721807, -573495, -358570, -98750, 219813, 294015, -13771, -243607, -194334]
7318a94334J64643n697R8119J88334l6774J9989J27937m1772j66987j52012Q5685
7307H7131J49738J04040l3899j29077j25497L0454K30294l2129j22848m285P997
7296A61919J02576J44367j15088j17483P427K60196K06764j74564j11371K64514
7286F29257j0550q3377j39520l53567l32533J49745K74784r4058j67132J09411
7276a7540J90860J00174Q0651k9422j65606r8121J74551M7003j01557q1511O0110
7265A59592q5905j65372n3432j18346J55487L00986L148J22314K47374K9056k44772
7254C50130m47400r5102J00360l8002k07763j76376L6928J65754q8702j50190
7244e50363J8918q813K99331J97933o9909q1176L01914M96249J11843k93324l49984
$$ y = [-194334, -29691, -35388, 62731, 251065, 214291, 234280, 362217, 320445, 153458, 1446, 87131, 236869, 340909, 307010, 177933, 52436, 82890, 313184, 281055, 158207, 153922, 161919, 264495, 408862, 293774, 176291, 183718, 443914, 650678, 476114, 364743, 629257, 618707, 535330, 395810, 42243, -290290, -140545, 134239, 40181, -126951, -17540, 173320, 273494, 354145, 324723, 159117, 60996, 235547, 282550, 180993, 99482, 159592, 73687, -91685, -145117, -263463, -107976, 193010, 196158, 318472, 565846, 594902, 350130, -97270, -192372, -92012, -130014, -337777, -514153, -477225, -311471, -400173, -550363, -531445, -540258, -240927, -42994, -112903, -194079, 107835, 604084, 715927, 422603, 72619]
7233G2619k094K08398Q2k31379j52666m7817P1154N230j3793J15927o0826j16427
7221a51592P9900R0371J10813K14446P4245j88446k72412k8446P5349r9353L8038
7210e7087J51362J03891L164k33894k66200k1857r2805k06521r8602J60541K60962
7199b97046J36231j94140k6993K14837J51653j37003k09829l388O7564J58615
7189a39499L6173K59197K26666J16908k3021j53815j52298N2367m8659j62032
7179A1987j11021P6718J97257J15643j14286j55693r374J13836J61332J5173k02554
7168I9018k9857J01893l8771n1946j4765N4211J43125J65561k44630l90127k14776
7157d21064J28753J03963K18934K09562o3774k04667j6183o6312L2258M5181l41426
$$ y = [72619, 70525, 278923, 279005, 47626, -105040, -152857, -81703, -76473, -90266, 25661, -35165, -151592, -71692, 18679, 129492, 343938, 418183, 229737, -42675, -71121, 4228, -95125, -57087, 94275, 198166, 201330, -32564, -298764, -320621, -413426, -619947, -718549, -558008, -297046, -160815, -354955, -381948, -167111, -15458, -152461, -362290, -365678, -298114, -139499, -103326, 155871, 382537, 499445, 476424, 322609, 170311, 222678, 174019, 11987, -99034, -22316, 174941, 290584, 176298, 20605, 11231, 125067, 286399, 301572, 99018, 69161, 171054, 132283, 80337, 65572, 119783, 262908, 428469, 183839, -206288, -421064, -292311, -188348, 30586, 240148, 176374, -28293, -44476, -110788, -78530, -33349, -374775]
7146c74775m18414Q3470M45712L08298K50056L2882k0467j44585j96922L390J00142
7135F8787J5810j24709J05580L28567m7389j74148P4852K63114J83887K36705
7125I31056R677j71829j50406k62267j80054m7846j2172j65211M7812M8861k1049
7114B6572L8070q3163K19271J57932P2227L7050j35786k78751k176O5128P9672
7103A96046L2912o5115K51743L17612N6824j84390J7096R3869M2188k05524j44253
7092D09008p7782n9357Q6019k48924m00898l2275J97513J7108j45606k88679j64018
7081g07891N0720K17267N2998K3020K14925L22414J42941j1719N5774j3001j18178
7070B29270l8645j09557J40421K64053j32223j7745P5992j09479j10218o3740
$$ y = [-374775, -793189, -709719, -264007, 44291, 294347, 327229, 306762, 162177, -34745, -31355, 68787, 84597, -40112, 65468, 394035, 346646, 172498, 247350, 510464, 694351, 931056, 940733, 768904, 618498, 356231, 176177, 128331, 116159, -49052, -1240, 47621, 26572, 64642, -18521, 200750, 358682, 430909, 467959, 332173, 53422, 51246, 116374, 196046, 228958, 163843, 415586, 733198, 790022, 605632, 622728, 716597, 758785, 553261, 409008, 331226, 271869, 357888, 108964, -291934, -324209, -126696, -109588, -255194, -543873, -707891, -657171, -439904, -386906, -363886, -148961, 173453, 316394, 304675, 360449, 347448, 229270, 190625, 81068, 221489, 485542, 353319, 335574, 411566, 302087, 191869, 128129]
7060A28129k41638N4522K13697K73675J60198N1839k165l8838k45506j94259k64192
7049a04538k13500J79530K53747r1670k75215j90059k4791j5177J35544j66119
7039e12248k59205J06685K96672K27123K1056k16116O284P3974K85364M29851
7029D59440K10633k14517k14209n9838r257r199r1411J3184m1666M2492N7388
7018A43040q5975q0505J31313J34161K1039k9446m0136n0171k47503j63508j1554
7007b79245p3595R4179P1496r9194K1389J09170q2404K8701n729J31229J30338
6996D6335r615K63133N20754J66257m25475l97225j87321k31868k70732k86590
6986h12347O4909M14558M17331K87680J80124J9401l06795m8007K32974j17829
$$ y = [128129, -113509, -58987, 154710, 428385, 588583, 640422, 638257, 599419, 353913, 159654, -104538, -318038, -138508, 115239, 23569, -251646, -441705, -466496, -481673, -346129, -512248, -771453, -664768, -368096, -140973, -119917, -336033, -329749, -255775, 29589, 459440, 670073, 455556, 241347, 181509, 172252, 163053, 71642, 84826, 43160, 85652, 143040, 57065, -23440, 107873, 242034, 263073, 233627, 193491, 143320, -104183, -267691, -279245, -352840, -258661, -187165, -286359, -264970, -155800, -238204, -209503, -215232, -84003, 46335, 36720, 299853, 820607, 986864, 561389, 164164, -23157, -255025, -525757, -812347, -747438, -332880, 84451, 372131, 552255, 571656, 264861, 216854, 449828, 331999]
6976C31999l53089k43337m7065K2782n5464O5420J25110l6434R9603J32940J38292
6965A80757J99110P4189j7948j09876k37957k96125k33891P9363N8956R8812N58
6954b04052L2592k2734R92p8406L7539K71550M058k34186n4916r0937R7428J65686
6942g5386r0279K9071K16422J24756j88598l33399o9470J44407r9387k68501n8019
6931f68383K54789J32491j1972L4274J3968j03371n9234M4591m3642n8028K84907
6920a79610P2038l10908j29963L48188M55479K90216K5361R8192k1919k05664
6910D41410k06094j39333o7828j39164j09821M787P3505N5228J65988J97823J11443
6899C87944k54011m26236l33671r5099j8424J27476J81863J23114J168k8522J09288
$$ y = [331999, -21090, -264427, -311492, -288710, -344174, -278754, -153644, -190078, -90475, 42465, 180757, 379867, 454056, 436108, 326232, 88275, -207850, -441741, -362378, -303422, -204610, -204052, -171460, -194194, -193202, -271608, -234069, 37481, 41539, -192647, -247563, -338500, -241072, -75386, -165665, -136594, 79828, 204584, 15986, -317413, -386883, -242476, -341863, -610364, -668383, -413594, -281103, -293075, -258801, -244833, -348204, -407438, -362847, -406489, -464517, -179610, -107572, -418480, -548443, -200255, 255224, 545440, 570801, 668993, 647074, 441410, 235316, 95983, 28155, -111009, -220830, -216043, -142538, -87310, 78678, 276501, 387944, 133933, -292303, -625974, -721073, -739497, -612021, -430158, -307044, -305876, -334398, -225110]
6888b25110L15909J2730p6779M4677K30358p6948l12374m1735K61505K74025J03059
6877E09317j81251o151K6009k1194k2932l6818o3210L1689j16312m1697m5976
6866C1474l07693p9987K14004K29736j45466J12871M02395P3362j65070N3731
6856D19357J65696J43971L5399k76317l60869L7631J06612N5379N2376n3892j12008
6845B13335k89651k09364J57531J31495q5950l14028n0732K70707K06553k11036
6835a81140k54496j66105Q9597J67731J07506J11546j19354k51030L4903L0767
6825d30075J76799K28883O6152j53563j36063N0956N7994K2541r5325n2402J44407
6814a19696L54191K17940k6764N0448j02621k55745r7792j51305p7870j37932
$$ y = [-225110, 90799, 103529, 26750, 71427, 301785, 224837, -87537, -129272, 132233, 406258, 509317, 328066, 321915, 347924, 326730, 303798, 266980, 203770, 235459, 119147, 77450, 31474, -276219, -356206, -142202, 87534, -57932, 54939, 457334, 530696, 365626, 419357, 585053, 729024, 764423, 488106, 127237, 164868, 271480, 326859, 379235, 325343, 213335, -76316, -285680, -128149, 3346, -82604, -396632, -447364, -176657, 29896, -181140, -435636, -601741, -512144, -344413, -236907, -125361, -244715, -495745, -460842, -430075, -253276, -24393, 41759, -111804, -247867, -196911, -138917, -116376, -211701, -264103, -119696, 234495, 452435, 425671, 476119, 373498, 117753, 19961, -131344, -209214, -347146]
6804c47146Q1926J32148J86766L17122J97843k0375R299J15635K12828K26733
6794A112779j27586k89619k14908j97790j66044R7482K20219J29402j61213l71988
6784C0734k07017j05081p0880J5102J71575J75630L3405l2059p041m032M1403
6773D1739j17219l36653k17893m0558O9719J96281L5329L4225K40684J45771o8997
6762a7572j26747p0385m5259J93393L90292J78817Q368J73927q0533k43677m2676
6751C17948J13303J70610R5628r8030N8235j12443l42157j74815N208P9393K02000
6740C14880j0436K5428K41851k4963n2522j90477n66247n39287l7724K06472L02568
6729c30457L39258J24660P3903J83005J20228L9854J24479q9699l31434j40948
$$ y = [-347146, -265220, -133072, 53694, 370816, 568659, 548284, 557583, 673218, 886046, 1112779, 985193, 695574, 480666, 282876, 116832, 214314, 434533, 563935, 402722, 30734, -176283, -281364, -352244, -337142, -165567, 10063, 43468, 11409, 4368, 336, 41739, -75480, -412133, -630026, -670584, -600865, -404584, -369255, -335030, -94346, 51425, -17572, -144319, -214704, -259963, -66570, 323722, 502539, 510907, 684834, 604301, 360624, 317948, 431251, 601861, 697489, 599459, 657694, 545251, 203094, 28279, 33487, 112880, 314880, 304444, 329872, 571723, 546760, 494238, 303761, -262486, -801773, -839497, -633025, -330457, 8801, 133461, 207364, 390369, 510597, 550451, 674930, 585231, 253797, 112849]
6719A12849L6309J43596J22627q5355P8310J54057J94117K41731k18133l32874
6709D47234l93740l24761k42430p5902L0216J67721K48975J18401R1587P2727
6699A40028j13884o6225J05537j4018j84968L5008K86578p9411l51250k88858
6689e31463m397K46813M02837L15687k7039j53360k5826n5166J44297K95655K32931
6678H40969M0507k39891k00988J10857K42871J32315k55352l17693j90590M0544
6668B03549J1599K5294Q6320m6906l1456m1090l36996l81009j46746r1952L2715
6657g16678M11985J99136o9214Q059J72032L43720J93970J15156J92749J57708
6647A008623j05236p7646o5720k53648l68720j39243j50017k33429l8479J55695
$$ y = [112849, 149158, 292754, 415381, 330026, 408336, 562393, 756510, 998241, 780108, 447234, 53494, -271267, -513697, -589599, -559383, -391662, -142687, -24286, 67301, 140028, 26144, -40081, 65456, 51438, -133530, -98522, 188056, 108645, -242605, -531463, -535860, -289047, 113790, 429477, 402438, 249078, 223252, 168086, 312383, 608038, 840969, 881476, 641585, 440597, 551454, 794325, 926640, 671288, 353595, 163005, 203549, 215148, 240442, 326762, 279856, 248400, 207310, -129686, -510695, -657441, -749393, -716678, -304693, -105557, -174771, -166712, 5320, 349040, 543010, 658166, 850915, 1008623, 903387, 825741, 760021, 506373, 137653, -1590, -151607, -385036, -423515, -267820]
6637b67820J89911K51609p942L6419K9676o4039k20087j66966j36537j58422J71581
6626c42617M19242L19117N4491m7844n3750J38118K7653l2315J83827K64435L0356
6615I60713k05870l10332j8736J76609M7488j42835k36059q3866J79988K23329
6605E90429k8521k09273k27042j84556P0405L39818K73452n545N6154R3739j75193
6594E93867k96772k25613J4791J24463k0819j0839L7290r8650j88653k48627j23383
6583d42945J96167K50732l5804k11026O5110J29376J02132k2284K0468j38968
6573h7042r3674J11204p0930J7139J7629p131m815p3313J5911M07824J45660l67149
6561A1313j92872K26552J87488J23539O8646P2742l6157j8374l8986j85040J64349
$$ y = [-267820, -77909, 173700, 165758, 202177, 231853, 167814, -52273, -219239, -355776, -514198, -342617, 76625, 395742, 450233, 402389, 348639, 486757, 514410, 482095, 665922, 930357, 960713, 754843, 444511, 425775, 602384, 649872, 507037, 270978, 187112, 367100, 590429, 561908, 352635, 125593, -58963, 11442, 351260, 624712, 619167, 675321, 769060, 593867, 297095, 71482, 86273, 210736, 189917, 179078, 216368, 117718, -70935, -319562, -442945, -246778, 3954, -31850, -242876, -177766, -48390, 53742, 31458, 51926, -87042, -180716, -69512, -140442, -123303, -105674, -112805, -117620, -190933, -175022, 232802, 378462, 11313, -181559, 44993, 232481, 356020, 424666, 497408, 461251, 442877, 403891, 218851, 383200]
6550C83200J76369q0130m4940l9702K7054k22423m92677l26569O3720N4976K22970
6539b78152K07716l9607J950O9806J29813J66482p3257r4625K1761r2966K6044
6528D4965j54294k04749k2846J29848K07720J99460m2439P5510J6367l16938k86627
6517c54023p2631l4485q341O3328L01015n2168l07725M1674L04976j0781n3496
6506a82657K36870M5119j53558k58389j19076K989Q6068J25726j3984k52999j94416
6495f78307J81921R9859J32564K13459J24719P1597K2872R2392n2949j11763J06275
6484B02639J12075j63225k75738j03310j05759R6585K11793J43323L5732j34817
6474A9298m159j26909j5992K87915R4999o2178m6379j03701O9997J58163K4427
$$ y = [383200, 559569, 479439, 434499, 394797, 421851, 199428, -293249, -619818, -556098, -501122, -278152, -70436, -110043, -108093, -38287, 91526, 258008, 184751, 90126, 111887, 18921, 44965, -109329, -314078, -336924, -207076, 644, 200104, 157665, 233175, 249542, -67396, -354023, -426654, -461139, -469480, -406152, -105137, -157305, -465030, -423356, -118380, -129161, -182657, 54213, 99332, -54226, -312615, -431691, -428702, -342634, -216908, -230892, -483891, -678307, -496386, -396527, -263963, -50504, 74215, 145812, 168684, 261076, 208127, 96364, 202639, 314714, 151489, -124249, -227559, -333318, -236733, -24940, 118383, 154115, 19298, 15139, -111770, -127762, 160153, 255152, 192974, 146595, 42894, 112891, 271054, 295481]
6463B95481r9298j50627j28442J53972L14151N3334r5818k11706m6902M6831Q0149
6452B11125M7040o9069N4588K1417j59904J9922J62961O0208j72031N6897K35133
6441D68287K0672n6197k44620l84453R3468J31478q55j07621k16228j48462M994
6430d39537K20596L3010k38308j38472J6896J94706K70093R0118O9441l0671Q4625
6419A32497O1750P1755j7655q6196k5027J14654P2602J40661J12111l1377j95546
6408C50229j61010R5996J98989J40233r3144k94857l17401k65396j13326J66837
6398b92850L48464K76880L21254J50890q0506l06618l08997o6800K48809K71245
6388E61771J6247O497k047l22956j28508j55087k42106j44604J25527M21445L33527
$$ y = [295481, 196183, 45556, -82886, 71086, 385237, 438571, 342753, 131047, 84145, 130976, 211125, 258165, 189096, 243684, 265101, 105197, 125119, 288080, 348288, 176257, 233154, 468287, 488959, 432762, 188142, -196311, -102843, 28635, 27780, -79841, -296069, -444531, -439537, -218941, -185931, -424239, -562711, -545815, -351109, -81016, 9102, 78543, 47872, 132497, 194247, 266002, 248347, 162151, 137124, 251778, 324380, 465041, 577152, 545775, 350229, 189219, 285215, 484204, 624437, 531293, 236436, -80965, -346361, -459687, -292850, 55614, 332494, 653748, 804638, 724132, 417514, 108517, 41717, 290526, 561771, 578018, 584515, 582468, 259512, 131004, -24083, -266189, -410793, -285266, 136179, 469706]
6377D69706K01168q2k06128k46286j37123J68698J64024p7014L2558j2543j17419
6366B39559r87N678J73610J47629J8050M7139Q0057l4846M6993K6588k64650j26351
6354C58469J81763j29100m55183l10093l78727j09245J85000L16619M67377K08462
6344C35342J38217k5036m1004j60087j80597L21323J76654k41391k1145J98028
6334E00304K81329m5777j06305K4171l59943j90615j21848q9167J18050K24805
6324B35004J28385L8003M9944r1578J53072P1026l12046k34700j27566L2475K04731
6313A46750Q9256j80972r5875J34028J41998J93453J68732O4667k2016j19076
6303E20945k0269p3037k41350M8339P3946j25350J71938K53819q613n4626j61914
$$ y = [469706, 670874, 670792, 464664, 218378, 81255, 249953, 413977, 336963, 369521, 356978, 239559, 238572, 244250, 417860, 565489, 583539, 630678, 710735, 675889, 722882, 749470, 484820, 358469, 540232, 411132, -44051, -354144, -732871, -842116, -657116, -340497, 126880, 335342, 473559, 448523, 407519, 247432, 66835, 388158, 564812, 323421, 302276, 500304, 781633, 735856, 629551, 653722, 293779, 103164, -18684, -107851, 10199, 235004, 363389, 401392, 451336, 359758, 512830, 583856, 271810, 37110, -90456, -57981, 146750, 236006, 55034, -40841, 93187, 235185, 428638, 597370, 662037, 640021, 520945, 500676, 427639, 186289, 234628, 308574, 183224, 355162, 608981, 600368, 545742, 383828]
6292C83828k26074k50366O611L32140L3777j75408k77147J07961N82127K20705
6282G38154J09019L3601J52209J56133R6968J08005K0455J97682N62135J26860
6272B301221m06339m83717m07695j79390Q5362J61793K85419J52939j54801k8909
6262A325883K30773J41007N9543k492J53797L66478M47569K11437l4303Q1547
6252B981239Q0592J2773J58185K15628M46176N26772J84005R477K37593N08837
6242E361277O26154O88650P61638P07027Q80605R94844J280754J394242J516022
6233A4211213J974541K399383K946423L834863N261303P347238J0525190J5579519
6225F4079673K3481356L7746792O0265357Q0258985M9100662l9415318q2382693
$$ y = [383828, 157754, -92612, -86001, 246139, 279916, 104508, -172639, -64678, 517449, 738154, 847173, 880774, 1032983, 1189116, 1286084, 1394089, 1414544, 1612226, 2174361, 2301221, 1894882, 1411165, 1003470, 824080, 909442, 1071235, 1356654, 1509593, 1354792, 1325883, 1556656, 1697663, 1757206, 1754714, 1908511, 2274989, 2722558, 2933995, 2899692, 2981239, 3061831, 3074604, 3232789, 3448417, 3894593, 4421365, 4605370, 4614847, 4852440, 5361277, 5987431, 6676081, 7437719, 8144746, 9025351, 10020195, 11300949, 12695191, 14211213, 16185754, 18585137, 21531560, 25366423, 30627726, 37974964, 48500154, 64079673, 87561029, 125307821, 185573178, 265832163, 314932825, 275517507, 193134814]
6218A93134814o4647517m0424561k4741990j5747193j0334584p510255n440330
6211B4288384m164210k928291k223682j495466j078012j310884j371527r75953
6203H740359q21621r37416q39880m43960m61402j88961K19854M46452M23763J324863
6193G462051K353339L012972K120999j176753l079917k717382k010523j334796
6185D629990o74419m98732o08089o01179o01442k50948k77616k62373j17099J27468
6175H65561P7319M6416P0441J5309M087J50369K48873M44597N66777K86083m29422
6164B346410o69682o02615m36541l11892j68587l9773K84605M84724R8577j23360
6154H61866K4620j50111k34074j15808J65553J70289p5506j78411m0927J60495
$$ y = [193134814, 128487297, 88062736, 63320746, 47573553, 37238969, 29728714, 24288384, 20124174, 17195883, 14972201, 13476735, 12398723, 11087839, 9716312, 8740359, 7918738, 6981322, 6141442, 5697482, 5236080, 5047119, 5266973, 5713425, 6137188, 7462051, 9815390, 12828362, 14949361, 13772608, 10692691, 7975309, 5964786, 4629990, 3955571, 3456839, 2848750, 2247571, 1646129, 1395181, 1117565, 855192, 738093, 865561, 942880, 989296, 1059737, 1075046, 1079133, 1229502, 1478375, 1922972, 2489749, 2775832, 2346410, 1676728, 1074113, 637572, 325680, 157093, 117320, 401925, 886649, 985226, 861866, 886486, 736375, 502301, 386493, 552046, 722335, 646829, 468418, 427491, 587986]
6144E87986K87874O6339m3925j06304k77470l90090p1304l1261O186O1260M2564
6133A31855J9136Q664q4922J35753L10994J48159Q3511P8869r2993j22446m6901
6122E69679j37823k20643k9245j56805l18135j62697K5375K62985K55761M5676
6112A34128P9116J84075K07005j57720k52273j17650J28624J23267j27643j36886
6102F4043K5487K22331Q7782j34045j41313k69122j28236j51152j49874k7203
6092f01302K15555L65580K02423K2922l4648J46794k8897k88505p2614O8900j00468
6081a04260j84053j19901K33816K17778J91598R5659j8190N4943j1053k33186
6071A23151l01732J7815N5108M4006J91343O2033K0529K8416j21833P1686K30749
$$ y = [587986, 875860, 942199, 898274, 791970, 514500, 124410, 53106, 21845, 28031, 89291, 131855, 150991, 159655, 74733, 210486, 521480, 669639, 753150, 832019, 739026, 616580, 569679, 431856, 211213, 181968, 25163, -292972, -455669, -430294, -167309, 88452, 134128, 213244, 397319, 604324, 446604, 194331, 76681, 205305, 328572, 200929, 64043, 89530, 311861, 399643, 265598, 124285, -144837, -273073, -424225, -574099, -601302, -385747, -20167, 182256, 205178, 170530, 317324, 288427, -78, -72692, -3792, -104260, -288313, -408214, -174398, 43380, 234978, 330637, 312447, 367390, 356337, 123151, -178581, -160766, -105658, -61652, 129691, 191724, 212253, 240669, 118836, 190522, 421271]
6060D21271j65548j56079J10238J23523k41648m31920l36699k43422k3033J44447
6050g98870L20254M24302J68155m2675j92236l2643p6392K503J00565K3716P0112
6039c3209K41276J00246j0261M9162k65728k06038j9472o5744o1352m4063j22400
6028d37583p6872R7573K10644j4507Q4604Q613P7719J8815k218J11908j2054m7205
6016A9437M7631Q4672J21130n1028m61355l41549J6009L65509N02252J23619j29698
6005B96629k78510j96460j90951p8572J90314J15976Q8509m1319k64533j40377
5995d99294L1282l4035K73366J09967m1001q3254k8328J23208K10992R7438m6803
5984A13538l740j01789q8104L7000j00041k7080J79840J34200J6425M2569n3913
$$ y = [421271, 255723, 99644, 209882, 333405, 91757, -340163, -676862, -920284, -943317, -798870, -478616, -54314, 113841, 71166, -121070, -153713, -230105, -227602, -127037, -103321, -33209, 208067, 308313, 298052, 347214, 81486, -124552, -144024, -209768, -271120, -315183, -437583, -514455, -416882, -206238, -220745, -136141, -127528, -49809, -30994, -33212, 78696, 66642, 19437, 67068, 151740, 272870, 221842, -239513, -581062, -565053, -199544, 302708, 426327, 296629, 18119, -178341, -369292, -447864, -257550, -141574, -53065, -94384, -358917, -499294, -468012, -502047, -228681, -118714, -159715, -242969, -271297, -148089, 62903, 160341, 113538, 109798, 8009, -80095, -43095, -143136, -170216, 9624, 143824, 160249, 202818, 148905]
5973A48905q0269j02709Q669N6905r0213j71895Q9222J57778N7819L4132k1860
5962H6484m348n3719J00541R1189J63052K1223l02795m46501j10105J90204K9615
5951b35160J68067J42313R8785J74599j39119m07530l26242o9575L71227K95066
5941G2431l13533m13999r2999P6383R9052Q6810L1245J55564K13109J03044q179
5930H928P1404Q9943k02690Q6404L87812q2325m78962k39090O8111l1437j14581
5919d36483M6171N0006j61610N1868Q2124k6969K18425J42221j1831j39565l7889
5908b23532l0226j31131R8472Q3018J42712J87201J09446j46183j32758r4288
5898a37269Q3344L68627M4152k2706j19227N177l7586k10578J42475J15310j20173
$$ y = [148905, 68636, -34073, -25404, 31501, -58712, -230607, -141385, 16393, 74212, 108344, 86484, 82136, 28417, 128958, 220147, 383199, 404422, 101627, -344874, -454979, -264775, -235160, -67093, 75220, 174005, 348604, 209485, -198045, -524287, -593862, -222635, 72431, -241102, -655101, -748100, -671717, -572665, -485855, -454610, -299046, -85937, 17107, 8928, 80332, 170275, -32415, 53989, 441801, 359476, -119486, -358576, -290465, -321902, -436483, -390312, -340306, -501916, -450048, -367924, -394893, -176468, -34247, -46078, -185643, -223532, -253758, -384889, -286417, -203399, -60687, 126514, 235960, 89777, -42981, -137269, -53925, 314702, 358854, 336148, 216921, 222098, 184512, -26066, 116409, 231719, 111546]
5887A11546q662R8286Q1794k06878l02788J4228K41198Q3356q4297M7153L0799
5876A05735k171L7250o6655J03490m5649k52974j04121J30075P6615n8368M6438
5865c0335R8970r6371j18327O441j59005j14225K51603K22980Q4764M9798M2716
5854B39009M6991j45m7851O9491J08197j13385j97470l71868m08303q6898K14788
5843e47444L18231J61481k9934j23831k66214l60162l8672K28006J44020o0036
5833e74555k58415q5843K40983K92935L79784K02039j68505k34516m10351k17622
5823h34066Q2947L95666L79791J48088K82441R9132k26869j64517J30782L57716
5813F51111R7938r5264k88540l21257l521P8274l9097j09482K1213J3651m1151
$$ y = [111546, 102884, 201170, 282964, 76086, -226702, -212474, 28724, 112080, 27783, 74936, 105735, 103564, 140814, 74159, 177649, 132000, -120974, -225095, -95020, -18405, -76773, -30335, 68635, -27736, -146063, -139622, -298627, -412852, -161249, 61731, 146495, 196293, 239009, 286000, 285855, 238004, 307495, 415692, 302307, 104837, -267031, -675334, -762232, -547444, -229213, -67732, -97666, -221497, -487711, -847873, -886545, -658539, -514519, -574555, -832970, -918813, -677830, -384895, -5111, 196928, 28423, -206093, -616444, -834066, -751119, -355453, 24338, 172426, 454867, 553999, 327130, 162613, 293395, 651111, 749049, 653785, 365245, 43988, 40467, 118741, 79644, -29838, -8625, 5026, -36125]
5802c6125j19657m8937R0849Q8408q4381k01068j20156J04359K75285J7523j98455
5791b32355j19259P4618J61847K65176J72265P8449j8465K1933k673k86261l85561
5780b70286k32435J30862P2139K4503J63616K24452j468k89217r5938J22075L32743
5769A81046L05704r190q9567J55286k2224j39511l0450m8258o6624j2117K3783
5758B47878J17052Q7742k10839l90265j92784j28914k05967P7993K65182L41540
5748H618K20849j75817r5873j11916j20888n4786K174K26379K82453M76j82461
5737g92j78958j99130n255J27413J39644O9580r6895j31730R1651P4783j29192
5726b38881q8986j0870Q8110K21425K91324K70353J68585j07503l70287j86786
$$ y = [-36125, -155782, -204719, -113870, -25462, -109843, -310911, -431067, -326708, -51423, -33900, -232355, -351614, -276996, -115149, 150027, 322292, 400741, 382276, 404209, 401536, 115275, -270286, -502721, -371859, -299720, -275217, -111601, 112851, 111383, -177834, -273772, -151697, 181046, 486750, 477560, 387993, 543279, 521055, 381544, 351094, 302836, 236212, 224095, 247878, 364930, 452672, 241833, -148432, -341216, -470130, -676097, -598104, -332922, 8618, 229467, 53650, -42223, -154139, -275027, -329813, -327639, -101260, 181193, 181669, -792, -179750, -378880, -384135, -256722, -117078, -47498, -144393, -276123, -184472, -109689, -238881, -327867, -338737, -250627, -29202, 262122, 532475, 701060, 593557, 223270, 36484]
5716C6484J64815J14784J34007M675o3260N5276O4863q8665r7828R87P4613K87417
5704F88168M2317j07361j02840j06591j21296q1806l3820o3102l31718l69040
5694e87089R2661K89922L3979N7286P8776J31420J81011J1256j15295o4397K6606
5683A36136m0637j70315k57095J37148L7086m8357J08300K16004p1109n4146K3417
5672A6432R6090R0347j9463l62483k52276j76344k3520l1673O5089N05783K10620
5661A18602l8727k51959j84611Q5960M2096j73818m9466J52198K19255O0694K75228
5650B55452K83877m2901r4026j80109L4859K68138J25944K5055j16619l41001
5640B18669k39506J12241N6943j1227k6516J21960o2079n8159K694p3042o3736
$$ y = [36484, 201299, 316083, 450090, 454765, 391505, 446781, 511644, 422979, 325151, 326138, 400751, 688168, 730485, 623124, 520284, 413693, 292397, 210591, 176771, 113669, -218049, -587089, -494428, -204506, -170527, -113241, -34465, 96955, 277966, 289222, 173927, 109530, 136136, 95499, -74816, -331911, -194763, -157677, -206034, -97734, 118270, 47161, -6985, 16432, 112522, 202869, 183406, -179077, -431353, -607697, -631217, -662890, -597801, -92018, 118602, 79875, -172084, -356695, -270735, -228639, -402457, -451923, -299725, -80470, -19776, 255452, 539329, 496428, 402402, 222293, 257152, 525290, 651234, 676289, 559670, 218669, -20837, 91404, 148347, 137120, 110604, 232564, 170485, 112326, 115020, 41978, -21758]
5629b1758J53458O2464q8074l2991Q6564o711r1247j11899P6429R9616k50207
5618a24356p3873K92788K94339J8508j40964m3816O3196j64042k0572J05423K1542
5607B28173o137j54919j48136l55263j30085J63169J31291K20276M31825J23644
5597E03838o5239l4500R2567K38860k4966k21179n7828L9461n9092k83448n77443
5586d48969j57503k0938j42555K65797L02508P6115r1314o7052K24334J28600
5576F9023q8583k89903l19186P2759J64255q161L5937O3888O6022N7464K60785
5565H4300K90559O3614k58145l08559m582K67553J37746k7313N0731J37272L9886
5554D73062J01243J10263k26689q27J06622K0748r6155k4125q6401j47707k20167
$$ y = [-21758, 131700, 194164, 106090, 73099, 159663, 152952, 61705, -50194, 26235, 125851, -124356, -198229, 94559, 388898, 407406, 266442, 222626, 285822, 121780, 101208, 206631, 228173, 222036, 67117, -81019, -436282, -566367, -403198, -271907, -51631, 380194, 503838, 438599, 404099, 496666, 735526, 710560, 489381, 431553, 471014, 411922, 128474, -448969, -606472, -627410, -769965, -504168, -201660, -125545, -216859, -283911, -59577, 69023, -19560, -309463, -628649, -555890, -391635, -399796, -363859, -299971, -233949, -176485, 84300, 374859, 438473, 180328, -128231, -132813, 134740, 272486, 245173, 295904, 433176, 473062, 574305, 684568, 457879, 457052, 563674, 584422, 488267, 464142, 377741, 230034, 9867]
5543I867J0455K33141N3656J38269J16390r2911m37570k32238K06548K35601O7982
5532C09190L266J1275j48197k20513N4496K07907L3516l1061n6935q9138q5736
5521a1930K20870K05352j92198k34332l03104Q9493K00295j34695q42L5457J6712
5510a08922J50543J84464m2681r6733J9311K43898L56049L10915L1183j88687
5500H59340k55610k79377m8296r6081j68084j23414N042N4327J10750Q3472j13508
5489B8561j64353l9634K0832o1214L8868P6788N0384J88620J73380j03570p3476
5478A35186n5392l5379J33435R5871j48370k17017M9355Q5393Q7085j49845l28130
5467c47808k12442m6509Q8115R8824l3457n3222M164J22947N0681N3483Q3083
$$ y = [9867, 20322, 253463, 307119, 445388, 561778, 468867, 31297, -200941, 5607, 241208, 309190, 312456, 323731, 175534, -44979, 9517, 217424, 250940, 219879, 162944, 73806, -11930, 208940, 414292, 222094, -12238, -315342, -225849, -25554, -160249, -161091, -125634, -108922, 41621, 226085, 183404, 86671, 105982, 349880, 705929, 1016844, 1048027, 859340, 603730, 324353, 276057, 179976, 11892, -111522, -106480, -52153, 58597, 142069, 28561, -135792, -175426, -154594, -215808, -176940, -100152, -49768, 138852, 312232, 208662, 135186, 79794, 44415, 177850, 273721, 125351, -91666, -42311, 43082, 130167, -19678, -347808, -560250, -606759, -518644, -419820, -453277, -506499, -502335, -379388, -328707, -275224, -192141]
5456a92141n6492R171j2662k2047J52700K59193J47726K7945O7930J5013j17349
5445B78987P3857L03008J08030j58908k04054m137o1703k07758j89250O9075J87129
5434A94276Q8688J5310l9082p8828j37271m2242J99734j6721j4419J96549J89533
5423E55527j13926l84556k53609j43443l2086Q7938K08841K04703J30398j18810
5413A40977r706J12396J20078m1956l51171l16525J58371J85568j72704j62638
5403c37310k78915m5392J94746R0302K34100J31347j71448j32019O5317Q6325
5393a62947M5501J01005p8269j71282J16658q4653j8037K26199K3374j74183k24085
5382d00719o1307Q9257J16749p3852M5624J83865O6232k5261k21737p3752J16904
$$ y = [-192141, -248633, -239462, -252124, -274171, -121471, 137722, 285448, 313393, 381323, 396336, 278987, 352844, 655852, 763882, 604974, 400920, 396783, 335080, 127322, -61928, 7147, 194276, 282964, 298274, 259192, 180364, 43093, 851, 200585, 183864, 169445, 365994, 555527, 441601, 57045, -196564, -340007, -372093, -284155, -75314, 129389, 259787, 140977, 131271, 243667, 363745, 321789, -29382, -345907, -187536, -1968, -174672, -337310, -616225, -661617, -466871, -376569, -142469, -11122, -182570, -314589, -249272, -162947, -117446, -16441, -94710, -265992, -149334, -233987, -252024, -25825, -2451, -176634, -400719, -462026, -372769, -256020, -329872, -284248, -100383, -34151, -59412, -281149, -354901, -237997]
5371b37997q8207m09371j29575K21472K45752L5817j37207k7588J8305J46999
5361c61600Q9101p8731Q0459R3771n7421m6863J39133J51191n0482j6677N2018
5350f101j9449r8667n6733l60M9908l6266o1400J68944P1814k77918J4934J86578
5338f4716j20457R9607L94420K38027n4226p7903m3651l42060k62203j7081J59078
5327i1165N1451p6761M0028j03192N1057K71349K26387J42688L20955L88185K86401
5316A507383k71279p59392p31906k96830J86402K54833K76187K06026J53274J74447
5306F99145j59158l43458l4784J10126O2643m6903k19121L5725K96454J11819
5296E12488k95276k55952m9722j8964q1643p6755K55213J66069K0454p6238J2747
$$ y = [-237997, -326204, -735575, -865150, -643678, -397926, -362109, -499316, -526904, -508599, -361600, -272499, -351230, -270771, -177000, -234421, -281284, -142151, 9040, -41442, -58119, -6101, -25550, -124217, -180950, -181310, -131402, -167668, -229068, -60124, 11690, -266228, -251294, -64716, -185173, -85566, 308854, 546881, 492655, 414752, 371101, 29041, -233162, -250243, -91165, -39714, -116475, -76447, -179639, -128582, 142767, 369154, 511842, 832797, 1220982, 1507383, 1236104, 476712, -255194, -552024, -365622, -110789, 165398, 371424, 524698, 699145, 539987, 196529, 161745, 271871, 334514, 287611, 68490, 104215, 400669, 512488, 217212, -38740, -88462, -107426, -189069, -265824, -10611, 155458, 175912, 99674, 112421]
5285A12421M4418j72832j11376Q9469J0313J02995Q324J15021L24673r259j48640
5274C65527p4602j00749l09297k41033j43859j26681L9162J303J40289K72826
5264a77114K71472R3706R5313M5425j36883k31868r4525q380K1637K00038J45522
5253B24343j96694j96680j46249m0421Q28j44726o1323J85671L72939J17500j69971
5242e4783k25440j29812M6065O2923o214J80007K95487K4618O2937j64850l48306
5231b57368L9124K78397J38143k74358j39731J36318K56458Q2051q9044r5968
5221G4022j24022r8195n6778O8163Q1129J3137k3174j02121j40547k82682P1596
5210e19472K50314R5411O8222K31362J18347q212j45802j02936j7699R6627K29307
$$ y = [112421, 156839, -15993, -127369, -37900, -27587, 75408, 83732, 198753, 523426, 514167, 365527, 290925, 190176, -119121, -360154, -504013, -630694, -591532, -590229, -449940, -177114, 94358, 188064, 283377, 328802, 191919, -39949, -134474, -142854, -121217, 78821, 224343, 27649, -169031, -315280, -355701, -354873, -499599, -560922, -375251, -2312, 115188, -54783, -280223, -410035, -363970, -301047, -307261, -127254, 168233, 192851, 255788, 90938, -257368, -218244, 60153, 198296, -76062, -215793, -79475, 176983, 259034, 169990, 74022, -50000, -148195, -204973, -136810, -55681, -42544, -65718, -167839, -308386, -591068, -519472, -269158, -173747, -105525, 125837, 244184, 235972, 90170, -12766, -30465, 66162, 295469]
5199B95469l5965j55806N3685K5930l00397k66750Q2988K20259J32206M7186j00132
5188a327m7304J51561J58313p8834k13255k64514M8322L11456J75982m453k70370
5177c4423l46962j91002j11954l9945J25237K07210K88620K51035J81404K24514
5167E53734Q0461K556j94726k31734j39974J80033J33709J01072N3091p397k36579
5156B94246p3288J63598K2920J2934l5646j38529j65028j46951j19971k72714
5146d58429j59437K72626K83568N1603K8310K0297p9577p6606j29893j99885N1406
5135c96017J20608n4015K3537J81456J80272k4142l10217p5851J80960K61842
5125H8433P9659k24146k94161j91711L9928P9692L96919K44927j56795l29984
$$ y = [295469, 259504, 103698, 157383, 183313, -117084, -383834, -300846, -80587, 51619, 98805, -1327, -48631, 102930, 261243, 182409, -30846, -295360, -247038, 64418, 240400, 235947, -34423, -381385, -572387, -684341, -724286, -599049, -391839, -103219, 147816, 329220, 553734, 634195, 636751, 442025, 210291, 70317, 250350, 384059, 485131, 538222, 530825, 294246, 220958, 384556, 407476, 420410, 384764, 246235, 81207, -65744, -185715, -458429, -617866, -345240, -61672, -10069, 18241, 38538, -41039, -117645, -247538, -447423, -396017, -275409, -329424, -305887, -124431, 55841, 31699, -278518, -354369, -173409, 88433, 168092, -56054, -350215, -541926, -501998, -422306, -25387, 219540, 62745, -267239]
5115b67239K6264K77331N1688R878K97267J22064k60529m47530k23758r1442J57077
5104c48929K12768K35066L3029m008Q6440J80385J9777k70411j1739O2708N3501
5093B48587j59246l61168N2566J05847j30990J2862K58848J29302J17307j9431
5083B54484j19139j5854l2567P4400R0558o648l10449j03377k4013j41287L0720
5072c03172K05532L30109K12892P7351L6302m3502j42886k86438k94886j58776
5062c67474p2879J44054J29497L4596R3181R5042j8426p1676R185J18890K14447
5051C08437M6372j02525n8900p9024j86726r4871M5386m8574k06720L808Q1579
5040b91758O8361k9235N1134J65088q082j20363J7328J68471J5271O7627K97599
$$ y = [-267239, -240975, 36356, 88044, 97922, 395189, 517253, 256724, -190806, -414564, -506006, -348929, -136161, 98905, 131934, 127926, 214366, 394751, 414528, 144117, 132378, 195086, 248587, 89341, -271827, -219261, -113414, -244404, -231542, 27306, 156608, 273915, 254484, 135345, 119491, 86924, 161324, 251882, 245234, -65215, -168592, -192605, -333892, -303172, -97640, 232469, 445361, 522712, 559014, 515512, 372626, 86188, -208698, -367474, -440353, -296299, -166802, -132206, -39025, 56017, 37591, -34085, -24900, 93990, 308437, 354809, 252284, 193384, 114360, -72366, -167237, -121851, -170425, -377145, -373337, -291758, -223397, -252632, -201498, -36410, -44492, -164855, -147527, 20944, 36215, 103842, 401441]
5029D01441K2214l27815k53194J42063J91819K90865K51436J23997R2674j76258
5019G59242k25981j98980j32963p4621j41650q8145M2875O7853j25179j87450
5009c04999j44360J10963L47434R5273j97403j6334k5139M1573o7261j90062K86051
4998f4264K95002Q6898n9808q3561m7005O7114K01487o7205j87740J21452q8361
4987A74009j37669L4038O832l3550j30552n9416p6855o1362P0938K3782K60005
4976G0200K39081L8336o4250j64493k56070q5563q5670m5261O848J96130J69196
4965A8484k18792O5496K10484j75604k11445J07238J97404J11430K0035k62761
4955a38031j80192N2143O7666K6099J47183J43480j1754K17318J67606j38877
$$ y = [401441, 423655, 95840, -157354, -15291, 176528, 467393, 718829, 842826, 935500, 759242, 533261, 334281, 201318, 126697, -14953, -103098, -60223, 7630, -117549, -304999, -449359, -338396, 9038, 104311, -93092, -109426, -134565, -92992, -160253, -350315, -64264, 230738, 317636, 257828, 174267, 127262, 194376, 395863, 328658, 140918, 262370, 174009, 36340, 70378, 77210, 43660, -86892, -146308, -223163, -284525, -213587, -189805, 70200, 309281, 347617, 283367, 118874, -137196, -222759, -308429, -353690, -346842, -150712, 18484, -200308, -134812, 75672, -99932, -311377, -204139, -6735, 104695, 124730, -138031, -318223, -266080, -198414, -172315, -25132, 118348, 106594, 323912, 491518, 352641]
4945C52641k19232k76185r2856r0932L2574J14240q5230l6634J41461Q6970k12656
4934b85839j07384r1738q9539K49266L52286o4292k11951j18616K01972J89061
4924B3226J41219J82172j30003l03229k10888P8851K91475J95260Q5319j74871
4914A78531k2834Q9495o7348l05001r5813l267k82784j69217M5045J47353J25610
4903c60230o0742J8524R9550P0847j58980j63268K40920K77727P0661n030j51803
4892a21824k14934N4214n5460O1131J4582j80487L758K38853O9390r0668M9319
4881a72126J67199N9830R420J2658J24108N0574j02973j9606K41541J09388k38576
4870B41437j52357r6525j90212m04574l32226M7408K74366L98926J30075k36119
$$ y = [352641, 133409, -142776, -235632, -326564, -293990, -179750, -264980, -301614, -160153, -73183, -285839, -393223, -484961, -574500, -325234, 27052, -37240, -249191, -367807, -165835, 23226, 164445, 346617, 216614, -86615, -297503, -218652, 72823, 268083, 353402, 178531, 155697, 245192, 177844, -127157, -222970, -226237, -509021, -678238, -633193, -485840, -360230, -420972, -402448, -302898, -232051, -391031, -554299, -313379, -35652, 35009, 29979, -121824, -336758, -282544, -338004, -276873, -262291, -442778, -439020, -200167, -130777, -221445, -172126, -4927, 54903, 64323, 76981, 201089, 251663, 148690, 129084, 370625, 480013, 241437, 89080, -7445, -197657, -602231, -934457, -887049, -612683, -213757, -83682, -319801]
4860c19801l66272q6063K36868Q7781M5056K91600K66334L4023o3669j03572k14025
4849a91740k02999J03704J41209K1007r437q1791q798K24548J0787J1855o9584
4838e1239j25262p1835k83331k77394q1055L27608M57937K17203o5905Q4471K01154
4827C32352p4359j91295k96401p6603K59643L11920L1899k08863k84455l3372
4817b29534P214j20288L0405J02328j14893j10223J5682L7823K34441J11991J61752
4806A26698O6099j66413j99510l6123K97789J91186j02157k3925p8884J1900J82990
4795B69650J85457j31008r9967M6783J11040K7042j18908j17070o8118j61002
4785e6101Q7831M89258J06373k64820k66516j05112K03304K22270P5660k23185
$$ y = [-319801, -686073, -772136, -535268, -447487, -402431, -110831, 155503, 189526, 125857, 22285, -191740, -394739, -291035, -149826, -128819, -138256, -220047, -228845, -4297, 6490, 18345, -51239, -176501, -248336, -531667, -809061, -890116, -562508, -104571, 112632, 46727, 131198, 332352, 257993, 66698, -229703, -306306, -46663, 265257, 297156, 88293, -196162, -229534, -222320, -342608, -312203, -209875, -324768, -434991, -419309, -381486, -147045, -35054, 126698, 192797, 26384, -173126, -209249, 88540, 279726, 177569, 153644, 74760, 86660, 269650, 455107, 324099, 224132, 270915, 381955, 408997, 290089, 173019, 104901, -56101, 31730, 520988, 627361, 362541, 96025, -9087, 194217, 416487, 492147, 268962]
4775B68962m17297k52812r4604q7620K44588M32872J34618k39082k76382j41217
4765d27974Q4342K53309k5991j16661k08988j2777J56500K84918M2467P662J00252
4754A37059l2610p1530K03357L96244L03414k3731m12369m41331k43280L2772
4744a52005k762j3878m5160m6885P1668L336O9938K4703k90689k05595J09174
4733d78155K92953q8423k84440l3504J30352K46763J39636N9823j02204J45436
4723B8237J30053L1997J04484q043p1515j46636r7242k04037k54091o8150J38624
4712d16319J37117j3055j45739q0697P021O3330P7564Q5951J72099p500K0326
4701i9902J0341j33175j46148j59799J7244J68215L354J42052k492k5746J25602
$$ y = [268962, -148335, -401147, -495751, -583371, -338783, 94089, 228707, -10375, -286757, -427974, -343632, -90323, -116314, -232975, -441963, -454740, -298240, -13322, 29145, 36807, 137059, 104449, 32919, 236276, 632520, 935934, 912203, 499834, 58503, -184777, -152005, -154767, -168645, -213805, -260690, -189022, -185686, -115748, -91045, -381734, -587329, -478155, -185202, -273625, -558065, -591569, -461217, -214454, -74818, -14995, -117199, 28237, 158290, 190287, 294771, 286728, 215213, 68577, -28665, -232702, -486793, -554943, -416319, -279202, -292257, -437996, -518693, -511672, -448342, -370778, -284827, -112728, -120228, -99902, -89561, -222736, -368884, -528683, -511439, -343224, -339870, -197818, -200310, -226056, -100454]
4690a00454K28629O2340j29679N9382J46579J13744j96772m33487k06363J0893
4680d45188J08824M7570n3120K1013k7158J08042J81842j57363o047j54911l41621
4669g18117j47373L6475N4644N3233K69249J49412K07291J23211L4802q1380n6154
4658g4707J00921M5122r6882j89175Q9769K50983Q5434q8976j02805r1837J2351
4647e9802j41585j2886Q6807n7101Q7720K33287J42626q3633m1883J24556O3875
4636C41981j96645k21103k99114n6780R9780M3832J16786L39841L50160M9771
4626E68509j38750j01804k20414r2684L0510j0837j13136k20650j16070J59703
4616b55623J65240J33019k2884j88458N5340P0898q9351j02275M7037J6880j06015
$$ y = [-100454, 128175, 190515, 60836, 120218, 266797, 380541, 183769, -249718, -456081, -445188, -336364, -288794, -341914, -320901, -348059, -240017, -58175, -215538, -221585, -376496, -718117, -865490, -829015, -774371, -721138, -451889, -302477, -95186, 28025, 62827, -18553, -74707, 26214, 71336, -25546, -214721, -124952, 126031, 211465, 122489, 19684, -72153, -59802, -201387, -214273, -127466, -184567, -96847, 136440, 279066, 195433, 153550, 278106, 341981, 145336, -75767, -374881, -431661, -331881, -288049, -171263, 168578, 518738, 568509, 429759, 327955, 107541, 14857, 45367, 34530, -78606, -299256, -415326, -255623, -90383, 42636, 19752, -168706, -113366, -42468, -131819, -234094, -187057, -170177, -276192]
4605b76192l5231Q0600K64528K63960K23644R7281m4125l6882R8796n1076j03302
4594D82001p2467k8893K2687N6960j5821p8452j50350j53098R3479j22520m30614
4583c97088j4166K84128J16211p5749j5145K33498J97968n035o6182J0379L3328
4572C02147J00341L1796O567L1227M8396m8207k42877k05162k54811k38617j7007
4561d86207K36072J54526j57319j12930j00394M8617M07863M47951O5325j47344
4551C56160k79954l11788j18940O3200K16263J91195L216j48051l06583j39111
4541d74393J16986J32280k2410k10095l28766o1327M9184N0731M8601Q7631K84471
4530c27107J25090O7374P1738M7530m0145k21568k15381O1258K36985K04803j74689
$$ y = [-276192, -311423, -230823, 33705, 297665, 521309, 618590, 574465, 537583, 636379, 585303, 482001, 409534, 380641, 403328, 460288, 444467, 366015, 215665, 62567, 156046, 33526, -397088, -411254, -127126, -10915, -86664, -101809, 131689, 329657, 324622, 258440, 268819, 302147, 402488, 434284, 440851, 472078, 520474, 472267, 229390, 24228, -230583, -469200, -486207, -250135, -95609, -252928, -365858, -466252, -417635, -9772, 438179, 503504, 356160, 76206, -235582, -354522, -291322, -75059, 116136, 119352, -28699, -335282, -474393, -357407, -225127, -247537, -457632, -786398, -847725, -798541, -747810, -699209, -611578, -327107, -202017, -134643, -62905, -15375, -55520, -277088, -492469, -431211, -194226, 10577, -164112]
4519a64112l01849r5315r1401M5284L06249K07081k37366r6819J79818K86269
4509C7839K01844J5716J12294L06742O3487k38168k61647j68272M2614k2577m14551
4498c24679n86807l5542K33353J67331J57989J57187J34112L6215l4994Q1972
4488a3863J23714J19833K7550j49286m4244m0882r8078J84642j24627l24393J68810
4477a70824K27368j83298J966J49492J48731J44740M9239k9187l0116k6243o2966
4466B18902j85n6185j75339k73091p8064J1595J40299J63659M3152J29536J19140
4455B43419O0701j73293q4877J8218j7461J44l6215K278p9045K07126K40727k81499
4443A00223m23132r6436J60618J42383O6966k5938k38080j95093M751M0528J12521
$$ y = [-164112, -465961, -561276, -652677, -607393, -301144, -94063, -331429, -428248, -248430, 37839, 239683, 255399, 367693, 674435, 737922, 499754, 238107, 69835, 112449, 89872, -324679, -911486, -947028, -713675, -546344, -388355, -231168, -97056, -60841, -95835, -13863, 109851, 229684, 257234, 107948, 63704, 22822, -75256, 109386, -15241, -339634, -170824, 56544, -126754, -124788, 24704, 173435, 318175, 367414, 338227, 308111, 281868, 218902, 218717, 162532, -12807, -285898, -363962, -352367, -212068, -48409, -5257, 124279, 243419, 304120, 130827, 45950, 64168, 46707, 46851, 10636, 12914, -66131, 140995, 381722, 100223, -322909, -419345, -258727, -116344, -49378, -75316, -313396, -508489, -503738, -463210, -350689]
4432c50689J23257n400L4092k40148k30131n1556J19118K52881L00865Q3519L575
4421C9383J27194q74P7648J04206k42669j83177O8893O4476L1337p8285r5859
4410h7727l476N1805Q2964O0956J1882M5590j80635l21377j03147k0479k0822
4399d84466M4931J74258K05996K67594L25366J81373K0802j48580l55277r2643
4389A39354Q4088J32059J26354r4619m7056j16102k3810J5289K2543j46208k84267
4378a92375r3098K3769k84114k22082K16370K45751K78576K72891J17752K351
4368C65791k7900j39527k1081k21137M4529M2857j39527j112N4451J4747O7856
4357C9947O4158j37578K8855N1748K16581K19939m1068j97479j89554L4760P2927
$$ y = [-350689, -227432, -232832, -198740, -438888, -669019, -720575, -601457, -348576, -47711, 35808, 39383, 166577, 165703, 243351, 347557, 104888, -78289, -9396, 55080, 86417, 8132, -87727, -91203, -39398, 43566, 104522, 116404, 161994, -18641, -340018, -443165, -463644, -484466, -439535, -265277, -59281, 208313, 533679, 715052, 735854, 587274, 231997, 139354, 223442, 355501, 481855, 387236, 340180, 224078, 200268, 215557, 238100, 91892, -192375, -285473, -261704, -545818, -767900, -551530, -305779, -27203, 245688, 363440, 365791, 337891, 198364, 177283, -43854, 675, 43532, -95995, -97107, -42656, -27909, 39947, 104105, -33473, -4618, 47130, 263711, 483650, 442582, 245103, 55549, 90309, 163236]
4346A63236j25226R5190K59858P0210m4975o8338n2500J9118K05946J02729k15679
4335D09569j6816P6919O3961p5815k89242k32970P5479J11313P1933J04134J9378
4324C17843q7740j49601k58284j92044n2120l824J50570K10338j0990j98745j35833
4313d10430J1635R9450P0578n7384P5022L1585k47224j84861j2105L89320M04311
4302A69897L05704J29798l20284k64129L6586L0465J23896L58272J82457r7657
4292F55005p0657P0422j38948n75460l57381R4995J70585J54034J40786J00310
4282B43691P2560j39730k83505j42162Q0553J73601K60555k5990j69956j8799
4272E0818j93677j45433J58405L62397K84966O1198J1664n863k47645l70248k62667
$$ y = [163236, 38010, 133200, 393058, 463268, 418293, 349955, 297455, 316573, 522519, 625248, 409569, 392753, 469672, 533633, 457818, 168576, -64394, 11085, 122398, 194331, 298465, 317843, 230103, 80502, -177782, -369826, -421946, -425770, -275200, -64862, -75852, -274597, -410430, -398795, -299345, -228767, -286151, -211129, -179544, -426768, -611629, -623734, -234414, 169897, 475601, 605399, 285115, 20986, 57572, 88037, 211933, 570205, 752662, 655005, 584348, 654770, 515822, -59638, -417019, -322024, -151439, 2595, 143381, 243691, 316251, 176521, -106984, -249146, -168593, 5008, 265563, 239573, 69617, 50818, -142859, -288292, -129887, 232510, 517476, 578674, 590338, 584475, 336830, -33418, -296085]
4261b96085n5930m7906M4865K00481K29457r6642k27953j38336J42893K85592
4251D0436Q9075p7212m3284j59246p295K71898j7660l05887j97760N3258l9099
4240c92776R7484L19755L07917R1419p7226j13358k28589o7554Q2331M8208M9849
4229A17460k3654k41949q5199Q8922J37423K13539K7994j10890j59928j262r7810
4218a35354O8593O7669q6811j29876k35228k46596P6772J84502R7001k7326j74769
4207e41423k9482K14913J41214J97556K15994L062j06590j1715q6748L2990M0624
4196G0395j36048j77661j31167R1159J85618l2348p2659j75185k88260j13065
4186g79221L38260L78957L8212o3920n03K41493K09824N7322m6347j66637n7999
$$ y = [-296085, -352015, -399921, -355056, -154575, 74882, -21760, -249713, -388049, -245156, 40436, 129511, 52299, 9015, -150231, -157526, 114372, 96712, -209175, -406935, -353677, -392776, -295292, 24463, 332380, 423799, 346573, 233215, 4626, -62928, 19403, 67611, 117460, 93806, -148143, -233342, -144420, -6997, 206542, 234536, 123646, -36282, -37544, -135354, -66761, 908, -85903, -215779, -451007, -697603, -620831, -436329, -339328, -366654, -541423, -570905, -355992, -214778, -17222, 198772, 201834, 95244, 83529, -3219, 29771, 70395, -65653, -243314, -374481, -283322, -97704, -130052, -202711, -377896, -666156, -779221, -440961, -62004, -23792, -87712, -88215, 153278, 363102, 420424, 374077, 207440, 149441]
4175A49441O9179J04426J37937M4533k8356j7251k6449j07051k20587r2949k20392
4164b07519q1663J73419K5518M0650O8301J9519q212o7050q7369J3118N1550p8547
4152a38285k482J75105n9432l38663k06128j3293n7995L6758O3987K9544J85694
4141c25190L24612J9177j71635M6238Q0651J73435J77201j32733j1298J68129
4131C48587M8041p2258j17048j92088j20714J42174n5383n1885J59989J76111
4121B65526J18302J26571j2658l13414k16750p102L39566K07404j18454j15523
4111B73468j30317k53781j21680q3563Q30J56916J35094J9470M6913k8280J31787
4100A46857m1771O4581j17466k87303O170J82144j38969j33585j83297n458K12271
$$ y = [149441, 218620, 323046, 460983, 505516, 477160, 459909, 433460, 326409, 105822, 12873, -207519, -289182, -115763, -90245, -49595, 18706, 38225, 30013, -37037, -124406, -111288, -59738, -138285, -140767, 34338, -25094, -363757, -569885, -583178, -641173, -604415, -540428, -510884, -325190, -578, 18599, -153036, -106798, -26147, 147288, 324489, 191756, 180458, 348587, 396628, 324370, 207322, 15234, -105480, 36694, -18689, -70574, 89415, 265526, 383828, 510399, 497741, 184327, -32423, -39525, 300041, 507445, 388991, 273468, 143151, -110630, -232310, -315873, -315043, -158127, -23033, -3563, 43350, 15070, 146857, 105086, 169667, 52201, -235102, -228932, -46788, -185757, -319342, -502639, -508097, -295826]
4089b95826K79684L40972L32107J47591j18423o7838q2355k10235l22828k00999
4079a98150L4280K19593J44047m7968N6271J52971J32446p0129l25866j09674
4069a2179o9592r2667p5288r5888j36329L077J41204J84437K37848N7792P1823
4058B14238J84144O2249k24425k78860J67156L42962J12270J4859j39880p057
4048D47656m950q7405j88664j90731l8869J51489K58205L1888p7863k2619R0367
4037C68504n4326L5226J20853Q1692k0711k72470k11967j4485j04757L3607j1575
4026e0409k2299j7829j00376L3464o0344q2144J25101O2312N4381N7427R5624
4015I4908R6531J54952J59985L6158R8504J02010j6850Q76o1304j34081m5260
$$ y = [-295826, -16142, 324830, 656937, 804528, 686105, 618267, 535912, 325677, 2849, -198150, -163870, 55723, 199770, 151802, 208073, 361044, 493490, 423361, 97495, -12179, -81771, -174438, -249726, -345614, -481943, -478866, -337662, -153225, 84623, 142415, 214238, 398382, 460631, 236206, -42654, 124502, 467464, 579734, 594593, 454713, 447656, 442706, 355301, 166637, -24094, -62963, 88526, 346731, 378619, 300756, 278137, 368504, 314178, 349404, 470257, 551949, 531238, 258768, 46801, 32316, -72441, -38834, -50409, -72708, -90537, -190913, -157449, -217793, -299937, -174836, -112524, -58143, -716, 94908, 191439, 346391, 506376, 542534, 641038, 743048, 726198, 727074, 665770, 531689, 486429]
4004D86429o3998k56096l40547K051J07357J87976J02089p6187j0505J6228J56796
3993C11593J74998p2845J74119K78483j75816l74793m32410k69818j40093N004
3983e21578J19842P9170j18823M5944p0688m2900p2896J1137J46756K59575K03036
3972C8575J56216J57877J81029J20884j5741j31487k48517j95446K7490r4129
3962c249k56859l73618M258K59518Q0912J9546O8123J40444K58119j3223q277
3951A75694K20748r5503j24707j34337k9816q7599q4343j7981j8920R6452n9938
3940a60250J5859J60538J14843N2426Q0706L1001k3825k4926m6113j03040k82660
3929a85441O8969P2197n8373J63032M37952L41516j04233k94149l91146k97230
$$ y = [486429, 422431, 166335, -174212, -172161, -64804, 123172, 225261, 149074, 138569, 154797, 311593, 486591, 413746, 587865, 866348, 690532, 315739, -116671, -386489, -526582, -521578, -401736, -322566, -441389, -395445, -466133, -509033, -581929, -570792, -424036, -164461, 38575, 194791, 352668, 533697, 654581, 638840, 507353, 258836, 63390, 90880, -3249, -260108, -633726, -629468, -369950, -289038, -269492, -201369, -60925, 197194, 183971, 175694, 396442, 300939, 176232, 41895, 12079, -75520, -159863, -177844, -196764, -100312, -160250, -144391, 16147, 130990, 183416, 264122, 295123, 271298, 246372, 200259, 97219, -185441, -116472, -44275, -102648, 60384, 498336, 839852, 735619, 441470, 50324, -246906]
3919b46906j5857R6197J20214L6079K03499K45203Q682k21292j34169k74826k5566
3908b08742K56433J40164j28750l08202j90063j6212k7130M6899M0598J23474
3898b71531J08725j12231M6911L6905k20274l44870J46278L99860J09590k2162
3888a22799Q8145K46336J19981j52529R4361P9583k70213j99606j8095J82257
3878D7421J08985j89210j51725J55413J6025j26116k15421N949J95694J61641
3868H656j6278o2269J7606j0129l5801k3448o8949K886Q7788j19485O0755L3366
3856a25302k5488K34149J29822n9531R19l0972N3461J29990Q5693j04081j49583
3845A39077r9787J57784Q5062n094q8031j43125q1405j9107N3995j634n7180j10309
$$ y = [-246906, -262763, -166566, -46352, -10273, 193226, 438429, 447111, 225819, 91650, -183176, -208742, 47691, 187855, 59105, -249097, -439160, -455372, -482502, -435603, -395005, -271531, -162806, -275037, -228126, -191221, -411495, -756365, -610087, -210227, -100637, -122799, -34654, 211682, 331663, 179134, 273495, 353078, 82865, -116741, -134836, 47421, 156406, -32804, -184529, -29116, -13091, -139207, -354628, -348679, -152985, 8656, -7622, -69891, -52285, -62414, -98215, -121663, -190612, -187726, -99938, -219423, -158668, -125302, -150790, 83359, 213181, 153650, 154569, 123597, 177058, 307048, 392741, 288660, 139077, 39290, 197074, 282136, 277042, 189011, 45886, -35519, -54626, -631, -2265, -59445, -169754]
3833a69754j14178n0704J38465K7476n2131j6709m8825l0689J21757K16221P5867
3822I6796j26097l9782J31349J20350j03790j7576m8370l3302P8989K08948K58082
3811E25597o2208j30543L9474l312k6137N2366j43095j56024N8597J02668n2289
3800B05094j10468j10909k39085j72741J01298K51531J85051J89574K40748K78359
3790H18452J4828l92793l84493l37987q9993Q9019j2136J37810K96545L28003
3780D67255p8938l66775o2017Q5248j37064j65360K2042J09281K0015m8777L9352
3769a15738K0947j690j08965L3088N358M2167L2413k30185q5567J65452J89463
3758e3257l9952N0186J84727J9716Q1075J50109k9212O2034M2819j43149q6890
$$ y = [-169754, -283932, -334636, -196171, -168695, -220826, -237535, -286360, -317049, -195292, 20929, 96796, -29301, -69083, 62266, 182616, 78826, 61250, 12880, -20422, 58567, 267515, 525597, 463389, 332846, 372320, 369008, 342871, 395237, 252142, 96118, 154715, 257383, 205094, 94626, -16283, -255368, -428109, -326811, -75280, 109771, 299345, 540093, 818452, 833280, 440487, 55994, -281993, -371986, -282967, -295103, -157293, 139252, 467255, 388317, 21542, -40475, 44773, -92291, -257651, -235609, -126328, -106313, -155090, -115738, -94791, -96481, -205446, -172358, -167000, -124833, -92420, -322605, -408172, -242720, -53257, -93209, -43023, 141704, 161420, 242495, 392604, 363392, 425426, 468245, 325096, 238206]
3747B38206r9871k95702j69630Q0400J19143n291o9507k45279p8173j2562k39206
3736g77472j39446j16333J85109K70546p7909M8784J04844J32118J49574L203
3726b16982P3287L215j11472J26585O2746L4045J30120M0443j90642j19393J93236
3715B5188J59421J5896K3358j0534k10480j69209r7104n6892Q6376K74954J36485
3704A77459J92234N612q7878p7843k74686l47607k28809k4112J69448J79600J56422
3693a60160Q1017p19k2385n2839N5702Q8793N1767J00207Q2289k05336k13481
3682a95145K23245M33007J96869K192j69805j55744k69462k92131n3439r9167
3672c79580J16067L14179J75986J40730K26615L0647m4707j35817j38705j49188
$$ y = [238206, 138335, -157367, -326997, -246597, -127454, -132745, -202252, -447531, -525704, -538266, -777472, -916918, -1033251, -848142, -577596, -655505, -606721, -501877, -369759, -220185, -216982, -143695, -140480, -251952, -125367, -62621, -28576, 101544, 141987, -48655, -168048, 25188, 184609, 200505, 223863, 213329, 2849, -166360, -263464, -320356, -233980, 40974, 177459, 369693, 375305, 287427, 209584, -65102, -412709, -641518, -665630, -496182, -316582, -160160, -79143, -79862, -102247, -155086, -99384, -10591, 41176, 141383, 223672, 18336, -195145, 28100, 461107, 657976, 660168, 490363, 334619, 65157, -226974, -280413, -379580, -263513, 50666, 226652, 367382, 593997, 624644, 579937, 444120, 305415, 156227]
3662A56227p8424J63276J54308N091p6175K2554O1005l4479o9170L1508J61531
3651D97252k5377j11302L6890N814l6569k5306j85082k39005q5244j48155l1985
3640c48069J60447J84996M6699j187P4893o2012j44976m8288j38518o3361m4546
3629c83922k59733j96616P8417J59361P7589J93203J99825K15124J93141Q7268
3619C63657m9383l5565j1738o4046q1978j63645j7432P3508n9598k07234l13315
3608e66769N2437K72496J39313j03055l45882q1489J60532M0467j61697l8225
3598f31872J42679J72735j12471M2241K29113J08888R9004R9062J90061K87098
3588F26538J56025R0173K0057k06132k92019k65489j59056k23224j27646j20297
$$ y = [156227, 77803, 241079, 395387, 400478, 324303, 346857, 407862, 373383, 304213, 335721, 497252, 471875, 360573, 397463, 403277, 366708, 341402, 156320, -82685, -167929, -316084, -348069, -187622, -2626, 44073, 42886, 117779, 55767, -89209, -137497, -276015, -339376, -383922, -643655, -840271, -761854, -602493, -524904, -331701, -131876, 83248, 276389, 363657, 314274, 278709, 266971, 202925, 120947, -42698, -60130, 13378, -46220, -253454, -566769, -514332, -241836, -102523, -205578, -551460, -632949, -472417, -431950, -593647, -631872, -489193, -316458, -428929, -386688, -157575, -48687, 50317, 149379, 339440, 626538, 782563, 872736, 892793, 686661, 394642, 129153, -29903, -253127, -380773, -501070]
3578e01070p1017J04323L08728J56428k48547n1235K12745J48506J19630K242
3568A80733j41332j25029o0089k1782n1380k22810k03510k96752j48533J02444
3558i88040K39361M24991L35268o848j12696j15002r6674p163M2813r9068o7673
3547d50731k4008J08565K92387N2429j5335p0495j03441j32487n568J5015J34016
3536a99653K27962n6451k40974j41931j03518Q3724J43068L08964K72422j12722
3526A80891j31160j48116L3635J30082p8645j8772Q2474J78734o8798k05277j24290
3515a69242k1026K14362j18009j50259n3100j26005k4408n9252O5136K5368k8526
3504d44961j9962N9856J05965J02089O6167J16750R7905j44670l5448J11505r576
$$ y = [-501070, -572087, -467764, -159036, -2608, -251155, -302390, -89645, 58861, 178491, 180733, 39401, -85628, -145717, -167499, -218879, -441689, -645199, -941951, -1090484, -988040, -748679, -323688, 11580, 4732, -107964, -222966, -319640, -326803, -283990, -383058, -450731, -474739, -366174, -73787, -21358, -36693, -107188, -210629, -343116, -348684, -333669, -199653, 28309, -28142, -269116, -411047, -514565, -430841, -287773, 21191, 293613, 180891, 49731, -98385, -64750, 65332, -13313, -32085, 50389, 229123, 160325, -44952, -169242, -190268, 24094, -93915, -244174, -297274, -423279, -447687, -506939, -441803, -416435, -444961, -464923, -405067, -299102, -197013, -130846, -14096, 83809, -60861, -96309, 15196, 5620]
3493E620Q4376K08745L82787K63681j90533n1137J01336p0084j23000j80458j50291
3482B81042L0333K5898p5113p0372k41967k27175p2018J21434J82736L727O103
3471c5372j6945K45867K68389j01962l79504k20331M1280J12294N9173K16703
3461A89592k1264j71048R4675K11089J22710k06508k56826k7538L3758p4728j65938
3450b72026k11114j03714M7815q2190M1049K84028J51662M2619r2800j04200M4325
3439b54546J18485Q1441l9366o1954K02043K52134K04253L4204l9157o0248k98471
3428A38818j92420J1695k02584k9416J34411J00167J16773q5347J79906J74794
3418C46797k36482j33714K7564J54986K24567J35987p9766j67417o9810j85184
$$ y = [5620, 89996, 298741, 681528, 945209, 754676, 703539, 804875, 734791, 611791, 431333, 281042, 311375, 337273, 262160, 191788, -50179, -277354, -349372, -227938, -45202, -41475, -35372, -52317, 193550, 461939, 359977, -19527, -239858, -198578, -86284, -27111, 189592, 168328, -2720, 91955, 303044, 425754, 219246, -37580, -65118, -31360, -106088, -272026, -483140, -586854, -539039, -621229, -580180, -296152, -144490, -101871, -194671, -298871, -254546, -136061, -54620, -93986, -155940, 46103, 298237, 502490, 536694, 497537, 437289, 138818, -53602, -41907, -244491, -273907, -139496, -39329, 77444, -7903, 172003, 346797, 110315, -23399, 4165, 159151, 383718, 519705, 439939, 272522, 202712, 17528]
3408A7528r8703N4842K00783R5193q2887q7049j28127j85123M4012K42995K7896
3397A01360k83425k37327K48707L52288K04070K79156N7989k27852j4173P5125
3387E55918n0860k56299k44432r6667p5376r5145J29939J62781q9496n33362k50272
3376h43271K0893n73609n05766N60885Q47632M42897K94219J42166j26993j09935
3366A49118J40700J66040m4967k20478j77551J03222K18345K47442K70224O6932
3356I19027k36694l20381j88007K0791K70871L18015l4320j61653j83981q7941
3346C15727N6024L142n1383J706q4151l5485P2159p429L866r6972J7513j42782
3334E1935k16181J17905J53295j53843j52846M867n6417J04956J84574p470k2158
$$ y = [17528, -81175, -26333, 174450, 269643, 186756, 99707, -28420, -213543, -169531, 73464, 101360, -182065, -419392, -170685, 181603, 385673, 664829, 722818, 494966, 480793, 555918, 505058, 248759, 4327, -92340, -167716, -262861, -132922, 29859, -59637, -592999, -843271, -822378, -1395987, -1901753, -1340868, -493236, -50339, 243880, 386046, 259053, 149118, 289818, 455858, 410891, 190413, 12862, 116084, 334429, 581871, 852095, 919027, 682333, 361952, 173945, 194736, 465607, 783622, 749302, 587649, 403668, 315727, 371751, 374893, 323510, 325216, 241065, 205580, 277739, 270310, 274176, 177204, 194717, 51935, -164246, -46341, 106954, -46889, -199735, -194868, -251285, -146329, 38245, 30775, 8617]
3323H617J00696J08386O9940J55362J55255j68751m26265l02928j20643K36046
3313a84285K28189J26243K8315j2265m647r0946J17p8035p8197M5531N3515j35167
3301a01632j58775o3225J73823J57706K29629J50973m612L4228l4035j01594j33533
3290A48953r5261j27767J62127L80029K84341k39219m37763l55583j10712P7405
3280c13450J39486J14013K39228p9828k41183l742K42529J70351j20352j27959
3270A9093k8413k6469r8596J8034K56412K5404j77477J8918j13469j9311J53660
3259B7786P7411k6458J2344N2064j33398j79352m4384l6817o5049K35286L00151
3248B19584P8911o5755j36077k8391J61664r219k05362j18720J11564K90675J14003
$$ y = [8617, 109313, 217699, 287639, 443001, 598256, 429505, 3240, -299688, -420331, -184285, 43904, 170147, 198462, 186197, 181550, 90604, 90721, 12686, -65511, -19980, 33535, -101632, -260407, -323632, -149809, 7897, 237526, 388499, 383887, 418115, 384080, 282486, 148953, 53692, -74075, 88052, 468081, 752422, 513203, 75440, -280143, -390855, -313450, -173964, -59951, 179277, 99449, -141734, -145476, 97053, 267404, 147052, 19093, -9320, -35789, -134385, -116351, 140061, 165465, -12012, 6906, -106563, -125874, 27786, 105197, 78739, 91083, 143147, 9749, -169603, -213987, -250804, -315853, -80567, 219584, 298495, 232740, 96663, 68272, 229936, 220717, 15355, -103365, 8199, 298874, 412877]
3237D12877o2319j05559R479P0065O73k12773k36575K7098J7962K2371P3800R4828
3225A11927K0746j25282j49248j23452l54032k45198J30074J19436o7802n4728
3215g37559J5696K34994J51901N9548L7997k2889p5222o5852N7530l279J06447
3204b40688L2000r6942n2230K3700l6886m0314J71713n9833N6017J69639j8872
3193i2696m110p2867L8264J47857O991k32358j78542j46541P3775J53887j12176
3182d18516M9064K25619K50620K37440j20368k25090k16816j83626l2666o6503
3172e00842J15716K42645J65108J70273J45156P982J24859M9614r1859l73064
3162E5588j75291K15701J55776k17860l37783J1597K71958L83621R2937K9727
$$ y = [412877, 350558, 244999, 254478, 324543, 325216, 112443, -124132, -97034, -79072, -56701, 17099, 111927, 132673, 7391, -141857, -265309, -619341, -864539, -734465, -615029, -682831, -737559, -721863, -486869, -334968, -275420, -237423, -260312, -335534, -401386, -343856, -347135, -240688, -208688, -305630, -357860, -334160, -371046, -411360, -239647, -299480, -243463, -73824, -92696, -96806, -169673, -131409, 16448, 23439, -208919, -387461, -534002, -460227, -306340, -418516, -369452, -143833, 106787, 344227, 223859, -1231, -218047, -401673, -434339, -500842, -385126, -142481, 22627, 192900, 338056, 346038, 470897, 520511, 428652, 55588, -119703, 95998, 251774, 33914, -303869, -292272, -20314, 363307, 456244, 485971]
3152D85971K60484N361n2880j14243j89700p2743L475j38776j36333P3131J96112
3141C19859J74514o0051k26316p6866J98774J41712m1462j74699l34062j04315
3131a82912K81246J92759N6759q553J49701J80341J13253j55750m9801J20224
3121F97267j49614k90897k33886o236K10503r9371m28999k88129k3524K7037Q9786
3110d96063J82926K14658Q3107r7476m02557l20076j24783K63561K56830K90009
3100a49864J17445n2739J0627q9280K8229L15378L95167J56976P0271p0785m81252
3089B50173m25143o5676K67011L36508N4320j40259k16256j03483j35152n3433
3079b31390K27581P4969j10928O912k9075J27788J01626k18677q9525J5875J70025
$$ y = [485971, 746455, 751816, 698936, 584693, 394993, 322250, 325725, 186949, 50616, 123747, 319859, 494373, 434322, 208006, 131140, 329914, 471626, 430164, 255465, -78597, -182912, 98334, 291093, 347852, 339299, 489000, 669341, 782594, 626844, 577043, 697267, 547653, 256756, 22870, 16634, 227137, 127766, -301233, -589362, -612886, -585849, -496063, -313137, -98479, -15372, -112848, -515405, -835481, -960264, -696703, -439873, -149864, -32419, -85158, -74531, -163811, -135582, 179796, 574963, 731939, 802210, 731425, 250173, -174970, -240646, 26365, 362873, 417193, 276934, 60678, -42805, -177957, -231390, -3809, 71160, -39768, -32856, -61931, 65857, 167483, -51194, -140719, -124844, 45181]
3068D5181p8006l04003k37768l3622R9550J90212J35563J24230M5465J32171K09191
$$ y = [45181, -32825, -336828, -574596, -608218, -508668, -318456, -182893, -58663, -13198, 118973, 328164]
$$ [...]
##END NTUPLES=NMR SPECTRUM
##END=
