##TITLE=C13_SR_IMG_4
 CDCl3, 22500sc

 17.11.2021
##JCAMPDX= 6.0         $$ Bruker NMR JCAMP-DX V2.0
##DATA TYPE= NMR SPECTRUM
##DATA CLASS= NTUPLES
##ORIGIN= UXNMR, Bruker Analytische Messtechnik GmbH
##OWNER= root
$$ XWIN-NMR		Version 3.5
$$ Thu Nov 18 11:02:41 2021 Russian Standard Time (UT+4h)  she@DPX200
##.OBSERVE FREQUENCY= 50.327896
##.OBSERVE NUCLEUS= ^13C
##.ACQUISITION MODE= SIMULTANEOUS
##.ACQUISITION SCHEME= undefined
##.AVERAGES= 22501
##.DIGITISER RES= 17
##SPECTROMETER/DATA SYSTEM= spect
##.PULSE SEQUENCE= zgpg30
##.SOLVENT NAME= Acetone
##.SHIFT REFERENCE= (INTERNAL, Acetone, 0, 223.62)
##AUDIT TRAIL= $$ (NUMBER, WHEN, WHO, WHERE, WHAT)
$$ ##TITLE= Audit trail, XWIN-NMR		Version 3.5
$$ ##JCAMPDX= 5.01
$$ ##ORIGIN= Bruker BioSpin GmbH
$$ ##OWNER= she
$$ F:/spectra/data/she/nmr/c13/1/pdata/1/auditp.txt
$$ ##AUDIT TRAIL=  $$ (NUMBER, WHEN, WHO, WHERE, WHAT)
(   1,<2021-11-18 11:01:04.54 +0400>,<she>,<DPX200>,
      <created by zg, POWCHK disabled, PULCHK disabled
       terminated by command 'halt'
       configuration hash MD5:
       00 E9 B6 7A A2 85 ED C7 34 08 36 98 17 FE 4E 26
       data hash MD5: 32K
       F1 FD F7 27 63 2B 57 B2 35 8C FF C8 A2 4F 70 B7>)
(   2,<2021-11-18 11:01:07.14 +0400>,<she>,<DPX200>,
      <Start of raw data processing
       efp BC_mod = 2 LB = 1 FT_mod = 6 PKNL = 1 PHC0 = -305.2912 PHC1 = -3.237635 SI = 32K 
       data hash MD5: 32K
       32 F4 F6 C0 4F 9A AE 6F 1C 30 21 86 40 E4 CF 96>)
(   3,<2021-11-18 11:01:09.78 +0400>,<she>,<DPX200>,
      <abs ABSG = 5 
       data hash MD5: 32K
       71 46 DC 05 BF D0 39 CC 21 AE E9 34 1C 8A EC 19>)
(   4,<2021-11-18 11:01:44.09 +0400>,<she>,<DPX200>,
      <pk PHC0 = 2.459437 PHC1 = -3.799999 
       data hash MD5: 32K
       6D 92 42 E1 6B CC 62 BE AC 0E 86 DF 88 F5 25 02>)
(   5,<2021-11-18 11:01:47.40 +0400>,<she>,<DPX200>,
      <abs ABSG = 5 
       data hash MD5: 32K
       9A 02 4B B8 1B 81 2E DF 21 B9 76 53 86 5F 3F 5E>)
$$ ##END=
$$ 
$$ hash MD5
$$ 58 35 B0 76 7F 89 53 EA 1D 10 97 4D 33 2D AB 44
##$RELAX= 
##$RELAX= 
##$RELAX= 
##$RELAX= 
##$RELAX= 
##$RELAX= 
##$RELAX= 
##$RELAX= 
$$ Bruker specific parameters
$$ --------------------------
##$DU= <F:/spectra>
##$EXPNO= 1
##$NAME= <c13>
##$PROCNO= 1
##$TYPE= <nmr>
##$USER= <she>
##$AMP= (0..31)
100 100 100 100 100 100 100 100 100 100 100 100 100 100 100 100 100 100 
100 100 100 100 100 100 100 100 100 100 100 100 100 100 
##$AQSEQ= 0
##$AQ_mod= 1
##$AUNM= <au_zg>
##$AUTOPOS= <>
##$BF1= 50.322709
##$BF2= 200.13
##$BF3= 50.322709
##$BF4= 500.13
##$BF5= 500.13
##$BF6= 500.13
##$BF7= 500.13
##$BF8= 500.13
##$BYTORDA= 1
##$CFDGTYP= 0
##$CFRGTYP= 5
##$CHEMSTR= <none>
##$CNST= (0..31)
1 1 145 1 1 1 1 1 1 1 1 1 1 1 1 1 1 1 1 1 1 1 1 1 1 1 1 1 1 1 1 1 
##$CPDPRG= <waltz16>
##$CPDPRG1= <>
##$CPDPRG2= <waltz16>
##$CPDPRG3= <>
##$CPDPRG4= <mlev>
##$CPDPRG5= <mlev>
##$CPDPRG6= <mlev>
##$CPDPRG7= <mlev>
##$CPDPRG8= <mlev>
##$CPDPRGB= <>
##$CPDPRGT= <>
##$D= (0..31)
$$ [...]
##$SUBNAM4= <"">
##$SUBNAM5= <"">
##$SUBNAM6= <"">
##$SUBNAM7= <"">
##$SUBNAM8= <"">
##$SUBNAM9= <"">
##$SW= 239.972175391363
##$SWIBOX= (0..15)
0 1 3 0 0 0 0 0 0 0 0 0 0 0 0 0 
##$SW_h= 12077.2946859903
##$TD= 32768
##$TD0= 1
##$TE= 0
##$TE2= 300
##$TE3= 300
##$TEG= 300
##$TL= (0..7)
120 120 120 120 120 120 120 120 
##$TP= (0..7)
150 150 150 150 150 150 150 150 
##$TP07= 0
##$TPNAME0= <>
##$TPNAME1= <>
##$TPNAME2= <>
##$TPNAME3= <>
##$TPNAME4= <>
##$TPNAME5= <>
##$TPNAME6= <>
##$TPNAME7= <>
##$TPOAL= (0..7)
0.5 0.5 0.5 0.5 0.5 0.5 0.5 0.5 
##$TPOFFS= (0..7)
0 0 0 0 0 0 0 0 
##$TUNHIN= 0
##$TUNHOUT= 0
##$TUNXOUT= 0
##$USERA1= <user>
##$USERA2= <user>
##$USERA3= <user>
##$USERA4= <user>
##$USERA5= <user>
##$V9= 5
##$VALIST= <valist>
##$VCLIST= <CCCCCCCCCCCCCCC>
##$VD= 0
##$VDLIST= <DDDDDDDDDDDDDDD>
##$VPLIST= <PPPPPPPPPPPPPPP>
##$VTLIST= <TTTTTTTTTTTTTTT>
##$WBST= 1024
##$WBSW= 4
##$XGAIN= (0..3)
0 0 0 0 
##$XL= 0
##$YL= 0
##$YMAX_a= 143084404
##$YMIN_a= -34187498
##$ZGOPTNS= <>
##$ZL1= 120
##$ZL2= 120
##$ZL3= 120
##$ZL4= 120
##$ABSF1= 223.6203
##$ABSF2= -16.37674
##$ABSG= 5
##$ABSL= 3
##$ALPHA= 0
##$AQORDER= 0
##$ASSFAC= 0
##$ASSFACI= 0
##$ASSFACX= 0
##$ASSWID= 0
##$AUNMP= <proc_1d>
##$AZFE= 0.1
##$AZFW= 0.5
##$BCFW= 0
##$BC_mod= 2
##$BYTORDP= 0
##$COROFFS= 0
##$CY= -3
##$DATMOD= 1
##$DC= 0
##$DFILT= <>
##$DTYPP= 0
##$F1P= 0
##$F2P= 0
##$FCOR= 0.5
##$FTSIZE= 32768
##$FT_mod= 6
##$GAMMA= 0
##$GB= 0
##$INTBC= 1
##$INTSCL= 4.134877e-10
##$ISEN= 128
##$LB= 1
##$LEV0= 0
##$LPBIN= 0
##$MAXI= 10000
##$MC2= 0
##$MEAN= 0
##$ME_mod= 0
##$MI= 0.1934396
##$NCOEF= 0
##$NC_proc= 2
##$NLEV= 6
##$NOISF1= 120.0001
##$NOISF2= 80.00006
##$NSP= 0
##$NTH_PI= 0
##$NZP= 0
##$OFFSET= 223.6203
##$PC= 1.4
##$PHC0= -302.8318
##$PHC1= -7.037634
##$PH_mod= 1
##$PKNL= yes
##$PPARMOD= 0
##$PSCAL= 0
##$PSIGN= 0
##$REVERSE= no
##$SF= 50.3226814732359
##$SI= 32768
##$SIGF1= 140
##$SIGF2= 120
##$SINO= 11.81781
##$SIOLD= 32768
##$SREGLST= <13C.CDCl3>
##$SSB= 0
##$STSI= 32768
##$STSR= 0
##$SW_p= 12077.2946859903
##$SYMM= 0
##$S_DEV= 0
##$TDeff= 32768
##$TDoff= 0
##$TI= <>
##$TILT= no
##$TM1= 0
##$TM2= 0
##$TOPLEV= 0
##$USERP1= <user>
##$USERP2= <user>
##$USERP3= <user>
##$USERP4= <user>
##$USERP5= <user>
##$WDW= 1
##$XDIM= 32768
##$YMAX_p= 496497348
##$YMIN_p= -19431582
$$ End of Bruker specific parameters
$$ ---------------------------------
##NTUPLES= NMR SPECTRUM
##VAR_NAME=  FREQUENCY,     SPECTRUM/REAL,   SPECTRUM/IMAG
##SYMBOL=    X,             R,               I
##VAR_TYPE=  INDEPENDENT,   DEPENDENT,       DEPENDENT
##VAR_FORM=  AFFN,          ASDF,            ASDF
##VAR_DIM=   32768,         32768,           32768
##UNITS=     HZ,            ARBITRARY UNITS, ARBITRARY UNITS
##FACTOR=    0.368581032318806, 1,           1
##FIRST=     11253.1731425924, 0,            0
##LAST=      -824.121543397872, 0,           0
##MIN=       -824.121543397872, -19431582,   0
##MAX=       11253.1731425924, 496497348,    0
$$ Real data points
##PAGE= N=1
##DATA TABLE= (X++(R..R)), XYDATA
$$ [...]
15829B0482J46377J8370l33863l72532j00793M6921k22820k60485o5492L34941
$$ 20482 166859 185229 -148634 -521166 -621959 -575038 -797858 -1058343 -1123835 -788894
15819g88894O23458K56560M1300J16670N1504Q4294J55772J90261P4837Q6800
$$ -788894 -165436 91124 132424 249094 300598 384892 540664 730925 805762 892562
15809H92562J94891l7367r20716o85758l67728J91032L81094k09241j44418k07260
$$ 892562 1087453 1050086 129370 -556388 -924116 -733084 -351990 -561231 -705649 -912909
15799i12909Q9746L78230K40698K19999L052k5186j91963r8777j64709j26093
$$ -912909 -823163 -444933 -204235 15764 18816 -6370 -198333 -297110 -461819 -587912
15789e87912J44261M37148L09569j35591m82786m40334m26420l45845J82348J80849
$$ -587912 -443651 -6503 303066 167475 -315311 -755645 -1182065 -1527910 -1345562 -1164713
15779a164713Q3546j18762N8626R3956J26725K9946j1223M00515L51341j37013
$$ -1164713 -1081167 -1199929 -1141303 -1047347 -920622 -890676 -901899 -501384 -150043 -287056
15769b87056J8196M71912M38444N131m75719m52590o6705L11455P5964j04759
$$ -287056 -268860 203052 641496 646627 170908 -281682 -348387 -36932 39032 -65727
15759f5727M0152J92059L4984k59495m39800m89828j21672J35742N43146O90291
$$ -65727 -25575 166484 201468 -58027 -497827 -987655 -1109327 -973585 -430439 259852
15749B59852n3240q79643n33542J96827N22694L26044j77645m06767K06867N38470
$$ 259852 206612 -673031 -1206573 -1009746 -487052 -161008 -338653 -745420 -538553 -83
15739h3L39682j48987l59741j81034o87696n77678J53489N07188K50632M02611
$$ -83 339599 190612 -169129 -350163 -1037859 -1615537 -1462048 -954860 -704228 -301617
15729c01617J09506N2076J2081p2849q3442k0045j8577j26676J95419K92098j00481
$$ -301617 -192111 -140035 -127954 -200803 -284245 -304290 -322867 -449543 -254124 37974 -62507
15718f2507j32220K16037L94997L77404o2159K62511j20647q90913m48670m7477
$$ -62507 -194727 21310 416307 793711 731552 994063 873416 -17497 -466167 -513644
15708e13644J82755J91814P7810m3107k57799q3600j15255k57921n707M09762
$$ -513644 -330889 -139075 -61265 -104372 -362171 -445771 -561026 -818947 -824654 -414892
15698d14892O1536o8476L71999k2738l35001J68088K44734L05701K57964J41299
$$ -414892 -353356 -421832 -49833 -72571 -407572 -239484 5250 310951 568915 710214
15688G10214k41496l98762j98125J11356L08454k6612k41053j6538O0511k28309
$$ 710214 468718 69956 -128169 -16813 291641 265029 23976 7438 67949 -160360
15678a60360n83355p4258L51677O4079l633N5665K33776M15403R3876m92494o92746
$$ -160360 -743715 -817973 -466296 -402217 -405850 -350185 -116409 298994 392870 -99624 -792370
15667g92370k71732n5706N51627P18293J8013l79722P1990K66593o98282n79718
$$ -792370 -1064102 -1119808 -568181 150112 168125 -211597 -139607 126986 -571296 -1151014
15657a151014K7019L01208J71504O1535K79849K86895J19460K2520K79053K51862
$$ -1151014 -1123995 -822787 -651283 -589748 -309899 -23004 96456 118976 398029 649891
15647F49891p5103N5986R5238N0806l52170k03159l08245m63213J7471J9434P4238
$$ 649891 574788 630774 726012 776818 424648 221489 -86756 -549969 -532498 -513064 -438826
15636d38826J64290r6543k95723R2849N25433Q34999M70812k1999m51570m51819
$$ -438826 -274536 -371079 -666802 -573953 -48520 786479 1257291 1235292 783722 331903
15626C31903o9804p3596j46517p648j7760l28367m15049k68528j98505N4687J12232
$$ 331903 262099 188503 41986 34338 16578 -311789 -726838 -995366 -1193871 -1139184 -1026952
15615a026952K01066N71474M14378p6277n9623K86119K03055M113L825j60154
$$ -1026952 -825886 -254412 159966 83689 24066 310185 513240 517353 521178 361024
15605C61024j412P2606J05128J59120j26724k44900K37127J11637l05092n09305
$$ 361024 359612 432218 537346 696466 569742 324842 561969 673606 368514 -140791
15595a40791L6667M6130j23175j94191L3548M49153M95948k9083j41129k09233
$$ -140791 -104124 -57994 -181169 -375360 -341812 107341 603289 574206 433077 223844
15585B23844q193J20288K39165M17704R0829m29323k67129k71411j04094M67912
$$ 223844 215651 335939 575104 992808 1083637 654314 387185 115774 11680 479592
15575D79592R31438N02601m20790o71847k31291M1446L88467J78755k35417n26664
$$ 479592 1411030 1913631 1492841 820994 589703 631149 1019616 1198371 962954 436290
15565D36290l95317K6492P2066l51073l22186k14784j66406L79915J32782j34487
$$ 436290 40973 67465 139531 -211542 -533728 -748512 -914918 -535003 -402221 -536708
15555e36708R1631l6432q9499L95756L92970J90060O9076k86968q70772o30967
$$ -536708 -445077 -481509 -571008 -175252 217718 407778 476854 189886 -680886 -1311853
15545a311853j34159L63881N30229O14903L77284j44422p0659j60503k11781l23351
$$ -1311853 -1446012 -1082131 -551902 63001 440285 295863 225204 64701 -147080 -470431
15535d70431j2580M00674K67212J96087J44644k3776k54530j90506k60881k29639
$$ -470431 -483011 -82337 184875 380962 525606 501830 247300 56794 -204087 -433726
15525d33726k60804P8716M17616J38394m9917J46316L04076K77208N5073J2171
$$ -433726 -694530 -615814 -198198 -59804 -109721 36595 340671 617879 672952 685123
15515F85123Q6115J02936l41428l92517l68523j38202L29379M51230J07590M06491
$$ 685123 771238 874174 532746 140229 -228294 -366496 -37117 414113 521703 928194
15505I28194M17411p028L3588j41539n92760l52389J387K05487J8466j71734L06249
$$ 928194 1345605 1338577 1372165 1230626 637866 285477 286864 492351 510817 339083 645332
15494F45332O89716L93392m95423n69181j13508k02151M8407Q2299K9813l1948
$$ 645332 1335048 1728440 1233017 663836 550328 348177 396584 478883 508696 476748
15484D76748k46073k97363R4086M53232q8132l79683l5717L50863K39310P1282
$$ 476748 230675 -66688 27398 480630 392498 12815 -22902 327961 567271 638553
15474F38553J89972J09934j68604p46307j90495J19831k13772k42692k2298L68343
$$ 638553 828525 938459 769855 23548 -166947 -47116 -260888 -503580 -525878 -157535
15464a57535K8920l9235j73665j30690K23263P6778j16901J03605K15778j89355
$$ -157535 -128615 -167850 -341515 -472205 -248942 -172164 -289065 -185460 30318 -159037
15454a59037R4195K13076R4109J64648K81474K13229k80403o13791k79323k38110
$$ -159037 -64842 148234 242343 406991 688465 901694 621291 7500 -271823 -509933
15444e09933j9207K46693R011k28490O1297K34954Q6567L02774K52399K99058
$$ -509933 -529140 -282447 -273436 -501926 -440629 -205675 -119108 183666 436065 735123
15434G35123j10443o86691l56076J09948L27980J48310j71279l33833k52567l994
$$ 735123 624680 -62011 -418087 -308139 19841 168151 -3128 -336961 -589528 -593522
15424e93522Q4185l2013J98642K21598J00977J25417j35882k28693p2813L67235
$$ -593522 -509337 -541350 -342708 -121110 -20133 105284 -30598 -259291 -332104 35131
15414C5131J54544j50818m1435J40843K15242N8850j35651k81547n51883l97780
$$ 35131 189675 38857 -2578 138265 353507 412357 276706 -4841 -556724 -954504
15404i54504L9978K51491R0015p3996J24627K34291K53076K7056n38022k58576
$$ -954504 -914526 -663035 -573020 -647016 -522389 -288098 -35022 -7966 -545988 -804564
15394h04564K57012L1304j83158Q7L25744L05348l2370r5000K87892N9108n66866
$$ -804564 -547552 -516248 -699406 -699319 -373575 -68227 -100597 -195597 92295 151403 -415463
15383d15463k88367K58108M91362J93551q2766M3442j95513l88614J89755L20948
$$ -415463 -703830 -445722 45640 239191 156425 199867 4354 -384260 -194505 126443
15373A26443l79790l85479j27863J78932M84566J78467L18259j76719n24406R5999
$$ 126443 -253347 -638826 -766689 -587757 -103191 75276 393535 216816 -307590 -211591
15363b11591j47959k26480M22571L30686k0760q2839j52657o7140K18893J49569
$$ -211591 -359550 -586030 -163459 167227 146467 63628 -89029 -156169 62724 212293
15353B12293N8574J61736k58219k96316R3826J10439k25944j66211J71783j58790
$$ 212293 270867 432603 174384 -121932 -28106 82333 -143611 -309822 -138039 -296829
15343b96829n02194J32610N12683M7226n89227j54329M7902j59418r4811K83425
$$ -296829 -799023 -666413 -153730 -106504 -695731 -850060 -802158 -961576 -1056387 -772962
15333g72962K58157Q3875M43581L29743J98279L63374j70695o88663n30160J57916
$$ -772962 -514805 -430930 12651 342394 540673 904047 733352 44689 -485471 -327555
15323c27555P358k51921J55717L60624L4720J06779l2260p2254o9504N8573L81121
$$ -327555 -320197 -572118 -416401 -55777 -21057 85722 53462 -18792 -88296 -29723 351398
15312C51398L49716j33408l15303k8747Q5355m14283m95903R1450J87239M0372
$$ 351398 701114 567706 252403 223656 309011 -105272 -601175 -509725 -322486 -282114
15302b82114M18669L96359J37317j53063l63343l61360j7602K65468J4553L2074
$$ -282114 136555 532914 670231 517168 153825 -207535 -225137 40331 54884 86958
15292H6958K74591J04976l64604j09240J20145K68677J06296r6911j22618k90062
$$ 86958 361549 466525 101921 -7319 112826 381503 487799 390888 268270 -21792
15282b1792q2777M91814M64701M5191Q472M8587P3418r1701j73636n9167J73457
$$ -21792 -104569 387245 851946 897137 905609 954196 1027614 935913 762277 703110 876567
15271H76567j25977j07785k49763j18123j82606l71545J92944O46782K46059k59149
$$ 876567 750590 642805 393042 274919 92313 -279232 -86288 560494 806553 547404
15261E47404j37492j92130n9187L85235P3763m05190o07362l31429L14819J85680
$$ 547404 409912 217782 158595 543830 617593 212403 -394959 -726388 -411569 -225889
15251b25889j53610k04699k22641k84307K32779M4496l4878L86672L20702k35904
$$ -225889 -379499 -584198 -806839 -1091146 -858367 -813871 -848749 -462077 -141375 -377279
15241c77279j95422O7063L40692o9272k70025m8708j92148J03976K18518k43759
$$ -377279 -572701 -505638 -164946 -234218 -504243 -552951 -745099 -641123 -422605 -666364
15231f66364j31536l3042m21923J23149L55062J15948K13890K0067k37234j64630
$$ -666364 -797900 -830942 -1252865 -1129716 -774654 -658706 -444816 -424749 -661983 -826613
15221h26613L61774N05865k008n10628l34178m2035J20593M4709r1806K15811
$$ -826613 -464839 41026 39018 -471610 -805788 -847823 -727230 -682521 -774327 -558516
15211e58516M25700j22627R6495K53994o7323j14954r6361K9167j54472j90360
$$ -558516 -132816 -255443 -158948 95046 27723 -87231 -183592 -154425 -308897 -499257
15201d99257J65852j22739j30821M79811L15290p4710k66464n6792J46474k12039
$$ -499257 -333405 -456144 -586965 -107154 208136 133426 -133038 -189830 -43356 -255395
15191b55395r4705r1566m3562q7249K66386M56243l27766m46646M15365L21822
$$ -255395 -350100 -441666 -485228 -572477 -306091 150152 -177614 -624260 -208895 112927
15181A12927j64160k10411L48603M56974k168l34203n76148j98218J22944j32976
$$ 112927 -51233 -261644 86959 543933 541765 207562 -368586 -566804 -443860 -576836
15171e76836m9265L99037K93728l80233n84219j29691J79147K93989K27777K30712
$$ -576836 -626101 -227064 66664 -313569 -897788 -1027479 -848332 -554343 -326566 -95854
15161i5854J06518j39993m84080n58162q0339j09813L41905N62917L70592j7342
$$ -95854 10664 -129329 -613409 -1171571 -1251910 -1361723 -1019818 -456901 -86309 -103651
15151a03651k29030j81134k79440r3888N69428N95425K05349N2867J2904L7749
$$ -103651 -332681 -513815 -793255 -887143 -317715 277710 483059 535926 548830 586579
15141E86579m43002q04959l44018J11436M80592M99809L78780q3705k33825K52425
$$ 586579 143577 -661382 -1005400 -893964 -413372 86437 465217 381512 147687 400112
15131D00112M60561K47570l93422l97893k03135j5451N6457j93759j89330k82561
$$ 400112 860673 1108243 714821 316928 113793 98342 154799 -38960 -228290 -510851
15121e10851k14407k2696M83557j1651l33240K07755L77863J64228p2668L8711
$$ -510851 -725258 -747954 -264397 -276048 -609288 -401533 -23670 140558 67890 106601
15111A06601J96238k36441m44873r6185J18948K73880K67203q3796n766L71480
$$ 106601 302839 66398 -378475 -474660 -355712 -81832 185371 101575 95809 467289
15101D67289K32434Q5107k117j26335o6131k25293k36188j24425l17958k45144
$$ 467289 699723 784830 782713 656378 590247 364954 128766 4341 -313617 -558761
15091e58761m62880k72368R6119M14305M51154K7538l83131j17413K03577n151
$$ -558761 -1021641 -1294009 -1197890 -783585 -332431 -304893 -688024 -805437 -601860 -607011
15081f07011Q7459P9016J07177j27527j39724P0343l8724J48707L59017K54837
$$ -607011 -519552 -440536 -333359 -460886 -600610 -530267 -568991 -420284 -61267 193570
15071A93570j60311l41992Q1991J38686K49187K06054l62261k99030J04507J51772
$$ 193570 33259 -308733 -226742 -88056 161131 367185 4924 -294106 -189599 -37827
15061c7827M50476M18686J76842j20178m24730l74296l2841P5121j74533r8563
$$ -37827 412649 831335 1008177 887999 463269 88973 56132 131253 -43280 -141843
15051a41843q6541J00698O7760k85331k61117L36446M60310M9659n84087l10284
$$ -141843 -228384 -127686 -59926 -345257 -606374 -269928 190382 240041 -344046 -654330
15041f54330j77438r1312p7823L24346M83607L84225L28648k1775k01022l62755
$$ -654330 -831768 -923080 -1000903 -676557 -192950 191275 519923 498148 297126 -65629
15031f5629k00655J21594Q249J53875K25891j01460k9635J17781j41705j02353
$$ -65629 -266284 -144690 -136441 17434 243325 141865 112230 230011 88306 -14047
15021a4047K3904l22555o66963j34958O9821M4826O5461N3273l3519j23185l31871
$$ -14047 9857 -312698 -979661 -1114619 -1044798 -999972 -934511 -881238 -914757 -1037942 -1369813
15010a369813j40573L22626M86921N93573M3009q6439J6660k1147K60768j32363
$$ -1369813 -1510386 -1187760 -700839 -107266 -64257 -150696 -134036 -155183 105585 -26778
15000b6778m2684J07358k17786L45335K80633k01967M9377k42807m09435p2146
$$ -26778 -69462 37896 -179890 165445 446078 244111 293488 50681 -358754 -430900
14990d30900J2886J51467R5179o5293Q6725J04526l32132n630N78133L90020M32016
$$ -430900 -418014 -266547 -171368 -236661 -149936 -45410 -377542 -383172 194961 584981 1016997
14979A016997L15341j79895l37859M53420O74119k45910n02445j16036J8218J63119
$$ 1016997 1332338 1152443 814584 1268004 1942123 1696213 1193768 1077732 1095950 1259069
14969A259069j23085l97865k12996j03354J5802J91534k63044m25767n7788J08874
$$ 1259069 1135984 738119 525123 421769 437571 629105 366061 -59706 -117494 -8620
14959h620K47292q6814j19414K13370M9210J21979K83080K26697k14244o43770
$$ -8620 238672 151858 32444 245814 295024 417003 700083 926780 712536 68766
14949F8766k20790K0102J48344P5428L0358Q5602j01237m34824q1923M70159L39453
$$ 68766 -152024 -131922 16422 91850 122208 207810 106573 -328251 -410174 59985 399438
14938C99438N842m34009l06282N3595L61450M31236j00197o13396l56905N3070
$$ 399438 405280 -28729 -335011 -281416 80034 511270 411073 -202323 -559228 -506158
14928e06158j2791j32059J33649N141j42419J51639K1218M482k82541k69265L93621
$$ -506158 -518949 -651008 -517359 -512218 -654637 -502998 -481780 -477298 -759839 -1029104 -635483
14917f35483L68425R4147k35956j04074N3513k0493J26952p959j80570j2777K59998
$$ -635483 -267058 -172911 -408867 -512941 -459428 -479921 -352969 -360928 -541498 -554275 -294277
14906b94277P07148J10025J08725M22172J48962k44919q8151J13042m4735k1563
$$ -294277 412871 522896 631621 1053793 1202755 957836 869685 982727 937992 916429
14896I16429L06528L33842n4395j69860j99297l67482m01389m55463j01477Q8858
$$ 916429 1222957 1556799 1502404 1332544 1133247 765765 364376 -91087 -192564 -103706
14886a03706j8920j38866j05574J35422k63414l9045K21613K90793K81078J98771
$$ -103706 -122626 -261492 -367066 -231644 -495058 -534103 -312490 -21697 259381 458152
14876D58152m51585m67456j62996L84388K21420M7065m26522p95047n60697R9955
$$ 458152 6567 -460889 -623885 -239497 -18077 28988 -397534 -1192581 -1753278 -1653323
14866a653323M45931o0232p6727n6352J75195O13767M79725N29074J55745k09094
$$ -1653323 -1207392 -1267624 -1344351 -1400703 -1225508 -611741 -132016 397058 552803 343709
14856C43709l83611J4235K3306k41208k47523J9795L13450M22749q8937m09139
$$ 343709 -39902 -25667 -2361 -243569 -491092 -471297 -157847 264902 175965 -233174
14846b33174N197M5684m3048k78432j91754R4558L44778N8425j03896j65527M8831
$$ -233174 -227977 -182293 -225341 -503773 -695527 -600969 -256191 -197766 -301662 -467189 -418358
14835d18358P7778m21116l28706J27367M08591K10665j98182J0818p9178o5542
$$ -418358 -340580 -761696 -1090402 -963035 -554444 -343779 -541961 -531143 -610321 -675863
14825f75863N58139O49570J33172k01102j38663j68531r1529o6407J06528K9489
$$ -675863 -117724 531846 665018 463916 325253 156722 65193 -1214 105314 134803
14815A34803j70705K38445M13253J29428j77298l89770n81827k93343k28479j17650
$$ 134803 -35902 202543 615796 745224 567926 178156 -403671 -697014 -925493 -1043143
14805a043143K3433J77032K23720J80645j59609m38906k68804l35N74262L97001
$$ -1043143 -1019710 -842678 -618958 -438313 -597922 -1036828 -1305632 -1305967 -731705 -334704
14795c34704J4992M41983J98076K10496L30645J37278k31856j81155P8486k51947
$$ -334704 -319712 122271 320347 530843 861488 998766 766910 585755 664241 412294
14785D12294n1516l29266l84082O3808K51190o6234k02370Q4981K02148J02305
$$ 412294 360778 31512 -352570 -288762 -37572 -103806 -306176 -221195 -19047 83258
14775H3258J89693K36881k87567q39077l19833K99264M2118j11672J13761J57597
$$ 83258 272951 509832 222265 -616812 -936645 -637381 -595263 -706935 -593174 -435577
14765d35577L64559M20983K0360n9290l58546m88078p9658N26328J27763l09417
$$ -435577 -71018 349965 370325 311035 -47511 -535589 -615247 -88919 38844 -270573
14755b70573Q4437j68055l20625k567K22967O1441k14569l62916r9426o8267L9138
$$ -270573 -186136 -354191 -674816 -677383 -454416 -392975 -607544 -970460 -1069886 -1138153 -1099015
14744a099015M01202J5445l12154n0784K76873l52425l11938K02071N6709L79568
$$ -1099015 -697813 -682368 -994522 -1045306 -768433 -1120858 -1432796 -1230725 -1174016 -794448
14734g94448M92315J12355l56969m21149l1489j4592J21863O08480M59314n38170
$$ -794448 -302133 -189778 -546747 -967896 -999385 -1013977 -892114 -283634 175680 -362490
14724c62490n79597P6462l7960M5534L18075O28217R08135L22976l75398q1631
$$ -362490 -942087 -865625 -903585 -858051 -539976 88241 996376 1319352 943954 862323
14714H62323L94386J32696n15338j53632J08524P1210O3418k85793l38293l93782
$$ 862323 1256709 1389405 874067 720435 828959 900169 963587 677794 339501 -54281
14704e4281o53703m33749k5605N76539L19005J82837K86401R2467j5590k7241
$$ -54281 -707984 -1141733 -1167338 -590799 -271794 -88957 197444 289911 274321 247080
14694B47080n8671L5159m3575n15286n86609k83054J61047M41135L60686K00059
$$ 247080 188409 223568 179993 -335293 -921902 -1204956 -1043909 -602774 -242088 -42029
14684d2029L9023N740J4148M8184L26303J57520J00427j6806l02977m36561j42942
$$ -42029 -3006 2734 16882 65066 391369 548889 649316 632510 329533 -107028 -249970
14673b49970l17647n7630l8296r1275j84647m22696J65941j50270m92327K12444
$$ -249970 -567617 -625247 -663543 -754818 -939465 -1362161 -1196220 -1346490 -1838817 -1626373
14663a626373L15710M39820K1197m20491m05315Q1544P28447J1065m79314l1037
$$ -1626373 -1310663 -870843 -849646 -1270137 -1675452 -1593908 -865461 -854396 -1333710 -1364747
14653a364747J1245J14535K95646J11944j41290j08177J8430J42347J93794j37826
$$ -1364747 -1353502 -1238967 -943321 -831377 -972667 -1080844 -1062414 -920067 -726273 -864099
14643h64099m77354l74772K97675P97247O02256K07995j1812j3493L4900P7929
$$ -864099 -1341453 -1716225 -1418550 -621303 -19047 188948 177136 163643 198543 276472
14633B76472j31371J39511L60322j32680l88226j04900J03450R3051l25762k56492
$$ 276472 145101 284612 644934 512254 124028 19128 122578 215629 -110133 -366625
14623c66625K03109R4791P162k30176m30567l6549M07345M82959Q5561J33259
$$ -366625 -163516 -68725 -61563 -291739 -722306 -758855 -351510 131449 217010 350269
14613C50269K20332j39165m89026K7898K49845k60313j44309O2460L54267l2910
$$ 350269 570601 431436 -57590 -29692 220153 -40160 -184469 -122009 232258 199348
14603A99348l93740m19324r8427O11551M57415k00609k23963J41173L1560k68705
$$ 199348 -194392 -613716 -712143 -100592 356823 156214 -67749 73424 104984 -163721
14593a63721l18267n34373o38684l92794O8029J61118K63686K17552L4585K6982
$$ -163721 -481988 -1016361 -1655045 -2047839 -1979810 -1818692 -1555006 -1337454 -1302869 -1275887
14583a275887p2791k69837k67873j16431J36349J75208N81003N14289M33529M39918
$$ -1275887 -1348678 -1618515 -1886388 -2002819 -1866470 -1691262 -1110259 -595970 -162441 277477
14573B77477l3696N2134M434l84041j95176l07562k17144J23737K99021J76644
$$ 277477 243781 295915 300349 -83692 -278868 -586430 -803574 -679837 -380816 -204172
14563b04172r1917k73602J1598k3799j46324J05793K85222K10944K43298L5169
$$ -204172 -296089 -569691 -558093 -581892 -728216 -622423 -337201 -126257 117041 152210
14553A52210j11211Q7983J2932K60111L62850l94282o71973k82239K92277M49881
$$ 152210 40999 128982 141914 402025 764875 370593 -301380 -583619 -291342 158539
14543A58539L46947L10270K06358l15626o17571k02290k71297L45519M75835J51276
$$ 158539 505486 815756 1022114 706488 88917 -113373 -384670 -39151 436684 587960
14533E87960M9935r8806j38993n8627J00614j56916o91308l92031o5013K7435
$$ 587960 637895 539089 400096 341469 442083 285167 -406141 -798172 -863185 -835750
14523h35750q8088o8096M33737O05972M2177j75197j48705l9788j44175m25748
$$ -835750 -923838 -991934 -558197 47775 89952 -85245 -233950 -273738 -417913 -843661
14513h43661k73861j17142k77503j27434l82866k36864N77499O71974L99452M62055
$$ -843661 -1117522 -1234664 -1512167 -1639601 -2022467 -2259331 -1681832 -1009858 -610406 -148351
14503a48351P54509L17163k52116j72439m7756m43183n43227n5114M64129M95880
$$ -148351 606158 923321 671205 498766 451010 7827 -535400 -590514 -126385 369495
14493C69495J20231m81287m82552j4411j13019k39278J704J95854L42248K75328
$$ 369495 489726 8439 -474113 -488524 -601543 -840821 -839117 -643263 -301015 -25687
14483b5687K5696j67492j59281L0031K27552M84914J17570m00672m33575M6195
$$ -25687 9 -167483 -326764 -296733 -69181 415733 533303 132631 -300944 -254749
14473b54749K74637j22134o3979K61911R8502j96794k20695l74456j16620o0873
$$ -254749 19888 -102246 -166225 95686 194188 -2606 -223301 -597757 -714377 -775250
14463g75250m76289K0882N30932O85165L49992K94062M0732j31645k19633k37442
$$ -775250 -1251539 -1230657 -699725 -14560 335432 629494 670226 538581 318948 81506
14453H1506j88530L2388j12524j25056j79663j22257N8939M07084L87459k91198
$$ 81506 -107024 -74636 -187160 -312216 -491879 -614136 -555197 -148113 239346 -51852
14443e1852j37749J96388O7020m69366m09836O0338K75915K42305J40476L81381
$$ -51852 -189601 6787 73807 -395559 -805395 -745057 -469142 -226837 -86361 295020
14433B95020M94688j2163q23279l09942L34944M70037M16324J089J90517J15953
$$ 295020 789708 777545 -45734 -355676 -20732 449305 865629 866718 1057235 1173188
14423A173188m9396l84659m25117m55933j15228m2023N7995L2379K2886K6243
$$ 1173188 1123792 739133 314016 -141917 -257145 -299168 -241173 -208794 -185908 -159665
14413a59665J5446L01808K39259j09153n22615n28742p5090k78397M03485N74431
$$ -159665 -144219 157589 396848 287695 -234920 -763662 -838752 -1117149 -713664 -139233
14403a39233Q1254k40001j31526K99387R1500n06144j75830n1003r6768N08893
$$ -139233 -57979 -297980 -429506 -130119 -38619 -544763 -720593 -771596 -868364 -359471
14393c59471J83529j76087j54923O4217J47108L44475L06159j08965j31308k76539
$$ -359471 -175942 -352029 -506952 -442735 -295627 48848 355007 246042 114734 -161805
14383a61805k3602R2654o22244j79920O89136P29051K77853L3303j09523l37471
$$ -161805 -185407 -92753 -714997 -894917 -205781 523270 801123 834426 724903 387432
14373C87432k13281J7429j28113l17636j62773j64149K28017K33577l1235k73323
$$ 387432 174151 191580 63467 -254169 -416942 -581091 -353074 -119497 -150732 -424055
14363d24055l44096k99397O10107M19437k37263l36412k45613j84720k54993m80448
$$ -424055 -768151 -1067548 -457441 -38004 -275267 -611679 -857292 -1042012 -1297005 -1777453
14353a777453L74695M60345k19855m20036j23467L7137M47311P97341L54091m67173
$$ -1777453 -1402758 -942413 -1162268 -1582304 -1705771 -1668634 -1221323 -423982 -69891 -537064
14343e37064p25774j84741j6782j04725j93919k4151k11495P4593M77838L01595
$$ -537064 -1262838 -1447579 -1464361 -1569086 -1763005 -1787156 -1998651 -1924058 -1446220 -1144625
14333a144625J23620j35117k47468j944N845K70166K65705L79680M84576N0545
$$ -1144625 -1021005 -1156122 -1403590 -1405534 -1399689 -1129523 -863818 -484138 438 50983
14323E0983j89955j81200k41181k87517j8248P64641P89225J28039l68037m47164
$$ 50983 -138972 -320172 -561353 -848870 -867118 -102477 686748 814787 446750 -414
14313d14n25202l55991Q3601K20004J83802R3671l55852n05043m42060l6992q0942
$$ -414 -525616 -881607 -798006 -578002 -394200 -300529 -656381 -1161424 -1603484 -1640476 -1721418
14302a721418j26421j4563M25485J041211N00266j5965j67612m32834k65457n818
$$ -1721418 -1847839 -1862402 -1436917 -395706 104560 88595 -79017 -511851 -777308 -783126
14292g83126R7256J82112j75172m0634L65095M25825K0466l9205K59978R600q4437
$$ -783126 -685870 -503758 -678930 -719564 -354469 71356 91822 52617 312595 322195 237758
14281B37758m11942k7116N13636N35181N48638j27594j5759k28904m94676j43014
$$ 237758 -174184 -201300 312336 847517 1396155 1268561 1252802 1023898 529222 386208
14271C86208l7750l9588l46161j10607J41051L4624K79468J12797k81039j9193
$$ 386208 348458 308870 -37291 -147898 -6847 27777 307245 420042 139003 119810
14261A19810O648l24185n57491k24817J57209M28905m0710m28737l31289o6971
$$ 119810 126458 -197727 -755218 -980035 -822826 -393921 -434631 -863368 -1194657 -1261628
14251a261628J28731M22025N57268R6191k74415r9822L12812J71149k91026n1970
$$ -1261628 -1132897 -710872 -153604 -57413 -331828 -431650 -118838 52311 -238715 -290685
14241b90685j96838j41290j64367j88268L99815N49395K53911j88482J11944J75538
$$ -290685 -487523 -628813 -793180 -981448 -581633 -32238 221673 33191 145135 320673
14231C20673K8488K58516k22917j12201Q5116M13374J47932o50156p71322k03929
$$ 320673 349161 607677 384760 272559 357675 771049 918981 268825 -502497 -706426
14221g06426J39156J67472J55634K38210j40349r8776j90104l65528m87316l73080
$$ -706426 -567270 -399798 -244164 -5954 -146303 -245079 -435183 -800711 -1288027 -1661107
14211a661107L88643P22908O66221O71564L60149l6514K6579l16418l72984K50603
$$ -1661107 -1272464 -549556 116665 788229 1148378 1111864 1138443 822025 449041 699644
14201F99644J74338k73755l69657m24828k66878J6616K97541M36408L64225k39600
$$ 699644 873982 600227 230570 -194258 -461136 -444520 -146979 289429 653654 414054
14191D14054l48038J48987K46917l93942o74651k91255n5934J96446K24649L17802
$$ 414054 66016 215003 461920 67978 -606673 -897928 -953862 -757416 -532767 -214965
14181b14965J0510n6617L8559p2277j78427q5954k67360l17193J17747O89039
$$ -214965 -204455 -261072 -222513 -294790 -473217 -559171 -826531 -1143724 -1025977 -336938
14171c36938J106421L97686m31428m24572l76052J15517K34825L3966j20733O2778
$$ -336938 769483 1167169 735741 311169 -64883 50634 285459 319425 198692 261470
14161B61470J03989j15307j73302j08531j15578K7050J39977N86608O05091l14261
$$ 261470 365459 250152 76850 -31681 -147259 -120209 19768 606376 1211467 897206
14151H97206p82039o7858K74003j55028k94358k15055r8946J19506j30447k54177
$$ 897206 115167 47309 321312 166284 -128074 -343129 -442075 -322569 -453016 -707193
14141g07193j81377L95114O51279J30413m52780m25543k3630r5434l23566j61767
$$ -707193 -888570 -493456 157823 288236 -164544 -590087 -613717 -709151 -1032717 -1194484
14131a194484K04963J93972J46464N99398K42036m21852n7533L32160O87693L02849
$$ -1194484 -989521 -795549 -649085 -49687 192349 -229503 -287036 45124 732817 1035666
14121A035666k11737j59690k26812p8205k41545k2629K00438l20493n57763n33890
$$ 1035666 823929 664239 437427 359222 117677 95048 295486 -25007 -582770 -1116660
14111a116660j18042K19179P79614M65870m51551o82351N197j49510k07837J80964
$$ -1116660 -1234702 -1015523 -235909 229961 -221590 -903941 -898744 -1048254 -1256091 -1075127
14101a075127M11385J31790R2010l0386K11412K19609k19195L01827O02634L69498
$$ -1075127 -663742 -531952 -439942 -470328 -258916 -39307 -258502 43325 645959 1015457
14091A015457O902m90963m69963k21517r1397l09181K74711M45133Q0272N9783
$$ 1015457 1022359 531396 61433 -160084 -251481 -560662 -285951 159182 239454 299237
14081B99237R5095L70789M58798m5106l75022l61595l42531j31293n29822o34179
$$ 299237 394332 765121 1223919 1178813 803791 442196 99665 -31628 -561450 -1195629
14071a195629j2414J70852L25030L23815L07253Q5272J09235l51814l26817j2339
$$ -1195629 -1208043 -1037191 -712161 -388346 -81093 4179 113414 -238400 -565217 -577556
14061e77556J67095p2169L30198N32478L22586N9162k59226n02270k77064P3565
$$ -577556 -410461 -482630 -152432 380046 702632 761794 502568 298 -276766 -203201
14051b03201P5490K16550j62009p4132J97083j66385m68690n3035j02503l58494
$$ -203201 -127711 88839 -73170 -147302 49781 -116604 -585294 -638329 -740832 -1099326
14041a099326q7335j66338J78049k61424l92756N75157M79055K7630k5437l10675
$$ -1099326 -1186661 -1352999 -1174950 -1436374 -1829130 -1253973 -774918 -747288 -772725 -1083400
14031a083400J38775N20642M67904J46306l77333j81518j13227J12024J70218
$$ -1083400 -944625 -423983 43921 190227 -187106 -368624 -481851 -369827 -199609
14022a99609K53373K24836Q9169L57823K1048l80322l11563j46269l34208l35567
$$ -199609 53764 278600 367769 725592 746640 366318 54755 -91514 -425722 -761289
14012g61289o6256j486J92069K43900M78355K73703l46498j88246J92196q4416
$$ -761289 -827545 -829031 -636962 -393062 85293 358996 12498 -175748 16448 -67968
14002f7968m93784m58028K13080N01810M62796K92997j94512m9246K21091J95448
$$ -67968 -561752 -1019780 -806700 -304890 157906 450903 256391 207145 428236 623684
13992F23684j980j83869m64184m56624K5372J00947n1647m1072N3445j55701k66728
$$ 623684 621704 437835 -26349 -482973 -457601 -356654 -408301 -449373 -395928 -551629 -818357
13981h18357k01838J79767M91436N02478L86486N84689M65199l30529n03641n22234
$$ -818357 -1020195 -840428 -348992 153486 539972 1124661 1589860 1259331 755690 233456
13971B33456l86590M06777L8552m83444J80888K83595J12219j57761J57200k5554
$$ 233456 -153134 253643 292195 -191249 -10361 273234 385453 227692 384892 359338
13961C59338j17956P4381K52137L65992k04218j48240J57681L2750L9391j28023
$$ 359338 241382 315763 567900 933892 729674 581434 739115 771865 811256 683233
13951F83233m64989o54953m99260k57255K52200O13905K25256M6668k919j19441
$$ 683233 218244 -436709 -935969 -1193224 -941024 -327119 -101863 -55195 -58114 -177555
13941a77555j50476k84447k6555M74999L37850k06539o3010p375Q7765M2337q0848
$$ -177555 -328031 -612478 -639033 -164034 173816 -32723 -95733 -103108 -15343 26994 -53854
13930e3854M7798j54192k44636k18377K18990M06302k0904k34090j76841K6074
$$ -53854 -6056 -160248 -404884 -623261 -404271 2031 -18873 -252963 -429804 -403730
13920d03730L39126M39246O60530N41457k08936m58222k54549K5457L42416L24607
$$ -403730 -64604 374642 1035172 1576629 1367693 909471 654922 680379 1022795 1347402
13910A347402J89966M9949L40239K30784j64372l84233m01317J81506K57812p0659
$$ 1347402 1537368 1587317 1927556 2158340 1993968 1609735 1208418 1389924 1647736 1577077
13900A577077K8213J4257m0401l17209l12721R4443M14203M48114K74281J46574
$$ 1577077 1605290 1619547 1579146 1261937 949216 1043659 1457862 1905976 2180257 2326831
13890B326831J8603j06254k26892l87215k79145j11993J37566J44738O3155k17870
$$ 2326831 2345434 2239180 2012288 1625073 1345928 1233935 1371501 1516239 1579394 1361524
13880A361524K08113K46443J06313k50420l35329m148N57280M45716l23253l11875
$$ 1361524 1569637 1816080 1922393 1671973 1336644 1332496 1889776 2335492 2012239 1700364
13870A700364O419n5009K10J46832J69001J59589Q956j25940o08618j96256P0033
$$ 1700364 1706783 1651774 1651984 1798816 1967817 2127406 2136362 2010422 1401804 1205548 1275581
13859A275581m3054k3346J47673L67349J28458L7626K96272J72814k01664j48275
$$ 1275581 1232527 1209181 1356854 1724203 1852661 1890287 2186559 2359373 2157709 2009434
13849B009434p8501p816l22486l26943k68762l39648m5397J45027J4972q1392
$$ 2009434 1930933 1923117 1600631 1273688 1004926 665278 619881 764908 779880 698488
13839F98488k86081J70855N54153J60947K53918M08517M44715k6815n60262m3711
$$ 698488 412407 583262 1137415 1298362 1552280 1960797 2405512 2378697 1818435 1774724
13829A774724O3059N1949K17132j9890P5661N53608J23364r6300l29896o39910
$$ 1774724 1837783 1889732 2106864 2086974 2162635 2716243 2839607 2743307 2413411 1773501
13819A773501N5011N88136O57290L47218M53582P7931o02084o56204m40477j08078
$$ 1773501 1828512 2416648 3073938 3421156 3874738 3952669 3350585 2694381 2253904 2145826
13809B145826N8463m36570m20695K97219N10398j83048n59013n29630q4330P7971
$$ 2145826 2204289 1767719 1347024 1644243 2154641 1971593 1412580 882950 798620 876591
13799H76591m4119P9529q0701K21879K09227J37088n6337j89235j14001l10292
$$ 876591 832472 912001 831300 1053179 1262406 1399494 1343157 1153922 1039921 729629
13789G29629n44347j39751L48904J25696k04097L74O2515o7826j22288q82K7779
$$ 729629 185282 45531 394435 520131 316034 316408 378923 311097 188809 187927 215706
13778B15706J52292l7014k9746J09375K58179J1326l12538k71830m68531o5424
$$ 215706 367998 330984 301238 410613 668792 680118 367580 95750 -372781 -438205
13768d38205K47882J19555k17013m4062K96157M58100Q0182l84906j35742K38680
$$ -438205 -190323 -70768 -287781 -331843 -35686 422414 502596 117690 -18052 220628
13758B20628J46612k85717l47069j1373J9041k97671k91688J99990n2441k99084
$$ 220628 367240 81523 -265546 -276919 -257878 -555549 -847237 -647247 -699688 -998772
13748i98772r5618K33248K64588J91683J99782O30832K17508k73226J35950n9605
$$ -998772 -1094390 -861142 -596554 -404871 -205089 425743 643251 370025 505975 446370
13738D46370j41342j17244k67887k83838m15372N254J42356o7910j3789M6509
$$ 446370 305028 187784 -80103 -363941 -779313 -774059 -631703 -699613 -713402 -666893
13728f66893n9736k55112o45460j78K97235O7167K70286M34696L82431R3720L3090
$$ -666893 -726629 -981741 -1627201 -1627379 -1330144 -1262977 -992691 -557995 -175564 -81844 -48754
13717d8754j64162j78333k38386j17669J79528L58578K99567M1444O200K09355
$$ -48754 -212916 -391249 -629635 -747304 -567776 -209198 90369 131813 138013 347368
13707C47368q3372j86055j56980k26867l11847k19688O17403M62420m7982j04123
$$ 347368 263996 77941 -79039 -305906 -617753 -837441 -220038 242382 194400 90277
13697I0277p6307J43416k95896l00234L02056L62292J13513P4029l5643J09607
$$ 90277 13970 157386 -138510 -438744 -136688 225604 339117 413146 377503 487110
13687D87110l2713k28236J7176P1697K88473j08481o55032k63355j42061p5753
$$ 487110 454397 226161 243337 315034 603507 495026 -160006 -423361 -565422 -641175
13677f41175J48582K45017K98239m351j98721J7877Q9834J75311L9079l459N60541
$$ -641175 -492593 -247576 50663 46312 -152409 -134532 -44698 130613 169692 166233 726774
13666G26774N89912j65494o43568p72238j42670N63260J29102l05711k14275k83307
$$ 726774 1316686 1151192 507624 -264614 -407284 155976 285078 -20633 -234908 -518215
13656e18215J00852J71530j61232l347L38093J03664k23118J32425P57561J44308
$$ -518215 -417363 -245833 -407065 -410412 -72319 31345 -191773 -59348 698213 842521
13646H42521r59868o52644M0802L95744M98962j33209m56179j22112k12927n85742
$$ 842521 -117347 -769991 -729189 -333445 165517 32308 -423871 -545983 -758910 -1344652
13636a344652J1032J98116K04560J67554j35848j29298J59048N89153O01945J44628
$$ -1344652 -1333620 -1135504 -930944 -763390 -899238 -1028536 -869488 -280335 321610 466238
13626D66238l03713l4582K26549K54528M8851j41736l04512k37113J04664m00292
$$ 466238 162525 127943 354492 609020 657871 516135 211623 -25490 79174 -321118
13616c21118o27959k48856j52245K46865O88641J69830k79910k01615J03278K25366
$$ -321118 -949077 -1197933 -1350178 -1103313 -414672 -244842 -524752 -726367 -623089 -397723
13606c97723k43291l67180l03204k19056j30045L01949N89355L60232J33012J21134
$$ -397723 -641014 -1008194 -1311398 -1530454 -1660499 -1358550 -769195 -408963 -275951 -154817
13596a54817Q7499k90834k27609N6975M4568j0202K47841j44581N4410K61284
$$ -154817 -67318 -358152 -585761 -528786 -484218 -494420 -246579 -391160 -336750 -75466
13586g5466P2576J17889O2582M630k92703n10136r3567J88333J92785J39175k13068
$$ -75466 -2890 114999 177581 182211 -110492 -620628 -714195 -525862 -333077 -193902 -406970
13575d06970l07850j37754j86659j64863N6578j52173l82938k3249K89761K18462
$$ -406970 -714820 -852574 -1039233 -1204096 -1147518 -1299691 -1682629 -1705878 -1416117 -1197655
13565a197655j37682O2999K47088J96150O41448N37804j00972m75170k27187j6000
$$ -1197655 -1335337 -1272338 -1025250 -829100 -187652 350152 249180 -225990 -453177 -469177
13555d69177P3438M3583j48130j3633K30086j98295k21046L13742L01425j65711
$$ -469177 -395739 -352156 -500286 -513919 -283833 -482128 -703174 -389432 -88007 -253718
13545b53718J04436M7783M0175k38848n76608j69241J13671J81638L79471L21619
$$ -253718 -149282 -101499 -61324 -300172 -876780 -1046021 -932350 -750712 -371241 -49622
13535d9622l32787k08933J74626P0676M0849o4710k42566j16296m6323M9126j16705
$$ -49622 -382409 -591342 -416716 -346040 -305191 -369901 -612467 -728763 -775086 -725960 -842665
13524h42665m07629J76652M55691J26895J22139L9819j97573l31143K33289L11518
$$ -842665 -1250294 -1073642 -617951 -491056 -368917 -329098 -526671 -857814 -624525 -313007
13514c13007j49264j41003k29761J54514N02819N14962J51717k27199n70547n28570
$$ -313007 -462271 -603274 -833035 -678521 -175702 339260 490977 263778 -306769 -835339
13504h35339n3980J65826J15646N6637j71504k62421K37798N64866N82706L22507
$$ -835339 -889319 -723493 -607847 -551210 -722714 -985135 -747337 -182471 400235 722742
13494G22742j43012k93212j17817k43945p0400J31824L32130K28653n27100n01188
$$ 722742 579730 286518 168701 -75244 -145644 -13820 318310 546963 19863 -481325
13484d81325l18842J1556L21304M73544K63366k56501j36043J97166O6139K20767
$$ -481325 -800167 -788611 -467307 6237 269603 13102 -122941 74225 140364 361131
13474C61131J97452l17134m60734j19187J5089J66931R0607j011L54323N03607
$$ 361131 558583 241449 -219285 -338472 -323383 -156452 -65845 -66856 287467 791074
13464G91074j42802n38171n98991l79958J02711q5748K0471Q182j0924r2526j78
$$ 791074 648272 110101 -488890 -868848 -766137 -851885 -831414 -823232 -834156 -926682 -926860
13453i26860J69382j2958J41369n1585M16027L46998P4389l15010m57466l90549
$$ -926860 -757478 -770436 -629067 -680652 -264625 82373 156762 -158248 -615714 -1006263
13443a006263k05130M8877j40681q50J16348k66298n01614j6674O70675P15644
$$ -1006263 -1211393 -1162516 -1303197 -1304047 -1187699 -1453997 -1955611 -1972285 -1301610 -585966
13433e85966M44834j56314l41583k02276j1396K20014j19934j19272L72869M53539
$$ -585966 -141132 -297446 -639029 -841305 -852701 -632687 -752621 -871893 -499024 -45485
13423d5485k2074O509L87541K99489l03062j74138j21545k29330k17886j38179
$$ -45485 -67559 -61050 326491 625980 322918 148780 27235 -202095 -419981 -558160
13413e58160K47224L50763J58326j86051P2561j82781K36645N8903j5031J87375
$$ -558160 -310936 39827 198153 12102 84663 -98118 138527 197430 182399 369774
13403C69774J37Q2052q636J0953j6101k02548l07675q0671K04543L26242o1133
$$ 369774 369911 451963 443327 454280 438179 235631 -72044 -152715 51828 378070 316937
13392C16937k14848j77036l22915j03435K61372k47586o13887j38380N170J08580
$$ 316937 102089 -74947 -397862 -501297 -239925 -487511 -1101398 -1239778 -1234608 -1126028
13382a126028J94949L14280J44822N77574N06853k63118l83140j8636M18455L92596
$$ -1126028 -931079 -616799 -471977 105597 612450 349332 -33808 -52444 366011 758607
13372G58607K34332k0263r6856l42650j65228q2816R8902L49647j00904m37695
$$ 758607 992939 972676 875820 533170 367942 285126 384028 733675 632771 195076
13362A95076l1672J89940L10003j08988l28524l43292n17912k28074K9033J78861
$$ 195076 163404 353344 663347 554359 225835 -117457 -635369 -863443 -834410 -655549
13352f55549N26071K40152o2254J32459K20497j35284j88406L1368M13294L36349
$$ -655549 -129478 110674 48420 180879 401376 266092 77686 109054 522348 858697
13342H58697l6098p2247j48962l4141M00208L31314k01032l24248m01269m14393
$$ 858697 822599 750352 601390 567249 967457 1298771 1097739 773491 372222 -42171
13332d2171k40066j10589j64114m64546j34206K32117L62519L12508K03519m1425
$$ -42171 -282237 -392826 -556940 -1021486 -1155692 -923575 -561056 -248548 -45029 -86454
13322h6454l77660J04064N54363M78075L20860l84240p97035k57946r0510M41448
$$ -86454 -464114 -360050 194313 672388 993248 609008 -188027 -445973 -536483 -95035
13312i5035J91574j59450P0304K69039N0410m84660k59659J22909N3330J10446
$$ -95035 96539 -62911 7393 276432 326842 -157818 -417477 -294568 -241238 -130792
13302a30792K76227Q9577l6534K47496N40398N9204j74232R1042k5159k67292
$$ -130792 145435 235012 198478 445974 986372 1045576 871344 962386 937227 669935
13292F69935k66566m48275o94057l95841O8621P0821K63786M11359M55792L84525
$$ 669935 403369 -44906 -738963 -1134804 -1066183 -995362 -731576 -320217 135575 520100
13282E20100J19626j44455j15758k57585k72720j31631L77685N05860p1452o48979
$$ 520100 639726 495271 379513 121928 -150792 -282423 95262 601122 529670 -119309
13272a19309k89540J92114K4275J1709K77893L99634j76036J04322L94273L7070
$$ -119309 -408849 -216735 -192460 -180751 97142 496776 320740 425062 819335 856405
13262H56405l14036m7146o9103N0796m7352j20740k58343l96806m20461j63705
$$ 856405 542369 495223 426120 476916 429564 308824 50481 -346325 -766786 -930491
13252i30491K06628K80654K09857n1713k8212L87661M27278J47173m5074l88137
$$ -930491 -723863 -443209 -233352 -285065 -313277 74384 501662 648835 603761 215624
13242B15624l96299J80078P31579L36365Q6157p0787l49849j72048K67207K54288
$$ 215624 -180675 -597 730982 1067347 1153504 1082717 732868 560820 828027 1082315
13232A082315K79179M05048K76334j02235n50496n39303l58487k7625R1306L56751
$$ 1082315 1361494 1766542 2042876 1940641 1390145 850842 492355 464730 556036 912787
13222I12787L96221J70229J58311j57386j60448n77186l05776J15415j16525q9301
$$ 912787 1309008 1479237 1637548 1480162 1319714 742528 436752 552167 435642 346341
13212C46341o9206j32102r1705l1985N5653k53168k50595j83885j28754j26835
$$ 346341 277135 145033 53328 21343 76996 -176172 -426767 -610652 -739406 -866241
13202h66241P7770L29772J93671J15769L03741M39797N3847k71897J11738J89807
$$ -866241 -788471 -458699 -265028 -149259 154482 594279 648126 376229 487967 677774
13192F77774o6073k18513j02313m69350n63660k02839Q2337N56395m8754l27994
$$ 677774 611701 393188 290875 -178475 -742135 -944974 -862637 -306242 -354996 -682990
13182f82990K85271K74576L47013L54129J56812j23048m6297K35871L57540K05247
$$ -682990 -397719 -123143 223870 577999 734811 611763 565466 801337 1158877 1364124
13172A364124K09813J19334j16770k27260l28316n77358j34928j7755j1015k39158
$$ 1364124 1573937 1693271 1576501 1349241 1020925 443567 308639 290884 279869 40711
13162D0711j66875J40590K51056K17325J68201P6112j70273l78756J6580J54015
$$ 40711 -126164 14426 265482 482807 651008 727120 556847 178091 194671 348686
13152C48686J69556K30659K30032o4648r1016n591j16935J81806n0849l73297
$$ 348686 518242 748901 978933 914285 823269 817678 700743 882549 831700 458403
13142D58403n39840K2009L48342n5111J36050N80504L30262k25331m6676J36147
$$ 458403 -81437 -59428 288914 233803 369853 950357 1280619 1055288 1008612 1144759
13132A144759J6284k30585k60329r8384L62230N93946L20618j11886M7622P7186
$$ 1144759 1161043 930458 670129 571745 933975 1527921 1848539 1736653 1784275 1861461
13122A861461k18705J58736J31463l07161n99727k54916K95896L37440M51770
$$ 1861461 1642756 1801492 1932955 1625794 1026067 771151 1067047 1404487 1856257
13113A856257L14036j84435m34775m98311k70659n7865j06890n63835n9675N94622
$$ 1856257 2170293 1985858 1551083 1052772 782113 724248 617358 53523 -6152 588470
13103E88470L58579J29160o1973l22720p7493K67326K50505O5146l2552K1216
$$ 588470 947049 1076209 1014236 691516 614023 881349 1131854 1197000 1164448 1185664
13093A185664K44512P5564M8651j38811J0168K31750J11793J00316m52978p61131
$$ 1185664 1430176 1505740 1554391 1415580 1425748 1657498 1769291 1869607 1416629 655498
13083F55498j95335M467l04441j25654K49505O31367L66141p6571O3921K66141
$$ 655498 460163 464630 160189 34535 284040 915407 1281548 1204977 1268898 1535039
13073A535039J73908J44278j75646j61836l8128j29421j40036K65465L77997r5551
$$ 1535039 1708947 1853225 1677579 1515743 1477615 1348194 1208158 1473623 1851620 1756069
13063A756069Q7633K37872J41592k84013Q9758J78578L90726K25647m58258m70645
$$ 1756069 1843702 2081574 2223166 1939153 2028911 2207489 2598215 2823862 2365604 1894959
13053A894959p1834J32251J75056M44931L94359O164m72091l05418J52757j25961
$$ 1894959 1823125 1955376 2130432 2575363 2969722 2975886 2503795 2198377 2351134 2225173
13043B225173N0807L04906K1680m6850j15746j65555l98649j88493J81584J42929
$$ 2225173 2275980 2580886 2602566 2555716 2439970 2274415 1875766 1687273 1868857 2011786
13033B011786N28163O24064J78915n0721J48072L41194M02965K33296k3579p8894
$$ 2011786 2539949 3164013 3342928 3292207 3440279 3781473 4184438 4417734 4394155 4315261
13023D315261J28893q6969k46088j31754M4597J1063N9252J43830N91159N00588
$$ 4315261 4444154 4357185 4111097 3979343 4023940 4035003 4094255 4238085 4829244 5329832
13013E329832K63892J59316l02581P0667L01410k1487J62052O61528N84555L03999
$$ 5329832 5593724 5753040 5450459 5521126 5822536 5801049 5963101 6624629 7209184 7513183
13003G513183N59384P26221N13423N11547O58641P54192J108331Q72460J156743
$$ 7513183 8072567 8798788 9312211 9823758 10482399 11236591 12344922 13217382 14374125
12994A4374125J569555J671825K061739K631688K889406L264312M124447M882737
$$ 14374125 15943680 17615505 19677244 22308932 25198338 28462650 32587097 37469834
12986C7469834O118899P925652R113653J0585696J3035135J6171844K0995434
$$ 37469834 43588733 51514385 60628038 71213734 84248869 100420713 121416147
12979A21416147K7541649L6509181M8898002O3774767P6122340P2586795L7152764
$$ 121416147 148957796 185466977 234364979 298139746 374262086 446848881 484001645
12972D84001645k1662900o5158267p4823360o4543581n0047559l8168951k9479855
$$ 484001645 462338745 397180478 322357118 257813537 207765978 169597027 140117172
12965A40117172k2421870j7727464j4065109j1225077r241033p225208o106640
$$ 140117172 117695302 99967838 85902729 74677652 65436619 58211411 52104771
12958E2104771n416843m745788m179077l809283l278641k644544j973946j478262
$$ 52104771 46687928 41942140 37763063 33953780 30675139 28030595 26056649 24578387
12950B4578387j340546j194541j325279j674830j480667j020394q67282p72483
$$ 24578387 23237841 22043300 20718021 19043191 17562524 16542130 15674848 14902365
12942A4902365o47268l70002k17653j77894k7065k34558p08714m82474k24116
$$ 14902365 14255097 13885095 13667442 13489548 13462483 13227925 12519211 12036737 11812621
12933A1812621n94800J3546k7431Q4437L46575N26545N27994O06162O30608P49448
$$ 11812621 11217821 11231367 11203936 11288373 11634948 12161493 12689487 13295649 13926257 14675705
12923A4675705J108320J478405K023405K333593K472437L943210M931637N620962
$$ 14675705 15784025 17262430 19285835 21619428 24091865 28035075 32966712 38587674
12915C8587674O114072M028148p86387m601433n292812m176035k862491j592336
$$ 38587674 44701746 48729894 47943507 43342074 38049262 33873227 31010736 29418400
12907B9418400l25238K88711Q79420J236289J900286L067237M256995N161263
$$ 29418400 29093162 29381873 30261293 31497582 33397868 36465105 40722100 45883363
12899D5883363O282812P406712Q720416J0315055J3371317J7481401K2665938
$$ 45883363 52166175 59572887 68293303 78608358 91979675 109461076 132127014
12892A32127014K9610155L9863802N3546254O9187837Q0193322O9738677K2230287
$$ 132127014 161737169 201600971 255147225 324335062 404528384 474267061 496497348
12885D96497348m0442217p5126975p5834561o1987971m6682034l5058833k7023858
$$ 496497348 456055131 380928156 305093595 243105624 196423590 161364757 134340899
12878A34340899k1240840j6390439j3070166j0521775q835313p912772o473630
$$ 134340899 113100059 96709620 83639454 73117679 64282366 56369594 49895964
12871D9895964m664904l985633l754480l076482k464792k390044k492236k145102
$$ 49895964 45231060 41245427 37490947 34414465 31949673 29559629 27067393 24922291
12863B4922291k012792j830720j346435q79742q71313j250899q11346q54372j161355
$$ 24922291 22909499 21078779 19732344 18852602 17981289 16730390 15919044 15064672 13903317
12854A3903317r77203p57520n07506k06231K0646m3197m74286l69738j66961l90809
$$ 13903317 12926114 12168594 11661088 11454857 11475503 11432306 10958020 10588282 10421321 10030512
12844A0030512p2746Q3922k51586j69858J49544N48838L09856j6544J28318J75338
$$ 10030512 9957766 10041688 9790102 9620244 9769788 10318626 10628482 10611938 10740256 10915594
12834A0915594K06728M25513M37672K23623J82931Q2948L58860P11185N48511
$$ 10915594 11122322 11547835 11985507 12209130 12392061 12475009 12833869 13545054 14093565
12825A4093565M17486J136388J694588J300942J035693J531314J962522J960845
$$ 14093565 14511051 15647439 17342027 18642969 19678662 21209976 23172498 25133343
12817B5133343K222793K717991L809540N206826N828754O773670Q327916R781542
$$ 25133343 27356136 30074127 33883667 39090493 44919247 51692917 60020833 69802375
12809F9802375J1945862J5001829J8755388K4148702L1910535M2487111N6331583
$$ 69802375 81748237 96750066 115505454 139654156 171564691 214051802 270383385
12802B70383385P0761317P6772460N6819653M506382n0222937p4571378p0703092
$$ 270383385 341144702 417917162 474736815 479243197 429020260 354448882 283745790
12795B83745790n6666031m3258809l2817482k5272012j9811205j5591876j2600721
$$ 283745790 227079759 183820950 151003468 125731456 105920251 90328375 77727654
12788G7727654j0234611q527282p053409n826546m935604m635259l828573l138802
$$ 77727654 67493043 58965761 51912352 46085806 41150202 36514943 32686370 29547568
12780B9547568k820602k506666j944810j929090k158133j583560j415717j173398
$$ 29547568 26726966 24220300 22275490 20346400 18188267 16604707 15188990 14015592
12772A4015592p74781o10136n01358p46693q40035r16553o39117l28548k2068
$$ 14015592 13240811 12630675 12129317 11382624 10542589 9626036 8986919 8658371 8636303
12763H636303j42227l25279l15596o60391q00758n48471n11243j13998K44820
$$ 8636303 8494076 8168797 7853201 7192810 6392052 5843581 5332338 5218340 5463160
12754E463160Q4310k8136O4263l22311o43289n20298j71415Q249n7234l38579
$$ 5463160 5547470 5519334 5583597 5261286 4617997 4097699 3926284 3934533 3877299 3538720
12744C538720l60271k56719l60264J580O28722L93785L2425j92006l62225p25905
$$ 3538720 3178449 2921730 2561466 2563046 3191768 3585553 3617978 3425972 3063747 2337842
12734B337842l26105K80186K06727Q9091j07032L45210K85670M1261L2247p2340
$$ 2337842 2011737 2291923 2498650 2587741 2480709 2825919 3111589 3152850 3185097 3112757
12724C112757M4857k9802J0750j98589j78174K94175K68092K6841j10783l22516
$$ 3112757 3157614 3127812 3138562 2939973 2761799 3055974 3324066 3350907 3240124 2917608
12714B917608k57596k78469l12428L03400L73335l81963r21716m90595J41583
$$ 2917608 2660012 2381543 2069115 2372515 2745850 2363887 1442171 951576 1093159
12705A093159J07771j72382j41901K53011l2486J08619J03347j26694p3482k45465
$$ 1093159 1200930 1028548 886647 1139658 1107172 1215791 1319138 1192444 1118962 873497
12695H73497l94940k17951K32505M52096M63702j21192j12745L1086o4994L45854
$$ 873497 478557 260606 493111 945207 1408909 1287717 1174972 1206058 1141064 1486918
12685A486918N52002K44874m36747p80253k47598J15337o2363J91041O1760J72880
$$ 1486918 2038920 2283794 1847047 1066794 819196 934533 872170 1063211 1124971 1297851
12675A297851M12969M12129m868q9458j20824J19141k91951n61935k63689R2376
$$ 1297851 1710820 2122949 2118081 2028623 1907799 2026940 1734989 1173054 909365 1001741
12665A001741q0259m1826l77169j03804p5859k42647k74138l29557L42L67509
$$ 1001741 921482 879656 502487 398683 322824 80177 -193961 -523518 -523176 -155667
12655a55667L45931J4181J17588N10603L10637o03358o67763k20960O6679K52275
$$ -155667 190264 204445 322033 832636 1143273 539915 -127848 -348808 -282129 -29854
12645b9854M09179N16841N58099j75881j23028K58502J17892o6806R0968j14208
$$ -29854 379325 896166 1454265 1278384 1155356 1413858 1531750 1464944 1555912 1441704
12635A441704o96378n08607r5952n281K27885K28306J07837k4072k02999k88596
$$ 1441704 745326 236719 140767 135486 363371 591677 699514 675442 472443 183847
12625A83847k61550q9239J05103L95639M84860j01952n75762l73511m50906M2681
$$ 183847 -77703 -166942 -61839 333800 818660 716708 140946 -232565 -683471 -640790
12615f40790P47308N48029J14915j70982p8431n72027n80075m6413J83312Q740
$$ -640790 106518 654547 769462 598480 520049 -51978 -632053 -678466 -495154 -486414
12605d86414J94302N87227M09142j59997o4534K38086J22906k9391N9321L4478
$$ -486414 -292112 295115 704257 544260 479726 717812 840718 811327 870648 905126
12595I05126k19510o26147n1399M46480R2780j38371K73789L79177J27798Q8968
$$ 905126 685616 59469 8070 454550 547330 408959 682748 1061925 1189723 1278691
12585A278691j63936k58737m20239n7241L59341P6654p5900N03819M51889m21902
$$ 1278691 1114755 856018 435779 378538 737879 814533 738633 1242452 1694341 1272439
12575A272439n58149q1813l47173l02756K61266L35878L0675J86656l5261m73723
$$ 1272439 714290 632477 285304 -17452 243814 579692 610367 797023 761762 288039
12565B88039l39092k8247M40275L20531k67382k18075J11225K77062K67754q0567
$$ 288039 -51053 -79300 360975 681506 414124 196049 307274 584336 852090 771523
12555G71523k37526l0387j03169J07296L84694L49593J92585K27743L19439l11274
$$ 771523 533997 503610 400441 507737 892431 1242024 1434609 1662352 1981791 1670517
12545A670517o34849n23480k9298q437J5543K04844j68127k23887l83680k54332
$$ 1670517 1035668 512188 482890 474453 489996 694840 526713 302826 -80854 -335186
12535c35186O1020J60517k05504l2037r7310r5313O1286J3362K50445J43571J05763
$$ -335186 -274166 -113649 -319153 -351190 -448500 -543813 -482527 -469165 -218720 -75149 30614
12524C0614O1623k16879j27657L23606j7989j17226L916P3251K39021K55135j3597
$$ 30614 92237 -124642 -252299 71307 53318 -63908 -59992 13259 252280 507415 493818
12513D93818J72503M10461q1169J02084J76257m01370l86386j31601j10370K4125
$$ 493818 666321 1076782 995613 1097697 1273954 872584 486198 354597 244227 268352
12503B68352K66965j39012m14184n02475R933L94706Q9014L3624J02278J9759
$$ 268352 535317 396305 -17879 -520354 -510421 -115715 -26701 6923 109201 128960
12493A28960l94778n02870q6493J33528r4442n3381J50351q6235O8062r1565O5857
$$ 128960 -265818 -768688 -855181 -721653 -816095 -869476 -719125 -805360 -737298 -828863 -763006
12482g63006L31177P94611O09314J30323n90428o39396L16620M86584L26178K28724
$$ -763006 -431829 362782 972096 1102419 511991 -127405 189215 675799 1001977 1230701
12472A230701j73243k15096m06692l81127l79104L67500N55449n4668l35137j30326
$$ 1230701 1057458 842362 435670 54543 -324561 42939 598388 543720 208583 78257
12462G8257k71588m53735o0076M24712J67459J85818K58031K45380J0384m2837
$$ 78257 -193331 -647066 -707142 -282430 -114971 70847 328878 574258 584642 541805
12452E41805K2138J20704L48522R0592k06962l70264k28366L1881l1244l18843
$$ 541805 563943 684647 1033169 1123761 916799 546535 318169 350050 318806 -37
12442c7l7545Q1393K09290K62882n6922m72472j85017K28905K64266j75341l9049
$$ -37 -37582 43811 253101 515983 459061 -13411 -198428 30477 294743 119402 80353
12431H0353K10343K55354J24991r3793J30554J44799R2525k18223o42835j32698
$$ 80353 290696 546050 671041 577248 707802 852601 945126 726903 84068 -48630
12421d8630M11482K29748K8954j20361L5606J26502K67302O7465j56144n95994
$$ -48630 362852 592600 621554 501193 536799 663301 930603 998068 841924 245930
12411B45930l80480j28511j49854n28689o09637l40235L60986P11341P26092M47750
$$ 245930 -134550 -263061 -412915 -941604 -1551241 -1891476 -1530490 -819149 -93057 354693
12401C54693j39772m10562m67934n37987j96633M6388p0460L43537K83573n9541
$$ 354693 214921 -195641 -663575 -1201562 -1398195 -1351807 -1422267 -1078730 -795157 -854698
12391h54698l30215R342N75830N34464J35253K16686M90183K33823j59590n28669
$$ -854698 -1184913 -1175571 -599741 -65277 69976 286662 776845 1010668 851078 322409
12381C22409p6767N00187M18457N1894l76525m13950k81309r00K50114J38720
$$ 322409 245642 745829 1164286 1216180 839655 425705 144396 143496 393610 532330
12371E32330n5110j95644j34p2537k70721j68874J43840L93517K70277j33700
$$ 532330 477220 281576 281442 208905 -61816 -230690 -86850 306667 576944 443244
12361D43244L03464J78899l39033j90169K82422L96809J65101q3583o25137m28318
$$ 443244 746708 925607 586574 396405 678827 1075636 1240737 1157154 532017 103699
12351A03699k80428J25638J08971j48452O5428L208J49667M35127M25003j29828
$$ 103699 -176729 -51091 57880 -90572 -25144 -21936 127731 562858 987861 858033
12341H58033o78776k89300m330L74881L81184k68744n09757j3052q1237J15480
$$ 858033 179257 -110043 -114373 260508 641692 372948 -136809 -149861 -231098 -115618
12331a15618K52082O36375M10250l90514o21502n07568j69369m5153j69036j54927
$$ -115618 136464 772839 1183089 792575 171073 -336495 -505864 -551017 -720053 -874980
12321h74980r4532n0414j35255n7606j35493L11663M54714J77313L79875N75015
$$ -874980 -969512 -1019926 -1155181 -1212787 -1348280 -1036617 -581903 -404590 -24715 550300
12311E50300K74399l68563o43621n49952k75258j24009O8133M03094L59436J44510
$$ 550300 824699 456136 -187485 -737437 -1012695 -1136704 -1068571 -665477 -306041 -161531
12301a61531J42605j06330N9635J99945N0581j58364k49796N3326l08057n33869
$$ -161531 -18926 -125256 -65621 134324 184905 26541 -223255 -169929 -477986 -1011855
12291a011855n2887L97434k49806j91328M03172O9787J83381K91254O0329j34846
$$ -1011855 -1064742 -667308 -917114 -1108442 -705270 -635483 -452102 -160848 -100519 -235365
12281b35365j03453j59926P6437L59999L00412J78392o3355j21370j32311J9477
$$ -235365 -338818 -498744 -422307 -62308 238104 416496 353141 231771 99460 118937
12271A18937J66987O1073j02204j80699j49342M45931L05280j99244k80810j87560
$$ 118937 285924 346997 244793 64094 -85248 360683 665963 466719 185909 -1651
12261a651j12543J39754j07347j61713k47850J51223K66235M00691L53394J8218
$$ -1651 -114194 25560 -81787 -243500 -491350 -340127 -73892 326799 680193 698411
12251F98411k68603j15149j12026j00390L1247j96180k84364k92873m33187l95455
$$ 698411 429808 314659 202633 102243 133490 -62690 -347054 -639927 -1073114 -1468569
12241a468569k6595O3805L81851J97162O5061M13768L63713J99058N1882L07440
$$ -1468569 -1495164 -1431359 -1049508 -852346 -787285 -373517 -9804 189254 241136 548576
12231E48576k05412k82586k9321j33539K54483L5086j10730k42373J91611K75235
$$ 548576 343164 60578 31257 -102282 152201 187287 76557 -165816 25795 301030
12221C01030j26400J02290o0783k28344L7889j922p0006K24566L8502k45309n28714
$$ 301030 174630 276920 216137 -12207 25682 23760 -46246 178320 216822 -28487 -557201
12210e57201j56731N92942N82295N02253K28882M6614k28902m38342l30054k61833
$$ -557201 -713932 -120990 461305 963558 1192440 1239054 1010152 571810 241756 -20077
12200b0077L68423q1113l61396K23375K49595p7269l22489l00431l06811q029
$$ -20077 348346 267233 -94163 129212 378807 301538 -20951 -321382 -628193 -636222
12190f36222m0093j70116m12675p2607M68931L29455J36460J63373L84415M4171
$$ -636222 -676315 -846431 -1259106 -1331713 -862782 -533327 -396867 -233494 150921 195092
12180A95092l55690J07187J66490K65843n8013r8909K82226M6423j64394l62654
$$ 195092 -160598 -53411 113079 378922 320909 222000 504226 550649 386255 23601
12170B3601o88237n36909K58861O29720N74326k63085j04001K77978N4848k48540
$$ 23601 -664636 -1201545 -942684 -312964 261362 -1723 -105724 172254 227102 -21438
12160b1438K2779L30799L72730j26926m01143k11453J05218J90479m62917m89037
$$ -21438 1341 332140 704870 577944 176801 -34652 70566 261045 -201872 -690909
12150f90909r8876J71043R7983r8386L09535P83428K87503M1670k38523k51336
$$ -690909 -789785 -618742 -520759 -619145 -309610 473818 761321 802991 564468 313132
12140C13132q7182l54687k8785L20293m0751j61462J2594P7483K47030J79125
$$ 313132 225950 -128737 -157522 162771 122020 -39442 -26848 50635 297665 476790
12130D76790l70774j11403O3778J7504O8455K26390j12082m87475K9547K16226
$$ 476790 106016 -5387 58391 75895 144350 370740 258658 -228817 -199270 16956
12120A6956j41768K74132L37373N15235p2368m18568n12626o97506j80660k6666
$$ 16956 -124812 149320 486693 1001928 929560 510992 -1634 -699140 -879800 -906466
12110i06466L48858O75851j30607j86759K36872k2502J25349K53582Q9285j17272
$$ -906466 -557608 118243 -12364 -199123 37749 15247 140596 394178 483463 366191
12100C66191o8941l47922m35875j85007J93579N09846N16906k41554r5286M66074
$$ 366191 297250 -50672 -486547 -671554 -477975 31871 548777 307223 211937 678011
12090F78011J11852r2784J72804m26595m83665r795O339k18211l77567K20370
$$ 678011 789863 697079 869883 443288 -40377 -50172 -43833 -262044 -639611 -419241
12080d19241L37288k0973j32225p2457P5581O0886K18967J04631N80R9947Q5433
$$ -419241 -81953 -102926 -235151 -307608 -232027 -171141 47826 152457 153037 252984 338417
12069C38417M5437o1432Q268J35583K67554K47847K31215J21127P1553L0091m1945
$$ 338417 383854 322422 330690 466273 733827 981674 1212889 1334016 1405569 1435660 1393715
12058A393715j39774l80766l70081n49470l18697j76440L52238L91166q2976o6459
$$ 1393715 1253941 873175 503094 -46376 -365073 -541513 -189275 201891 118915 52456
12048E2456j23305Q277k26727J56085J96243j05132j40513j3482P3954L88169
$$ 52456 -70849 -62572 -289299 -133214 63029 -42103 -182616 -196098 -122144 266025
12038B66025O13452J14221o0693l2871M04254r6763k74785j71253l36303n45750
$$ 266025 879477 993698 933005 900134 1304388 1207625 932840 761587 425284 -120466
12028a20466r805K88804j9080o8203j212j52623l65499j20495M8802M20455N45567
$$ -120466 -130271 158533 139453 71250 70038 -82585 -448084 -568579 -519777 -99322 446245
12017D46245K1834k78464M41253M19091k16187j65707r9286M7915n2263j07116
$$ 446245 468079 189615 630868 1049959 833772 668065 568779 616694 564431 457315
12007D57315j0398N8714K52222O2065j46576l6996q7177l47890m41559j88902
$$ 457315 446917 505631 757853 819918 673342 636346 549169 201279 -240280 -429182
11997d29182j94741N8078M38824K37960L466J53755J42056k01533l88603o1029
$$ -429182 -623923 -565845 -127021 110939 114405 268160 410216 208683 -179920 -240949
11987b40949M30734J53185n7822m22687l77898j44144O0077R1401K94434J4361
$$ -240949 189785 342970 285148 -137539 -515437 -659581 -599504 -508103 -213669 -199308
11977a99308K56067J39252l5508L3734r5755k71947j58712k16807R1828M38920
$$ -199308 56759 196011 160503 194237 98482 -173465 -332177 -548984 -457156 -18236
11967a8236K8596j82696J90328K84920L63238n1450j31224K84056P55938K38613
$$ -18236 10360 -172336 17992 302912 666150 614700 483476 767532 1523470 1762083
11957A762083o61027r13624o71668m35961k14577k05725L1993K92264K01669K06830
$$ 1762083 1101056 187432 -484236 -920197 -1134774 -1340499 -1308506 -1016242 -814573 -607743
11947f07743J54725M3446k10196j16053R4385J05459J92980N79166N51750J79376
$$ -607743 -453018 -409572 -619768 -735821 -641436 -535977 -342997 236169 787919 967295
11937I67295l30201l57676l09849j73622J85705O1464P2650o3009J43795L40961
$$ 967295 637094 279418 -30431 -204053 -18348 43116 115766 52757 196552 537513
11927E37513j29176l29322j56804J24366K31993r3948n73521l53945J23580J96165
$$ 537513 408337 79015 -77789 46577 278570 184622 -388899 -742844 -619264 -423099
11917d23099K37833L8444k89279j50979j00238K10182M83880L63114J97765k54929
$$ -423099 -185266 -146822 -436101 -587080 -687318 -477136 6744 369858 567623 312694
11907C12694k32951J82168N61078N02393p4583o19761n85932O9760M42522J95246
$$ 312694 79743 261911 822989 1325382 1250799 631038 45106 114866 557388 752634
11897G52634M88913N66807K48224m10887p88073o47235l76957j81334K963J52012
$$ 752634 1241547 1808354 2056578 1645691 857618 210383 -166574 -347908 -344945 -192933
11887a92933P281j9023J9000l44329m58828L3127L09095J73310k7878j11704J4305
$$ -192933 -185652 -204675 -185675 -530004 -988832 -955705 -646610 -473300 -501178 -612882 -598577
11876e98577P8172L35868j98939k74417j17747Q142J46934r6853Q2147P083R4754
$$ -598577 -520405 -184537 -383476 -657893 -775640 -767498 -620564 -717417 -635270 -628187 -533433
11865e33433L90828M10370Q4803j89277j52621o6618K20140J02607j51878r3177
$$ -533433 -142605 267765 352568 163291 10670 -55948 164192 266799 114921 21744
11855B1744K83575K97974K12785L76055l51217o18134k87786J4433j26886O4515
$$ 21744 305319 603293 816078 1192133 840916 222782 -65004 -50571 -177457 -112942
11845a12942k98789m98408n5477k45777m10008N71089Q40469J28367j33205n253
$$ -112942 -411731 -910139 -965616 -1211393 -1621401 -1050312 -209843 -81476 -214681 -219934
11835b19934j27626k08018K55002L32538p2287j85303J91459M76046J92330J03085
$$ -219934 -347560 -555578 -300576 31962 -40325 -225628 -34169 441877 634207 737292
11825G37292n51916n42792l71706j97932O8557J34729J27608O4474k38883K78468
$$ 737292 185376 -357416 -729122 -927054 -858497 -723768 -596160 -531686 -770569 -492101
11815d92101P85559K98750j19338k25680J37536k292l05967j98175o0088J7666
$$ -492101 293458 592208 472870 247190 384726 382434 76467 -121708 -181796 -164130
11805a64130j15346l07313l37777o6469J77208K16819N13637M18613K35584P9055
$$ -164130 -279476 -586789 -924566 -991035 -813827 -597008 -83371 335242 570826 649881
11795F49881j47343J07889L56907N7870l46214p53457k68923K15399L91975J63410
$$ 649881 502538 610427 967334 1025204 678990 -74467 -343390 -127991 263984 427394
11785D27394P293l7129j85603j99095L04390N78698J10325k60202k73511L30176
$$ 427394 434687 397558 211955 12860 317250 895948 1006273 746071 472560 802736
11775H02736J27757L96273N76607K15415q8690o77213n72485l16317l9281j05395
$$ 802736 930493 1326766 1903373 2118788 2030098 1352885 780400 464083 424802 319407
11765C19407l94723o49822n50118M61250Q13678n965m32275j03923J92980N59580
$$ 319407 -75316 -725138 -1275256 -814006 -328 -6293 -438568 -542491 -349511 210069
11755B10069L22161m4830j94763K6184J45631m8626j31507l72839k95335P6526
$$ 210069 532230 487400 292637 318821 464452 415826 284319 -88520 -383855 -307329
11745c07329M08745L29409M2336r4976n04502k30820k74536k02047K92653N25564
$$ -307329 101416 430825 473161 378185 -126317 -357137 -631673 -833720 -541067 -15503
11735a5503m0399p3064k15083j40983L46155L81228P6211J4626R4992K0691K40908
$$ -15503 -55902 -128966 -344049 -485032 -138877 242351 318562 333188 428180 448871 689779
11724F89779J01903p61818k94654L31366j009964m53716M00940K90068M08190
$$ 689779 791682 29864 -264790 66576 -943388 -1397104 -996164 -706096 -297906
11715b97906K94103Q1441J67314p4862l5426N6062m03514p53119k16635L13263
$$ -297906 -3803 77638 244952 170090 134664 190726 -212788 -965907 -1182542 -869279
11705h69279K45027J93932K46364N0772j92656k3631J26514k61492n4049L20640
$$ -869279 -624252 -430320 -183956 -133184 -325840 -349471 -222957 -484449 -538498 -217858
11695b17858M20125K01822j45944j07608L31085O02552J91581P9054J6433M38763
$$ -217858 202267 404089 258145 150537 481622 1084174 1275755 1354809 1371242 1810005
11685A810005J324753J660869J40166j108973j113302r49381l37085l39928m01302
$$ 1810005 3134758 4795627 4935793 3826820 2713518 1764137 1427052 1087124 685822
11676F85822q659k3845K04353L3335j41034l9274q6287m07846k66144l9078O0253
$$ 685822 677163 653318 857671 891006 749972 710698 624411 216565 -49579 -88657 -28404
11665b8404K97400Q0784k15956p3801L57681N86308M61172j45129m87990M01039
$$ -28404 268996 349780 133824 60023 417704 1004012 1465184 1320055 832065 1233104
11655A233104L12091k21371j47715j54335n39123m61127j49042l1307J66255J46762
$$ 1233104 1545195 1323824 1176109 1021774 482651 21524 -127518 -158825 7430 154192
11645A54192K53439O5024l67630m13460L1753R7918k94162k98817J36499N15037
$$ 154192 407631 472655 105025 -308435 -276682 -178764 -472926 -771743 -635244 -120207
11635a20207M36794J79118L8430r6576k54798j52569K14958K14685r4720k94878
$$ -120207 316587 495705 534135 437559 182761 30192 245150 459835 365115 70237
11625G0237k15837J61343k5401j54190M34812N43057P865k42278m09186k55095
$$ 70237 -145600 15743 -9658 -163848 270964 814021 821886 579608 170422 -84673
11615h4673j07156Q3375K85137K0235l335L90264J26312M6877K18549J17402l49141
$$ -84673 -191829 -108454 176683 196918 193583 583847 710159 757036 975585 1092987 743846
11604G43846n20316k47443j34491Q7448l6271m79664j91890L08566N1279J2595
$$ 743846 223530 -23913 -158404 -70956 -107227 -586891 -778781 -470215 -418936 -406341
11594d06341q8307j50377j30884Q2698J25173j75173q6325J24122o6880J01676
$$ -406341 -494648 -645025 -775909 -693211 -568038 -743211 -829536 -705414 -772294 -670618
11584f70618L42166L0450O4079j79925P2157L41087K72872J31753m0781R7j56443
$$ -670618 -328452 -298002 -233923 -413848 -341691 -604 272268 404021 363240 363337 206894
11573B06894o7553J81813J37522m88959k91261M48689J47710j74647N3761O9982
$$ 206894 139341 321154 458676 -30283 -321544 127145 274855 100208 153969 223951
11563B23951L92569M72535O08460L09157o01304n03543m58642m18029K49055N74737
$$ 223951 616520 1089055 1697515 2006672 1405368 901825 443183 25154 274209 848946
11553H48946J10146j75682m41365n34943k4036K84111K47563j73061q9328r7322
$$ 848946 959092 783410 342045 -192898 -216934 67177 314740 141679 52351 -44971
11543d4971J93141n1674j67186O3310P4111Q6140j23009n7561K39516L69430M6345
$$ -44971 148170 96496 -70690 -7380 66731 152871 29862 -27699 211817 581247 627592
11532F27592l12295J4491L09726j03364j93317m8546j03372j28929m928N45j58030
$$ 627592 315297 329788 639514 536150 342833 294287 190915 61986 57058 57603 -100427
11521a00427k5591K19701M25166m379k13045j55989K16730L48000J20745l10351
$$ -100427 -126018 93683 518849 514470 301425 145436 362166 710166 830911 520560
11511E20560o74902m44700P8520L95500K88684J93421j39969l26933j34132N0880
$$ 520560 -154342 -599042 -520522 -125022 163662 357083 217114 -109819 -243951 -193071
11501a93071P6422l0475p2658K01563K44032k06383m15616k81519q3940M3027
$$ -193071 -116649 -147124 -219782 -18219 225813 19430 -396186 -677705 -761645 -718618
11491g18618L07877M00429L38215P398m10235k31147o6324r9610n86559n11234
$$ -718618 -410741 -10312 327903 335301 -74934 -306081 -372405 -472015 -1058574 -1569808
11481a569808j7637L2360K39108L97985M24195P1789l35259Q0507N15720J12681
$$ -1569808 -1587445 -1555085 -1315977 -917992 -493797 -422008 -757267 -676760 -161040 -48359
11471d8359k86543J10548K26816M95008O8982o32713n66441k08434l3258K47458
$$ -48359 -334902 -224354 2462 497470 566452 -66261 -632702 -841136 -874394 -626936
11461f26936L5399q5582J45718R2504k14944j2295L25430j02849M2348J6834N4814
$$ -626936 -591537 -677119 -531401 -438897 -653841 -666136 -340706 -443555 -401207 -384373 -329559
11450c29559J91075p4189l81139k53865n5260M17792L96548j2442m26281j46571
$$ -329559 -138484 -212673 -593812 -847677 -902937 -485145 -88597 -101039 -527320 -673891
11440f73891K62246J96264r5668K0203J60253k75197k86227l08455j42506j47365
$$ -673891 -411645 -215381 -311049 -290846 -130593 -405790 -692017 -1000472 -1142978 -1290343
11430a290343j64019p328k0560j04667L40273O80868J04671l30466M4812L83245
$$ -1290343 -1454362 -1461690 -1482250 -1586917 -1246644 -565776 -461105 -791571 -746759 -363514
11420c63514k31523n85152r9129R32769J174911m6382q58655k26069J26242J06949
$$ -363514 -595037 -1180189 -1279318 -346549 828362 781980 -76675 -302744 -176502 -69553
11410f9553K97618K73236j12157K0843l7596k52738k78760J61273j69982N9073
$$ -69553 228065 501301 389144 409987 372391 119653 -159107 2166 -167816 -108743
11400a08743j76462l05693n0196q295K39579L98124L90150J31773m04748n84934
$$ -108743 -285205 -590898 -641094 -649389 -409810 -11686 378464 510237 105489 -479445
11390d79445m99504j14146K1309K03901K89616l09964m45082J53505P50681J69223
$$ -479445 -978949 -1093095 -1071786 -867885 -578269 -888233 -1333315 -1179810 -429129 -259906
11380b59906k99451n9688j38639M6052J25080L43942J51227j04907l41463n55636
$$ -259906 -559357 -619045 -757684 -711632 -586552 -242610 -91383 -196290 -537753 -1093389
11370a093389j65414J03827L50328O9718O2277N54348K35944l12555m61714n9293
$$ -1093389 -1258803 -1154976 -804648 -734930 -672653 -118305 117639 -194916 -656630 -715923
11360g15923K27455j52605J0967L20420M97972M36927K40488l80611r02739l43165
$$ -715923 -488468 -641073 -630106 -309686 188286 625213 865701 485090 -417649 -760814
11350g60814K08808J6579J10390K0820p1216m6616N75059N56930j53505o49362
$$ -760814 -552006 -535427 -425037 -404217 -475433 -522049 53010 609940 456435 -192927
11340a92927p11086J42564N52294R0171j35231j27299J08441J84142O52090J078696
$$ -192927 -904013 -761449 -209155 -118984 -254215 -381514 -273073 -88931 563159 1641855
11330A641855J00764n96764k35620k05264k5152K67634K9162j1944q2727l43140
$$ 1641855 1742619 1145855 910235 704971 679819 947453 976615 964671 881944 538804
11320E38804n68169k14288k25506k49921M01153M13448j99343k82463k92846k8424
$$ 538804 -29365 -243653 -469159 -719080 -317927 95521 -103822 -386285 -679131 -707555
11310g07555J39247K53470K61655Q1289l58905l03611M0334L03J14890J67975
$$ -707555 -568308 -314838 -53183 28106 -330799 -634410 -594076 -593773 -478883 -310908
11300c10908j5788K00824K55017l18901M427P59913M83657k29416j99758j11367
$$ -310908 -326696 -125872 129145 -189756 -185329 574584 1058241 828825 629067 517700
11290E17700j63253l2422J00949l0638L8646J6155k46747l74273m8637L01838
$$ 517700 354447 322025 422974 392336 430982 447137 200390 -173883 -222520 79318
11280G9318j9802l53138l69979J27219K4087J13439L70486J62118J41282m298
$$ 79318 59516 -293622 -663601 -536382 -512295 -398856 -28370 133748 275030 270732
11270B70732J66186m8110o4760L29486J50547o4213k96976o75031M6820K51877
$$ 270732 436918 388808 324048 653534 804081 739868 442892 -232139 -185319 66558
11260F6558p018k21554K61435L85931r3197k98441k40616P8187j17926m7919n41
$$ 66558 59540 -162014 99421 485352 392155 93714 -146902 -68715 -186641 -234560 -235101
11249b35101j90151K69454N70729K9375k95808k66277K08564L1167l24139j07925
$$ -235101 -425252 -155798 414931 444306 148498 -117779 90785 121952 -202187 -310112
11239c10112L36322N61970p0587k02575l0093r2598m31894k88716m03703j00338
$$ -310112 26210 588180 517593 315018 284925 192327 -239567 -528283 -931986 -1032324
11229a032324Q1029J49180M23484N87053K50168J71867m7161j19952j34420J24844
$$ -1032324 -951295 -802115 -378631 208422 458590 630457 583296 463344 328924 453768
11219D53768J97541k3121K20390J33622j70872n10635m35601M75506L97330K6277
$$ 453768 651309 628188 848578 982200 811328 300693 -134908 340598 737928 764205
11209G64205M0391l08123m53194j37102r9896K2869L1955j65257o4481L8778N36569
$$ 764205 804596 496473 43279 -93823 -193719 -170850 -138895 -304152 -368633 -329855 206714
11198B06714P51056L49600L5515r6360r3998j56558j12022K2526K09236k68008
$$ 206714 957770 1307370 1342885 1246525 1152527 995969 883947 906473 1115709 847701
11188H47701m27582m91839K51986O75935J50939l73513o51282k60214K10694j61375
$$ 847701 420119 -71720 180266 856201 1007140 633627 -17655 -277869 -67175 -228550
11178b28550p26917m03277o2346L07296J43408L2787M6354q9295L68703O65617
$$ -228550 -955467 -1358744 -1421090 -1113794 -970386 -937599 -891245 -980540 -611837 53780
11168E3780N1352m80923j49338P2610k4353J75482N99155K18120j24139L1974
$$ 53780 105132 -375791 -525129 -452519 -476872 -301390 297765 515885 391746 423720
11158D23720j10532k10619l35421n15678J80280L27099j65840l90445j80589k46973
$$ 423720 313188 102569 -232852 -748530 -568250 -241151 -406991 -797436 -978025 -1224998
11148a224998k23680O8594L74230L10325L13816l80979l07552L11303K64563L44302
$$ -1224998 -1448678 -1380084 -1005854 -695529 -381713 -762692 -1070244 -758941 -494378 -150076
11138a50076K87772J358M8557m3649k87792l11053N4696J05127Q8090K89502j48488
$$ -150076 137696 139054 187611 143962 -143830 -454883 -400187 -295060 -206970 82532 -65956
11127f5956l35697k33138j60748l24690k4809L44482M05068M39068L01639J95238
$$ -65956 -401653 -634791 -795539 -1120229 -1145038 -800556 -395488 43580 345219 540457
11117E40457J31036J73853k76865k62457j1350m68377k69257L6859K40664L73453
$$ 540457 671493 845346 568481 306024 294674 -173703 -442960 -406101 -165437 208016
11107B08016M46389k28902l99434j01246j4944j65812j20083K09143N48475N12138
$$ 208016 654405 425503 26069 -75177 -90121 -255933 -376016 -166873 381602 893740
11097H93740J65164K7035o0868l41783o31642l9331J51551k73129J11105J61210
$$ 893740 1058904 1085939 1025071 683288 51646 12315 163866 -109263 1842 163052
11087A63052N5540K19856l0884n09447p8998p86N2173q0550j95245l31608l72988
$$ 163052 218592 438448 407564 -101883 -180881 -181667 -129494 -210044 -405289 -736897 -1109885
11076a109885n08592k36066K5842K64398K70100K76060Q1745j22731K33004O08056
$$ -1109885 -1618477 -1854543 -1828701 -1564303 -1294203 -1018143 -936398 -1059129 -826125 -218069
11066b18069J84927J18601j39332j6624J81049J29134q090K4738q4670j56051
$$ -218069 -33142 85459 -53873 -70497 110552 239686 231596 256334 171664 15613
11056A5613l4383K40998q6750m66124m14520l89490J44665K96191K8104K81898
$$ 15613 -18770 222228 135478 -330646 -745166 -1134656 -989991 -693800 -665696 -383798
11046c83798N17960J44448n01591n60760k46132l26970l14100M45964Q29707N12020
$$ -383798 134162 278610 -222981 -783741 -1029873 -1356843 -1670943 -1224979 -395272 116748
11036A16748J7700l73731l90277j93408k1110p4462m3361J66377n8797n3507J58803
$$ 116748 134448 -239283 -629560 -822968 -844078 -918540 -961901 -795524 -854321 -907828 -749025
11025g49025K99552J79428j58924k941K40806K75316K2906j53762j38037J54370
$$ -749025 -449473 -270045 -428969 -431910 -191104 84212 107118 -46644 -184681 -30311
11015c0311L2226l95950k17814L20889K59766k99413Q8648L85666L10968k03209
$$ -30311 1915 -394035 -611849 -290960 -31194 -330607 -241959 143707 454675 251466
11005B51466j83326M89198J13290m41561n08699j21725J94615R9265J64182M29342
$$ 251466 68140 557338 670628 229067 -279632 -401357 -206742 -107477 56705 486047
10995D86047n2042j50966k15035l30631j17723J50018K5373l41000j07475K62313
$$ 486047 434005 283039 68004 -262627 -380350 -230332 -204959 -545959 -653434 -391121
10985c91121R94n9701O7408M9426k50714j27746p9264j23392J96889L33416j66376
$$ -391121 -390127 -449828 -382420 -332994 -583708 -711454 -790718 -914110 -717221 -383805 -550181
10974e50181n73820j66821K29901K0633J56114J43924j29824l6771Q0427k53841
$$ -550181 -1124001 -1290822 -1060921 -1040288 -884174 -740250 -870074 -906845 -826418 -1080259
10964a080259J65915N88374L5178R286J19215J51289j77359k91616k1601L04169
$$ -1080259 -914344 -325970 -290792 -281506 -162291 -11002 -188361 -479977 -501578 -197409
10954a97409L85095M02825K01303j27029k21025j92948l0168l651k42966m64991
$$ -197409 187686 590511 791814 664785 443760 250812 220644 216993 -25973 -490964
10944d90964l23527M02098L36284l2104K15395L67655K79000r9656k45600k95537
$$ -490964 -814491 -412393 -76109 -108213 107182 474837 753837 654181 408581 113044
10934A13044n60914j12744N06371o3438P9756K24154l06578q1622M10088N47905
$$ 113044 -447870 -560614 -54243 -117681 -37925 186229 -120349 -201971 208117 756022
10924G56022m43641o12270J50138Q863L57717Q06735m5144q59163n78629O2714
$$ 756022 312381 -299889 -149751 -140888 216829 1023564 978420 119257 -459372 -396658
10914c96658K02050r3015j84321j52626M3734K33870j65356J74292L64860J8296
$$ -396658 -194608 -287623 -471944 -624570 -580836 -346966 -512322 -338030 26830 45126
10904D5126n7469l0426k95747k93334K2763K75395J28159k95672k94364j28048
$$ 45126 -12343 -42769 -338516 -631850 -609087 -333692 -205533 -501205 -795569 -923617
10894i23617j21931k3854K04527J28268K80789J46407K60097M34519R9316j53869
$$ -923617 -1045548 -1069402 -864875 -736607 -455818 -309411 -49314 385205 484521 330652
10884C30652r4650K47860M90636j49387j51067l7789J0939j13112n20150l25314
$$ 330652 236002 483862 974498 825111 674044 636255 647194 534082 13932 -311382
10874c11382j67637k65949k14272M65633O17250J39046n08189n45554N2211K58730
$$ -311382 -479019 -744968 -959240 -493607 123643 262689 -245500 -791054 -738843 -480113
10864d80113R8243Q2652J79033J0770l0396J67032L03368L93497p5136m47470
$$ -480113 -381870 -299218 -120185 -109415 -139811 27221 330589 724086 648950 201480
10854B01480l18886L5536J91871n058J02284l69676l04630K67652K41989o9321
$$ 201480 -117406 -81870 110001 104943 207227 -162449 -467079 -199427 42562 -26759
10844b6759l55300k89604J4106K09591K98550m2642m023M52420L9232k3947M2182
$$ -26759 -382059 -671663 -657557 -447966 -149416 -192058 -196081 256339 295571 271624 313806
10833C13806m51551J59570M08567J24385q1544l32924k58726J02540J98780N52357
$$ 313806 -137745 21825 430392 554777 473233 140309 -118417 -15877 182903 735260
10823G35260L91473k29085j84898k1840n34712j90155J29233N7638N1443j21921
$$ 735260 1126733 897648 712750 690910 156198 -33957 95276 152914 204357 82436
10813H2436M37092M55112K22748J68997r7442m18574o46102J10025M54304R0191
$$ 82436 519528 974640 1197388 1366385 1268943 850369 204267 314292 768596 858787
10803H58787K00539J97933n2041R3120m16110o34242k91681J33818O40590K80225
$$ 858787 1059326 1257259 1205218 1298338 882228 247986 -43695 90123 730713 1010938
10793A010938J14445j10599k97644J96030J8921j702N00588J49589l52162j68411
$$ 1010938 1125383 1014784 717140 913170 932091 930389 1430977 1580566 1228404 1059993
10783A059993L09247o1990J69799M42485J43509k05780K16493M74560N6541j46056
$$ 1059993 1369240 1307250 1477049 1919534 2063043 1857263 2073756 2548316 2604857 2458801
10773B458801K19087L75721P5809O12213P47183L47562M75887O06264N68907n290
$$ 2458801 2677888 3053609 3129418 3741631 4488814 4836376 5312263 5918527 6487434 6482144
10763F482144n64421o53163j04927K06318P6350K76158L75697K01594l13625m40553
$$ 6482144 5917723 5264560 5159633 5365951 5442301 5718459 6094156 6295750 5982125 5541572
10753E541572k85312k66748n45422r51780m19169M73137L93209j61774n02768
$$ 5541572 5256260 4989512 4444090 3492310 3073141 3546278 3939487 3777713 3274945
10744C274945k53415j57141k35373J31838J70977J18642n8789j10096K48361J59437
$$ 3274945 3021530 2864389 2629016 2760854 2931831 3050473 2991684 2881588 3129949 3289386
10734C289386k06153j17006J6508K1783m7903L27123J03444j90748l65476k50927
$$ 3289386 3083233 2966227 2982735 3004518 2956615 3283738 3387182 3196434 2830958 2580031
10724B580031k72560k53506j02084k52707j70080K83575K2739o48195n11470j82990
$$ 2580031 2307471 2053965 1951881 1699174 1529094 1812669 1835408 1187213 675743 492753
10714D92753J27111P5914O2352Q7819J81632l5925l41334k54740j29358K005K80808
$$ 492753 619864 695778 758130 845949 1027581 991656 650322 395582 266224 268229 549037
10703E49037L69021J74908R4973L1164P6557j59601l25917l76512k21738k01376
$$ 549037 918058 1092966 1187939 1219103 1295660 1136059 810142 433630 211892 10516
10693A0516k24404K64196K91919j42536j73052K19338N9318J60704K74943k25760
$$ 10516 -213888 50308 342227 199691 26639 245977 305295 465999 740942 515182
10683E15182j78245k27312k26789j52966n2486K01684K05024R6955n2415j45503
$$ 515182 336937 109625 -117164 -270130 -322616 -120932 84092 181047 128632 -16871
10673a6871k33610j69153J90368L43896J50774P8682K46472M25289K34449k26615
$$ -16871 -250481 -419634 -229266 114630 265404 344086 590558 1015847 1250296 1023681
10663A023681n12856q0755N24727M01933l59070n91825j90107K4175o0014j8663
$$ 1023681 510825 430070 954797 1356730 997660 405835 215728 239903 179889 161226
10653A61226K66186M80808J57639J44781K2622l03191n18959m69978j90009k44206
$$ 161226 427412 908220 1065859 1210640 1233262 930071 411112 -58866 -248875 -493081
10643d93081J65142K03882o8006l14438n30394l2811L66749M42453K17674m7720
$$ -493081 -327939 -124057 -192063 -506501 -1036895 -1069706 -702957 -260504 -42830 -90550
10633i0550j19231J07513j17576k75119k85812k8680J68618k5723K00274M64428
$$ -90550 -209781 -102268 -219844 -494963 -780775 -809455 -640837 -666560 -466286 -1858
10623a858L15191k09127l99627j6352k26914l75491j30901L95597K15891m29561
$$ -1858 313333 104206 -295421 -311773 -538687 -914178 -1045079 -649482 -433591 -863152
10613h63152J8153M96146J63048m93290l39109l63370p5368M45497N58200M46223
$$ -863152 -844999 -348853 -185805 -679095 -1018204 -1381574 -1456942 -1011445 -453245 -7022
10603g022k06511k66281K73314P1650m6182M5204o1596Q9441K35401j44091l48619
$$ -7022 -213533 -479814 -206500 -134850 -181032 -135828 -197424 -107983 127418 -16673 -365292
10592c65292p2888p0928M80606k3534k22924O30366N67668p6853k81537l41358
$$ -365292 -438180 -509108 -28502 -52036 -274960 355406 923074 846221 564684 223326
10582B23326j97416Q7843K4067L1988J75085j21720p97312m42004K86921J01318
$$ 223326 25910 113753 137820 169808 344893 223173 -574139 -1016143 -729222 -627904
10572f27904l64660R7870N11690J88559K3706q5295L0716j81622k45200o1056
$$ -627904 -992564 -894694 -383004 -194445 -170739 -256034 -225318 -406940 -652140 -713196
10562g13196L4577L04961L02752J39916J63918R8572l66546j80322K62981O1031
$$ -713196 -678619 -373658 -70906 69010 232928 331500 -35046 -215368 47613 108644
10552A08644j68984m874J95635j17612m9648j40972k18611K63762J55915J02871
$$ 108644 -60340 -65214 130421 12809 -36839 -177811 -396422 -132660 23255 126126
10542A26126J24081N8762j14382m54064k72494n3199j0020j58659k90065j25055
$$ 126126 250207 308969 194587 -259477 -531971 -585170 -595190 -753849 -1043914 -1168969
10532a168969L84223M73944K16462K01434L25455M23358L6693J7255J58291k25882
$$ -1168969 -784746 -310802 -94340 107094 432549 855907 892600 909855 1068146 842264
10522H42264m00606k01492l30512L5768L61025L73227K24822j49871l32213n425
$$ 842264 441658 240166 -90346 -54578 306447 679674 904496 754625 422412 416987
10512D16987j80478l39232k40559J11410K23023l07938k65852R6288K7356m983
$$ 416987 236509 -102723 -343282 -231872 -8849 -316787 -582639 -486351 -458995 -463978
10502d63978p965L24884K90578Q3782K33137j77337o94810m80343j66441J13328
$$ -463978 -471943 -147059 143519 227301 460438 283101 -411709 -892052 -1058493 -945165
10492i45165K42720J86148K76873J60340j40279j28497q5981J29143K16745j95637
$$ -945165 -702445 -516297 -239424 -79084 -219363 -347860 -433841 -304698 -87953 -283590
10482b83590m20345N1048L21595J37049J60986N1090J02589K61725K44878n6474
$$ -283590 -703935 -652887 -331292 -194243 -33257 17833 120422 382147 627025 570551
10472E70551m25407m97398k40607l62522K6792J63988n7043j93418l24543m6935
$$ 570551 145144 -352254 -592861 -955383 -928591 -764603 -821646 -1015064 -1339607 -1386542
10462a386542N2718k24493R8266M97705l1030r329M44678J44369Q7359k58895
$$ -1386542 -1333824 -1558317 -1460051 -962346 -993376 -1002705 -558027 -413658 -326299 -585194
10452e85194j42520L11831K87758j21831J4941m9016m4065K44799J32790J6444
$$ -585194 -727714 -415883 -128125 -249956 -235015 -284031 -328096 -83297 49493 65937
10442F5937J60270J12455l63696j98432K6480J29648J59513J2970j36461k07616
$$ 65937 226207 338662 -25034 -223466 -196986 -67338 92175 105145 -31316 -238932
10432b38932l06837j38464O2310K47871L76764r9260m73279l03447J56543k1821
$$ -238932 -545769 -684233 -621923 -374052 2712 -96548 -569827 -873274 -716731 -738552
10422g38552l43221m92167l05451n4030L72624P04284O52748K16211n40341k83300
$$ -738552 -1081773 -1573940 -1879391 -1933421 -1560797 -856513 -203765 12446 -527895 -811195
10412h11195K06964K77179j63749k322J54223K30247J71896j34735r2638J20328
$$ -811195 -604231 -327052 -490801 -493123 -338900 -108653 63243 -71492 -164130 -43802
10402d3802k7554l82693M9277K55563j03850J91329Q2847r2406n4657j87498m95690
$$ -43802 -71356 -454049 -404772 -149209 -253059 -61730 21117 -71289 -125946 -313444 -809134
10391h09134m60002n0074J86628L88491M99647J67091m16264o2184J46908R6276
$$ -809134 -1269136 -1319210 -1132582 -744091 -244444 -77353 -493617 -555801 -408893 -312617
10381c12617k57643n08430m25029m10988N76925J115769O85185k99120n00537
$$ -312617 -570260 -1078690 -1503719 -1914707 -1337782 -222013 463172 164052 -336485
10372c36485k30728n7141k09755k99038J33304Q1927j36121j74776L33903N07642
$$ -336485 -567213 -624354 -834109 -1133147 -999843 -917916 -1054037 -1228813 -894910 -387268
10362c87268K15283K83664m2711k49336l53323O04756Q53382J90377j17225n09193
$$ -387268 -171985 111679 68968 -180368 -533691 71065 924447 1114824 997599 488406
10352D88406k75528K1272J67731L21616o505m25797m70500m56393p1065O10795
$$ 488406 212878 234150 401881 723497 716992 291195 -179305 -635698 -706763 -95968
10342i5968N49628K74888k87139q6705M45543J10286j91601l14829n5652R1103
$$ -95968 453660 728548 441409 354704 800247 910533 718932 404103 348451 439554
10332D39554o7897R8043J93327r3792l60292k26478j90476k89518J06002K88609
$$ 439554 371657 469700 663027 569235 208943 -17535 -208011 -497529 -391527 -102918
10322a02918M0783j35675k13334j94831j7049L02822J367k07002k45355l13724
$$ -102918 -62135 -197810 -411144 -605975 -623024 -320202 -318835 -525837 -771192 -1084916
10312a084916L36401M47229K94179R4384k1923l109j79391m9212K25898M27105
$$ -1084916 -748515 -301286 -7107 87277 65354 62245 -117146 -166358 59540 486645
10302D86645J71240m23317n6707L62281P4396l95000k57724r9386K6861L66423
$$ 486645 657885 234568 177861 540142 614538 219538 -38186 -137572 -110711 255712
10292B55712J20436R2771K9195l9881K83146J80988J02939L4974M3413l97378
$$ 255712 376148 468919 498114 458233 741379 922367 1025306 1060280 1103693 706315
10282G06315m15276m45235l17129l45797j96505L64987L57577L4027L86763K00142
$$ 706315 291039 -154196 -471325 -817122 -1013627 -648640 -291063 -257036 129727 329869
10272C29869k00598P2618n276k93136P670N5002J85854L1273k03817o0459K12090
$$ 329869 129271 201889 196613 -96523 -88853 -33851 152003 183276 -20541 -81000 131090
10261A31090M14188J69933M339l29k63238m06272l03940j02031k63471q0902J70441
$$ 131090 545278 715211 719550 719221 455983 49711 -254229 -356260 -619731 -700633 -530192
10250e30192K23167J54084O6859l3300k77177j95775l72110K727N32549M99804
$$ -530192 -307025 -152941 -86082 -119382 -396559 -592334 -964444 -961717 -429168 70636
10240G0636J03276J16681R8160O6101l9152q7710k20559l53114l77511o4982j5374
$$ 70636 173912 290593 388753 454854 415702 327992 107433 -245681 -623192 -688174 -703548
10229g03548K86100M4306j74526j28316m2381m4014O9335R1566K60260K0159m0195
$$ -703548 -417448 -373142 -547668 -675984 -718365 -762379 -693044 -601478 -341218 -321059 -361254
10218c61254M02028k8724k87179l06656K00431L62461N0986r9001l47331L48840
$$ -361254 40774 12050 -275129 -581785 -381354 -18893 32093 -66908 -414239 -65399
10208f5399O45226J54799m10609o50020m15958q8286M75314K65355L22715O05849
$$ -65399 579827 734626 324017 -326003 -741961 -830247 -354933 -89578 233137 838986
10198H38986J94181n24930j76816J43900J33399J12311m02429j64504k23686m54377
$$ 838986 1033167 508237 331421 475321 608720 721031 318602 154098 -69588 -523965
10188e23965j1487L24233N19282K09353K20614l6930l38007n42280m55670J47297
$$ -523965 -535452 -211219 308063 517416 738030 701100 363093 -179187 -634857 -487560
10178d87560L10973K39710L58919J36494l37040k70438l20213k31920M18893L82266
$$ -487560 -176587 63123 422042 558536 221496 -48942 -369155 -601075 -182182 200084
10168B00084r0434m5711K17717J10569m0978k9884j04510l8724P893K46418k58930
$$ 200084 109650 63939 281656 392225 351247 321363 216853 178129 186022 432440 173510
10157A73510o58474K7790K30969l66099n40730J46611L77739K9711j16425k79077
$$ 173510 -484964 -457174 -226205 -592304 -1133034 -986423 -608684 -578973 -695398 -974475
10147i74475K86439M28268j17012m80818j3997K61262n9948j77106L6660N26814
$$ -974475 -688036 -259768 -376780 -857598 -871595 -610333 -670281 -847387 -810727 -283913
10137b83913N80240N17249J82888j70938N6305q6663l66812l48548J58444N8888
$$ -283913 296327 813576 996464 825526 881831 795168 428356 79808 238252 297140
10127B97140n9942K32779j26569k36167l23992m21244k04899M525J12426J98288
$$ 297140 237198 469977 343408 107241 -216751 -637995 -842894 -838369 -725943 -527655
10117e27655N8807m9176P6233j6616j55060J61551O49935K17314l41101l13828
$$ -527655 -468848 -518024 -441791 -458407 -613467 -451916 198019 415333 74232 -239596
10107b39596l9620M68628M70380p9342n71001o63424m13245j1508R6901j43522
$$ -239596 -279216 189412 659792 580450 9449 -653975 -1067220 -1078728 -981827 -1125349
10097a125349K44748N19652L55975K83354K0305r6269q0222M6652J01307J56028
$$ -1125349 -880601 -360949 -4974 278380 298685 202416 122194 168846 270153 426181
10087D26181J42119j05361q6524k31411l42602K33489L03922j34604j51992J58862
$$ 426181 568300 462939 376415 145004 -197598 35891 339813 205209 53217 212079
10077B12079L08181L07890o2846M5045K403o24792l81071O8197L281J7406N7923
$$ 212079 520260 828150 765304 810349 812752 187960 -193111 -124914 -121633 -104227 -46304
10066d6304m1734R9256q6473J80592k5098n2740J24370K079J91023P946k01757
$$ -46304 -88038 11218 -75255 105337 80239 27499 151869 153948 344971 352917 151160
10055A51160j2540j50827l959K90044J69555p2572P8456m00573l12062j58991
$$ 151160 138620 -12207 -16166 273878 443433 370861 449317 48744 -263318 -422309
10045d22309j75023K4505j04792j4263L31690O10821L41144j06445m85981n28078
$$ -422309 -597332 -572827 -677619 -691882 -360192 250629 591773 485328 -653 -528731
10035e28731m67001K88580Q03844L00266n35259n46864k79072J48429L0207J15992
$$ -528731 -995732 -707152 96692 396958 -138301 -685165 -964237 -815808 -785601 -669609
10025f69609L90280n032k81642L9865J98016K52337L96392n8927l87638j98518
$$ -669609 -279329 -284361 -566003 -526138 -328122 -75785 320607 261680 -125958 -324476
10015c24476P261l26740l79416J81843L65472M69972N48659J52831l46868m57092
$$ -324476 -317215 -643955 -1023371 -841528 -476056 -6084 542575 695406 348538 -108554
10005a08554l95447j8039L72429O07035J32883j65199j68634K02219j30059l58715
$$ -108554 -504001 -522040 -149611 457424 590307 425108 256474 458693 328634 -30081
9995c0081l66857l14038K95572L02213m3063j70733l15031r6182J92231K09068
$$ -30081 -396938 -710976 -415404 -113191 -156254 -326987 -642018 -738200 -545969 -336901
9985c36901L8594J0125q7193k2971J85332L69599K93769K9212q2825o06703q42799
$$ -336901 -298307 -288182 -375375 -398346 -213014 156585 450354 479566 396741 -209962 -1052761
9974a052761j03954K57364m52519m1465M91469J61042j83777j01186M65179P25094
$$ -1052761 -1156715 -899351 -1351870 -1393335 -901866 -740824 -924601 -1025787 -560608 164486
9964A64486N57052L44556n93554q94515k02891L7278n13206o22305J58474L41178
$$ 164486 721538 1066094 472540 -421975 -624866 -587588 -1100794 -1723099 -1564625 -1223447
9954a223447M30186K76394M428J23226P8040K23338L52790L5541j05527l65897
$$ -1223447 -793261 -516867 -512439 -389213 -311173 -87835 264955 300496 194969 -170928
9944a70928j64194L4992J41336q0081l50799o403K01066j0743k69147j99627j57469
$$ -170928 -335122 -300130 -158794 -238875 -589674 -596077 -395011 -405754 -674901 -874528 -1031997
9933a031997m1339K65883J34985K30331L70332L98131K81846j57337m00120k89917
$$ -1031997 -1073336 -807453 -672468 -442137 -71805 326326 608172 450835 50715 -239202
$$ [...]
##END NTUPLES=NMR SPECTRUM
##END=
