##TITLE=C13_SR_IMG_3
 CDCl3, 21100sc

 16.11.2021
##JCAMPDX= 6.0         $$ Bruker NMR JCAMP-DX V2.0
##DATA TYPE= NMR SPECTRUM
##DATA CLASS= NTUPLES
##ORIGIN= UXNMR, Bruker Analytische Messtechnik GmbH
##OWNER= root
$$ XWIN-NMR		Version 3.5
$$ Tue Nov 16 11:16:48 2021 Russian Standard Time (UT+4h)  she@DPX200
##.OBSERVE FREQUENCY= 50.327896
##.OBSERVE NUCLEUS= ^13C
##.ACQUISITION MODE= SIMULTANEOUS
##.ACQUISITION SCHEME= undefined
##.AVERAGES= 21101
##.DIGITISER RES= 17
##SPECTROMETER/DATA SYSTEM= spect
##.PULSE SEQUENCE= zgpg30
##.SOLVENT NAME= Acetone
##.SHIFT REFERENCE= (INTERNAL, Acetone, 0, 223.62)
##AUDIT TRAIL= $$ (NUMBER, WHEN, WHO, WHERE, WHAT)
$$ ##TITLE= Audit trail, XWIN-NMR		Version 3.5
$$ ##JCAMPDX= 5.01
$$ ##ORIGIN= Bruker BioSpin GmbH
$$ ##OWNER= she
$$ F:/spectra/data/she/nmr/c13/1/pdata/1/auditp.txt
$$ ##AUDIT TRAIL=  $$ (NUMBER, WHEN, WHO, WHERE, WHAT)
(   1,<2021-11-16 11:15:15.01 +0400>,<she>,<DPX200>,
      <created by zg, POWCHK disabled, PULCHK disabled
       terminated by command 'halt'
       configuration hash MD5:
       00 E9 B6 7A A2 85 ED C7 34 08 36 98 17 FE 4E 26
       data hash MD5: 32K
       16 4C D8 05 0C C1 CB 8E B2 95 CB FC 83 47 DA 28>)
(   2,<2021-11-16 11:15:19.37 +0400>,<she>,<DPX200>,
      <Start of raw data processing
       efp BC_mod = 2 LB = 1 FT_mod = 6 PKNL = 1 PHC0 = -311.3156 PHC1 = -3.637634 SI = 32K 
       data hash MD5: 32K
       57 F1 35 8B 13 9D EE 3C 9F 05 8E 3D 56 DB 48 69>)
(   3,<2021-11-16 11:15:22.04 +0400>,<she>,<DPX200>,
      <abs ABSG = 5 
       data hash MD5: 32K
       AB 0E B9 80 59 15 A9 EC 39 CB FD 86 F2 B6 63 F4>)
(   4,<2021-11-16 11:15:56.89 +0400>,<she>,<DPX200>,
      <pk PHC0 = -5.051113 PHC1 = 7.199999 
       data hash MD5: 32K
       6E D2 69 93 9B FD EB 5B 28 A2 F3 66 84 58 80 06>)
(   5,<2021-11-16 11:16:00.26 +0400>,<she>,<DPX200>,
      <abs ABSG = 5 
       data hash MD5: 32K
       FF 74 35 8B BE 39 41 25 F3 53 24 1C 7B B8 C5 B4>)
$$ ##END=
$$ 
$$ hash MD5
$$ BF DE 20 10 74 21 44 34 41 D7 F6 EF D1 E7 2B B5
##$RELAX= 
##$RELAX= 
##$RELAX= 
##$RELAX= 
##$RELAX= 
##$RELAX= 
##$RELAX= 
##$RELAX= 
$$ Bruker specific parameters
$$ --------------------------
##$DU= <F:/spectra>
##$EXPNO= 1
##$NAME= <c13>
##$PROCNO= 1
##$TYPE= <nmr>
##$USER= <she>
##$AMP= (0..31)
100 100 100 100 100 100 100 100 100 100 100 100 100 100 100 100 100 100 
100 100 100 100 100 100 100 100 100 100 100 100 100 100 
##$AQSEQ= 0
##$AQ_mod= 1
##$AUNM= <au_zg>
##$AUTOPOS= <>
##$BF1= 50.322709
##$BF2= 200.13
##$BF3= 50.322709
##$BF4= 500.13
##$BF5= 500.13
##$BF6= 500.13
##$BF7= 500.13
##$BF8= 500.13
##$BYTORDA= 1
##$CFDGTYP= 0
##$CFRGTYP= 5
##$CHEMSTR= <none>
##$CNST= (0..31)
1 1 145 1 1 1 1 1 1 1 1 1 1 1 1 1 1 1 1 1 1 1 1 1 1 1 1 1 1 1 1 1 
##$CPDPRG= <waltz16>
##$CPDPRG1= <>
##$CPDPRG2= <waltz16>
##$CPDPRG3= <>
##$CPDPRG4= <mlev>
##$CPDPRG5= <mlev>
##$CPDPRG6= <mlev>
##$CPDPRG7= <mlev>
##$CPDPRG8= <mlev>
##$CPDPRGB= <>
##$CPDPRGT= <>
##$D= (0..31)
$$ [...]
##$SUBNAM4= <"">
##$SUBNAM5= <"">
##$SUBNAM6= <"">
##$SUBNAM7= <"">
##$SUBNAM8= <"">
##$SUBNAM9= <"">
##$SW= 239.972175391363
##$SWIBOX= (0..15)
0 1 3 0 0 0 0 0 0 0 0 0 0 0 0 0 
##$SW_h= 12077.2946859903
##$TD= 32768
##$TD0= 1
##$TE= 0
##$TE2= 300
##$TE3= 300
##$TEG= 300
##$TL= (0..7)
120 120 120 120 120 120 120 120 
##$TP= (0..7)
150 150 150 150 150 150 150 150 
##$TP07= 0
##$TPNAME0= <>
##$TPNAME1= <>
##$TPNAME2= <>
##$TPNAME3= <>
##$TPNAME4= <>
##$TPNAME5= <>
##$TPNAME6= <>
##$TPNAME7= <>
##$TPOAL= (0..7)
0.5 0.5 0.5 0.5 0.5 0.5 0.5 0.5 
##$TPOFFS= (0..7)
0 0 0 0 0 0 0 0 
##$TUNHIN= 0
##$TUNHOUT= 0
##$TUNXOUT= 0
##$USERA1= <user>
##$USERA2= <user>
##$USERA3= <user>
##$USERA4= <user>
##$USERA5= <user>
##$V9= 5
##$VALIST= <valist>
##$VCLIST= <CCCCCCCCCCCCCCC>
##$VD= 0
##$VDLIST= <DDDDDDDDDDDDDDD>
##$VPLIST= <PPPPPPPPPPPPPPP>
##$VTLIST= <TTTTTTTTTTTTTTT>
##$WBST= 1024
##$WBSW= 4
##$XGAIN= (0..3)
0 0 0 0 
##$XL= 0
##$YL= 0
##$YMAX_a= 133956773
##$YMIN_a= -32085332
##$ZGOPTNS= <>
##$ZL1= 120
##$ZL2= 120
##$ZL3= 120
##$ZL4= 120
##$ABSF1= 223.6203
##$ABSF2= -16.37674
##$ABSG= 5
##$ABSL= 3
##$ALPHA= 0
##$AQORDER= 0
##$ASSFAC= 0
##$ASSFACI= 0
##$ASSFACX= 0
##$ASSWID= 0
##$AUNMP= <proc_1d>
##$AZFE= 0.1
##$AZFW= 0.5
##$BCFW= 0
##$BC_mod= 2
##$BYTORDP= 0
##$COROFFS= 0
##$CY= -3
##$DATMOD= 1
##$DC= 0
##$DFILT= <>
##$DTYPP= 0
##$F1P= 0
##$F2P= 0
##$FCOR= 0.5
##$FTSIZE= 32768
##$FT_mod= 6
##$GAMMA= 0
##$GB= 0
##$INTBC= 1
##$INTSCL= 4.134877e-10
##$ISEN= 128
##$LB= 1
##$LEV0= 0
##$LPBIN= 0
##$MAXI= 10000
##$MC2= 0
##$MEAN= 0
##$ME_mod= 0
##$MI= 0.1934396
##$NCOEF= 0
##$NC_proc= 2
##$NLEV= 6
##$NOISF1= 120.0001
##$NOISF2= 80.00006
##$NSP= 0
##$NTH_PI= 0
##$NZP= 0
##$OFFSET= 223.6203
##$PC= 1.4
##$PHC0= -316.3667
##$PHC1= 3.562365
##$PH_mod= 1
##$PKNL= yes
##$PPARMOD= 0
##$PSCAL= 0
##$PSIGN= 0
##$REVERSE= no
##$SF= 50.3226814732359
##$SI= 32768
##$SIGF1= 140
##$SIGF2= 120
##$SINO= 11.81781
##$SIOLD= 32768
##$SREGLST= <13C.CDCl3>
##$SSB= 0
##$STSI= 32768
##$STSR= 0
##$SW_p= 12077.2946859903
##$SYMM= 0
##$S_DEV= 0
##$TDeff= 32768
##$TDoff= 0
##$TI= <>
##$TILT= no
##$TM1= 0
##$TM2= 0
##$TOPLEV= 0
##$USERP1= <user>
##$USERP2= <user>
##$USERP3= <user>
##$USERP4= <user>
##$USERP5= <user>
##$WDW= 1
##$XDIM= 32768
##$YMAX_p= 440683334
##$YMIN_p= -2510908
$$ End of Bruker specific parameters
$$ ---------------------------------
##NTUPLES= NMR SPECTRUM
##VAR_NAME=  FREQUENCY,     SPECTRUM/REAL,   SPECTRUM/IMAG
##SYMBOL=    X,             R,               I
##VAR_TYPE=  INDEPENDENT,   DEPENDENT,       DEPENDENT
##VAR_FORM=  AFFN,          ASDF,            ASDF
##VAR_DIM=   32768,         32768,           32768
##UNITS=     HZ,            ARBITRARY UNITS, ARBITRARY UNITS
##FACTOR=    0.368581032318806, 1,           1
##FIRST=     11253.1731425924, 0,            0
##LAST=      -824.121543397872, 0,           0
##MIN=       -824.121543397872, -2510908,    0
##MAX=       11253.1731425924, 440683334,    0
$$ Real data points
##PAGE= N=1
##DATA TABLE= (X++(R..R)), XYDATA
$$ [...]
$$ plain form
15717 48920 77127 367079 1020218 1092409 417070 -40398 -162535 -443046 -491514 -692199
15707 -692199 -578611 -347629 -169907 238770 -79747 -594260 -649857 -587247 -559165 -173116
15697 -173116 34440 -99902 -268780 -584758 -1034765 -1180292 -972684 -1001274 -1392171 -1398687
15687 -1398687 -1255822 -830137 -87214 32540 103039 203329 -186216 -571448 -462713 -323303
15677 -323303 -103506 -73012 -388878 -390485 -178180 -192418 -194719 -221112 59939 431475 679469
15666 679469 730790 412962 442541 488975 730986 613328 455965 370048 328258 196633
15656 196633 275242 343105 341247 187706 -26058 -241547 -719307 -772061 -339516 -184973
15646 -184973 -371794 -555139 -271544 121667 366077 300511 -5773 -307878 -677447 -629850
$$ packed form
15717D8920K8207K89952O53139P2191o75339m57468j22137k80511m8468k00685
15707f92199J13588K30982J77722M08677l18517n14513n5597O2610K8082L86049
15697a73116K07556j34342j68878l15978m50007j45527K07608k8590l90897o516
15687a398687J42865M25685P42923J19754P0499J00290l89545l85232J08735J39410
15677c23303K19797L0494l15866j607K12305j4238k301k6393K81051L71536K47994
15666F79469N1321l17828K9579M6434K42011j17658j57363q5917m1790j31625
15656A96633P8609O7863j858j53541k13764k15489m77760n2754M32545J54543
15646a84973j86821j83345K83595L93211K44410o5566l06284l02105l69569M7597
$$ plain form
15636 -629850 -136586 2636 -282566 -48294 364668 176135 86762 310947 325763 36320
15626 36320 -401013 -449999 -431736 -341442 -66612 -7115 -533395 -1142478 -1469266 -1679380
15616 -1679380 -1529845 -1332847 -875334 -449324 -840958 -1433029 -1000369 -419644 -170744
15607 -170744 255521 486277 496878 443958 184793 -41836 182154 368053 319932 176055
15597 176055 202728 -217906 -724229 -827796 -891956 -1087870 -912629 -876650 -725018 -403581
15587 -403581 -747421 -1261591 -1322712 -1327673 -1208260 -1002262 -454147 165991 236319 197
15577 197 -98698 -254864 -183904 67371 -30915 62124 133234 -210380 -699951 -872426 -847525
15566 -847525 -887619 -732941 -297917 -54744 -106626 -264971 -611696 -304181 410931 709819
$$ packed form
15636f29850M93264J39222k85202K34272M12962j88533q9373K24185J4816k89443
15626C6320m37333m8986J8263R0294K74830N9497n26280o09083l26788k10114
15616a679380J49535J96998M57513M26010l91634n92071M32660N80725K48900
15607a70744M26265K30756J0601n2920k59165k26629K23990J85899m8121j43877
15597A76055K6673m20634n06323j03567o4160j95914J75241L5979J51632L21437
15587d03581l43840n14170o1121m961J19413K05998N48115O20138P0328k36122
15577A97r8895j56166P0960K51275r8286R3039P1110l43614m89571j72475K4901
15566h47525m0094J54678M35024K43173n1882j58345l46725L07515P15112K98888
$$ plain form
15556 709819 465671 296844 320150 705540 975218 764363 641651 632664 517889 718304
15546 718304 734704 607549 525369 437806 299880 15271 -534047 -488595 -397268 -507246
15536 -507246 -649002 -376134 22012 -86209 -78207 252910 528541 687846 671353 265278
15526 265278 211763 350107 109087 659542 1422961 1173833 210113 -425840 -479088 -741058
15516 -741058 -957488 -755357 -335362 43766 296115 440374 428709 351389 -33330 -166005
15506 -166005 -86525 155854 -19996 -570986 -489722 -245237 -344922 -451121 -515270 -1056244
15496 -1056244 -1444075 -1416061 -1238108 -805895 124408 665987 821020 673313 243381 66112
15486 66112 -29090 -274141 -390174 -117748 185270 304661 282190 338012 411487 458258 75951
$$ packed form
15556G09819k44148j68827K3306L85390K69678k10855j22712q987j14775K00415
15546G18304J6400j27155q2180q7563j37926k84609n49318M5452R1327j09978
15536e07246j41756K72868L98146j08221Q002L31117K75631J59305j6493m06075
15526B65278n3515J38344k41020N50455P63419k49128r63720o35953n3248k61970
15516g41058k16430K02131M19995L79128K52349J44259j1665p7320l84719j32675
15506a66005P9480K42379j75850n50990Q1264K44485r9685j06199o4149n40974
15496a056244l87831K8014J77953M32213R30303N41579J55033j47707m29932j77269
15486F6112r5202k45051j16033K72426L03018J19391k2471N5822P3475M6771l82307
$$ plain form
15475 75951 -265082 -536614 -799856 -620122 -75526 93726 -80117 -49927 92673 131653
15465 131653 236444 539572 642705 246437 -145886 168854 303183 -187690 -608840 -770110
15455 -770110 -570951 -175308 -238092 -248590 -463412 -724664 -757257 -771267 -770652 -639273 -358061
15444 -358061 37787 570724 1014427 665724 53884 -122012 35707 341985 449052 251703
15434 251703 270374 524327 872520 942243 309036 -366294 -216977 227504 324117 214437
15424 214437 45351 18021 190570 160115 -209578 -331516 27850 422533 745648 810041
15414 810041 714217 656578 688138 793299 1027769 952138 779087 932697 1040357 628450
15404 628450 274896 425991 606476 169654 -403612 -364592 -88903 -54984 151269 497876
$$ packed form
15475G5951l41033k71532k63242J79734N44596J69252j73843L0190J42600L8980
15465A31653J04791L03128J03133l96268l92323L14740J34329m90873m21150j61270
15455g70110J99159L95643o2784j0498k14822k61252l2593j4010O15J31379K81212
15444c58061L95848N32937M43703l48703o11840j75896J57719L06278J07067j97349
15434B51703J8671K53953L48193O9723o33207o75330J49317M44481R6613j09680
15424B14437j69086k7330J72549l0455l69693j21938L59366L94683L23115O4393
15414H10041r5824n7639L1560J05161K34470p5631j73051J53610J07660m11907
15404F28450l53554J51095J80485m36822n73266L9020K75689L3919K06253L46607
$$ plain form
15394 497876 867424 771569 487089 307984 -92779 -656076 -675758 -734580 -867776 -768862
15384 -768862 -334432 35178 338627 385600 -127275 -730899 -1101153 -761624 -366709 -49637
15374 -49637 165265 268648 96611 -100436 -197336 52323 317726 103978 -290303 -187051
15364 -187051 528385 1044230 1027916 835436 821960 402517 548126 432722 -167481 -523322
15354 -523322 -868890 -1082263 -925139 -1096431 -1481990 -1602115 -1251459 -885844 -839252 -640866
15344 -640866 -216157 251143 169175 110177 -83650 -126165 153960 187095 -2666 -107994
15334 -107994 -315251 -342057 -8262 300677 62788 -271940 -563445 -660595 -556000 -513666
15324 -513666 -211155 424287 774694 532465 415294 410040 596893 898784 747674 298407
$$ packed form
15394D97876L69548r5855k84480j79105m00763n63297j9682n8822j33196R8914
15384g68862M34430L69610L03449M6973n12875o03624l70254L39529L94915L17072
15374d9637K14902J03383j72037j97047r6900K49659K65403k13748l94281J03252
15364a87051P15436N15845j6314j92480j3476m19443J45609j15404o00203l55841
15354e23322l45568k13373J57124j71292l85559j20125L50656L65615M6592J98386
15344f40866M24709M67300q1968n8998j93827m2515K80125L3135j89761j05328
15334a07994k07257k6806L33795L08939k37889l34728k91505r7150J04595M2334
15324e13666L02511O35442L50407k42229j17171n254J86853L01891j51110m49267
$$ plain form
15314 298407 195754 85678 -114089 -341638 -557842 -308879 -172170 -114456 -580400 -659399
15304 -659399 -526316 -376769 7757 -62341 -385292 -733451 -905872 -697148 -643025 -872118
15294 -872118 -901043 -679530 -355170 -54432 188238 -5101 -268205 -246514 -31551 144124
15284 144124 -247495 -644234 -979790 -1089281 -818192 -552228 -304767 -202456 125640 556050
15274 556050 578996 400387 347181 385369 177790 -70894 27183 47222 -51444 -26001 -188323
15263 -188323 -448622 -403131 -269601 -423105 -431445 -25633 55773 -356264 -645190 -1151506
15253 -1151506 -1139178 -618098 -92480 105948 -282107 -526545 -575707 -589648 -498119 -81948
15243 -81948 357525 298764 -137423 -321571 -514293 -546208 -304743 -229116 -80710 134996
$$ packed form
15314B98407j02653j10076j99767k27549k16204K48963J36709N7714m65944p8999
15304f59399J33083J49547L84526p0098l22951l48159j72421K08724N4123k29093
15294h72118k8925K21513L24360L00738K42670j93339k63104K1691K14963J75675
15284A44124l91619l96739l35556j09491K71089K65964K47461J02311L28096M30410
15274E56050K2946j78609n3206L8188k07579k48684R8077K0039r8666K5443j62322
15263a88323k60299M5491J33530j53504q340M05812Q1406m12037k88926n06316
15253a151506J2328N21080N25618J98428l88055k44438m9162j3941R1529M16171
15243h1948M39473n8761m36187j84148j92722l1915K41465P5627J48406K15706
$$ plain form
15233 134996 193434 360914 503715 560582 628871 222820 -96414 -259274 -628666 -766856
15223 -766856 -774493 -745778 -295487 30853 274557 563008 498880 256623 348845 293543 514416
15212 514416 1155572 950333 673839 893192 878921 773565 12383 -511692 -327138 -83148
15202 -83148 250604 170269 -17106 -299568 -620326 -683791 -347947 124463 754775 959508
15192 959508 239022 -222658 -300713 -232461 -149585 -263601 -743590 -943368 -481000 -272850
15182 -272850 -419576 -294514 114851 349423 177071 -17487 180530 480875 615432 452009
15172 452009 434177 581120 511685 456356 1008990 1385325 943169 131013 -366042 -350667
15162 -350667 -199036 -328978 -220230 73197 310645 83778 -112135 -255809 -121305 -113332
$$ packed form
15233A34996N8438J67480J42801N6867O8289m06051l19234j62860l69392j38190
15223g66856p637K8715M50291L26340K43704K88451o4128k42257R2222n5302K20873
15212E14416O41156k05239k76494K19353j4271j05356p61182n24075J84554K43990
15202h3148L33752q0335j87375k82462l20758o3465L35844M72410O30312K04733
15192I59508p20486m61680p8055O8252Q2876j14016m79989j99778M62368K08150
15182b72850j46726J25062M09365K34572j72352j94558J98017L00345J34557j63423
15172D52009j7832J46943o9435n5329N52634L76335m42156q12156m97055J5375
15162c50667J51631j29942J08748K93427K37448k26867j95913j43674J34504P973
$$ plain form
15152 -113332 -576048 -896435 -883706 -436243 131982 66300 -68041 -97029 -420815 -368030
15142 -368030 -491239 -923065 -939054 -1082356 -934554 -602633 -478885 -440520 -109323 130974
15132 130974 212166 427677 725655 319446 -195750 -143473 -76748 -4332 -142596 -91429
15122 -91429 176719 316992 244615 309200 387790 8239 -422410 -78338 534936 745814
15112 745814 584669 672098 740942 640929 555149 558285 629446 757034 1052207 745652 329987
15101 329987 104762 -69733 -355948 -292061 -70742 -71360 -106293 5967 320146 339881 -120813
15090 -120813 -471609 -270763 596184 963873 782734 577211 -57029 -308598 -231763 -221192
15080 -221192 -207001 -10179 237830 264514 23919 -14216 48766 105990 -48235 -384077
$$ packed form
15152a13332m62716l20387J2729M47463N68225o5682j34341k8988l23786N2785
15142c68030j23209m31826j5989j43302J47802L31921J23748L8365L31197K40297
15132A30974Q1192K15511K97978m06209n15196N2277O6725P2416j38264N1167
15122i1429K68148J40273p2377O4585P8590l79551m30649L44072O13274K10878
15112G45814j61145Q7429O8844j00013q5780L136P1161J27588K95173l06555m15665
15101C29987k25225j74495k86215O3887K21319o18l4933J12260L14179J9735m60694
15090a20813l50796K00846Q66947L67689j81139k05523o34240k51569P6835J0571
15080b21192J4191J96822K48009K6684k40595l8135O2982N7224j54225l35842
$$ plain form
15070 -384077 -480380 -385894 -818208 -1302443 -1289216 -983129 -536383 -423419 -313001 -544060
15060 -544060 -1223290 -1421758 -1024744 -501120 -599503 -1078352 -942045 -726174 -496176 19910
15050 19910 136390 75042 91352 430142 457765 267119 228847 33158 -187133 -427127
15040 -427127 -306911 -35787 110750 -52186 -405027 -724440 -1271798 -1508503 -1711262 -1710309
15030 -1710309 -1703214 -1956872 -2071857 -1866201 -1111122 -420382 75103 -52234 -592671 -538664
15020 -538664 -213684 -179456 -332312 -105679 322686 184033 -468766 -802041 -828031 -553922
15010 -553922 -328715 4811 527899 610535 251011 -63621 -331053 -39439 448615 461777
15000 461777 374034 425800 415593 309148 -58672 -296752 -185285 -248587 -536965 -357503
$$ packed form
15070c84077r6303R4486m32314m84235J3227L06087M46746J12964J10418k31059
15060e44060o79230j98468L97014N23624r8383m78849J36307K15871K29998N16086
15050A9910J16480o1348J6310L38790K7623j90646l8272j95689k20291k39994
15040d27127J20216K71124J46537j62936l52841l19413n47358k36705k02759R53
15030a710309P095k53658j14985K05656P55079O90740M95485j27337n40437N4007
15020e38664L24980L4228j52856K26633M28365j38653o52799l33275k5990K74109
15010e53922K25207L33526N23088Q2636l59524l14632k67432K91614M88054J3162
15000D61777q7743N1766j0207j06445l67820k38080J11467o3302k88378J79462
$$ plain form
14990 -357503 20442 -167980 -305619 -182151 -96426 -495438 -917134 -590659 -325053 -525253
14980 -525253 -704287 -574259 -634514 -592643 -723841 -569790 -299325 -442241 -351476 -164920
14970 -164920 -130962 -54656 -64992 61463 31204 -87053 -25060 -161358 -193953 -128366 -46288
14959 -46288 251325 -34016 -488908 -378084 84044 484532 448217 338001 200867 11506
14949 11506 -53131 100546 207816 173222 233006 276161 151763 -235990 -495019 -824800
14939 -824800 -1236230 -1146884 -1026511 -1044500 -954599 -907005 -657197 -291493 -312947 -448943
14929 -448943 -571963 -508870 -209167 233799 686533 669937 463071 92327 -491982 -813759
14919 -813759 -1004706 -1292272 -1304445 -961238 -892787 -960831 -664080 -143887 -393 -26090
$$ packed form
14990c57503L77945j88422j37639J23468Q5725l99012m21696L26475K65606k00200
14980e25253j79034J30028o0255M1871j31198J54051K70465j42916R0765J86556
14970a64920L3958P6306j0336J26455l0259j18257O1993j36298l2595O5587Q2078
14959d6288K97613k85341m54892J10824M62128M00488l6315j10216j37134j89361
14949A1506o4637J53677J07270l4594N9784M3155j24398l87753k59029l29781
14939h24800m11430Q9346J20373j7989Q9901M7594K49808L65704k1454j35996
14929d48943j23020O3093K99703M42966M52734j6596k06866l70744n84309l21777
14919h13759j90947k87566j2173L43207O8451o8044K96751N20193J43494k5697
$$ plain form
14909 -26090 45333 11989 134817 110250 -259913 -664776 -886393 -935480 -999233 -894837 -697493
14898 -697493 -505495 -154653 63663 128562 150133 191599 -8915 -330125 -636520 -499492
14888 -499492 139282 287884 280824 542103 654062 190224 42570 278885 43448 -89579
14878 -89579 -187172 -350057 -477132 -789402 -886619 -694059 -684131 -604209 70436 612077 910783
14867 910783 737793 486377 395344 300899 90497 308846 357184 -956 -181718 158085
14857 158085 384856 -33873 -506352 -757780 -771062 -802755 -712596 -524086 -426663 -205517
14847 -205517 188445 179951 212395 602424 630053 456769 349904 526969 626838 289369
14837 289369 123108 -39342 -140422 -9827 266122 138254 100776 504196 656677 379101
$$ packed form
14909b6090P1423l3344J22828k4567l70163m04863k21617m9087o3753J04396J97344
14898f97493J91998L50842K18316O4899K1571M1466k00514l21210l06395J37028
14888d99492O38774J48602p060K61279J11959m63838j47654K36315k35437j33027
14878h9579r7593j62885j27075l12270r7217J92560R928P9922O74645N41641K98706
14867I10783j72990k51416r1033r4445k10402K18349M8338l58140j80762L39803
14857A58085K26771m18729m72479k51428j3282l1693R0159J88510R7423K21146
14847b05517L93962q494L2444L90029K7629j73284j06865J77065R9869l37469
14837B89369j66261j62450j01080J30595K75949j27868l7478M03420J52481k77576
$$ plain form
14827 379101 256488 -39619 -249485 -159489 -190196 -317626 -624019 -850802 -1101661 -1220373
14817 -1220373 -1200309 -1338628 -1442080 -1275221 -962498 -760505 -908535 -605446 -133357 29145
14807 29145 250513 113561 -267502 -547102 -783124 -596662 -171549 108195 159572 -185711
14797 -185711 -409555 -99366 428848 667651 755082 1034959 1486271 1609875 1141082 707957
14787 707957 394863 188402 467425 664947 310952 -216607 -244332 176493 503861 696186
14777 696186 392283 -159424 -756652 -1312817 -1120166 -747949 -840922 -846744 -850275 -518981
14767 -518981 167853 541015 411408 288126 319065 278749 278654 96293 290044 569711 871463
14756 871463 406711 -111268 -15193 260932 639818 615039 336501 -390349 -838703 -517870
$$ packed form
14827C79101j22613k96107k09866Q9996l0707j27430l06393k26783k50859j18712
14817a220373K0064j38319j03452J66859L12723K01993j48030L03089M72089J62502
14807B9145K21368j36952l81063k79600k36022J86462M25113K79744N1377l45283
14797a85711k23844L10189N28214K38803Q7431K79877M51312J23604m68793m33125
14787G07957l13094k06461K79023J97522l53995n27559k7725M20825L27368J92325
14777F96186l03903n51707n97228n56165J92651L72217r2973n822l531L31294
14767e18981O86834L73162j29607j23282L0939m0316r5j82361J93751K79667L01752
14756H71463m64752n17979R6075K76125L78886k4779k78538p26850m48354L20833
$$ plain form
14746 -517870 -115568 492330 718171 275074 145716 58670 -110182 -221087 -159611 147363
14736 147363 459164 123183 -53383 -231407 -161327 -179683 -499958 -511960 59973 258422
14726 258422 435031 584199 357957 -119206 -335519 -312355 -590264 -320469 28727 -120631
14716 -120631 -196086 -280233 -795162 -1054895 -858679 -574432 -486565 -561913 -688855 -518692
14706 -518692 127815 438922 88211 -223012 -135150 -279862 -259947 86550 690365 943343
14696 943343 759286 607768 555687 338114 -20031 78708 267877 403549 38754 -439412
14686 -439412 -391539 -391246 -344577 -397550 -524053 -713040 -861561 -918377 -904427 -893071 -866798
14675 -866798 -588177 -362436 -498321 -910407 -1360432 -1723757 -1416468 -704202 -749327 -1304716
$$ packed form
14746e17870M02302O07898K25841m43097j29358q7046j68852j10905O1476L06974
14736A47363L11801l35981j76566j78024P0080j8356l20275j2002N71933J98449
14726B58422J76609J49168k26242m77163k16313K3164k77909K69795L49196j49358
14716a20631p5455q4147n14929k59733J96216K84247Q7867p5348j26942J70163
14706e18692O46507L11107l50711l11223Q7862j44712J9915L46497O03815K52978
14696I43343j84057j51518n2081k17573l58145R8739J89169J35672l64795m78166
14686d39412M7873K93M6669n2973j26503j88987j48521n6816J3950J1356K6273
14675h66798K78621K25741j35885m12086m50025l63325L07289P12266m5125n55389
$$ plain form
14665 -1304716 -1379947 -1204358 -1405121 -1673890 -1845911 -1606113 -1380102 -1360884 -924846 -470146
14655 -470146 -300862 -166861 -140297 19507 16076 -76735 172419 410061 342007 5354
14645 5354 -291674 -552828 -362341 441559 670319 533400 201227 -122979 -245428 -211463
14635 -211463 47767 165420 215421 245695 -136585 -767082 -947530 -664571 -240499 38359
14625 38359 269755 113833 28910 158600 263500 221434 47450 -381373 -496468 -336644
14615 -336644 -288912 -346260 -121353 81443 -166137 -362603 -788668 -920179 -743711 -822637
14605 -822637 -840193 -424727 -7971 23971 -12947 -90353 -353529 -597512 -413204 -324792
14595 -324792 -670346 -764487 -528443 -507182 -442684 -72714 40442 500 -76938 238337
$$ packed form
14665a304716p5231J75589k00763k68769j72021K39798K26011J9218M36038M54700
14655d70146J69284J34001K6564J59804l431r2811K49154K37642o8054l36653
14645E354k97028k61154J90487Q03900K28760j36919l32173l24206j22449L3965
14635b11463K59230J17653N0001L0274l82280o30497j80448K82959M24072K78858
14625C8359K31396j55922q4923J29690J04900m2066j73984m28823j15095J59824
14615c36644M7732n7348K24907K02796k47580j96466m26065j31511J76468p8926
14605h22637j7556M15466M16756L1942l6918p7406k63176k43983J84308Q8412
14595c24792l45554r4141K36044K1261O4498L69970J13156l9942p7438L15275
$$ plain form
14585 238337 283064 -34181 -15947 85868 395398 1084746 1519514 1553932 1418725 987055
14575 987055 544053 350143 285668 152817 138696 343076 414588 278022 239861 -184114
14565 -184114 -531673 -81359 733839 845660 375672 -324703 -601955 -547645 -30254 599715
14555 599715 381522 -165887 -306272 -359190 -271274 -168506 -305219 -744436 -1121208 -1252288
14545 -1252288 -1175686 -1069497 -1000602 -918118 -676884 -397551 -171029 -148595 -19121 -54103
14535 -54103 -55115 218274 661645 887084 620941 -45476 -303803 -233611 -113717 -295613
14525 -295613 -388392 -220899 -573219 -437654 10022 258227 261209 8458 10378 82284 150733
14514 150733 254742 205636 -41446 -229958 -507526 -629459 -671830 -805845 -963074 -956058
$$ packed form
14585B38337M4727l17245J8234J01815L09530O89348M34768L4418j35207m31670
14575I87055m43002j93910o4475j32851j4121K04380P1512j36566l8161m23975
14565a84114l47559M50314Q15198J11821m69988p00375k77252N4310N17391O29969
14555E99715k18193n47409j40385n2918Q7916J02768j36713m39217l76772j31080
14545a252288P6602J06189O8895Q2484K41234K79333K26522K2434J29474l4982
14535e4103j012K73389M43371K25439k66143o66417k58327P0192J19894j81896
14525b95613r2779J67493l52320J35565M47676K48205K982k52751J920P1906O8449
14514A50733J04009m9106k47082j88512k77568j21933m2371j34015j57229P016
$$ plain form
14504 -956058 -935989 -1056549 -755871 -262820 -203973 -422831 -446245 -336680 -531574 -785899
14494 -785899 -994399 -1125913 -1217768 -700432 49015 118742 -108429 126132 143642 1713
14484 1713 -320427 -440117 -391757 -425588 -535919 -439361 -223687 -22293 46888 -256522 -174291
14473 -174291 300208 224015 -42522 -263475 -669359 -270791 168730 206614 220186 5256
14463 5256 -491585 -634277 -413136 -378042 -402220 32836 39910 -312551 -463785 -272216 -389909
14452 -389909 -286997 45882 43376 217431 308707 407020 385075 378572 400926 473776 408551
14441 408551 323005 541669 650738 662578 445049 160107 319922 55300 -114265 -161973
14431 -161973 -558751 -499612 29364 472130 314475 55821 222220 644385 664839 352355
$$ packed form
14504i56058K0069j20560L00678M93051N8847k18858k3414J09565j94894k54325
14494g85899k08500j31514r1855N17336P49447O9727k27171K34561J7510j41929
14484A713l22140j19690M8360l3831j10331R6558K15674K01394O9181l03410Q2231
14473a74291M74499p6193k66537k20953m05884L98568M39521L7884J3572k14930
14463E256m96841j42692K21141L5094k4178M35056P074l52461j51234J91569j17693
14452c89909J02912L32879k506J74055R1276R8313k1945o503K2354P2850o5225
14441D08551q5546K18664J09069J1840k17529k84942J59815k64622j69565m7708
14431a61973l96778N9139N28976M42766j57655k58654J66399M22165K0454l12484
$$ plain form
14421 352355 3300 -181802 -364158 -621137 -819808 -758294 -526436 -204400 -52862 99034
14411 99034 317352 142893 -145323 -213112 -265158 -289022 -214555 144140 399021 264825
14401 264825 186435 -289392 -851843 -915366 -691271 -780774 -906434 -826494 -405416 -77361
14391 -77361 135979 -8478 -417011 -397639 -228172 -175009 -103846 -211173 -582786 -763230
14381 -763230 -696139 -683992 -790824 -425087 -172731 3377 -19161 -328603 -445451 -459038
14371 -459038 -445352 -744655 -825271 -695713 -568346 -596159 -1082710 -1300148 -1600343 -1601850
14361 -1601850 -1329079 -913752 -314060 168718 437093 80696 -413852 -578244 -88619
14352 -88619 215950 125720 216198 420223 455147 175587 2984 182642 439943 414112
$$ packed form
14421C52355l49055j85102j82356k56979j98671O1514K31858L22036J51538J51896
14411I9034K18318j74459k88216o7789n2046k3864P4467L58695K54881j34196
14401B64825p8390m75827n62451o3523K24095q9503j25660P9940M21078L28055
14391g7361K13340j44457m08533J9372J69467N3163P1163j07327l71613j80444
14381g63230O7091J2147j06832L65737K52356J76108k2538l09442j16848j3587
14371d59038J3686k99303q0616J29558J27367k7813m86551k17438l00195j507
14361a601850K72771M15327N99692M82778K68375l56397m94548j64392M89625
14352h8619L04569r0230R0478K04025L4924k79560j72603J79658K57301k5831
$$ plain form
14342 414112 567721 539124 679834 807460 781299 307156 -30630 127549 169727 183543
14332 183543 318839 390856 519545 743337 879966 882186 802417 477350 396075 431719 173341
14321 173341 71862 -270453 646 225758 124118 192875 308312 961441 1355608 1080761
14311 1080761 349625 -328725 -375598 -44588 54006 29073 -27018 -139114 -211637 -137742
14301 -137742 55513 216591 335451 332745 -6660 -145875 -292952 -884907 -1229908 -825292
14291 -825292 -717853 -659956 -537206 -252670 -78425 47828 6750 -145233 -275779 -284976
14281 -284976 -142091 180705 305745 -40768 -361510 -374233 -201562 -84749 116270 399817
14271 399817 334399 106243 -46225 91002 -129928 -245336 -348695 -778936 -1096063 -1135047
$$ packed form
14342D14112J53609k8597J40710J27626k6161m74143l37786J58179M2178J3816
14332A83543J35296P2017J28689K23792J36629K220p9769l25067q1275L5644k58378
14321A73341j01479l42315K71099K25112j01640O8757J15437O53129L94167k74847
14311A080761p31136o78350m6873L31010R8594k4933n6091j12096p2523P3895
14301a37742J93255J61078J18860k706l39405j39215j47077n91955l45001M04616
14291h25292J07439N7897J22750K84536J74245J26253m1078j51983j30546r197
14281b84976J42885L22796J25040l46513l20742j2723J72671J16813K01019K83547
14271C99817o5418k28156j52468J37227k20930j15408j03359m30241l17127l8984
$$ plain form
14261 -1135047 -1220404 -954366 -454894 -348087 -315700 -373199 -614019 -687640 -198173 72015
14251 72015 63479 -55840 -167588 -253299 164459 803768 673751 339358 486 -117128
14241 -117128 -384973 -652389 -963289 -801872 -515815 -463689 -189254 -322219 -478407 -568745
14231 -568745 -391295 -90924 25681 193296 410352 558491 920049 1138846 1290805 1380165
14221 1380165 1324296 847618 -63838 -1091847 -1245683 -678141 -210922 -103154 -322384
14212 -322384 -621548 -905512 -1006428 -1043803 -732524 -795758 -1197161 -1335099 -1697386 -2044948
14202 -2044948 -1821837 -1168383 -748642 -375352 -12985 298738 153949 -55116 -523392
14193 -523392 -863259 -832990 -991460 -357577 235227 50655 -119019 119407 193973 -30281
$$ packed form
14261a135047q5357K66038M99472J06807L2387n7499k40820p3621M89467K70188
14251G2015q536j19319j11748q5711M17758O39309j30017l34393l38872j17614
14241a17128k67845k67416l10900J61417K86057N2126K74435j32965j56188r0338
14231e68745J77450L00371J16605J67615K17056J48139L61558K18797J51959Q9360
14221A380165n5869m76678r11456j028009j53836N67542M67219J07768k19230
14212c22384k99164k83964j00916l7375L11279o3234m01403j37938l62287l47562
14202b044948K23111O53454M19741L73290L62367L11723j44789k09065m68276
14193e23392l39867L0269j58470O33883N92804j84572j69674K38426P4566k24254
$$ plain form
14183 -30281 -268239 -278572 157998 92708 -480016 -469324 -349192 -367899 -694146 -826414
14173 -826414 -498035 -440549 -566126 -402951 -63850 141105 251894 210972 93827 334181
14163 334181 971008 760070 445691 -86495 -478339 -268443 -77320 -367320 -719639 -965474
14153 -965474 -943971 -762731 -552649 -564339 -585418 -712813 -803513 -619501 -304720 -91979
14143 -91979 -131134 -362988 -86263 75302 -115275 -68161 -277414 -988813 -1330068 -1107500
14133 -1107500 -802681 -586216 -645860 -476620 -419340 -528891 -258832 298398 809594 1014035
14123 1014035 965198 888661 742831 480035 -119250 -408549 -195398 -334523 -436158 21671
14113 21671 290138 50464 -684004 -1136548 -830078 -545994 -791623 -789871 -824229 -659298
$$ packed form
14183c0281k37958j0333M36570o5290n72724J0692J20132j8707l26247j32268
14173h26414L28379N7486j25577J63175L39101K04955J10789m0922j17145K40354
14163C34181O36827k10938l14379n32186l91844K09896J91123k90000l52319k45835
14153i65474K1503J81240K10082j1690k1079j27395r0700J84012L14781K12741
14143i1979l9155k31854K76725J61565j90577M7114k09253p11399l41255K22568
14133a107500L04819K16465n9644J69240N7280j09551K70059N57230N11196K04441
14123A014035m8837p6537j45830k62796n99285k89299K13151j39125j01635M57829
14113B1671K68467k39674p34468m52544L06470K84084k45629J752l4358J64931
$$ plain form
14103 -659298 -187509 -4475 45256 29125 -117096 -432427 -636066 -632709 -763704 -659519
14093 -659519 -16784 878575 1371670 978446 500743 500896 501364 371640 729424 831751 831518
14082 831518 716455 183259 -29376 -8177 -22730 -209042 -464871 -452811 -517516 -869502
14072 -869502 -1181525 -1055793 -1021758 -1321900 -1342821 -1048834 -163481 550682 862715 995816
14062 995816 833623 907477 923173 701851 586096 98990 -438308 -192787 467083 577133
14052 577133 191587 -205614 -613795 -871437 -941842 -894534 -479636 -294730 -479841 -625409
14042 -625409 -438813 -83404 -63294 -802957 -1059799 -694383 -993687 -1262850 -1276900 -856414
14032 -856414 -432236 -193948 -154655 -282934 -431182 -125613 -114016 -279896 -207449 -524320
$$ packed form
14103f59298M71789J83034M9731j6131j46221l15331k03639L357j30995J04185
14093f59519O42735Q95359M93095l93224m77703J53M68j29724L57784J02327k33
14082H31518j15063n33196k12635K1199j4553j86312k55829J2060o4705l51986
14072h69502l12023J25732L4035l00142k0921K93987Q85353P14163L12033J33101
14062I95816j62193P3854J5696k21322j15755m87106n37298K45521O59870J10050
14052E77133l85546l97201m08181k57642p0405M7308M14898J84906j85111j45568
14042f25409J86596L55409K0110p39663k56842L65416k99304k69163j4050M20486
14032h56414M24178K38288L9293j28279j48248L05569J1597j65880P2447l16871
$$ plain form
14022 -524320 -878263 -936563 -1013018 -1135713 -849469 -603659 -481008 -265801 -146506 345299
14012 345299 425110 152661 13561 -51322 -256259 -622398 -1065074 -1563395 -1564152 -542448
14002 -542448 422764 398435 126957 207346 156190 83572 138102 237265 -214802 -465852 -751045
13991 -751045 -867983 -992943 -1231713 -895359 -790631 -849167 -911021 -1228899 -1061588 -1060816
13981 -1060816 -933360 -372253 56069 141455 80792 -50493 -286454 -343793 -459904 -513629
13971 -513629 -250213 28811 -105414 -253360 -69688 -6114 60556 364427 528176 553422
13961 553422 553402 417181 415120 661478 791531 578469 626267 691621 359600 294477 13698
13950 13698 138761 326150 764041 994519 844549 713873 726123 1074463 1182614 608369
$$ packed form
14022e24320l53943n8300p6455j22695K86244K45810J22651K15207J19295M91805
14012C45299P9811k72449j39100o4883k04937l66139m42676m98321p57J021704
14002e42448R65212k4329k71478Q0389n1156p2618N4530R9163m52067k51050k85193
13991g51045j16938j24960k38770L36354J04728n8536o1854l17878J67311P72
13981a060816J27456N61107M28322Q5386o0663j31285k35961n7339j16111n3725
13971e13629K63416K79024j34225j47946J83672O3574O6670L03871J63749K5246
13961E53422k0j36221k061K46358J30053k13062M7798O5354l32021o5123k80779
13950A3698J25063J87389M37891K30478j49970j30676J2250L48340J08151n74245
$$ plain form
13940 608369 499626 593799 171789 -190601 -56122 374652 661807 557306 356037 491442
13930 491442 248729 54303 157112 176673 387892 507701 604678 899324 1308590 1589649
13920 1589649 1604525 1641837 1368611 1088526 683457 360562 82022 27035 236174 468378
13910 468378 603230 711374 745207 816653 1111918 1409710 1961901 2006211 1765390 1312771
13900 1312771 1000600 684639 441774 450177 683671 792122 830353 600408 327845 281597
13890 281597 533259 818456 938293 1045883 928423 965876 1072883 1102107 1452326 1746723
13880 1746723 1364107 886074 1138768 1497619 1689765 1436173 1197939 1312661 1329077 1295706
13870 1295706 1073368 1108150 1306515 1609513 1982661 2031947 1964913 2262287 2761439 3062913
$$ packed form
13940F08369j08743R4173m22010l62390J34479M30774K87155j04501k01269J35405
13930D91442k42713j94426J02809J9561K11219J19809R6977K94646M09266K81059
13920A589649J4876L7312k73226k80085m05069l22895k78540n4987K09139K32204
13910D68378J34852J08144L3833P1446K95265K97792N52191M4310k40821m52619
13900A312771l12171l15961k42865Q403K33494J08451L8231k29945k72563m6248
13890B81597K51662K85197J19837J07590j17460L7453J07007K9224L50219K94397
13880A746723l82616m78033K52694L58851J92146k53592k38234J14722J6416l3371
13870A295706k22338L4782J98365L02998L73148M9286o7034K97374M99152L01474
$$ plain form
13860 3062913 2740359 1801986 1262596 1302332 1028710 655364 802223 987332 1128565 1268939
13850 1268939 1691610 1625594 1715341 1788814 1501353 1401595 1683208 1910781 1749157 1677696
13840 1677696 1756150 1618323 1532816 1853374 2224401 2353124 2316453 2436691 3082727 3170865
13830 3170865 2540408 1915836 1832765 2099285 1784121 1101494 987407 1201896 907743 804219
13820 804219 1373075 1635100 1902741 2222621 2061180 1860122 1555295 1335048 1262670 1449399
13810 1449399 1743164 1861175 1867156 1655674 1381421 1012401 750592 673647 829572 891056
13800 891056 875624 598922 202516 -101869 -202149 -329735 -384996 -543821 -715193 -937314
13790 -937314 -1426376 -1415329 -567815 -127011 -140069 -39006 355450 817001 775911 1028080
$$ packed form
13860C062913l22554r38373n39390L9736k73622l73346J46859J85109J41233J40374
13850A268939M22671o6016Q9747P3473k87461r9758K81613K27573j61624p1461
13840A677696P8454j37827q5507L20558L71027J28723l6671J20238O46036Q8138
13830C170865o30457o24572q3071K66520l15164o82627j14087K14489k94153j03524
13820H04219N68856K62025K67641L19880j61441k01058l04827k20247p2378J86729
13810A449399K93765J18011N981k11482k74253l69020k61809p6945J55925O1484
13800H91056j5432k76702l96406l04385j00280j27586n5261j58825j71372k22121
13790i37314m89062J1047Q47514M40804j3058J01063L94456M61551m1090K52169
$$ plain form
13780 1028080 1176984 916497 559306 120805 458072 1037549 1409251 1147642 744515
13771 744515 624777 761732 998201 771429 478713 181838 448276 865148 672490 396126
13761 396126 -4676 -418064 -491104 -760893 -1059014 -964553 -555409 66006 381376 -13529
13751 -13529 -226115 -314491 -354460 -153436 -168602 -134467 320559 666337 549186 187771
13741 187771 -33249 -368936 -459202 -416074 -380933 -391585 -523081 -304724 -71715 75114
13731 75114 295265 -382 -397097 -792264 -937728 -629103 -164302 -237425 -619675 -668279
13721 -668279 -809891 -617815 -301689 -120009 -36707 -300170 -241248 -124813 -571842 -1197130
13711 -1197130 -1560173 -1646564 -1194821 -846269 -749217 -566698 -356708 -419320 -572007 -583931
$$ packed form
13780A028080J48904k60487l57191m38501L37267N79477L71702k61609m03127
13771G44515j19738J36955K36469k26772k92716k96875K66438M16872j92658k76364
13761C96126m00802m13388p3040k69789k98121R4461M09144O21415L15370l94905
13751a3529k12586q8376l9969K01024j5166L4135M55026L45778j17151l61415
13741A87771k21020l35687r0266M3128L5141j0652j31496K18357K33009J46829
13731G5114K20151k95647l96715l95167j45464L08625M64801p3123l82250m8604
13721f68279j41612J92076L16126J81680Q3302k63463N8922J16435m47029o25288
13711a197130l63043q6391M51743L48552R7052J82519K09990o2612j52687j1924
$$ plain form
13701 -583931 173600 541643 266038 4226 206117 210381 -26072 -226888 -392215 -684446
13691 -684446 -658084 -624623 -766120 -380710 370464 498651 105740 154248 523009 938524
13681 938524 1052119 657491 299014 239898 224807 -38856 -144898 -294622 -433392 -434215
13671 -434215 -657003 -760378 -716663 -169762 50562 254568 480975 497472 687143 1069473
13661 1069473 992035 297712 -367246 -636323 -523063 -348416 -366458 -530101 -526805 -568687
13651 -568687 -650639 -1036232 -1248911 -960096 -577623 -256085 -345425 -370602 10124 280512
13641 280512 479372 388888 51697 -124285 -20458 -372911 -1133748 -963264 -483522 -419846
13631 -419846 -532916 -288340 -8632 -277712 -736252 -722089 -51989 210348 221348 630401
$$ packed form
13701e83931P57531L68043k75605k61812K01891M264k36453k00816j65327k92231
13691f84446K6362L3461j41497L85410P51174J28187l92911M8508L68761M15515
13681I38524J13595l94628l58477n9116j5091k63663j06042j49724j38770q23
13671d34215k22788j03375M3715N46901K20324K04006K26407J6497J89671L82330
13661A069473p7438o94323o64958k69077J13260J74647j8042j63643L296m1882
13651e68687q1952l85593k12679K88815L82473L21538q9340k5177L80726K70388
13641B80512J98860r0484l37191j75982J03827l52453p60837J70484M79742O3676
13631d19846j13070K44576K79708k69080m58540J4163O70100K62337J1000M09053
$$ plain form
13621 630401 970553 1032378 619240 148702 22218 -210204 -574166 -647799 -141009 225957
13611 225957 355696 371567 358983 188342 1550 135437 366092 518252 708589 487215
13601 487215 -143587 -494714 -477074 -234256 48217 -37561 -143455 3769 -84056 -418894
13591 -418894 -453929 -309703 -103289 87191 263102 104277 -553836 -1050727 -789917 -107201
13581 -107201 187399 -234779 -550335 -544727 -366036 -336894 -300020 -304614 279702 873033 125596
13570 125596 -575428 -367710 -205836 -245078 -255538 119246 426505 50768 -629594 -667576
13560 -667576 -372736 -395067 -578012 -660453 -655135 -778329 -460307 -232826 -37897 -100218
13550 -100218 5552 137909 -322237 -697309 -835960 -1067661 -886953 -662552 -357716 -47722
$$ packed form
13621F30401L40152O1825m13138m70538j26484k32422l63962p3633N06790L66966
13611B25957J29739J5871j2584j70641j86792J33887K30655J52160J90337k21374
13601D87215o30802l51127J7640K42818K82473q5778j05894J47224q7825l34838
13591d18894l5035J44226K06414J90480J75911j58825o58113m96891K60810O82716
13581a07201K94600m22178l15556N608J78691K9142L6874m594N84316N93331p47437
13570A25596p01024K07718J61874l9242j0460L74784L07259l75737o80362l7982
13560f67576K94840k2331j82945q2441N318j23194L18022K27481J94929o2321
13550a00218J05770J32357m60146l75072j38651k31701J80708K24401L04836L09994
$$ plain form
13540 -47722 529662 929626 1021205 863676 449399 383460 190683 -185060 19318 1593
13530 1593 -217925 -188118 -74247 -131403 -352303 -625926 -837862 -972047 -723997 -253531
13520 -253531 -134576 -308665 -595878 -707690 -875061 -719208 -374556 -502971 -583231 -539988
13510 -539988 -341699 31122 -19077 -198380 -149065 -161728 -495459 -678341 -743235 -431925
13500 -431925 59476 194462 102986 -34610 84001 259063 325892 451007 391201 201376
13490 201376 54832 -222702 -515648 -506358 -169622 -546100 -776883 -424294 -389338 -713763
13480 -713763 -786447 -895822 -700807 -288913 268146 771121 874146 961946 876520 373507
13470 373507 -298221 -1069495 -1390695 -1141758 -431382 266014 255010 224023 676839 930518
$$ packed form
13540d7722N77384L99964R1579j57529m14277o5939j92777l75743K04378j7725
13530A593k19518K9807J13871n7156k20900k73623k11936j34185K48050M70466
13520b53531J18955j74089k87213j11812j67371J55853L44652j28415q0260M3243
13510e39988J98289L72821n0199j79303M9315j2663l33731j82882o4894L11310
13500d31925M91401J34986r1476j37596J18611J75062O6829J25115n9806j89825
13490B01376j46544k77534k92946R290L36736l76478k30783L52589L4956l24425
13480g13763p2684j09375J95015M11894N57059N02975J03025Q7800q5426n03013
13470C73507o71728p71274l21200K48937P10376O97396j1004l0987M52816K53679
$$ plain form
13460 930518 898342 432519 -166282 -378291 -799530 -1293390 -1405630 -1331912 -1100061 -745594
13450 -745594 -520538 -407188 43561 648407 930276 402366 -207286 148316 204463 -47780
13440 -47780 -153148 -340170 -358089 -124375 41610 -27924 512667 1062851 1017154 924497
13430 924497 853904 1060173 777309 188885 -19364 22748 239472 437925 609498 346356
13420 346356 210408 425504 248785 19729 -654800 -1231856 -1314815 -1131250 -706871 -307003
13410 -307003 61711 459768 700705 797873 1283206 1538133 1469625 1220313 1189670 1015006
13400 1015006 778000 337020 -78827 -35889 26266 -141367 -433584 -341955 -195396 -224650
13390 -224650 -559682 -780725 -665562 -533852 -364846 -412300 -469859 -465624 -287580 -282537 -374855
$$ packed form
13460I30518l2176m65823n98801k12009m21239m93860j12240P3718K31851L54467
13450g45594K25056J13350M50749O04846K81869n27910o09652L55602N6147k52243
13440d7780j05368j87022j7919K33714J65985o9534N40591N50184m5697r2657
13430I24497p0593K06269k82864n88424k08249M2112K16724J98453J71573k63142
13420C46356j35948K15096j76719k29056o74529n77056q2959J83565M24379L99868
13410c07003L68714L98057K40937R7168M85333K54927o8508k49312l0643j74664
13400A015006k37006m40980m15847M2938O2155j67633k92217R1629J46559k9254
13390b24650l35032k21043J15163J31710J69006m7454n7559M235J78044N043r2318
$$ plain form
13379 -374855 -115241 8345 14471 241721 504173 164447 -287252 -154915 -44055 251949
13369 251949 401173 251448 -47325 -568674 -890911 -1006436 -955949 -672381 -514267 -468694
13359 -468694 -160472 -387508 -485485 -384905 6295 251750 186677 245265 217282 -313141
13349 -313141 -779995 -1004643 -1128374 -1083068 -824202 -435224 -97834 178749 99709 293777
13339 293777 364109 362569 509638 633406 596041 295331 -56409 -295818 -41785 449567
13329 449567 744247 720499 702685 749301 945370 980046 1320665 1707024 1342933 847663
13319 847663 982788 1360142 1297905 747970 140698 325467 705825 992511 930985 897435
13309 897435 930473 951925 1133696 1257712 1034129 616245 518700 693689 835924 869996
$$ packed form
13379c74855K59614J23586O126K27250K62452l39726m51699J32337J10860K96004
13369B51949J49224j49725k98773n21349l22237j15525N0487K83568J58114M5573
13359d68694L08222k27036r7977J00580L91200K45455o5073N8588k7983n30423
13349c13141m66854k24648j23731M5306K58866L88978L37390K76583p9040J94068
13339B93777P0332j540J47069J23768l7365l00710l51740k39409K54033M91352
13329D49567K94680k3748j7814M6616J96069L4676L40619L86359l64091m95270
13319H47663J35125L77354o2237n49935o07272J84769L80358K86686o1526l3550
13309H97435L3038K1452J81771J24016k23583m17884r7545J74989J42235L4072
$$ plain form
13299 869996 519945 55555 240611 557289 427597 403469 678014 471061 308024 303716
13289 303716 352283 336305 123888 -352050 -487060 30984 788547 1181909 1140944 943005
13279 943005 413373 -105074 -3689 418332 1044665 1632891 1853369 1802892 1350006 1050962
13269 1050962 497784 245999 482483 517928 858558 1104471 757546 360712 345245 680536
13259 680536 1096612 1201073 1006399 823254 573644 -152057 -374112 383459 907832 851443
13249 851443 525670 383605 728592 438973 -25580 -86250 372004 702091 394026 -56423
13239 -56423 -243426 -322889 -484966 -574402 -610417 -258357 490887 995987 1369944 1638957
13229 1638957 1482195 1459446 1219429 355636 -154648 -16327 880747 1585610 1668987 916887
$$ packed form
13299H69996l50051m64390J85056L16678j29692k4128K74545k06953j63037m308
13289C03716M8567j5978k12417m75938j35010N18044P57563L93362m0965j97939
13279I43005n29632n18447J01385M22021O26333N88226K20478n0477m52886k99044
13269A050962n53178k51785K36484L5445L40630K45913l46925l96834j5467L35291
13259F80536M16076J04461j94674j83145k49610p25701k22055P57571N24373n6389
13249H51443l25773j42065L44987k89619m64553o0670M58254L30087l08065m50449
13239e6423j87003p9463j62077q9436l6015L52060P49244N05100L73957K69013
13229A638957j56762k2749k40017q63793n10284J38321Q97074P04863Q3377p52100
$$ plain form
13219 916887 277468 30636 457564 1429514 2150339 2139567 1529732 1410429 1366993 1006916
13209 1006916 844626 822746 730296 745794 865918 1177427 1563131 1626192 1483341 1434025
13199 1434025 1674801 1810742 1546693 745442 544156 587409 230408 157791 426635 858525
13189 858525 865865 650605 681399 807665 464724 -60290 -233599 198813 663621 795631
13179 795631 525412 303515 481381 769396 879911 393297 195125 495713 748766 731127
13169 731127 500082 766197 1227179 1403552 1515845 1314409 1448312 1906358 2199074 2246902
13159 2246902 1941633 1304713 1073506 1337968 1417391 1660185 1440989 1195333 1296040 1474067
13149 1474067 1563352 1706104 1713071 1879405 1902109 2002786 1949053 1824020 1711376 1369435
$$ packed form
13219I16887o39419k46832M26928R71950P20825j0772o09835j19303m3436l60077
13209A006916j62290k1880r2450J5498J20124L11509L85704O3061j42851m9316
13199A434025K40776J35941k64049q01251k01286M3253l57001p2617K68844M31890
13189H58525P340k15260L0794J26266l42941n25014j73309M32412M64808J32010
13179G95631k70219k21897J77866K88015J10515m86614j98172L00588K53053j7639
13169G31127k31045K66115M60982J76373J12293k01436J33903M58046K92716M7828
13159B246902l05269o36920k31207K64462P9423K42794k19196k45656J00707J78027
13149A474067Q9285J42752O967J66334K2704J00677n3733j25033j12644l41941
$$ plain form
13139 1369435 938607 859090 1166769 1702665 1740394 2148548 2414214 2327800 1813354 1380252
13129 1380252 1734773 1935626 1794030 1682490 1774126 1612192 1618036 1183337 557442 499505
13119 499505 398949 450687 359494 269917 502856 387335 635862 900028 680911 873339
13109 873339 1305752 1395348 961943 482076 658317 1013772 961212 773222 934330 1529766
13099 1529766 1800024 1832667 1838975 1857352 1638299 1488326 1525166 1429028 1252838 1245545 1565860
13088 1565860 1895533 1751633 1269962 845950 1042516 1489488 1492124 1656557 2024880 2138693
13078 2138693 1760942 1410100 1228356 706071 223029 268113 573413 851834 1323362 1710769
13068 1710769 1926590 2392863 2687670 2562160 2509219 2477622 2490482 2764344 3325759 3629840
$$ packed form
13139A369435m30828p9517L07679N35896L7729M08154K65666q6414n14446m33102
13129A380252L54521K00853j41596j11540R1636j61934N844m34699o25895n7937
13119D99505j00556N1738r1193q9577K32939j15521K48527K64166k19117J92428
13109H73339M32413Q9596m33405m79867J76241L55455n2560j87990J61108N95436
13099A529766K70258L2643O308J8377k19053j49973L6840r6138j76190p293L20315
13088A565860L29673j43900m81671m24012J96566M46972K636J64433L68323J13813
13078B138693l77751l50842j81744n22285m83042M5084L05300K78421M71528L87407
13068A710769K15821M66273K94807j25510n2941l1597J2860K73862N61415L04081
$$ plain form
13058 3629840 3394185 3006985 2364490 1978444 1673651 1575855 1888808 2064203 2226570 2413807
13048 2413807 2820964 3361789 3479839 3556843 3732097 4097983 4525153 4518228 4216865 4037125
13038 4037125 4008872 3971051 3937520 4277194 4749612 4986114 5244868 5220377 5016778 4751577
13028 4751577 4913478 5227297 5409712 5108304 4663369 4504849 4536940 4815337 5159353 5226583
13018 5226583 5230558 5372483 5565660 5699796 6026378 6609080 7126340 7276197 7788883 8746278
13008 8746278 9025376 8716043 8640638 8962991 9394365 10280826 11531646 12610009 12896233
12999 12896233 13013121 13969908 15220006 16425995 17760795 19147992 20644315 22043482
12991 22043482 24204188 27072497 30007713 33252121 36957509 41621028 47699993 55078462
$$ packed form
13058C629840k35655l87200o42495l86046l04793r7796L12953J75395J62367J87237
13048B413807M07157N40825J18050P7004J75254L65886M27170o925l01363j79740
13038D037125k8253l7821l3531L39674M72418K36502K58754k4491k03599k65201
13028D751577J61901L13819J82415l01408m44935j58520L2091K78397L44016O7230
13018E226583L975J41925J93177J34136L26582N82702N17260J49857N12686R57395
13008H746278K79098l09333p5405L22353M31374Q86461J250820J078363K86224
12999A2896233J16888R56787J250098J205989J334800J387197J496323J399167
12991B2043482K160706K868309K935216L244408L705388M663519O078965P378469
$$ plain form
12983 55078462 63844334 74367402 87098055 102765758 122546728 147925346 181123337
12976 181123337 224217730 279027284 343414515 403322799 431674736 410546117 353446056
12969 353446056 288139233 231212244 186803887 153277219 127605950 107506222 91707521
12962 91707521 79323110 69140606 60751633 54067066 48418445 43310869 38759577 35186449
12954 35186449 31733046 28818342 26940364 25466434 24011545 22265050 20330303 18800462
12946 18800462 17290304 16293957 15757043 15074077 14310291 14005340 13981728 13973459 13949233 13764542
12936 13764542 13582133 13811048 13548483 13193154 13065444 13094696 13268188 13294866 13392027 13988391
12926 13988391 14749034 15379939 16004771 16618244 17763754 19443827 21399155 23978664 27330210
$$ packed form
12983E5078462Q765872J0523068J2730653J5667703J9780970K5378618L3197991
12976A81123337M3094393N4809554O4387231N9908284K8351937k1128619n7100061
12969C53446056o5306823n6926989m4408357l3526668k5671269k0099728j5798701
12962I1707521j2384411j0182504q388973o684567n648621n107576m551292l573128
12954C5186449l453403k914704j877978j473930j454889j746495j934747j529841
12946A8800462j510158r96347n36914o82966p63786l04951k3612q269k4226j84691
12936A3764542j82409K28915k62565l55329j27710K9252J73492K6678R7161N96364
12926A3988391P60643O30905O24832O13473J145510J680073J955328K579509L351546
$$ plain form
12917 27330210 31556591 36872918 42956917 49397048 53045418 51617596 46737098 41146143
12909 41146143 36884713 34475374 33230172 32453212 32536472 33579456 34792029 36827934
12901 36827934 39870451 43395391 48167611 54654730 62094284 70508662 81006241 94397652
12893 94397652 110940636 132023866 159650694 195532639 241875124 300989675 368201776
12886 368201776 424713283 440683334 404077440 338553939 272872338 218925530 177314850
12879 177314850 145669079 121463680 102882955 88471117 76649087 66613600 58487728
12872 58487728 51632287 45963341 41178107 37124259 33863208 30746130 28586719 26742585
12864 26742585 24547621 22406592 20591773 19025885 17602002 16713352 16266221 15659265
$$ packed form
12917B7330210M226381N316327O083999O440131L648370j427822m880498n590955
12909D1146143m261430k409339j245202p76960Q3260J042984J212573K035905
12901C6827934L042517L524940M772220O487119P439554Q414378J0497579J3391411
12893I4397652J6542984K1083230K7626828L5881945M6342485N9114551O7212101
12886C68201776N6511507J5970051l6605894o5523501o5681601n3946808m1610680
12879A77314850l1645771k4205399j8580725j4411838j1822030j0035487q125872
12872E8487728o855441n668946m785234m053848l261051l117078k159411j844134
12864B6742585k194964k141029j814819j565888j423883q88650m47131o06956
$$ plain form
12856 15659265 15359427 15476678 14834462 13990897 12928563 11671456 10749118 10401534 10770289
12847 10770289 11012616 10820003 10570608 10587138 10570878 10346595 10205417 10192104 10462770 10509803
12837 10509803 10177557 10272312 10618359 10747477 10993146 11799662 12553973 12819771 12865267 13153573
12827 13153573 13702605 14229216 14738607 15365128 16477636 17825518 19156971 20845994 23043357
12818 23043357 24990545 27145535 30022894 33190686 37170757 42122892 47677453 54040336
12810 54040336 62005520 71732821 83424171 98012144 115983437 138512422 167809027
12803 167809027 206565773 256307182 316805464 380273012 425167138 424935680 378795079
12796 378795079 313446816 252091430 202784601 165009249 136097758 113359609 95423722
$$ packed form
12856A5659265k99838J17251o42216q43565j062334j257107r22338l47584L68755
12847A0770289K42327j92613k49395J6530j6260k24283j41178j3313K70666M7033
12837A0509803l32246R4755L46047J29118K45669Q06516P54311K65798M5496K88306
12827A3153573N49032N26611N09391O26521J112508J347882J331453J689023K197363
12818B3043357J947188K154990K877359L167792L980071M952135N554561O362883
12810E4040336P965184R727301J1691350J4587973J7971293K2528985K9296605
12803A67809027L8756746M9741409O0498282O3467548M4894126k31458m6140601
12796C78795079o5348263o1355386m9306829l7775352k8911491k2738149j7935887
$$ plain form
12789 95423722 81723944 70586937 61168644 53317248 46740878 41498871 36779434 32808969
12781 32808969 29610118 26754299 24132050 22077598 20335506 19025596 17636863 16212087
12773 16212087 14964076 14142349 13360864 12410318 11434378 10891082 10440543 9855012 9153969
12764 9153969 8396802 7678724 7312435 6764934 6040443 5467007 5192769 4597143 4373330
12755 4373330 4510776 4549614 4420483 3954383 3482100 3151037 3155844 3326732 3395448 3372085
12745 3372085 3321336 3308980 3408613 3070385 2751673 2931542 3128861 3093322 2791851 2617166
12735 2617166 2774588 2832455 2877790 2978925 2877804 2909294 2724734 2372237 2564244 2769396
12725 2769396 2294391 2221822 2594456 2478290 1839862 1331924 887996 422100 401838 654026
$$ packed form
12789I5423722j3699778j1137007r418293p851396o576370n242007m719437l970465
12781C2808969l198851k855819k622249k054452j742092j309910j388733j424776
12773A6212087j248011q21727p81485r50546r75940n43296m50539n85531p01043
12764I153969p57167p18078l66289n47501p24491n73436k74238n95626k23813
12755D373330J37446L8838j29131m66100m72283l31063M807J70888O8716k3363
12745C372085n0749j2356R9633l38228l18712J79869J97319l5539l01471j74685
12735B617166J57422N7867M5335J01135j01121L1490j84560l52497J92007K05152
12725B769396m75005p2569L72634j16166o38428n07938m43928m65896k0262K52188
$$ plain form
12715 654026 704106 761403 930014 1228945 1335536 1583973 1700904 1509755 1189383 534014
12705 534014 -197084 -313735 194045 520832 672199 720146 846464 976516 605813 80563
12695 80563 24154 194855 334644 400615 471912 410961 360334 460699 900154 903554 877023
12684 877023 662060 537169 519139 457501 688768 806962 490981 609398 1019014 1646356
12674 1646356 2071266 1956792 1934436 1770894 1013639 271397 35063 243771 586232 824809
12664 824809 1198755 1170948 1038577 1123135 1220815 1740546 2094660 2039050 1791102 1550218
12654 1550218 1554566 1218550 846654 1038121 820299 669993 830937 952758 952440 790778
12644 790778 652218 685805 192123 -665939 -1003030 -614172 -180580 -27383 418248 997655
$$ packed form
12715F54026N0080N7297J68611K98931J06591K48437J16931j91149l20372o55369
12705E34014p31098j16651N07780L26787J51367M7947J26318J30052l70703n25250
12695H0563n6409J70701J39789O5971P1297o0951n0627J00365M39455L400k6531
12684H77023k14963j24891j8030o1638K31267J18194l15981J18417M09616O27342
12674A646356M24910j14474k2356j63542p57255p42242k36334K08708L42461K38577
12664H24809L73946k7807j32371Q4558R7680N19731L54114n5610k47948k40884
12654A550218M348l36016l71896J91467k17822j50306J60944J21821l18j61662
12644G90778j38560L3587m93682q58062l37091L88858M33592J53197M45631N79407
$$ plain form
12634 997655 925755 746901 972946 855687 724119 829859 909914 478021 167506 216153
12624 216153 77250 -182405 -82913 97505 -78539 -285658 -211422 47027 285757 487693
12614 487693 315042 -153369 -15422 418947 609895 275807 61796 -51634 -342722 -608103
12604 -608103 -675506 -460846 -9280 11187 -560359 -488759 98072 467384 290229 250596
12594 250596 750120 668010 454347 492625 276872 -140987 -445424 -239603 139797 334206
12584 334206 441264 519523 565341 392344 -305977 -555537 -268601 -299506 -516371 -706314
12574 -706314 -741970 -701815 -281193 40160 -11123 136757 277253 -60257 -247901 -561653
12564 -561653 -731661 -691593 -302911 35590 -192715 -335028 -243458 153339 237817 233512
$$ packed form
12634I97655p1900j78854K26045j17259j31568J05740Q0055m31893l10515M8647
12624B16153j38903k59655R9492J80418j76044k07119P4236K58449K38730K01936
12614D87693j72651m68411J37947M34369J90948l34088k14011j13430k91088k65381
12604f08103o7403K14660M51566K0467n71546P1600N86831L69312j77155l9633
12594B50596M99524q2110k13663L8278k15753m17859l04437K05821L79400J94409
12584C34206J07058P8259M5818j72997o98321k49560K86936l0905k16865j89943
12574g06314l5656M0155M20622L21353n1283J47880J40496l37510j87644l13752
12564e61653j70008M0068L88682L38501k28305j42313R1570L96797Q4478m305
$$ plain form
12554 233512 546839 1025493 1095090 926867 669375 444167 177695 220839 -131567 -606775
12544 -606775 -165298 198690 389779 435681 322220 59075 146671 577955 588159 339740
12534 339740 -18840 -86149 174390 258355 -64789 -495781 -436045 410555 1091036 1044263
12524 1044263 762680 976904 903727 379673 228810 673876 780180 280443 -137448 -308923
12514 -308923 -397896 -300872 -73799 302055 532839 441722 271790 430670 476085 700964
12504 700964 843409 713541 739961 809388 279277 -336024 -713050 -468701 -24747 -45196
12494 -45196 -363809 -814547 -795815 -407998 -91426 -109002 -315445 -603042 -797597 -1018571
12484 -1018571 -1173454 -1082262 -949660 -992778 -585169 -219519 -237307 -188572 -165589 -204442
$$ packed form
12554B33512L13327M78654O9597j68223k57492k25208k66472M3144l52406m75208
12544f06775M41477L63988J91089M5902j13461k63145Q7596M31284J0204k48419
12534C39740l58580o7309K60539Q3965l23144m30992N9736Q46600O80481m6773
12524A044263k81583K14224p3177n24054j50863M45066J06304m99737m17891j71475
12514c08923q8973R7024K27073L75854K30784r1117j69932J58880M5415K24879
12504G00964J42445j29868K6420O9427n30111o15301l77026K44349M43954k0449
12494d5196l18613m50738J8732L87817L16572j7576k06443k87597j94555k20974
12484a018571j54883R1192J32602m3118M07609L65650j7788M8735K2983l8853
$$ plain form
12474 -204442 -242499 -252951 -599 29207 213803 61750 6161 157673 -18110 -137773
12464 -137773 -189371 -278661 -115624 -238945 -133938 432332 806328 819647 -106829 -911293
12454 -911293 -805326 -288909 113971 312537 259967 -59140 -714498 -1019058 -664327 -213619
12444 -213619 -281376 -163834 -23632 -29630 -248995 -150230 152559 330211 494712 600123
12434 600123 460025 195161 365066 38386 -213121 -66029 228067 257783 720 -380736
12424 -380736 -390825 -119149 -144176 -352175 -461953 -762610 -797328 -452917 -543456 -671159
12414 -671159 -464412 -414279 -466356 -701491 -852314 -771175 -745873 -627998 -335104 41258
12404 41258 321274 352936 259299 47756 114448 155985 261702 309563 327211 461189 316499
$$ packed form
12474b04442l8057j0452K52352K9806J84596j52053n5589J51512j75783j19663
12464a37773n1598q9290J63037j23321J05007N66270L73996J3319r26476q04464
12454i11293J05967N16417M02880J98566n2570l19107o55358l04560L54731M50708
12444b13619o7757J17542J40202n998k19365R8765L02789J77652J64501J05411
12434F00123j40098k64864J69905l26680k51507J47092K94096K9716k57063l81456
12424c80736j0089K71676k5027k07999j09778l00657l4718L44411r0539j27703
12414f71159K06747N0133n2077k35135j50823Q1139K5302J17875K92894L76362
12404D1258K80016L1662r3637k11543O6692M1537J05717M7861J7648J33978j44690
$$ plain form
12393 316499 300016 598164 821333 1024700 772621 523339 475127 343571 -29356 -566103
12383 -566103 -836491 -685921 -630404 -549866 -490338 -192463 1245 -285055 -260479 374764
12373 374764 722278 259713 -192552 -86052 85444 -150812 -240187 -210241 -16094 -52232
12363 -52232 -392158 -319013 47855 355540 706555 602488 308700 -24680 -239575 -316735
12353 -316735 -231026 16752 211435 330258 431176 220348 54326 15128 -112282 -174029
12343 -174029 -132387 -155326 -335586 -393769 -231544 -161189 14324 1714 515508 1325478
12333 1325478 1266872 1018974 1203422 1430421 1629287 1599801 1284041 1372661 1236420 319911
12323 319911 -8511 -74905 -107773 -74685 -160958 -320043 -356380 -8600 113158 406708
$$ packed form
12393C16499j6483K98148K23169K03367k52079k49282m8212j31556l72927n36747
12383e66103k70388J50570N5517Q0538N9528K97875J93708k86300K4576O35243
12373C74764L47514m62565m52265J06500J71496k36256q9375K9946J94147l6138
12363e2232l39926P3145L66868L07685L51015j04067k93788l33380k14895p7160
12353c16735Q5709K47778J94683J18823J00918k10828j66022l9198j27410o1747
12343a74029M1642k2939j80260n8183J62225P0355J75513j2610N13794Q09970
12333A325478n8606k47898J84448K26999J98866k9486l15760Q8620j36241r16509
12323C19911l28422o6394l2868L3088q6273j59085l6337L47780J21758K93550
$$ plain form
12313 406708 738517 455027 205889 159834 -163330 -612216 -940880 -861493 -689387 -652200
12303 -652200 -770566 -575850 -296514 -98457 514973 892302 903129 910439 897083 859228
12293 859228 636420 273924 164595 122509 -41824 -196594 -620332 -810585 -655329 -304392
12283 -304392 138000 637819 881486 708653 463581 36747 -316871 -480167 -588174 -571482
12273 -571482 -467979 -701568 -975728 -967212 -548721 -311823 -84659 6557 -22138 127583
12263 127583 -126827 -351249 -543035 -357059 -95688 64455 -214904 -360010 -276299 -571953
12253 -571953 -490584 -338672 -185483 9166 342931 371383 -226787 -449227 -440335 -415129
12243 -415129 -209805 318205 595336 242427 -213155 -601950 -723308 -388010 78065 125859
$$ packed form
12313D06708L31809k83490k49138m6055l23164m48886l28664P9387J72106L7187
12303f52200j18366J94716K79336J98057O13430L77329J0827P310j3356l7855
12293H59228k22808l62496j09329m2086j64333j54770m23738j90253J55256L50937
12283c04392M42392M99819K43667j72833k45072m26834l53618j63296j08007J6692
12273e71482J03503k33589k74160Q516M18491K36898K27164R1216k8695J49721
12263A27583k54410k24422j91786J85976K61371J60143k79359j45106Q3711k95654
12253e71953Q1369J51912J53189J94649L33765K8452n98170k22440Q892K5206
12243d15129K05324N28010K77131l52909m55582l88795j21358L35298M66075M7794
$$ plain form
12233 125859 42914 -5298 -95312 -322247 -322384 -387697 -641269 -1015223 -1106291 -764241 -540627
12222 -540627 -431506 -256578 67555 361642 462317 575404 375983 111245 -117480 -271337
12212 -271337 -152161 -355161 -403802 143974 450104 425941 49825 -126510 158666 215171
12202 215171 45501 211696 613487 326420 227483 179955 412439 1110313 1854805 1766506
12192 1766506 1138359 480685 -111845 -429124 -150849 153862 154724 503159 814210 480333
12182 480333 118423 -18247 -201239 -54880 38828 -176350 -525160 -776539 -782163 -291709
12172 -291709 656801 1114493 760681 353200 282888 -52191 -135269 -90212 236256 284715
12162 284715 34812 -198426 -191833 -293353 -593239 -693199 -518478 51658 375161 397964
$$ packed form
12233A25859q2945m8212r0014k26935j37o5313k53572l73954r1068L42050K23614
12222e40627J09121J74928L24133K94087J00675J13087j99421k64738k28725j53857
12212b71337J19176k03000m8641N47776L06130k4163l76116j76335K85176N6505
12202B15171j69670J66195M01791k87067r8937m7528K32484O97874P44492q8299
12192A766506o28147o57674n92530l17279K78275L04711Q62L48435L11051l33877
12182D80333l61910j36670j82992J46359R3708k15178l48810k51379n624M90454
12172b91709R48510M57692l53812m07481p0312l35079q3078M5057L26468M8459
12162B84715k49903k33238O593j01520k99886r9960J74721N70136L23503K2803
$$ plain form
12152 397964 200892 -64919 -401044 -380485 -563007 -987074 -1266053 -913700 -165671 73772
12142 73772 31657 156321 189605 62035 33824 -320035 -593428 -380813 -625665 -945757
12132 -945757 -549403 -417281 -628561 -877621 -862748 -740998 -621927 -468045 -203502 -77016
12122 -77016 -439566 -775737 -743319 -442929 -354854 -550317 -1151089 -1364874 -1112306 -718544
12112 -718544 -479456 -441615 -103696 74686 -372817 -725729 -504568 24772 409042 525620
12102 525620 533700 465669 422503 570477 705380 592107 256072 207279 -2223 -64723 163400
12091 163400 667038 858062 589135 244209 -75394 -115934 -225726 -553916 -537515 -493185
12081 -493185 -599174 -924530 -1188060 -991902 -651917 -207469 -55198 -67662 -248600 -654418
$$ packed form
12152C97964j97072k65811l36125K0559j82522m24067k78979L52353P48029K39443
12142G3772m2115J24664L3284j27570k8211l53859k73393K12615k44852l20092
12132i45757L96354J32122k11280k49060J4873J21750J19071J53882K64543J26486
12122g7016l62550l36171L2418L00390Q8075j95463o00772k13785K52568L93762
12112g18544K39088L7841L37919J78382m47503l52912K21161N29340L84270J16578
12102E25620Q080o8031m3166J47974J34903j13273l36035m8793k09502o2500K28123
12091A63400N03638J91024k68927l44926l19603m0540j09792l28190J6401M4330
12081d93185j05989l25356k63530J96158L39985M44448J52271j2464j80938m05818
$$ plain form
12071 -654418 -846410 -926751 -1163913 -854491 -257914 202175 780033 768611 445001 73118
12061 73118 55274 -253838 -570071 -551306 -867973 -1322194 -1306073 -1049884 -830056 -677372
12051 -677372 -558518 -476638 -432963 -277591 -243094 -229462 -176916 -111663 274779 388569 264815
12040 264815 162893 150748 250108 8678 -109710 -192370 -263250 18102 258975 353118
12030 353118 117326 -383353 -459670 -246408 -81741 -74827 -99127 -180506 -146246 136013 136116
12019 136116 -14356 119779 207638 57474 -49363 -424873 -727004 -570180 -230161 -62991
12009 -62991 -220303 -454245 -371595 -48765 278571 265216 24550 118274 -138214 -672288
11999 -672288 -874721 -996116 -1325978 -1199989 -677935 -213163 18355 -46539 61824 -79536
$$ packed form
12071f54418j91992q0341k37162L09422N96577M60089N77858j1422l23610l71883
12061G3118j7844l09112l16233J8765l16667m54221J6121K56189K19828J52684
12051f77372J18854Q1880M3675J55372L4497J3632N2546O5253L86442J13790j23754
12040B64815j01922j2145R9360k41430j18388q2660p0880K81352K40873R4143
12030C53118k35792n00679p6317K13262J64667O914k4300q1379L4260K82259J03
12019A36116j50472J34135Q7859j50164j06837l75510l02131J56824L40019J67170
12009f2991j57312k33942Q2650L22830L27336j3355k40666R3724k56488n34074
11999f72288k02433j21395l29862J25989N22054M64772K31518o4894J08363j41360
$$ plain form
11989 -79536 -107065 225427 -3448 -313990 -129032 246345 213314 -131141 -480266 -531030
11979 -531030 -463865 -538400 -388278 -44121 215126 311990 362350 290052 179604 36948
11969 36948 -295276 -314406 -327842 -742196 -1336790 -1377304 -984479 -789103 -518492 -359439
11959 -359439 -624992 -712597 -512419 -96173 220829 -132130 -357089 -222306 -165518 -180806
11949 -180806 -58012 153153 121358 159138 306806 408723 490321 606837 376433 16004
11939 16004 -303492 -408941 -262092 101401 561803 577782 73739 -217103 -177385 155366
11929 155366 -16430 -545594 -832716 -733479 -532838 -461808 -103444 109020 -18236 -158158
11919 -158158 -307157 -613068 -593135 -331645 -697884 -797187 -481658 -36864 254694 128943
$$ packed form
11989g9536k7529L32492k28875l10542J84958L75377l3031l44455l49125n0764
11979e31030O7165p4535J50122L44157K59247R6864N0360p2298j10448j42656
11969C6948l32224j9130j3436m14354n94594m0514L92825J95376K70611J59053
11959c59439k65553q7605K00178M16246L17002l52959k24959J34783N6788j5288
11949a80806J22794K11165l1795L7780J47668J01917Q1598J16516k30404l60429
11939A6004l19496j05449J46849L63493M60402J5979n04043k90842L9718L32751
11929A55366j71796n29164k87122R9237K00641P1030L58364K12464j27256j39922
11919a58158j48999l05911J9933K61490l66239r9303L15529M44794K91558j25751
$$ plain form
11909 128943 212207 372262 374074 208389 205961 -16539 -620858 -1199433 -1215048 -873512 -317603
11898 -317603 -84367 -107530 103577 37949 -899995 -1756140 -1397721 -683923 -391218 -564160
11888 -564160 -650244 -602174 -451823 -158904 -77101 -89039 -178476 -233813 144857 360440 152620
11877 152620 -343719 -734014 -702453 -647695 -771879 -666853 -395543 -439000 -477111 -235855
11867 -235855 15391 357734 703982 1097329 1124994 1066676 1183432 898240 720358 566284
11857 566284 79206 -105917 72060 -56669 -231104 -433713 -827446 -1050897 -1032798 -1012788
11847 -1012788 -361412 93885 -212706 -637815 -796001 -592359 -664727 -1034102 -919052 -574069
11837 -574069 -688233 -564045 37774 178029 -154376 -256987 -364128 -762817 -817347 -451498
$$ packed form
11909A28943Q3264J60055J812j65685k428k22500o04319n78575j5615L41536N55909
11898c17603K33236k3163K11107o5628r37944q56145L58419P13798K92705j72942
11888e64160q6084M8070J50351K92919Q1803j1938q9437n5337L78670K15583k07820
11877A52620m96339l90295L1561N4758j24184J05026K71310m3457l8111K41256
11867b35855K51246L42343L46248L93347K7665n8318J16756k85192j77882j54074
11857E66284m87078j85123J77977j28729j74435k02609l93733k23451J8099K0010
11847a012788O51376M55297l06591m25109j58186K03642p2368l69375J15050L44983
11837e74069j14164J24188O01819J40255l32405j02611j07141l98689n4530L65849
$$ plain form
11827 -451498 -251403 -609806 -995391 -909371 -617531 -147325 262433 315541 269004 667760
11817 667760 1006977 1044063 625646 368149 624438 569867 356740 -53453 -458413 -876051
11807 -876051 -668096 -283786 -165796 -107642 -257161 -573224 -295004 -105318 -203423 104238
11797 104238 268848 198277 98620 124620 277009 333737 -196785 -744388 -989417 -1048396
11787 -1048396 -961209 -915023 -874852 -637841 -182083 292453 664675 1014415 882189 224636
11777 224636 -346059 -366096 -292542 -212333 -96213 136637 182748 44333 -123877 -336802
11767 -336802 -483398 -862435 -1419157 -1363923 -778345 -101232 279479 10377 -341508 -264465
11757 -264465 -26430 472995 374423 31844 -309358 -812697 -1239987 -869092 -489969 -564008
$$ packed form
11827d51498K00095l58403l85585Q6020K91840M70206M09758N3108m6537L98756
11817F67760L39217L7086m18417k57497K56289n4571k13127m10193m04960m17638
11807h76051K07955L84310J17990N8154j49519l16063K78220J89686r8105L07661
11797A04238J64610p0571r9657K6000J52389N6728n30522n47603k45029n8979
11787a048396Q7187M6186M0171K37011M55758M74536L72222L49740j32226o57553
11777B24636n70695k0037P3554Q0209J16120K32850M6111j38415j68210k12925
11767c36802j46596l79037n56722N5234N85578O77113L80711k69102l51885P7043
11757b64465K38035M99425r8572l42579l41202n03339m27290L70895L79123p4039
$$ plain form
11747 -564008 31541 218316 -607387 -806634 49154 975291 1388462 1390967 1299642 1136035
11737 1136035 862307 362859 44561 -131323 -295582 -698724 -838711 -315770 169639
11728 169639 -138732 -783536 -853806 -628252 -514496 -314164 137036 466269 705033 607564
11718 607564 399773 130074 -607495 -1180990 -1609907 -1753570 -1649929 -1254116 -704061 -276781
11708 -276781 -32454 -124376 -370003 -533175 -688395 -644181 -700970 -657394 88697 683914
11698 683914 840207 537046 584536 941915 839030 821224 941235 1556268 1898432 2099954
11688 2099954 2118638 1992259 2543854 3300847 3158189 2365600 1645483 1330746 1120810 798198
11678 798198 527020 129755 -361224 -837988 -1366758 -1605798 -1318904 -945935 -871627 -712809
$$ packed form
11747e64008N95549J86775q25703j99247Q55788R26137M13171K505r1325j63607
11737A136035k73728m99448l18298j75884j64259m03142j39987N22941M85409
11728A69639l08371o44804p0270K25554J13756K00332M51200L29233K38764r7469
11718F07564k07791k69699p37569n73495m28917j43663J03641L95813N50055M27280
11708b76781K44327r1922k45627j63172j55220M4214n6789M3576P46091N95217
11698F83914J56293l03161M7490L57379j02885j7806J20011O15033L42164K01522
11688B099954J8684j26379N51595P56993j42658p92589p20117l14737k09936l22612
11678G98198k71178l97265m90979m76764n28770k39040K86894L72969P4308J58818
$$ plain form
11668 -712809 -429582 99349 565952 588403 174782 -358594 -459524 -130175 105611 447051
11658 447051 675635 613445 632102 401273 248537 462351 320451 81229 187153 -101691
11648 -101691 -659590 -786127 -510840 -262321 -384665 -453217 -478481 -674450 -383902 -27442
11638 -27442 -6279 -120352 -203387 22833 708372 1089238 937276 298651 -166836 -38002
11628 -38002 135934 79805 62755 -404204 -761426 -643203 -640482 -801088 -908981 -687710
11618 -687710 -877881 -1208500 -1381868 -1116807 -943750 -1153543 -1041609 -852520 -429160 -139558
11608 -139558 -213570 -284629 -574356 -705130 -683231 -731650 -905210 -619888 -45793 255704
11598 255704 -26418 -521291 -521002 -337134 -647936 -1141038 -1269244 -853581 -422555 -390520
$$ packed form
11668g12809K83227N28931M66603K2451m13621n33376j00930L29349K35786L41440
11658D47051K28584o2190J8657k30829j52736K13814j41900k39222J05924k88844
11648a01691n57899j26537K75287K48519j22344o8552k5264j95969K90548L56460
11638b7442K1163j14073q3035K26220O85539L80866j51962o38625m65487J28834
11628c8002J73936n6129j7050m66959l57222J18223K721j60606j07893K21271
11618f87710j90171l30619j73368K65061J73057k09793J11934J89089M23360K89602
11608a39558p4012p1059k89727j30774K1899m8419j73560K85322N74095L01497
11598B55704k82122m94873K89J83868l10802m93102j28206M15663M31026L2035
$$ plain form
11588 -390520 -295236 -114532 -291339 -6727 209580 142614 -168854 -259612 -81396 -169517
11578 -169517 -601542 -666160 -248221 -76129 -17526 468381 480298 -74142 -441574 -576540
11568 -576540 -632399 -653234 -363343 327359 691423 699542 419385 165899 -13551 -415450
11558 -415450 -682538 -968537 -1264835 -1183582 -764225 -555983 -370691 -431004 -442492 -728192
11548 -728192 -530656 153644 56311 3020 59716 -17116 6465 -49825 118085 -293716 -733253
11537 -733253 -726698 -656697 -583889 -773541 -917754 -921361 -1115919 -1208457 -1363152 -1278625 -686048
11526 -686048 -493487 -788136 -1136352 -1589236 -1367111 -1050739 -941267 -847280 -594770 -437942
11516 -437942 -275862 -6598 216105 175358 -361791 -821380 -796949 -679233 -721329 -373109
$$ packed form
11588c90520R5284J80704j76807K84612K16307o6966l11468r0758J78216q8121
11578a69517m32025o4618M17939J72092N8603M85907J1917n54440l67432j34966
11568e76540n5859k0835K89891O90702L64064Q119k80157k53486j79450m01899
11558d15450k67088k85999k96298Q1253M19357K08242J85292o0313j1488k85700
11548g28192J97536O84300r7333n3291N6696p6832K3581n6290J67910m11801m39537
11537g33253O555P0001P2808j89652j44213l607j94558r2538j54695Q4527N92577
11526f86048J92561k94649l48216m52884K22125L16372J09472R3987K52510J56828
11516d37942J62080K69264K22703m0747n37149m59589K4431J17716m2096L48220
$$ plain form
11506 -373109 203078 351387 265032 66689 -67814 -175413 -73237 120960 417560 148451
11496 148451 -355922 -542784 -532026 -407640 -348496 -601379 -920491 -999964 -1065750 -1147726
11486 -1147726 -980942 -402639 74884 287309 9258 -461406 -1011935 -1298125 -1401106
11477 -1401106 -1453889 -1395144 -987533 -205021 93470 291068 587073 590747 362498 94603
11467 94603 130901 316702 116548 -189903 -300137 -292345 -507848 -951301 -1194665 -959238
11457 -959238 -721512 -756274 -1029188 -925369 -254544 640460 1206682 1165939 1261692 807699
11447 807699 258164 673839 1141007 1086109 678473 610976 602369 254030 173109 560616
11437 560616 528511 480287 676667 1284746 1216040 361414 -227716 -478429 -475258 -131496
$$ packed form
11506c73109N76187J48309q6355j98343j34503j07599J02176J94197K96600k69109
11496A48451n04373j86862J0758J24386N9144k52883l19112p9473o5786q1976
11486a147726J66784N78303M77523K12425k78051m70664n50529k86190j02981
11477a401106n2783N8745M07611P82512K98491J97598K96005L674k28249k67895
11467I4603L6298J85801k00154l06451j10234P792k15503m43453k43364K35427
11457i59238K37726l4762k72914J03819O70825Q95004N66222m0743R5753m53993
11447H07699n49535M15675M67168n4898m07636o7497q607l48339q0921L87507
11437E60616l2105m8224J96380O08079o8706q54626n89130k50713L171L43762
$$ plain form
11427 -131496 316065 298607 142513 -200972 -367401 138569 331963 147227 58222 8393
11417 8393 160653 -51732 -373815 -968406 -1277933 -634137 91005 379932 371266 87908
11407 87908 124671 409564 443244 425624 960511 1281471 734767 97791 -190188 -399095
11397 -399095 -664224 -727402 -784632 -887835 -688907 -346731 -290380 -129157 -115446 -576955
11387 -576955 -765484 -737922 -592600 -357004 -287988 -273183 -194303 -89638 118835 34800
11377 34800 122115 530861 701488 452106 259157 -193552 -540583 -326893 -242310 -645642
11367 -645642 -781088 -517837 -519675 -477262 -27889 199181 179910 81441 51081 293127 260816
11356 260816 344837 726584 1073060 1090180 1116465 1138155 743352 358433 -208708 -599152
$$ packed form
11427a31496M47561j7458j56094l43485j66429N05970J93394j84736q9005m9829
11417H393J52260k12385l22083n94591l09527O43796P25142K88927q666k83358
11407H7908L6763K84893L3680j7620N34887L20960n46704o36976k87979k08907
11397c99095k65129o3178n7230j03203J98928L42176N6351J61223J3711m61509
11387e76955j88529K7562J45322K35596O9016J4805P8880J04665K08473q4035
11377C4800Q7315M08746J70627k49382j92949m52709l47031K13690Q4583m03332
11367f45642j35446K63251j838M2413M49373K27070j9271r8469l0360K42046l2311
11356B60816Q4021L81747L46476J7120K6285K1690l94803l84919n67141l90444
$$ plain form
11346 -599152 -767887 -866603 -1008895 -884207 -396043 -187440 -262724 -470254 7666 491613
11336 491613 208667 -361207 -745173 -597659 -37871 387687 350958 -293290 -998530 -1107920
11326 -1107920 -912503 -383044 -89232 -213527 -335817 -253063 -28479 405159 506507 119150
11316 119150 18922 35735 80829 -14811 -572805 -659624 -334814 50122 426915 205687
11306 205687 -426320 -437196 -478245 -664223 -662594 -818671 -730022 -514731 -596722 -896674 -935531
11295 -935531 -962222 -985424 -679424 -669068 -1165672 -980020 -480750 280449 308482 -277988
11285 -277988 -483595 -630330 -793676 -740631 -299201 167762 180464 53120 -96700 -233949
11275 -233949 -233445 -284381 -77446 308427 242267 19425 16811 230558 283124 -168035 -739720
$$ packed form
11346e99152j68735r8716j42292J24688M88164K08603p5284k07530M77920M83947
11336D91613k82946n69874l83966J47514N59788M25558l6729o44248p05240j09390
11326a107920J95417N29459K93812j24295j22290Q2754K24584M33638J01348l87357
11316A19150j00228J6813M5094r5640n57994q6819L24810L84936L76793k21228
11306B05687o32007j0876m1049j85978J629j56077Q8649K15291q1991k99952l8857
11295i35531k6691k3202L06000J0356m96604J85652M99270P61199K8033n86470
11285b77988k05607j46735j63346N3045M41430M66963J2702j27344j49820j37249
11275b33949N04n0936K06935L85873o6160k22842k614K13747N2566m51159n71685
$$ plain form
11264 -739720 -887877 -535416 -406707 -779126 -1032219 -1053810 -1426416 -1774488 -1698482 -1111914
11254 -1111914 -543882 -104318 186456 327888 207448 13036 -33624 -5772 -230886 -765832
11244 -765832 -494321 -32329 14948 -615104 -887249 -495629 -216110 -199389 -62878 50235
11234 50235 -125129 -217148 -409203 -300857 -222262 -602227 -955503 -967862 -676816 -269968
11224 -269968 99413 318505 225510 229711 467672 589551 627506 391826 -175433 -477022
11214 -477022 -774788 -562981 -292046 -511672 -649289 -635614 -695007 -492612 -23493 370712
11204 370712 313202 324438 472427 400088 466672 358335 266143 469715 940643 1214258
11194 1214258 1156443 765900 -34657 -448982 -381030 36703 528860 659231 695300 583853
$$ packed form
11264g39720j48157L52461J28709l72419k53093k1591l72606l48072P6006N86568
11254a111914N68032M39564K90774J41432j20440j94412m6660K7852k25114n34946
11244g65832K71511M61992M7277o30052k72145L91620K79519J6721J36511J13113
11234E0235j75364r2019j92055J08346P8595l79965l53276j2359K91046M06848
11224b69968L69381K19092r2995M201K37961J21879L7955k35680n67259l01589
11214d77022k97766K11807K70935k19626j37617J3675n9393K02395M69119L94205
11204C70712n7510J1236J47989p2339O6584j08337r2192K03572M70928K73615
11194A214258n7815l90543q00557m14325O7952M17733M92157J30371L6069j11447
$$ plain form
11184 583853 411674 406771 450552 186911 136954 281406 83190 -511158 -642235 -499999
11174 -499999 -536986 -643470 -1161453 -1036016 -660831 -500517 -223210 169053 491982 698984
11164 698984 678673 650346 576634 465333 140875 38327 33888 94919 63908 208268 239166
11153 239166 79822 -318108 -632982 -549203 -210571 371997 416747 297411 366102 193413
11143 193413 46991 170153 419926 450268 65347 -227389 -414500 -621158 -380164 -19107
11133 -19107 -76815 -107816 -33209 -173138 -349986 139644 187328 -169593 -593330 -961878
11123 -961878 -1139821 -883426 -297791 -315133 -604569 -766710 -727514 -828202 -932152 -690243
11113 -690243 -830161 -1072958 -1130311 -1040972 -749124 -689996 -656216 -426467 -352564 -468668
$$ packed form
11184E83853j72179m903M3781k63641m9957J44452j98216n94348j31077J42236
11174d99999l6987j06484n17983J25437L75185J60314K77307L92263L22929K07002
11164F98984k0311k8327p3712j11301l24458j02548m439O1031l1011J44360L0898
11153B39166j59344l97930l14874Q3779L38632N82568M4750j19336O8691j72689
11143A93413j46422J23162K49773L0342l84921k92736j87111k06658K40994L61057
11133a9107n7708l1001P4607j39929j76848M89630M7684l56921m23737l68548
11123i61878j77943K56395N85635j7342k89436j62141L9196j00688j03950K41909
11113f90243j39918k42797n7353Q9339K91848N9128L3780K29749P3903j16104
$$ plain form
11103 -468668 -422436 -110219 110963 -30428 -157997 -594322 -961885 -945120 -590088 -85667
11093 -85667 63214 -283769 -371036 -125138 -173621 -645223 -1068272 -927562 -316271 595968
11083 595968 862138 941484 872300 510665 -121956 -599196 -686278 -661487 -557733 -258157
11073 -258157 -55786 220859 767354 1029424 1016158 870548 643436 376057 -2419 -223249
11063 -223249 -389300 -272180 30826 294223 432147 523049 642242 726167 599981 599104
11053 599104 662306 716559 670207 340788 183929 690851 839588 347455 -243251 -475519
11043 -475519 -55642 28708 -460826 -974231 -1121041 -961318 -981899 -1100493 -924872 -713203
11033 -713203 -616902 -345104 31029 15252 -214101 -215524 -183690 321298 693948 72483
$$ packed form
11103d68668M6232L12217K21182j41391j27569m36325l67563J6765L55032N04421
11093h5667J48881l46983q7267K45898m8483m71602m23049J40710O11291R12239
11083E95968K66170P9346o9184l61635o32621m77240q7082K4791J03754K99576
11073b58157K02371K76645N46495K62070j3266j45610k27112k67379l78476k20830
11063b23249j66051J17120L03006K63397J37924R0902J19193Q3925j26186q77
11053E99104O3202N4253m6352l29419j56859N06922J48737m92133n90706k32268
11043d75519M19877Q4350m89534n13405j46810J59723k0581j18594J75621K11669
11033g13203R6301K71798L76133j5777k29353j423L1834N04988L72650o21465
$$ plain form
11023 72483 -462575 -764911 -826669 -188991 70409 38158 85208 85193 348642 230432 -108820
11012 -108820 -146152 -18501 153123 29064 -328465 -377756 17908 162790 -356077 -618460
11002 -618460 -396906 -106653 62385 218270 410474 123748 -17841 -183738 -361974 -36138
10992 -36138 230241 273950 51878 -396653 -719719 -824565 -987012 -1085078 -680607 112549
10982 112549 210978 -598332 -1313709 -1539392 -1387763 -948102 -647462 -570447 -588809 -659179
10972 -659179 -662561 -130559 359327 336523 225262 192437 118039 98315 -266443 -1035439 -1193768
10961 -1193768 -1377099 -1496075 -1310746 -1065787 -1049939 -863448 -664619 -330350 -73064 -85442
10951 -85442 -143172 84056 35862 -370656 -599143 -868303 -1063131 -945965 -588604 -53115
$$ packed form
11023G2483n35058l02336o1758O37678K59400l2251M7050j5K63449j18210l39252
11012a08820l7332J27651J71624j24059l57529m9291L95664J44882n18867k62383
11002f18460K21554K90253J69038J55885J92204k86726j41589j65897j78236L25836
10992c6138K66379M3709k22072m48531l23066j04846j62447r8066M04471P93156
10982A12549R8429q09310p15377k25683J51629M39661L00640P7015j8362p0370
10972f59179l382N32002M89886k2804j11261l2825p4398j9724l64758p68996j58329
10961a193768j83331j18976J85329K44959J5848J86491J98829L34269K57286j2378
10951h5442n7730K27228m8194m06518k28487k69160j94828J17166L57361N35489
$$ plain form
10941 -53115 208202 247255 669615 762543 335351 65127 9687 63106 -87581 -382313
10931 -382313 -145105 -79246 -93210 117538 360878 187524 -429252 -623125 -730724 -550471
10921 -550471 -362271 -317043 -408313 -420290 -189758 -136868 -50538 -188319 -484094 -519121 -202958
10910 -202958 -107317 -427801 -635133 -247532 -62483 -136964 -226762 -173482 20183 141196
10900 141196 -33665 154349 161273 -93642 -461161 -725031 -520476 -134092 -185374 -291137
10890 -291137 -321245 -116610 325325 288101 -163970 -323101 -154241 324092 548210 418702
10880 418702 114622 -317541 -492746 -590472 -758342 -715221 -645248 -282648 343097 515110
10870 515110 442333 222292 -66580 -411569 -93005 317979 181077 -163987 -299891 -15771
$$ packed form
10941e3115K61317L9053M22360R2928m27192k70224n5440N3419j50687k94732
10931c82313K37208O5859j3964K10748K43340j73354o16776j93873j07599J80253
10921e50471J88200M5228r1270j1977K30532N2890Q6330j37781k95775l5027L16163
10910b02958R5641l20484k07332L87601J85049p4481q9798N3280J93665J21013
10900A41196j74861J88014O924k54915l67519k63870K04555L86384n1282j05763
10890b91137l0108K04635M41935l7224m52071j59131J68860M78333K24118j29508
10880D18702l04080m32163j75205r7726j67870M3121O9973L62600O25745J72013
10870E15110p2777k20041k88872l44989L18564M10984j36902l45064j35904K84120
$$ plain form
10860 -15771 239812 439730 669189 708208 196279 80518 -32837 -307330 -137500 574999
10850 574999 751924 1029955 1474211 1455451 1246467 1088685 887577 820413 749278 494657
10840 494657 176059 -66605 -67977 35408 231638 447614 325174 -153644 -559088 -664364
10830 -664364 -329038 -299641 -369338 174206 710974 849095 706063 664440 793220 866198
10820 866198 894959 466131 46374 -124426 44771 396950 625043 697687 356341 89734
10810 89734 164814 474462 624090 712913 1086228 1194447 981208 531238 208564 559449
10800 559449 575092 31153 -126795 -64553 460927 1258966 1930681 2404602 1648147 1120148
10790 1120148 1289789 1553492 2053550 2125039 1620809 1378466 1581139 1696017 1945211 2698065
$$ packed form
10860a5771K55583J99918K29459L9019n11929j15761j13355k74493J69830P12499
10850E74999J76925K78031M44256j8760k08984j57782k01108o7164p1135k54621
10840D94657l18598k42664j372J03385J96230K15976j22440m78818m05444j05276
10830f64364L35326K9397o9697N43544N36768J38121j43032m1623J28780P2978
10820H66198K8761m28828m19757j70800J69197L52179K28093P2644l41346k66607
10810H9734P5080L09648J49628Q8823L73315J08219k13239m49970l22674L50885
10800E59449J5643n43939j57948O2242N25480P98039O71715M73921p56455n27999
10790A120148J69641K63703N00058P1489n04230k42343K02673J14878K49194P52854
$$ plain form
10780 2698065 2978533 2839747 3108176 3423512 3785367 3964934 4104993 3758399 3346936
10771 3346936 3046409 2811284 3013326 3606629 4353666 4905940 5062807 5273146 5514939
10762 5514939 5906875 5587154 4963791 4554271 4139369 3621395 3446924 3928407 4361971
10753 4361971 4083582 3216244 2996742 3501715 3723625 3428693 3255274 3207568 3279361 3430201
10743 3430201 3031322 2479340 2230316 2496023 2542850 2154488 1498650 1245990 1723286 2035811
10733 2035811 2189299 2720467 2857324 2573495 2173893 1779245 1626637 2027848 2073648 1725349
10723 1725349 2003357 2278838 2131945 1987893 1638802 1373214 1284019 1156626 981561 724696
10713 724696 829980 1198638 1424327 1301086 1045751 892018 1144605 1261950 862420 409290
$$ packed form
10780B698065K80468j38786K68429L15336L61855J79567J40059l46594m11463
10771C346936l00527k35125K02042N93303P47037N52274J56867K10339K41793
10762E514939L91936l19721o23363m09520m14902n17974j74471M81483M33564
10753D361971k78389q67338k19502N04973K21910k94932j73419m7706P1793J50840
10743C430201l98879n51982k49024K65707M6827l88362o55838k52660M77296L12525
10733B035811J53488N31168J36857k83829l99602l94648j52608M01211M5800l48299
10723A725349K78008K75481j46893j44052l49091k65588q9195j27393j75065k56865
10713G24696J05284L68658K25689j23241k55335j53733K52587J17345l99530m53130
$$ plain form
10703 409290 329162 639991 1312950 1616066 1124692 1030833 1426274 1254431 750340 314406
10693 314406 260557 517379 485347 426608 297050 448111 723504 725184 367387 233081
10683 233081 557487 831051 709302 306231 129955 610972 898932 896003 773544 598130
10673 598130 163067 -278451 -504315 -578063 -407530 -497074 -496673 -361989 -458987 -428390 -390720
10662 -390720 -512175 -332884 -187613 -380018 -806106 -1151271 -1020745 -814959 -862405 -1117651
10652 -1117651 -1536876 -1538106 -1064123 -582354 -62195 -70373 -17810 -182149 -538059 -441781
10642 -441781 -356462 -545683 -459744 -95940 -309360 -606093 -578604 -137168 310701 429987
10632 429987 183957 -127097 -272937 -415966 -220488 -77886 49868 175506 -107468 -378081
$$ packed form
10703D09290q0128L10829O72959L03116m91374r3859L95441j71843n04091m35934
10693C14406n3849K56822l2032n8739j29558J51061K75393J680l57797j34306
10683B33081L24406K73564j21749m03071j76276M81017K87960k929j22459j75414
10673E98130m35063m41518k25864p3748J70533q9544M01J34684r6998L0597L7670
10662c90720j21455J79291J45271j92405m26088l45165J30526K05786m7446k55246
10652a117651m19225j230M73983M81769N20159q178N2563j64339l55910R6278
10642d41781Q5319j89221Q5939L63804k13420k96733K7489M41436M47869J19286
10632D29987k46030l11054j45840j43029J95478J42602J27754J25638k82974k70613
$$ plain form
10622 -378081 -300394 -378479 -466114 -302991 -190164 -340039 -345174 -254348 -323055 -519831 -621455
10611 -621455 -546497 -829256 -1042917 -769347 -524283 -699766 -649097 -368722 -525650 -607688
10601 -607688 -533123 -601074 -561958 -841478 -801977 -281577 282151 564436 517322 -121717
10591 -121717 -486661 -489128 -582576 -473683 -184207 -95118 -24889 -103420 -351065 -402387 29723
10580 29723 272552 175537 -96955 -350523 -351483 -340275 -355137 -105083 2789 38295 217091
10569 217091 306251 12037 32757 89083 -11673 149300 587444 430306 -40733 -161329
10559 -161329 -55922 -321394 -540693 -55406 357012 510815 384189 -2571 -394572 -518746
10549 -518746 -261615 87901 417333 77130 -392817 -756737 -912857 -209039 314427 657255
$$ packed form
10622c78081P7687p8085q7635J63123J12827j49875n135R0826o8707j96776j01624
10611f21455P4958k82759k13661K73570K45064j75483N0669K80375j56928q2038
10601f07688P4565o7951L9116k79520L9501N20400N63728K82285m7114o39039
10591a21717l64944k467r3448J08893K89476Q9089P0229p8531k47645n1322M32110
10580B9723K42829r7015k72492k53568r60J1208j4862K50054J07872L5506J78796
10569B17091Q9160k94214K0720N6326j00756J60973M38144j57138m71039j20596
10559a61329J05407k65472k19299M85287M12418J53803j26626l86760l92001j24174
10549e18746K57131L49516L29432l40203m69947l63920j56120P03818N23466L42828
$$ plain form
10539 657255 695632 -168639 -930832 -1314179 -1536371 -1593413 -1660985 -1596414 -1246921 -1195215
10529 -1195215 -1089989 -753952 -582577 -319811 -120286 -98447 -411566 -722933 -511891 173995
10519 173995 481610 195114 -221668 -529767 -428605 -270835 -267057 -682728 -942186 -642438
10509 -642438 -376226 -309515 -385573 -324387 -259325 195030 352908 -46945 -215816 -394287
10499 -394287 -661603 -982245 -893190 -749303 -1138078 -1028271 -959623 -749495 -329252 -68959
10489 -68959 14129 163740 320965 78125 87954 -75922 -566827 -655668 -396296 -444168 -688756
10478 -688756 -490705 -307052 -605271 -689727 -445812 -211163 -109240 -127098 -164825 -206314
10468 -206314 -37824 117173 -139060 -417860 -524837 -772536 -828248 -856204 -902289 -640041
$$ packed form
10539F57255L8377q64271p62193l83347k22192n7042o7572O4571L49493N1706
10529a195215J05226L36037J71375K62766J99525K1839l13119l11367K11042O85886
10519A73995L07615k86496m16782l08099J01162J57770L778m15671k59458K99748
10509f42438K66212O6711p6058O1186O5062M54355J57878l99853j68871j78471
10499c94287k67316l20642Q9055J43887l88775J09807O8648K10128M20243K60293
10489f8959Q3088J49611J57225k42840R829j63876m90905q8841K59372m7872k44588
10478f88756J98051J83653k98219q4456K43915K34649J01923j7858l7727m1489
10468b06314J68490J54997k56233k78800j06977k47699n5712k7956m6085K62248
$$ plain form
10458 -640041 -373109 -156127 -188349 4927 578029 964008 957289 491227 144877 110475
10448 110475 149195 578866 1217413 1321302 1165576 1197964 1093417 897025 598532 516352
10438 516352 884302 1152990 897129 594044 889649 865032 826916 906256 666225 330282
10428 330282 242571 437739 777191 590346 214335 194181 156959 280937 117698 -188392
10418 -188392 -641801 -1235813 -1278769 -1171528 -1104195 -749162 -200849 155578 22419 -183871
10408 -183871 -379835 -357215 -175493 -215743 -370857 -399583 -297296 -212092 136768 639061
10398 639061 818054 965964 866834 639409 626118 521740 181959 -173468 -302604 -168348
10388 -168348 -177737 82074 607883 1126019 1400533 1589207 1332368 1074919 710309 -113061
$$ packed form
10458f40041K66932K16982l2222J93276N73102L85979o719m66062l46350l4402
10448A10475L8720M29671O38547J03889j55726L2388j04547j96392k98493q2180
10438E16352L67950K68688k55861l03085K95605k4617l8116P9340k40031l35943
10428C30282q7711J95168L39452j86845l76011k0154l7222J23978j63239l06090
10418a88392m53409n94012m2956J07241O7333L55033N48313L56427j33159k06290
10408a83871j95964K2620J81722m0250j55114k8726J02287Q5204L48860N02293
10398F39061J78993J47910r9130k27425j3291j04378l39781l55427j29136J34256
10388a68348r389K59811N25809N18136K74514J88674k56839k57449l64610q23370
$$ plain form
10378 -113061 -695780 -837893 -656204 -566169 -178858 329143 205523 -120174 -294550 -416479
10368 -416479 -635039 -1119924 -1226378 -1112612 -1439268 -1680701 -1406329 -706974 186918 502661
10358 502661 563669 981560 1164096 676424 121444 -75648 -73466 -310239 -425804 -466865
10348 -466865 -435392 -109074 434708 800657 741916 7466 -566930 -938232 -940449 -698285
10338 -698285 -232119 174440 291731 247392 182704 -159804 -149225 316105 819964 940210
10328 940210 446912 116977 -5080 -3324 159166 25807 -184247 -230109 -82548 -27157
10318 -27157 113629 497704 406463 300820 205312 -207889 -131445 -150100 -420266 -444099 -142568
10307 -142568 303 -64190 -70729 -116538 -366750 -433233 67397 188794 -63197 -200938
$$ packed form
10378a13061n82719j42113J81689R0035L87311N08001j23620l25697j74376j21929
10368d16479k18560m84885j06454J13766l26656k41433K74372O99355Q93892L15743
10358E02661O1008M17891J82536m87672n54980j97092K182k36773j15565m1061
10348d66865L1473L26318N43782L65949n8741p34450n74396l71302k217K42164
10338f98285M66166M06559J17291m4339o4688l42508J0579M65330N03859J20246
10328I40210m93298l29935j22057J756J62490j33359k10054m5862J47561N5391
10318b7157J40786L84075r1241j05643r5508m13201P6444j8655k70166k3833L01531
10307a42568J42871o4493o539m5809k50212o6483N00630J21397k51991j37741
$$ plain form
10297 -200938 -281067 -461768 -599016 -160635 108161 -93161 -245966 -552500 -1322864 -1707793
10287 -1707793 -1459121 -1063573 -681161 -354379 -236830 -269819 -306158 -378678 -21604 307890
10277 307890 316340 258216 265289 155738 63964 204325 53076 -220650 -164434 -149877 51823
10266 51823 379386 657298 810882 507939 195810 174195 -69898 -207985 -10819 114204
10256 114204 73904 37179 -255031 -130766 295176 -74076 -812717 -1117422 -1368343 -1049673
10246 -1049673 -819599 -753301 -510110 212868 800992 489149 219141 364539 407965 565241
10236 565241 632569 455558 -1881 -437786 -288614 -468248 -589332 -726728 -725085 -589337
10226 -589337 -649942 -858831 -1059584 -1058652 -960504 -630616 -311407 -16033 296099 249309 228971
$$ packed form
10297b00938q0129j80701j37248M38381K68796k01322j52805l06534p70364l84929
10287a707793K48672L95548L82412L26782J17549l2989l6339p2520L57074L29494
10277C07890Q450n8124P073j09551r1774J40361j51249k73726N6216J4557K01700
10266E1823L27563K77912J53584l02943l12129k1615k44093j38087J97166J25023
10256A14204m0300l6725k92210J24265M25942l69252p38641l04705k50921L18670
10246a049673K30074O6298K43191P22978N88124l11843k70008J45398M3426J57276
10236E65241O7328j77011m57439m35905J49172j79634j21084j37396J643J35748
10226e89337o0605k08889k00753R32R8148L29888L19209K95374L12132m6790k0338
$$ plain form
10215 228971 -28351 -509815 -1027866 -1212444 -757925 -682171 -857991 -710992 -391584 -71006
10205 -71006 143176 181735 -145665 -608977 -541477 -153344 -69543 -312915 -955556 -1463654
10195 -1463654 -1670896 -1358108 -969714 -532881 -265567 -74058 -62343 -120277 -4132 -327189
10185 -327189 -489595 -37943 118242 617 -18527 40140 162777 336328 532322 462806
10175 462806 199952 178440 165057 13774 104467 314854 228629 -125482 -300996 -404906
10165 -404906 -197431 56435 -23442 -546345 -568904 -142969 148266 512590 777783 611244
10155 611244 482208 235674 -16246 -245383 -639622 -907037 -836453 -543108 -141103 145015
10145 145015 332287 136542 -359547 -608408 -773518 -885882 -1030332 -1259544 -958818 -529500
$$ packed form
10215B28971k57322m81464n18051j84578M54519P5754j75820J46999L19408L20578
10205g1006K14182L8559l27400m63312O7500L88133Q3801k43372o42641n08098
10195a463654k07242L12788L88394M36833K67314J91509J1715n7934J16145l23057
10185c27189j62406M51652J56185j17625j9144N8667J22637J73551J95994o9516
10175D62806k62854k1512j3383j51283R0693K10387q6225l54111j75514j03910
10165d04906K07475K53866p9877n22903k2559M25935K91235L64324K65193j66539
10155F11244j29036k46534k51920k29137l94239k67415P0584K93345M02005K86118
10145A45015J87272j95745m96089k48861j65110j12364j44450k29212L00726M29318
$$ plain form
10135 -529500 -794923 -1034328 -721365 -127827 108543 -32506 -319039 -449481 -678139 -901121
10125 -901121 -971802 -1272165 -1084248 -632578 -471160 -423504 -273375 347 450433 626555
10115 626555 680878 386951 -527649 -1182911 -948871 -584811 -383517 -518553 -853458 -868145
10105 -868145 -617003 -100834 361493 419836 -215024 -560780 -572842 -624198 -223760 66686
10095 66686 195098 335044 333474 290839 143218 -32385 -561342 -1016049 -841611 -664050
10085 -664050 -922892 -1059993 -1229517 -1234379 -1098923 -936583 -627531 -171016 68254 200286
10075 200286 141169 146084 262305 17313 -165706 4643 457391 596538 451648 430635
10065 430635 147367 -169474 -140512 -64900 232799 441757 -12217 -220626 157717 245950
$$ packed form
10135e29500k65423k39405L12963N93538K36370j41049k86533j30442k28658k22982
10125i01121p0681l00363J87917M51670J61418M7656J50129K73722M50086J76122
10115F26555N4323k93927r14600o55262K34040L64060K01294j35036l34905j4687
10105h68145K51142N16169M62327N8343o34860l45756j2062n1356M00438K90446
10095F6686J28412J39946j570m2635j47621j75603n28957m54707J74438J77561
10085f64050k58842j37101j69524m862J35456J62340L09052M56515K39270J32032
10075B00286n9117M915J16221k44992j83019J70349M52748J39147j44890k1013
10065D30635k83268l16841K8962P5612K97699K08958m53974k08409L78343Q8233
$$ plain form
10055 245950 -151639 -804249 -979879 -1036549 -818447 -400390 -216686 -254707 -319089 -334390
10045 -334390 -453700 -844990 -1125652 -1149739 -859635 -506672 -137477 -11842 -102422 -80943
10035 -80943 -138170 -942835 -1442442 -1095508 -36740 850048 1097204 975544 699878 605107
10025 605107 674685 494651 260164 -27898 -665059 -968838 -845168 -1009781 -1204933 -1088726
10015 -1088726 -883701 -1017183 -1329225 -1404681 -1118320 -732407 -326034 11587 205141 31696
10005 31696 150128 -10380 -444649 -299438 163392 237629 -61101 3852 -97451 -349789
9995 -349789 -184234 -364603 -477401 -123974 -65200 -165316 -478967 -877274 -944832 -662756
9985 -662756 -348802 -413170 -309223 -70039 -193961 -391926 -678051 -601963 -421646 -271548
$$ packed form
10055B45950l97589o52610j75630n6670K18102M18057J83704l8021o4382j5301
10045c34390j19310l91290k80662k4087K90104L52963L69195J25635r0580K1479
10035h0943n7227q04665m99607L46934J058768Q86788K47156j21660k75666r4771
10025F05107O9578j80034k34487k88062o37161l03779J23670j64613j95152J16207
10015a088726K05025j33482l12042p5456K86361L85913M06373L37621J93554j73445
10005C1696J18432j60508m34269J45211M62830P4237k98730O4953j01303k52338
9995c49789J65555j80369j12798L53427N8774j00116l13651l98307o7558K82076
9985f62756L13954o4368J03947K39184j23922j97965k86125P6088J80317J50098
$$ plain form
9975 -271548 -869662 -1349500 -915360 -616495 -493382 -163022 -362766 -795685 -728884 -814726
9965 -814726 -668654 -667164 -925912 -699897 21595 231331 -181816 -572874 -505264 -395699
9955 -395699 -151623 -27000 -219242 -374515 6061 300802 304314 160495 -58269 56530
9945 56530 -189699 -447689 -572984 -531193 -891772 -1090307 -1243989 -1295125 -1109535 -876295
9935 -876295 -941969 -938769 -929883 -822740 -795394 -1144082 -1326606 -734265 -552968 -1111504 -1458336
9924 -1458336 -1353257 -1219572 -958792 -727461 -710817 -816414 -741948 -560297 -834101 -1228173
9914 -1228173 -1373870 -1285604 -1478841 -1856786 -1882900 -1437887 -1102114 -1005311 -1116794 -1257869
9904 -1257869 -1631951 -2169797 -1983614 -1504706 -919324 -487886 193413 877921 710443 132358
$$ packed form
9975b71548n98114m79838M34140K98865J23113L30360j99744m32919O6801q5842
9965h14726J46072J490k58748K26015P21492K09736m13147l91058O7610J09565
9955c95699K44076J24623j92242j55273L80576K94741L512j43819k18764J14799
9945E6530k46229k57990j25295M1791l60579j98535j53682n1136J85590K33240
9935h76295o5674L200Q886J07143K7346l48688j82524N92341J81297n58536l46832
9924a458336J05079J33685K60780K31331J6644j05597P4466J81651k73804l94072
9914a228173j45697Q8266j93237l77945k6114M45013L35773R6803j11483j41075
9904a257869l74082n37846J86183M78908N85382M31438O81299O84508j67478n78085
$$ plain form
9894 132358 -309524 -822268 -1209539 -1219375 -825950 -590715 -379224 -200982 204676 285064
9884 285064 272453 311945 352530 457778 239199 -161594 -193780 -172578 -362352 -351378 -224559
9873 -224559 -127732 -84827 -163872 -576606 -948311 -709454 -181011 391548 800486 730086
9863 730086 288225 -424591 -528664 -58572 51712 114115 398609 597216 647004 396092
9853 396092 -57982 -89705 -136823 -158673 -210289 -545241 -500632 -333585 -597337 -574479 -163427
9842 -163427 -46402 186325 291202 209420 293127 12158 -441059 -578675 -575058 -645638 -547900
9831 -547900 -378445 -150662 -250927 -580954 -782808 -493317 -298876 -592371 -703298 -557198
$$ packed form
9894A32358m41882n12744l87271r836L93425K35235K11491J78242M05658Q0388
9884B85064j2611L9492M0585J05248k18579m00793l2186K1202j89774J0974J26819
9873b24559R6827M2905p9045m12734l71705K38857N28443N72559M08938p0400
9863G30086m41861p12816j04073M70092J10284O2403K84494J98607M9788k50912
9853C96092m54074l1723m7118k1850n1616l34952M4609J67047k63752K2858M11052
9842a63427J17025K32727J04877q1782Q3707k80969m53217j37616L617p0580R7738
9831e47900J69455K27783j00265l30027k01854K89491J94441k93495j10927J46100
$$ [...]
##END NTUPLES=NMR SPECTRUM
##END=
