##TITLE=C13_SRR167_C2TFA
 CDCl3, 22700 sc

 5.9.2023
##JCAMPDX= 6.0         $$ Bruker NMR JCAMP-DX V2.0
##DATA TYPE= NMR SPECTRUM
##DATA CLASS= NTUPLES
##ORIGIN= UXNMR, Bruker Analytische Messtechnik GmbH
##OWNER= root
$$ XWIN-NMR		Version 3.5
$$ Wed Sep  6 13:44:47 2023 Russian Standard Time (UT+4h)  she@DPX200
##.OBSERVE FREQUENCY= 50.327896
##.OBSERVE NUCLEUS= ^13C
##.ACQUISITION MODE= SIMULTANEOUS
##.ACQUISITION SCHEME= undefined
##.AVERAGES= 22701
##.DIGITISER RES= 17
##SPECTROMETER/DATA SYSTEM= spect
##.PULSE SEQUENCE= zgpg30
##.SOLVENT NAME= DMSO
##.SHIFT REFERENCE= (INTERNAL, DMSO, 0, 222.624)
##AUDIT TRAIL= $$ (NUMBER, WHEN, WHO, WHERE, WHAT)
$$ ##TITLE= Audit trail, XWIN-NMR		Version 3.5
$$ ##JCAMPDX= 5.01
$$ ##ORIGIN= Bruker BioSpin GmbH
$$ ##OWNER= she
$$ F:/spectra/data/she/nmr/c13/1/pdata/1/auditp.txt
$$ ##AUDIT TRAIL=  $$ (NUMBER, WHEN, WHO, WHERE, WHAT)
(   1,<2023-09-06 13:41:41.14 +0400>,<she>,<DPX200>,
      <created by zg, POWCHK disabled, PULCHK disabled
       terminated by command 'halt'
       configuration hash MD5:
       00 E9 B6 7A A2 85 ED C7 34 08 36 98 17 FE 4E 26
       data hash MD5: 32K
       84 56 94 CC 52 A1 1B E0 36 46 49 F6 44 88 20 CE>)
(   2,<2023-09-06 13:41:47.32 +0400>,<she>,<DPX200>,
      <Start of raw data processing
       efp BC_mod = 2 LB = 2 FT_mod = 6 PKNL = 1 PHC0 = -370.0263 PHC1 = 29.33753 SI = 32K 
       data hash MD5: 32K
       5B 6B E9 0D B2 57 7A 03 6C 1B DC FE 6F A9 A0 5A>)
(   3,<2023-09-06 13:41:54.06 +0400>,<she>,<DPX200>,
      <abs ABSG = 5 
       data hash MD5: 32K
       08 0B B4 28 74 5A A8 68 F9 B6 46 08 A6 8A 4E 61>)
(   4,<2023-09-06 13:42:23.67 +0400>,<she>,<DPX200>,
      <pk PHC0 = -5.894213 PHC1 = 8.599999 
       data hash MD5: 32K
       90 CF F4 E7 AD 4D EB F8 C4 A2 80 6E D1 07 FD 2B>)
(   5,<2023-09-06 13:42:26.78 +0400>,<she>,<DPX200>,
      <abs ABSG = 5 
       data hash MD5: 32K
       B2 F1 27 F5 3C 7E D8 13 FA 8E 67 57 7D 64 80 5B>)
(   6,<2023-09-06 13:43:24.26 +0400>,<she>,<DPX200>,
      <pk PHC0 = -10.36906 PHC1 = 18.4 
       data hash MD5: 32K
       72 1B 08 F9 A8 CD 65 71 F6 6D 9E AD 1A 63 25 EA>)
(   7,<2023-09-06 13:43:47.96 +0400>,<she>,<DPX200>,
      <pk PHC0 = 11.66441 PHC1 = -21.2 
       data hash MD5: 32K
       0D D9 B1 17 F4 A6 EE E4 40 31 51 62 52 1D 05 0F>)
(   8,<2023-09-06 13:43:51.87 +0400>,<she>,<DPX200>,
      <abs ABSG = 5 
       data hash MD5: 32K
       C6 57 53 F6 39 3B EE 37 AD 74 03 16 23 C8 1D E2>)
$$ ##END=
$$ 
$$ hash MD5
$$ F1 C3 BB 51 13 0F 7E A8 42 CE 01 CD 18 EE 62 E6
##$RELAX= 
##$RELAX= 
##$RELAX= 
##$RELAX= 
##$RELAX= 
##$RELAX= 
##$RELAX= 
##$RELAX= 
$$ Bruker specific parameters
$$ --------------------------
##$DU= <F:/spectra>
##$EXPNO= 1
##$NAME= <c13>
##$PROCNO= 1
##$TYPE= <nmr>
##$USER= <she>
##$AMP= (0..31)
100 100 100 100 100 100 100 100 100 100 100 100 100 100 100 100 100 100 
100 100 100 100 100 100 100 100 100 100 100 100 100 100 
##$AQSEQ= 0
##$AQ_mod= 1
##$AUNM= <au_zg>
##$AUTOPOS= <>
##$BF1= 50.322709
$$ [...]
##$SUBNAM4= <"">
##$SUBNAM5= <"">
##$SUBNAM6= <"">
##$SUBNAM7= <"">
##$SUBNAM8= <"">
##$SUBNAM9= <"">
##$SW= 239.972175391363
##$SWIBOX= (0..15)
0 1 3 0 0 0 0 0 0 0 0 0 0 0 0 0 
##$SW_h= 12077.2946859903
##$TD= 32768
##$TD0= 1
##$TE= 0
##$TE2= 300
##$TE3= 300
##$TEG= 300
##$TL= (0..7)
120 120 120 120 120 120 120 120 
##$TP= (0..7)
150 150 150 150 150 150 150 150 
##$TP07= 0
##$TPNAME0= <>
##$TPNAME1= <>
##$TPNAME2= <>
##$TPNAME3= <>
##$TPNAME4= <>
##$TPNAME5= <>
##$TPNAME6= <>
##$TPNAME7= <>
##$TPOAL= (0..7)
0.5 0.5 0.5 0.5 0.5 0.5 0.5 0.5 
##$TPOFFS= (0..7)
0 0 0 0 0 0 0 0 
##$TUNHIN= 0
##$TUNHOUT= 0
##$TUNXOUT= 0
##$USERA1= <user>
##$USERA2= <user>
##$USERA3= <user>
##$USERA4= <user>
##$USERA5= <user>
##$V9= 5
##$VALIST= <valist>
##$VCLIST= <CCCCCCCCCCCCCCC>
##$VD= 0
##$VDLIST= <DDDDDDDDDDDDDDD>
##$VPLIST= <PPPPPPPPPPPPPPP>
##$VTLIST= <TTTTTTTTTTTTTTT>
##$WBST= 1024
##$WBSW= 4
##$XGAIN= (0..3)
0 0 0 0 
##$XL= 0
##$YL= 0
##$YMAX_a= 109114113
##$YMIN_a= -78630603
##$ZGOPTNS= <>
##$ZL1= 120
##$ZL2= 120
##$ZL3= 120
##$ZL4= 120
##$ABSF1= 222.624
##$ABSF2= -17.3728
##$ABSG= 5
##$ABSL= 3
##$ALPHA= 0
##$AQORDER= 0
##$ASSFAC= 0
##$ASSFACI= 0
##$ASSFACX= 0
##$ASSWID= 0
##$AUNMP= <proc_1d>
##$AZFE= 0.1
##$AZFW= 0.5
##$BCFW= 0
##$BC_mod= 2
##$BYTORDP= 0
##$COROFFS= 0
##$CY= -3
##$DATMOD= 1
##$DC= 0
##$DFILT= <>
##$DTYPP= 0
##$F1P= 0
##$F2P= 0
##$FCOR= 0.5
##$FTSIZE= 32768
##$FT_mod= 6
##$GAMMA= 0
##$GB= 0
##$INTBC= 1
##$INTSCL= 4.134877e-10
##$ISEN= 128
##$LB= 2
##$LEV0= 0
##$LPBIN= 0
##$MAXI= 10000
##$MC2= 0
##$MEAN= 0
##$ME_mod= 0
##$MI= 0.1934396
##$NCOEF= 0
##$NC_proc= 2
##$NLEV= 6
##$NOISF1= 120.0001
##$NOISF2= 80.00006
##$NSP= 0
##$NTH_PI= 0
##$NZP= 0
##$OFFSET= 222.624
##$PC= 1.4
##$PHC0= -374.6252
##$PHC1= 35.13753
##$PH_mod= 1
##$PKNL= yes
##$PPARMOD= 0
##$PSCAL= 0
##$PSIGN= 0
##$REVERSE= no
##$SF= 50.3227315983092
##$SI= 32768
##$SIGF1= 140
##$SIGF2= 120
##$SINO= 11.81781
##$SIOLD= 32768
##$SREGLST= <13C.CDCl3>
##$SSB= 0
##$STSI= 32768
##$STSR= 0
##$SW_p= 12077.2946859903
##$SYMM= 0
##$S_DEV= 0
##$TDeff= 32768
##$TDoff= 0
##$TI= <>
##$TILT= no
##$TM1= 0
##$TM2= 0
##$TOPLEV= 0
##$USERP1= <user>
##$USERP2= <user>
##$USERP3= <user>
##$USERP4= <user>
##$USERP5= <user>
##$WDW= 1
##$XDIM= 32768
##$YMAX_p= 347164516
##$YMIN_p= -13714680
$$ End of Bruker specific parameters
$$ ---------------------------------
##NTUPLES= NMR SPECTRUM
##VAR_NAME=  FREQUENCY,     SPECTRUM/REAL,   SPECTRUM/IMAG
##SYMBOL=    X,             R,               I
##VAR_TYPE=  INDEPENDENT,   DEPENDENT,       DEPENDENT
##VAR_FORM=  AFFN,          ASDF,            ASDF
##VAR_DIM=   32768,         32768,           32768
##UNITS=     HZ,            ARBITRARY UNITS, ARBITRARY UNITS
##FACTOR=    0.368581032318806, 1,           1
##FIRST=     11203.0474430531, 0,            0
##LAST=      -874.247242937185, 0,           0
##MIN=       -874.247242937185, -13714680,   0
##MAX=       11203.0474430531, 347164516,    0
$$ Real data points
##PAGE= N=1
##DATA TABLE= (X++(R..R)), XYDATA
$$ [...]
$$ plain form
15890 -167767 -94126 -183567 -358812 -462907 -460652 -342970 -104594 173574 369833 453540
15880 453540 521025 652391 810982 818860 511628 -23783 -491577 -691212 -685555 -610560 -479360
15869 -479360 -306638 -174335 -186289 -349562 -456877 -332689 -55946 162544 271005 409402
15859 409402 607316 736915 756192 713124 640723 533621 365449 197081 92398 -19901
15849 -19901 -175038 -268761 -154376 157252 457665 539700 362485 123925 47513 117883
15839 117883 176755 145651 92319 173240 383756 593454 739917 802716 797764 805240 863295
15828 863295 955754 1039774 1086119 1072547 952767 697371 391981 137203 -7847 37715
15818 37715 191715 271003 205491 51184 -57724 -52582 -5317 17623 8945 -52528 -151146
$$ packed form
15890a67767P3641q9441j75245j04095K255J17682K38376K78168J96259Q3707
15880D53540O7485J31366J58591P878l07232n35411m67794j99635N657P4995J31200
15869d79360J72722J32303j1954j63273j07315J24188K76743K18490J08461J38397
15859D09402J97914J29599J9277m3068p2401j07102j68172j68368j04683j12299
15849a9901j55137r3723J14385L11628L00413Q2035j77215k38560p6412P0370
15839A17883N8872l1104n3332Q0921K10516K09698J46463O2799m952P476N8055
15828H63295R2459Q4020M6345j3572j19780k55396l05390k54778j45050M5562
15818C7715J54000P9288o5512j54307j08908N142M7265K2940q678o1473r8618
$$ plain form
15807 -151146 -206227 -186296 -121868 -25118 84231 153978 197272 227588 189914 376 -295461
15796 -295461 -537663 -661956 -708394 -737882 -784523 -827272 -789940 -651770 -501635 -424539 -462611
15785 -462611 -600541 -743275 -750967 -566436 -269401 10137 172089 170928 79323 27327 39975
15774 39975 16908 -45305 -52593 -44503 -100396 -165283 -190170 -158767 -84088 -54524 -146734 -392706
15762 -392706 -644803 -722292 -632082 -438403 -197711 24563 176582 279449 305589 217645
15752 217645 176171 336731 604392 788099 834185 814364 737498 611861 477703 362143
15742 362143 262552 100769 -141215 -278617 -146895 152632 343704 182179 -291241 -785007
15732 -785007 -1107654 -1249509 -1253321 -1197250 -1104640 -994503 -945756 -992021 -1107981 -1247844 -1320426
$$ packed form
15807a51146n5081J9931O4428R6750J09349O9747M3294L0316l7674j89538k95837
15796b95461k42202j24293m6438k9488m6641m2749L7332J38170J50135P7096l8072
15785d62611j37930j42734p692J84531K97035K79538J61952j161r1605n1996J2648
15774C9975k3067o2213p288Q090n5893o4887k4887L1403P4679K9564r2210k45972
15762c92706k52097p7489R0210J93679K40692K22274J52019J02867K6140q7944
15752B17645m1474J60560K67661J83707M6086j9821p6866j25637j34158j15560
15742C62143r9591j61783k41984j37402J31722K99527J91072j61525m73420m93766
15732g85007l22647j41855l812N6071R2610J10137M8747m6265j15960j39863p2582
$$ plain form
15721 -1320426 -1190092 -846435 -417874 -43644 157576 193791 164646 90826 10560 -59343
15711 -59343 -95015 -11588 164400 386768 590695 586778 360095 153589 164030 355068 567822
15700 567822 701326 700016 576054 386495 138660 -106221 -257358 -387190 -555438 -669270
15690 -669270 -640240 -480866 -270394 -42076 185728 367811 503247 623052 668591 593351
15680 593351 475844 388247 327306 281315 205674 6661 -278685 -537696 -798966 -1068676
15670 -1068676 -1159560 -982044 -710222 -459618 -199540 45677 250702 408223 499931 550896
15660 550896 560625 515703 428332 300157 102511 -190357 -492475 -698310 -820791 -884004
15650 -884004 -820355 -583401 -307903 -196510 -248752 -303642 -278904 -206179 -116747 -31780 -31713
$$ packed form
15721a320426J30334L43657M28561L74230K01220L6215k9145p3820q0266o9903
15711e9343l5672Q3427J75988K22368K03927l917k26683k06506J0441J91038K12754
15700E67822J33504j310j23962j89559k47835k44881j51137j29832j68248j13832
15690f69270K9030J59374K10472K28318K27804J82083J35436J19805M5539p5240
15680E93351j17507q7597o0941m5991p5641j99013k85346k59011k61270k69710
15670a068676r0884J77516K71822K50604K60078K45217K05025J57521R1708N0965
15660E50896R729m4922q7371j28175j97646k92868l02118k05835j22481o3213
15650h84004O3649K36954K75498J11393n2242n4890K4738P2725Q9432Q4967O7
$$ plain form
15639 -31713 -122827 -228906 -343684 -543905 -829093 -1038904 -1092558 -1056219 -932403 -759041
15629 -759041 -596639 -417774 -233957 -123747 -78506 -22279 12049 -73355 -274587 -454053
15619 -454053 -491551 -370648 -164208 73298 302904 474545 579249 607956 565919 518217
15609 518217 489404 468982 468198 469760 468940 505359 587513 653907 666928 618943 435847 165410
15597 165410 -67567 -240740 -416912 -642547 -840026 -940054 -958486 -877620 -648432 -347114
15587 -347114 -86651 66792 50474 -108830 -361482 -636590 -785818 -762387 -633741 -474267
15577 -474267 -291396 -91543 2200 -75725 -218480 -340396 -467397 -617005 -672465 -508062
15567 -508062 -166879 232923 566142 761239 820941 773044 644041 453694 207447 -84914
$$ packed form
15639c1713r1114j06079j14778k00221k85188k09811n3654L6339J23816J73362
15629g59041J62402J78865J83817J10210M5241N6227L4328q5404k01232j79466
15619d54053l7498J20903K06440K37506K29606J71641J04704K8707m2037m7702
15609E18217k8813k0422p84J562q20L6419Q2154O6394J3021m7985j83096k70437
15597A65410k32977j73173j76172k25635j97479j00028j8432Q0866K29188L01318
15587c47114K60463J53443j6318j59304k52652k75108j49228K3431J28646J59474
15577d74267J82871J99853R3743p7925j42755j21916j27001j49608n5460J64403
15567e08062L41183L99802L33219J95097N9702m7897j29003j90347k46247k92361
$$ plain form
15557 -84914 -341397 -385418 -139683 222097 494263 622542 621953 563110 533550 554036 579103
15546 579103 483652 210410 -148756 -517336 -790186 -816728 -609055 -359085 -234407 -265269
15536 -265269 -359460 -415535 -427965 -386189 -306510 -200349 39605 326425 458436 401643 238775
15525 238775 58612 -75127 -87481 29668 202953 331688 362343 384698 528276 759534
15515 759534 913749 875564 651757 370980 117019 -178360 -486958 -593988 -426741 -137205
15505 -137205 154655 379327 491136 453614 230326 -104748 -413575 -606706 -673475 -620847
15495 -620847 -475979 -337734 -282560 -333065 -458007 -525344 -428442 -170512 147910 388332
15485 388332 503151 554234 574668 564374 545080 482084 352756 209365 72306 -43248
$$ packed form
15557h4914k56483m4021K45735L61780K72166J28279n89n8843k9560K0486K5067
15546E79103r5451k73242l59166l68580k72850k6542K07673K49970J24678l0862
15536b65269r4191n6075j2430M1776P9679J06161K39954K86820J32011n6793j62868
15525B38775j80163j33739j2354J17149J73285J28735L0655K2355J43578K31258
15515G59534J54215l8185k23807k80777k53961k95379l08598j07030J67247K89536
15505a37205K91860K24672J11809l7522k23288l35074l08827j93131o6769N2628
15495f20847J44868J38245N5174n0505j24942o7337R6902K57930L18422K40422
15485C88332J14819N1083K0434j0294j9294o2996j29328j43391j37059j15554
$$ plain form
15475 -43248 -150802 -288633 -417570 -480378 -475423 -440164 -419303 -443840 -533647 -714920 -944809
15464 -944809 -1091901 -1083470 -954916 -765908 -597057 -483947 -338574 -147027 -42303 -100478
15454 -100478 -286899 -535692 -776931 -952031 -1028289 -968220 -781438 -536639 -311809 -134924
15444 -134924 32684 155334 172399 103067 -64306 -326298 -541643 -612379 -553937 -410972
15434 -410972 -187199 2851 -8797 -168642 -361168 -586848 -772641 -775668 -596487 -403271
15424 -403271 -342856 -459541 -667440 -754031 -617933 -316389 1360 165937 57371 -311355
15414 -311355 -779283 -1096658 -1111865 -908392 -714752 -650998 -674043 -758414 -861696 -949017
15404 -949017 -1007217 -1047811 -1111977 -1196061 -1271789 -1315418 -1363972 -1395149 -1359156 -1343560 -1443440
$$ packed form
15475d3248j07554j37831j28937o2808M955L5259K0861k4537q9807j81273k29889
15464i44809j47092Q431J28554J89008J68851J13110J45373J91547J04724n8175
15454a00478j86421k48793k41239j75100p6258O0069J86782K44799K24830J76885
15444a34924J67608J22650J7065o9332j67373k61992k15345p0736N8442J42965
15434d10972K23773J90050j1648j59845j92526k25680j85793l027J79181J93216
15424d03271O0415j16685k07899q6591J36098L01544L17749J64577j08566l68726
15414c11355m67928l17375j5207K03473J93640O3754k3045q4371j03282q7321
15404i49017n8200m0594o4166q4084p5728m3629m8554l1177L5993J5596r9880
$$ plain form
15393 -1443440 -1629904 -1810597 -1874271 -1752859 -1543167 -1352662 -1207077 -1168594 -1299462 -1588313
15383 -1588313 -1902196 -2107911 -2082839 -1784668 -1395113 -1157211 -1140646 -1230616 -1294924 -1353047
15373 -1353047 -1432624 -1495126 -1493456 -1346522 -1063419 -801228 -680025 -663680 -712785 -757282 -694216
15362 -694216 -543043 -382268 -287601 -232657 -139497 -37730 47213 137987 236327 325664 400988
15351 400988 419003 335573 143518 -129597 -405050 -608204 -702176 -706024 -642155 -541835 -447664
15340 -447664 -352134 -220538 -59995 44510 -15366 -212455 -377505 -378328 -257627 -143407
15330 -143407 -99309 -153311 -276438 -382580 -430408 -425768 -358242 -279851 -238958 -190608 -114032
15319 -114032 -83003 -158943 -297394 -425871 -532027 -695493 -868383 -911212 -849255 -754266
$$ packed form
15393a443440j86464j80693o3674J21412K09692J90505J45585L8483j30868k88851
15383a588313l13883k05715K5072K98171L89555K37902J6565q9970o4308n8123
15373a353047p9577o2502J670J46934K83103K62191J21203J6345m9105m4497O3066
15362f94216J51173J60775R4667N4944R3160J01767Q4943R0774R8340Q9337P5324
15351D00988J8015q3430j92055k73115k75453k03154r3972l848O3869J00320R4171
15340d47664R5530J31596J60543J04505n9876j97089j65050q23J20701J14220
15330a43407M4098n4002j23127j06142m7828M640O7526P8391M0893M8350P6576
15319a14032L1029p5940j38451j28477j06156j63466j72890m2829O1957R4989
$$ plain form
15309 -754266 -597438 -381359 -164882 37864 232068 407126 558214 707467 822293 860719
15299 860719 772805 595591 459684 362748 207683 -13994 -251052 -501747 -797895 -1090182
15289 -1090182 -1259195 -1229388 -1017500 -707572 -415015 -156089 131117 416532 550114 464678
15279 464678 265130 61767 -148170 -375000 -540001 -550701 -391127 -119821 162688 334368
15269 334368 378961 336720 261757 203944 100461 -127756 -401989 -653166 -878425 -1007739
15259 -1007739 -908226 -587441 -286083 -146094 -58634 103902 292648 434160 575081 728622
15249 728622 750336 561525 291291 90288 -8224 -29521 -21604 -19121 -33502 -43550 -37618
15238 -37618 -44234 -128057 -253082 -341072 -485938 -745972 -921057 -840914 -636299 -432635 -237455
$$ packed form
15309g54266J56828K16079K16477K02746J94204J75058J51088J49253J14826L8426
15299H60719q7914j77214j35907r6936j55065k21677k37058k50695k96148k92287
15289a090182j69013K9807K11888L09928K92557K58926K87206K85415J33582q5436
15279D64678j99548k03363k09937k26830j65001j0700J59574K71306K82509J71680
15269C34368M4593m2241p4963n7813j03483k28217k74233k51177k25259j29314
15259a007739R9513L20785L01358J39989Q7460J62536J88746J41512J40921J53541
15249G28622K1714j88811k70234k01003r8512k1297P917K483j4381j0048N932
15238c7618o616q3823j25025q7990j44866k60034j75085Q0143K04615K03664J95180
$$ plain form
15227 -237455 -23020 193482 331612 312734 164463 -13879 -158616 -248990 -355684 -516207
15217 -516207 -597122 -512446 -370591 -241951 -83137 70080 131762 91966 -14513 -148998
15207 -148998 -259850 -303400 -239774 -64971 149586 265917 221320 65467 -127379 -254659
15197 -254659 -313943 -393121 -552192 -786348 -1018293 -1157605 -1187265 -1128492 -1051298 -974196 -808638
15186 -808638 -566610 -355836 -199161 -69320 33012 91624 48345 -147715 -491831 -820929
15176 -820929 -978836 -999778 -1017696 -1113829 -1274601 -1447272 -1558636 -1590904 -1564510 -1462186
15166 -1462186 -1335483 -1241857 -1141104 -1010956 -856213 -710969 -623947 -584520 -562782 -554760
15156 -554760 -554264 -537172 -518121 -502665 -457647 -318975 -82656 118588 139074 -50282 -318885
$$ packed form
15227b37455K14435K16502J38130j8878j48271j78342j44737r0374j06694j60523
15217e16207q0915Q4676J41855J28640J58814J53217O1682l9796j06479j34485
15207a48998j10852m3550O3626J74803K14557J16331m4597j55853j92846j27280
15197b54659n9284p9178j59071k34156k31945j39312k9660N8773P7194P7102J65558
15186h08638K42028K10774J56675J29841J02332N8612m3279j96060l44116l29098
15176h20929j57907k0942j7918r6133j60772j72671j11364l2268K6394J02324
15166a462186J26703R3626J00753J30148J54743J45244Q7022L9427K1738Q022
15156e54760M96J7092J9051J5456M5018J38672K36319K01244K0486j89356k68603
$$ plain form
15145 -318885 -472100 -433624 -283733 -133981 -23935 81064 216889 353584 439013 479625
15135 479625 521955 539417 484498 417689 477185 710044 1019093 1255962 1265576 1015398 617462
15124 617462 179648 -215451 -414807 -373468 -196050 9493 176908 251433 236583 183163
15114 183163 135586 200898 342478 412245 356261 222547 121792 73483 37422 20335 8323
15103 8323 -41943 -127992 -89535 172866 493025 717020 876359 1052799 1274655 1477355
15093 1477355 1587606 1606396 1592474 1539719 1384537 1154591 940173 706632 372408 -17170
15083 -17170 -336398 -571370 -822656 -1033862 -1070952 -968735 -838880 -698806 -559806 -550974
15073 -550974 -671372 -710316 -566985 -398273 -307896 -274190 -305293 -368017 -409877 -465119 -596860
$$ packed form
15145c18885j53215L8476J49891J49752J10046J04999J35825J36695Q5429M0612
15135D79625M2330J7462n4919o6809N9496K32859L09049K36869R614k50178l97936
15124F17462m37814l95099j99356M1339J77418K05543J67415P4525j4850n3420
15114A83163m7577O5312J41580O9767n5984j33714j00755m8309l6061j7087j2012
15103H323n0266q6049L8457K62401L20159K23995J59339J76440K21856K02700
15093A477355J10251J8790j3922n2755j55182k29946k14418k33541l34224l89578
15083a7170l19228k34972k51286k11206l7090J02217J29855J40074J39000Q832
15073e50974j20398l8944J43331J68712R0377L3706l1103o2724m1860n5242j31741
$$ plain form
15062 -596860 -744051 -863281 -913288 -866567 -772760 -671580 -523282 -288488 -89314 -23370
15052 -23370 -69723 -185238 -280956 -273014 -195235 -92867 53952 223953 292238 201319 40653
15041 40653 -81948 -202533 -437573 -665383 -736769 -758635 -825250 -903892 -973523 -1033034 -1101439
15030 -1101439 -1178342 -1228336 -1185673 -1060933 -938802 -883845 -844448 -721013 -481792 -186876
15020 -186876 50111 180100 216894 168873 56242 -53566 -117153 -148128 -198882 -323620
15010 -323620 -454633 -522525 -569462 -545318 -395225 -190297 30096 252835 417808 451023
15000 451023 294497 62930 -42157 -20157 59233 166631 213358 160455 55038 -47481
14990 -47481 -144404 -252277 -363638 -446571 -455509 -429529 -475560 -552776 -543255 -479733 -480055 -590586
$$ packed form
15062e96860j47191j19230n0007M6721R3807J01180J48298K34794J99174O5944
15052b3370m6353j15515r5718P942P7779J02368J46819J70001O8285r0919j60666
15041D0653j22601j20585k35040k27810p1386k1866o6615p8642o9631n9511o8405
15030a101439p6903m9994M2663J24740J22131N4957L9397J23435K39221K94916
15020a86876K36987J29989L6794m8021j12631j09808o3587l0975n0754j24738
15010c23620j31013o7892m6937K4144J50093K04928K20393K22739J64973L3215
15000D51023j56526k31567j05087K2000P9390J07398M6727n2903j05417j02519
14990d7481r6923j07873j11361q2933q938K5980m6031p7216R521O3522l22j10531
$$ plain form
14978 -590586 -765021 -865471 -856764 -831315 -781969 -647487 -441601 -247839 -98250 8712
14968 8712 85560 146795 207351 327174 527398 651459 616984 589629 688419 875917 1066073
14957 1066073 1110942 916512 541608 150309 -115130 -233632 -225170 -95134 119102 386368
14947 386368 708639 1009481 1162452 1112881 925943 778070 809308 922991 934316 808307
14937 808307 616293 425913 272014 206160 238979 284246 271309 200442 156003 230793 270110
14926 270110 114679 -123030 -195860 -73176 69516 166319 191650 131879 60104 56325 135037
14915 135037 228903 271040 290248 320649 290684 228374 262931 434264 601198 573556 414057
14904 414057 361064 503748 764186 1007250 1020669 771187 421327 65751 -244982 -409085
$$ packed form
14978e90586j74435j00450Q707K5449M9346J34482K05886J93762J49589J06962
14968H712P6848O1235O0556J19823K00224J24061l4475k7355R8790J87498J90156
14957A066073M4869j94430l74904l91299k65439j18502Q462J30036K14236K67266
14947C86368L22271L00842J52971m9571j86938j47873L1238J13683J1325j26009
14937H08307j92014j90380j53899o5854L2819M5267j2937p0867m4439P4790L9317
14926B70110j55431k37709p2830J22684J42692R6803K5331n9771p1775l779P8712
14915A35037R3866M2137J9208L0401k9965o2310L4557J71333J66934k7642j59499
14904D14057n2993J42684K60438K43064J3419k49482l49860l55576l10733j64103
$$ plain form
14894 -409085 -412849 -402700 -460288 -521916 -523924 -464396 -415533 -421896 -495391 -612399 -715618 -742251
14882 -742251 -692865 -666459 -766403 -945066 -1036816 -1009822 -1002298 -1090764 -1274225 -1490236 -1616699
14871 -1616699 -1641770 -1607341 -1455507 -1139281 -680325 -107463 392900 597511 518060 375155
14861 375155 280794 212143 143960 78634 34102 30354 68707 175365 370531 638699 879651
14850 879651 932313 722398 328804 -11797 -137318 -128435 -108309 -131688 -185189 -189628 -41811
14839 -41811 196005 368525 458773 457330 401700 400263 465295 453821 296112 112507 5039
14828 5039 10009 65774 127015 229830 329705 377316 395467 393435 326207 190687 61477 8931
14816 8931 46003 123741 69725 -170495 -370712 -390692 -331295 -340580 -455693 -647438 -863439
$$ packed form
14894d09085l764J0149n7588o1628k008N9528M8863o363p3495j17008j03219k6633
14882g42251M9386K6406r9944j78663r1750K6994P524q8466j83461k16011j26463
14871a616699k5071L4429J51834L16226M58956N72862N00363K04611p9451j42905
14861C75155r4361o8651o8183o5326m4532l748L8353J06658J95166K68168K40952
14850H79651N2662k09915l93594l40601j25521Q883K0126k3379n3501m439J47817
14839d1811K37816J72520R0248j443n5630j437O5032j1474j57709j83605j07468
14828E039M970N5765O1241J02815R9875M7611J8151k032o7228j35520j29210n2546
14816H931L7072P7738n4016k40220k00217j9980N9397r285j15113j91745k16001
$$ plain form
14805 -863439 -1080628 -1246784 -1246064 -1097147 -948446 -830830 -672205 -452553 -237706 -113077
14795 -113077 -72036 -108514 -260880 -484446 -726848 -922695 -935116 -774459 -536450 -247685
14785 -247685 50596 278731 368821 294713 135615 -9292 -139165 -187351 -75452 120330
14775 120330 268310 355366 421936 519336 649050 768737 934805 1164763 1328044 1321759
14765 1321759 1245225 1228812 1243878 1165005 916355 573185 319312 231441 257226 349544 496719
14754 496719 652733 764317 814477 759297 626139 535409 546460 626168 701284 687719 536914
14743 536914 269072 1594 -135133 -137072 -91638 -28989 100786 302174 503580 687287
14733 687287 945954 1222929 1350436 1280763 1061126 792594 574049 414830 325650 260825
$$ packed form
14805h63439k17189j66156P20J48917J48701J17616J58625K19652K14847J24629
14795a13077M1041l6478j52366k23566k42402j95847j2421J60657K38009K88765
14785b47685K98281K28135R0090p4108j59098j44907j29873m8186J11899J95782
14775A20330J47980Q7056O6570R7400J29714J19687J66068K29958J63281o285
14765A321759p6534j6413J5066p8873k48650l43170k53873q7871K5785R2318J47175
14754D96719J56014J11584N0160n5180j33158r0730J1051P9708P5116j3565j50805
14743E36914k67842k67478j36727j939M5434O2649J29775K01388K01406J83707
14733F87287K58667K76975J27507o9673k19637k68532k18545j59219q9180o4825
$$ plain form
14723 260825 152049 96308 150631 238943 289876 206466 25081 -125394 -199372 -135958 40753
14712 40753 136783 41038 -141273 -239967 -194431 -106567 -87272 -125725 -218413 -400138 -650065
14701 -650065 -872376 -940408 -828930 -687310 -704265 -874068 -968344 -864179 -613315 -334309
14691 -334309 -128692 -20326 46454 131165 191848 169095 72978 -41002 -92319 -71478 -22087
14680 -22087 56569 137655 186079 201354 202778 211022 142279 -10017 -114961 -156922 -202633 -212684
14668 -212684 -148798 -72825 -36491 -26474 19509 117971 238673 320434 260090 46828 -188122
14657 -188122 -328642 -331440 -234474 -91890 63485 182882 305929 459099 543027 502298
14647 502298 407106 338354 351965 411716 431859 396654 281776 96543 -73894 -142173 -67288
$$ packed form
14723B60825j08776n5741N4323Q8312N0933q3410j81385j50475p3978O3414J76711
14712D0753R6030r5745j82311r8694M5536Q7864J9295l8453r2688j81725k49927
14701f50065k22311o8032J11478J41620j6955j69803r4276J04165K50864K79006
14691c34309K05617J08366O6780Q4711O0683k2753r6117j13980n1317K0841M9391
14680b2087P8656Q1086M8424J5275J424Q244o8743j52296j04944m1961m5711j0051
14668b12684O3886P5973L6334J0017M5983R8462J20702Q1761o0344k13262k34950
14657a88122j40520k798R6966J42584J55375J19397J23047J53170Q3928m0729
14647E02298r5192o8752J3611N9751K0143l5205j14878j85233j70437o8279P4885
$$ plain form
14636 -67288 86211 232349 338373 376461 357242 361132 445719 574706 604066 471543 233107
14625 233107 24256 3634 130383 274181 399187 491207 553535 617784 641362 518885
14615 518885 259058 10454 -154995 -304613 -432121 -475882 -453559 -430568 -438846 -430650 -367489
14604 -367489 -257206 -114383 22811 91880 44690 -83414 -216263 -264116 -147624 47228
14594 47228 153981 154343 164502 245446 297301 273690 229347 169952 117003 91728 47040 -19639
14582 -19639 -25663 16328 3324 -49679 -86557 -100095 -103160 -125377 -170821 -268694 -425296 -568774
14570 -568774 -646280 -677271 -675650 -572687 -351208 -156749 -52128 3493 13009 20465 48372
14559 48372 39864 2224 -36173 -120666 -235452 -332411 -404930 -361329 -158051 82232 287683
$$ packed form
14636f7288J53499J46138J06024L8088j9219L890Q4587J28987K9360j32523k38436
14625B33107k08851k0622J26749J43798J25006R2020O2328O4249K3578j22477
14615E18885k59827k48604j65449j49618j27508m3761K2323K2991q278Q196O3161
14604c67489J10283J42823J37194O9069m7190j28104j32849m7853J16492J94852
14594D7228J06753L62J0159Q0944N1855k3611m4343n9395n2949k5275m4688o6679
14582a9639o024M1991j3004n3003l6878j3538l065k2217m5444r7873j56602j43478
14570e68774p7506l0991J621J02963K21479J94459J04621N5621R516P456K7907
14559D8372q508l7640l8397q4493j14786r6959p2519M3601K03278K40283K05451
$$ plain form
14548 287683 476443 615472 672224 697897 694194 612075 446970 235338 31168 -167212
14538 -167212 -380387 -622425 -897456 -1162267 -1340276 -1385103 -1317515 -1205631 -1082535 -953332
14528 -953332 -841338 -782477 -731972 -586398 -336610 -159309 -157351 -229495 -248989 -154541 53763
14517 53763 321591 612894 865559 952515 786645 440063 50654 -241421 -361102 -324377
14507 -324377 -175412 5357 105705 58625 -55902 -150326 -237231 -331223 -423826 -497225 -499208
14496 -499208 -389156 -184584 36545 140813 95966 50533 124351 334810 591849 780844
14486 780844 878356 858052 653498 323179 606 -203139 -234572 -137589 19653 169885
14476 169885 314570 468519 582086 602057 556017 483288 395603 303973 205520 103287 10694
$$ packed form
14548B87683J88760J39029N6752K5673l703q2119j65105k11632k04170j98380
14538a67212k13175k42038k75031k64811j78009m4827O7588J11884J23096J29203
14528i53332J11994N8861N0505J45574K49788J77301J958p2144j9494R4448K08304
14517E3763K67828K91303K52665Q6956j65870l46582l89409k92075j19681L6725
14507c24377J48965J80769J00348m7080j14527r4424q6905r3992r2603p3399j983
14496d99208J10052K04572K21129J04268m4847m5433P3818K10459K57039J88995
14486G80844R7512k0304k04554l30319l22573k03745l1433R6983J57242J50232
14476A69885J44685J53949J13567J9971m6040p2729q7685r1630r8453j02233r2593
$$ plain form
14465 10694 -85648 -232244 -455298 -714009 -944018 -1085608 -1084732 -995554 -917188 -836463 -768679
14454 -768679 -761928 -771451 -732140 -631492 -441009 -222203 -77557 -56608 -115227 -84956 75305
14443 75305 307957 527829 605405 478711 178971 -130708 -263968 -230201 -200806 -260127
14433 -260127 -360726 -460148 -642246 -944620 -1241343 -1408141 -1390571 -1252020 -1132647 -1043978
14423 -1043978 -901260 -717512 -501495 -244004 -22913 69926 60949 65502 110180 169027 225304
14412 225304 206867 48654 -218076 -479238 -617438 -637309 -556932 -370517 -124736 55059
14402 55059 144118 284195 494004 584990 448016 236051 94635 12252 -16234 30524 80537
14391 80537 5020 -211837 -440646 -565550 -512310 -346056 -237560 -260107 -368638 -440517
$$ packed form
14465A0694r6342j46596k23054k58711k30009j41590Q76Q9178P8366Q0725O7784
14454g68679O751r523L9311J00648J90483K18806J44646K0949n8619L0271J60261
14443G5305K32652K19872P7576j26694k99740l09679j33260L3767K9395n9321
14433b60127j00599r9422j82098l02374k96723j66798J7570J38551J19373Q8669
14423a043978J42718J83748K16017K57491K21091R2839q977M553M4678N8847N6277
14412B25304j8437j58213k66730k61162j38200j9871Q0377J86415K45781J79795
14402E5059Q9059J40077K09809R0986j36974k11965j41416q2383k8486M6758N0013
14391H0537p5517k16857k28809j24904N3240J66254J08496k2547j08531p1879
$$ plain form
14381 -440517 -451289 -410021 -264074 -48950 128803 198210 226302 314019 440449 465600 284549
14370 284549 -65234 -443320 -687843 -731725 -635592 -518002 -467158 -485833 -480028 -385110 -275862
14359 -275862 -181051 -70563 51910 97878 -10537 -205296 -376942 -417795 -310549 -209165
14349 -209165 -276871 -468256 -639422 -689744 -621933 -568957 -511160 -294183 69683 362039
14339 362039 407090 238814 67874 36694 103625 131178 68070 56664 185915 264806 99884
14328 99884 -192857 -392944 -501728 -619105 -711977 -741979 -698630 -613847 -556911 -558621 -615796
14317 -615796 -673966 -720146 -840203 -1029476 -1200716 -1317006 -1338074 -1263519 -1118107 -924084
14307 -924084 -755576 -635876 -512533 -428202 -423681 -450469 -488922 -527335 -532179 -584141 -726619
$$ packed form
14381d40517j0772M1268J45947K15124J77753O9407K8092Q7717J26430K5151j81051
14370B84549l49783l78086k44523m3882R6133J17590N0844j8675N805R4918J09248
14359b75862R4811J10488J22473M5968j08415j94759j71646m0853J07246J01384
14349b09165o7706j91385j71166n0322O7811N2976N7797K16977L63866K92356
14339C62039M5051j68276j70940l1180O6931K7553o3108j1406J29251P8891j64922
14328I9884k92741k00087j08784j17377r2872l0002M3349Q4783N6936j710n7175
14317f15796n8170m6180j20057j89273j71240j16290k1068P4555J45412J94023
14307i24084J68508J19700J23343Q4331M521k6788l8453l8413m844n1962j42478
$$ plain form
14296 -726619 -826394 -797917 -710559 -655520 -703462 -811022 -915786 -966974 -884716 -676207 -397317
14285 -397317 -76977 230820 467725 608498 624564 553315 482527 450282 411977 334230 235026
14274 235026 127035 49486 49640 62096 17663 1485 113697 288807 411761 406690 234926
14263 234926 -64651 -369748 -583262 -689320 -736685 -786485 -830994 -874067 -955799 -1028252 -1038604
14252 -1038604 -1039379 -1088562 -1150719 -1153722 -1115499 -1049834 -944944 -792671 -636296 -552713 -560951
14241 -560951 -603219 -626767 -617457 -554784 -446440 -316359 -206907 -138391 -104507 -78035 -62220
14230 -62220 -116492 -252859 -428029 -581684 -687895 -759743 -789568 -744546 -676369 -616793 -556798
14219 -556798 -514121 -513663 -551148 -542679 -454600 -328009 -199312 -89512 -32015 -2424 59068
$$ packed form
14296g26619r9775K8477Q7358N5039m7942j07560j04764n1188Q2258K08509K78890
14285c97317L20340L07797K36905J40773J6066p1249p0788l2245l8305p7747r9204
14274B35026j07991p7549J54J2456m4433j6178J12212J75110J22954n071j71764
14263B34926k99577l05097k13514j06058m7365m9800m4509m3073q1732p2453j0352
14252a038604p75m9183o2157l003L8223O5665J04890J52273J56375Q3583q238
14241e60951m2268k3548R310O2673J08344J30081J09452O8516L3884K6472J5815
14230f2220n4272j36367j75170j53655j06211p1848k9825M5022O8177N9576N9995
14219e56798M2677M58l7485Q469Q8079J26591J28697J09800N7497K9591O1492
$$ plain form
14208 59068 125832 160086 227768 318807 321160 199842 2263 -159167 -223645 -272982 -371065
14197 -371065 -486490 -599388 -715879 -850763 -972795 -1034392 -1033014 -989140 -854636 -616216
14187 -616216 -352791 -156599 -53489 -11458 -3078 14112 26447 -11501 -94496 -235848 -412310
14176 -412310 -503461 -429354 -276689 -152580 -18282 148109 298639 437177 605644 778605
14166 778605 905183 980651 992128 906363 764199 652327 630989 703673 781141 727023 512016
14155 512016 217661 -99228 -348462 -443118 -442636 -428379 -402639 -361111 -321530 -261911 -136735
14144 -136735 28050 158100 277531 412053 502779 509927 450848 367629 284743 205909 147043
14133 147043 119174 34569 -210313 -597823 -1004087 -1296082 -1484725 -1593553 -1598567 -1544527
$$ packed form
14208E9068O6764L4254O7682R1039K353j21318j97579j61430o4478m9337r8083
14197c71065j15425j12898j16491j34884j22032o1597J378M3874J34504K38420
14187f16216K63425J96192J03110M2031Q380J7190J2335l7948q2995j41352j76462
14176d12310r1151P4107J52665J24109J34298J66391J50530J38538J68467J72961
14166G78605J26578P5468J1477q5765j42164j11872k1338P2684P7468n4118k15007
14155E12016k94355l16889k49234r4656M82J4257K5740M1528L9581N9619J25176
14144a36735J64785J30050J19431J34522R0726P148n9079q3219q2886p8834n8866
14133A47043k7869q4605k44882l87510m06264k91995j88643j08828n014N4040
$$ plain form
14123 -1544527 -1529561 -1541087 -1500904 -1347786 -1093320 -823187 -625650 -508101 -435333 -371171
14113 -371171 -245608 -36913 142315 196246 147348 68427 24167 56954 161721 224485 150168
14102 150168 18504 -22172 -8677 -91198 -216540 -251527 -182226 -33856 96604 99462 -38853
14091 -38853 -258504 -436992 -505132 -525867 -505282 -425650 -333921 -293285 -317478 -352212 -366986
14080 -366986 -361943 -309287 -165348 51184 266324 407209 452369 398633 315022 318695 405525
14069 405525 460418 423410 306096 167499 19111 -190661 -401319 -440042 -290041 -160155
14059 -160155 -167352 -282724 -470844 -689819 -842496 -812136 -536176 -169523 63765 126226
14049 126226 58180 -107075 -276943 -380435 -427911 -459870 -536941 -709838 -968235 -1192997
$$ packed form
14123a544527J4966j1526M0183J53118K54466K70133J97537J17549P2768O4162
14113c71171J25563K08695J79228N3931m8898p8921m4260L2787J04767O2764p4317
14102A50168j31664m0676J3495q2521j25342l4987O9301J48370J30460K858j38315
14091c8853k19651j78488o8140k0735K0585P9632R1729M0636k4193l4734j4774
14080c66986N043N2656J43939K16532K15140J40885M5160n3736q3611L673Q6830
14069D05525N4893l7008j17314j38597j48388k09772k10658l8723J50001J29886
14059a60155p197j15372j88120k18975j52677L0360K75960L66653K33288O2461
14049A26226o8046j65255j69868j03492m7476l1959p7071j72897k58397k24762
$$ plain form
14039 -1192997 -1220686 -1075476 -913280 -828488 -771934 -672201 -553409 -493180 -546787 -631208 -577834
14028 -577834 -357380 -117797 29924 70678 8264 -56842 2951 184395 397836 544530
14018 544530 547444 413459 235833 67604 -39354 -88877 -171547 -278682 -326118 -285971 -264982
14007 -264982 -325887 -390240 -418102 -479212 -579579 -664484 -689647 -680330 -746993 -809179 -689844
13996 -689844 -455046 -288608 -199776 -87308 75951 211254 216758 65796 -160437 -381113
13986 -381113 -543610 -561396 -446842 -320035 -186509 13557 232734 398533 484911 457627
13976 457627 271399 -37405 -345515 -568062 -737369 -909325 -1049475 -1066737 -948522 -826612
13966 -826612 -807022 -865305 -898649 -836755 -646334 -307896 59965 324519 440915 378790
$$ packed form
14039a192997k7689J45210J62196Q4792N6554R9733J18792O0229n3607q4421N3374
14028e77834K20454K39583J47721M0754o2414o5106N9793J81444K13441J46694
14018E44530K914j33985j77626j68229j06958m9523q2670j07135m7436M0147K0989
14007b64982o0905o4353k7862o1110j00367q4905k5163R317o6663o2186J19335
13996f89844K34798J66438Q8832J12468J63259J35303N504j50962k26233k20676
13986c81113j62497j7786J14554J26807J33526K00066K19177J65799Q6378k7284
13976D57627j86228l08804l08110k22547j69307j71956j40150j7262J18215J21910
13966h26612J9590n8283l3344O1894J90421L38438L67861K64554J16396o2125
$$ plain form
13956 378790 139134 -198466 -493889 -654431 -692121 -700931 -735556 -761278 -697915 -579996 -554044
13945 -554044 -653465 -780975 -857447 -849306 -765203 -659310 -535758 -356621 -187587 -70039
13935 -70039 43634 123980 160135 202346 258608 331946 441240 578067 683116 717314 696499
13924 696499 662085 630967 582378 537562 531744 556880 525789 329910 65582 -99554 -126299
13913 -126299 -67473 -42610 -48394 -9688 45023 68500 62388 56664 44534 21006 26237 67624
13901 67624 128659 230691 373608 470737 500906 509843 473648 399066 292072 132010 -10985
13890 -10985 -96619 -160992 -215720 -272804 -342197 -429284 -530697 -624001 -695669 -726337 -730298 -747549
13878 -747549 -774250 -756882 -663665 -490500 -260790 -59148 36952 -3554 -144939 -261970
$$ packed form
13956C78790k39656l37600k95423j60542l7690q810l4625k5722O3363J17919K5952
13945e54044r9421j27510p6472Q141Q4103J05893J23552J79137J69034J17548
13935g0039J13673Q0346L6155M2211N6262P3338J09294J36827J05049L4198k0815
13924F96499l4414l1118m8589m4816n818K5136l1091j95879k64328j65136k6745
13913a26299N8826K4863n784L8706N4711K3477o112n724j2130k3528N231M1387
13901F7624O1035J02032J42917R7129L0169Q937l6195p4582j06994j60062j42995
13890a0985q5634o4373n4728n7084o9393q7087j01413r3304p1668l0668l961j7251
13878g47549k6701J7368R3217J73165K29710K01642R6100m0506j41385j17031
$$ plain form
13868 -261970 -243997 -104843 105316 340497 505873 563343 610035 735789 904031 934655
13858 934655 744049 467670 233436 110632 92492 74870 16712 -20311 37824 248341
13848 248341 541253 786686 911423 894254 789248 748485 758583 648660 291020 -209464
13838 -209464 -560592 -591659 -368174 -75875 128671 184346 140292 100680 113191 139798 151697
13827 151697 98179 -25937 -107499 -82079 -4730 71970 90911 8559 -130398 -269644 -408260
13816 -408260 -533168 -590337 -632759 -718053 -796946 -817546 -758206 -698046 -747203 -926262 -1113220
13805 -1113220 -1210433 -1202004 -1034463 -715683 -337240 -35795 69638 40742 6386 -92240
13795 -92240 -375303 -785954 -1083443 -1104433 -935576 -714348 -536163 -468174 -502673 -558345
$$ packed form
13868b61970J7973J39154K10159K35181J65376N7470M6692J25754J68242L0624
13858I34655j90606k76379k34234j22804j8140j7622n8158l7023N8135K10517
13848B48341K92912K45433J24737j7169j05006m0763J0098j09923l57640n00484
13838b09464l51128l1067K23485K92299K04546N5675m4054l9612J2511K6607J1899
13827A51697n3518j24116q1562K5420P7349P6700J8941q2352j38957j39246j38616
13816d08260j24908n7169m2422q5294p8893k0600N9340O0160m9157j79059j86958
13805a113220r7213Q429J67541L18780L78443L01445J05433k8896l4356r8626
13795i2240k83063m10651k97489k0990J68857K21228J78185O7989l4499n5672
$$ plain form
13785 -558345 -557692 -504577 -440768 -349726 -269575 -292287 -402363 -475005 -426933 -318354 -261292
13774 -261292 -253548 -235378 -185391 -146241 -155479 -220322 -338954 -474324 -608204 -742104 -822701
13763 -822701 -786842 -587029 -252433 56340 241880 354537 429046 463104 486596 492688 462944
13752 462944 401528 333561 257340 135372 -23255 -146888 -186856 -172470 -140802 -100076 -62646
13741 -62646 -26681 10336 46875 60967 42891 58557 96056 10994 -220399 -445151 -592572
13730 -592572 -645721 -615889 -601843 -647988 -694583 -719941 -742310 -695172 -584804 -541075 -612172
13719 -612172 -756566 -905584 -939691 -755150 -497458 -442352 -621034 -880727 -1133873 -1257717
13709 -1257717 -1206578 -1086420 -942485 -787487 -659155 -572188 -473265 -363888 -315425 -313510
$$ packed form
13785e58345O53N3115O3809R1042Q0151k2712j10076p2642M8072J08579N7062
13774b61292P744J8170M9987L9150r238o4843j18632j35370j33880j33900q0597
13763h22701L5859J99813L34596L08773J85540J12657P4509L4058K3492O092k9744
13752D62944o1416o7967p6221j21968j58627j23633l9968J4386L1668M0726L7430
13741f2646L5965L7017L6539J4092j8076J5666L7499q5062k31393k24752j47421
13730e92572n3149K9832J4046m6145m6595k5358k2369M7138J10368M3729p1097
13719f12172j44394j49018l4107J84541K57692N5106j78682k59693k53146j23844
13709a257717N1139J20158J43935J54998J28332Q6967R8923J09377M8463J915
$$ plain form
13699 -313510 -310563 -295954 -258882 -205466 -182527 -185640 -202992 -253873 -359834 -495762 -537874
13688 -537874 -427987 -255793 -120492 -36084 30385 73359 129540 261564 423463 507668
13678 507668 467418 390382 419188 506520 480557 330180 184445 124393 156054 223975 286852
13667 286852 348879 363603 331014 328195 370747 454832 570762 655159 607695 418425 196207
13656 196207 -14523 -138144 -77695 101291 313914 561326 779530 851625 731700 441995
13646 441995 104560 -70769 -41202 64681 172921 286080 338513 242194 53949 -161468
13636 -161468 -391277 -547441 -553337 -450435 -320689 -224773 -210639 -208096 -192830 -213324 -236882
13625 -236882 -206053 -170728 -235411 -423131 -655265 -778301 -717963 -592990 -520993 -505769 -474476
$$ packed form
13699c13510K947J4609L7072N3416K2939l113j7352n0881j05961j35928m2112
13688e37874J09887J72194J35301Q4408O6469M2974N6181J32024J61899Q4205
13678E07668m0250p7036K8806Q7332k5963j50377j45735o0052L1661O7921O2877
13667B86852O2027J4724l2589k819M2552Q4085J15930Q4397m7464j89270k22218
13656A96207k10730j23621O0449J78986K12623K47412K18204P2095j19925k89705
13646D41995l37435j75329K9567J05883J08240J13159N2433r6319j88245k15417
13636a61468k29809j56164n896J02902J29746R5916J4134K543J5266k0494k3558
13625b36882L0829L5325o4683j87720k32134j23036O0338J24973P1997J5224L1293
$$ plain form
13614 -474476 -390852 -277350 -214221 -247426 -316617 -310420 -193667 -81164 -102364 -225024 -377421
13603 -377421 -525983 -662233 -741211 -644918 -325976 84985 408504 571760 609133 593925
13593 593925 490396 241574 -49966 -227892 -260086 -248598 -252239 -272366 -373578 -585695
13583 -585695 -856333 -1097064 -1196044 -1091078 -822671 -502800 -230505 -51714 83072 198538
13573 198538 223825 176202 142723 151813 161484 107162 -33491 -219070 -421802 -640618 -779730
13562 -779730 -710817 -494469 -364743 -435090 -554100 -596577 -576613 -551530 -515738 -446934 -348834
13551 -348834 -201787 -17502 179722 332217 375644 358548 318847 248232 237227 389502
13541 389502 625188 768013 798763 817901 802505 673427 493822 311004 86568 -183565
$$ packed form
13614d74476Q3624J13502O3129l3205o9191O197J16753J12503k1200j22660j52397
13603c77421j48562j36250p8978R6293L18942M10961L23519J63256L7373j5208
13593E93925j03529k48822k91540j77926l2194J1488l641k0127j01212k12117
13583e85695k70638k40731r8980J04966K68407L19871K72295J78791J34786J15466
13573A98538K5287m7623l3479R090R671n4322j40653j85579k02732k18816j39112
13562g79730O8913K16348J29726p0347j19010m2477J9964K5083L5792O8804R8100
13551c48834J47047J84285J97224J52495M3427j7096l9701p0615j1005J52275
13541C89502K35686J42825L0750J9138j5396j29078j79605j82818k24436k70133
$$ plain form
13531 -183565 -450672 -637918 -748023 -793245 -739446 -641294 -582348 -617520 -735556 -820787 -796717
13520 -796717 -698902 -600187 -482391 -290117 -18497 267838 442057 425980 244837 18953
13510 18953 -150265 -271597 -344363 -332136 -279052 -295407 -360326 -356087 -285799 -285299 -404855 -515136
13498 -515136 -514612 -407420 -270481 -243683 -347391 -446254 -481692 -504510 -510507 -405563 -210103
13487 -210103 -49023 6919 -46703 -171095 -319886 -437804 -473661 -459432 -471794 -532367 -614489
13476 -614489 -718984 -840543 -923002 -875335 -701131 -517458 -432301 -482589 -599881 -703315
13466 -703315 -719896 -628976 -490965 -296146 -60710 68613 57579 15957 -17773 -84091 -153944
13455 -153944 -213590 -279908 -333151 -365962 -348092 -290246 -265365 -281817 -307729 -375600 -543759
$$ packed form
13531a83565k67107j87246j10105m5222N3799R8152N8946l5172j18036q5231K4070
13520g96717R7815R8715J17796J92274K71620K86335J74219j6077j81143k25884
13510A8953j69218j21332p2766J2227N3084j6355o4919M239P0288N00j19556j10281
13498e15136N24J07192J36939K6798j03708r8863l5438k2818n997J04944J95460
13487b10103J61080N5942n3622j24392j48791j17918l5857J4229j2362o0573q2122
13476f14489j04495j21559q2459M7667J74204J83673Q5157n0288j17292j03434
13466g03315j6581R0920J38011J94819K35436J29323j1034m1622l3730o6318o9853
13455a53944n9646o6318n3243l2811J7870N7846K4881j6452k5912o7871j68159
$$ plain form
13444 -543759 -803590 -1069833 -1264531 -1361949 -1380593 -1358281 -1286481 -1220253 -1197162 -1139006 -1003123
13433 -1003123 -824484 -639507 -438191 -153898 176910 433152 537694 477607 323994 239633
13423 239633 320233 482162 564003 459521 195350 -143299 -455739 -628494 -655970 -617423
13413 -617423 -528929 -422850 -311059 -169371 -45856 -16086 -97330 -154833 -102470 -192
13403 -192 60683 16164 -133771 -292617 -351734 -294913 -112803 228777 700728 1173224 1495614
13392 1495614 1593505 1501625 1286139 1086123 1021494 999202 922332 829292 727007 580406
13382 580406 448499 407667 404208 363079 373895 539455 767593 949651 1054545 1043924 946054
13371 946054 862695 827893 792243 754679 686342 559042 406689 300099 253927 188761 127092
$$ packed form
13444e43759k59831k66243j94698r7418j8644K2312P1800O6228K3091N8156J35883
13433a003123J78639J84977K01316K84293L30808K56242J04542o0087j53613q4361
13423B39633Q0600J61929Q1841j04482k64171l38649l12440j72755k7476L8547
13413f17423Q8494J06079J11791J41688J23515K9770q1244n7503N2363J02278
13403a92O0875m4519j49935j58846n9117N6821J82110L41580M71951M72496L22390
13392A495614R7891r1880k15486k00016o4629k2292p6870r3040j02285j46601
13382E80406j31907m0832l459m1129J0816J65560K28138J82058J04894j0621r7870
13371I46054q3359l4802l5650l7564o8337j27300j52353j06590m6172o5166o1669
$$ plain form
13360 127092 152560 228789 256651 258511 275284 306458 300685 220925 91973 -51693 -142592
13349 -142592 -122410 -22152 99359 206008 270044 320501 392697 477129 554470 644596 792844
13338 792844 1001976 1194390 1265205 1201462 1114473 1035053 911486 787238 720956 722105 795687
13327 795687 898341 1007152 1135541 1241720 1268659 1227383 1065284 783760 512247 274117
13317 274117 13095 -251384 -414712 -408113 -319413 -274776 -256803 -158383 81849 396048 658381
13306 658381 812226 905458 1059728 1311845 1542590 1694383 1818123 1879464 1801182 1586186
13296 1586186 1247368 865848 558243 372054 270555 123021 -113912 -299600 -333618 -239051
13286 -239051 -82151 92606 267583 454861 735838 1080656 1281213 1261087 1115126 941833
$$ packed form
13360A27092K5468P6229K7862J860J6773L1174n773p9760j28952j43666r0899
13349a42592K0182J00258J21511J06649O4036N0457P2196Q4432P7341R0126J48248
13338G92844K09132J92414P0815o3743q6989p9420j23567j24248o6282J149P3582
13327G95687J02654J08811J28389J06179K6939m1276j62099k81524k71513k38130
13317B74117k61022k64479j63328O599Q8700M4637J7973R8420K40232L14199K62333
13306F58381J53845R3232J54270K52117K30745J51793J23740O1341p8282k14996
13296A586186l38818l81520l07605j86189j01499j47534k36933j85688l4018R4567
13286b39051J56900J74757J74977J87278K80977L44818K00557k0126j45961j73293
$$ plain form
13276 941833 808243 713227 608373 504359 446611 467391 474030 372460 203864 46589
13266 46589 14652 122630 291705 440659 503272 504919 527205 618699 769222 912569 969487
13255 969487 986675 1100911 1314077 1502869 1574621 1565007 1581691 1645684 1697205 1706376 1676548
13244 1676548 1718341 1856023 1991754 2071025 2017624 1867517 1774991 1742522 1707965 1684835 1707360
13233 1707360 1794048 1888562 1938762 1949256 1971255 2044502 2133732 2171274 2129127 2057049 2037965
13222 2037965 2030011 1933098 1823766 1869925 2006521 2020902 1882144 1671544 1470393 1303955
13212 1303955 1133166 935299 800082 790223 858107 955955 1052797 1165068 1306250 1468146
13202 1468146 1664322 1902662 2122757 2227170 2166651 1992693 1771563 1545455 1360421 1303621
$$ packed form
13276I41833j33590r5016j04854j04014n7748K0780O639j01570j68596j57275
13266D6589l1937J07978J69075J48954O2613J647K2286R1494J50523J43347N6918
13255I69487J7188J14236K13166J88792P1752r614J6684O3993N1521R171k9828
13244A676548M1793J37682J35731P9271n3401j50107r2526l2469l4557k3130K2525
13233A707360Q6688R4514N0200J0494K1999P3247Q9230L7542m2147p2078j9084
13222B037965p954r6913j09332M6159J36596J4381j38758k10600k01151j66438
13212A303955j70789j97867j35217r859O7884R7848R6842J12271J41182J61896
13202A468146J96176K38340K20095J04413o0519j73958k21130k26108j85034n6800
$$ plain form
13192 1303621 1452265 1793598 2121547 2267275 2284706 2218710 2063086 1862142 1687761 1587790
13182 1587790 1591620 1683215 1763474 1760262 1695876 1611386 1519268 1489108 1625039 1902230 2225275
13171 2225275 2442955 2485707 2448641 2376452 2206771 1958324 1702858 1500971 1416808 1439453
13161 1439453 1520125 1555656 1526020 1523362 1598437 1743978 1899475 1962209 1917295 1814777 1718826
13150 1718826 1699630 1777170 1901934 2028099 2159609 2266569 2310712 2285154 2226679 2221051 2275088
13139 2275088 2283066 2212664 2155171 2166761 2269037 2422397 2597643 2799510 2949714 3010518
13129 3010518 3060282 3095650 3061339 2962065 2792279 2505282 2283443 2318228 2497324 2588905
13119 2588905 2501767 2358682 2281389 2320683 2412256 2428826 2385492 2404649 2556522 2777451 2928261
$$ packed form
13192A303621J48644L41333L27949J45728J7431o5996j55624k00944j74381r9971
13182A587790L830R1595Q0259l212o4386q4490r2118l0160J35931K77191L23045
13171B225275K17680M2752l7066p2189j69681k48447k55466k01887q4163K2645
13161A439453Q0672L5531k9636k658P5075J45541J55497O2734m4914j02518r5951
13150A718826j9196P7540J24764J26165J31510J06960M4143k5558n8475n628N4037
13139B275088P978p0402n7493J1590J02276J53360J75246K01867J50204O0804
13129C010518M9764L5368l4311r9274j69786k86997k21839L4785J79096R1581
13119B588905q7138j43085p7293L9294R1573J6570m3334J9157J51873K20929J50810
$$ plain form
13108 2928261 2929213 2851446 2831193 2840074 2771993 2665037 2617725 2650296 2715029 2842655 3049939
13097 3049939 3210883 3263928 3243216 3174792 3111060 3159917 3359693 3622713 3849709 4010752
13087 4010752 4093609 4110942 4125062 4194264 4325844 4456032 4449520 4302149 4128885 3949580
13077 3949580 3726630 3525574 3489745 3645816 3844014 3894921 3751962 3510596 3263159 3059783
13067 3059783 2946435 2964228 3112855 3342979 3615897 3940011 4272258 4561553 4743469 4788700
13057 4788700 4774320 4810810 4900941 4976408 5039471 5067529 4994760 4799024 4596040 4555846 4725246
13046 4725246 4958595 5160590 5405661 5747560 6105654 6379272 6572606 6693825 6768699 6810086
13036 6810086 6773552 6692421 6662237 6726496 6883904 7087959 7329068 7627480 7939884 8213389
$$ packed form
13108B928261R52p7767k0253Q881o8081j06956m7312L2571O4733J27626K07284
13097C049939J60944N3045k0712o8424o3732M8857J99776K63020K26996J61043
13087D010752Q2857J7333J4120O9202J31580J30188o512j47371j73264j79305
13077C949580k22950k01056l5829J56071J98198N0907j42959k41366k47437k03376
13067C059783j13348J7793J48627K30124K72918L24114L32247K89295J81916M5231
13057D788700j4380L6490R0131P5467O3063K8058p2769j95736k02984m0194J69400
13046D725246K33349K01995K45071L41899L58094K73618J93334J21219P4874M1387
13036F810086l6534q1131l0184O4259J57408K04055K41109K98412L12404K73505
$$ plain form
13026 8213389 8403979 8451296 8405370 8363921 8314044 8259198 8266795 8423516 8770812 9265262 9833571
13015 9833571 10366443 10918105 11558301 12099336 12330654 12349261 12413686 12636987 13019755 13540639
13005 13540639 14179991 14916097 15768068 16735425 17718071 18682227 19781877 21127739 22625668
12996 22625668 24201331 25883381 27727038 29728062 31886733 34293397 37135870 40553911
12988 40553911 44527082 49110067 54422743 60613522 67875211 76383569 86320916 97910087
12980 97910087 111508857 127566222 146645921 169401030 196365834 227664555 262340311
12973 262340311 297327559 326437160 341104706 335008347 309426419 272497339 233208579
12966 233208579 197157335 166389588 140962372 120224898 103324070 89487942 78145052
$$ packed form
13026H213389J90590M7317m5926m1449m9877n4846P597J56721L47296M94450N68309
13015I833571N32872N51662O40196N41035K31318J8607O4425K23301L82768N20884
13005A3540639O39352P36106Q51971R67357R82646R64156J099650J345862J497929
12996B2625668J575663J682050J843657K001024K158671K406664K842473L418041
12988D0553911L973171M582985N312676O190779P261689Q508358R937347J1589171
12980I7910087J3598770J6057365J9079699K2755109K6964804L1298721L4675756
12973B62340311L4987248K9109601J4667546o096359k5581928l6929080l9288760
12966B33208579l6051244l0767747k5427216k0737474j6900828j3836128j1342890
$$ plain form
12959 78145052 68845316 61195421 54828470 49453451 44918693 41160094 38048651 35417862
12951 35417862 33127607 31040719 29114379 27383647 25811639 24365349 23056601 21900065
12943 21900065 20897489 20020183 19197178 18440600 17850303 17390905 16995622 16657525 16361947
12934 16361947 16089224 15842638 15677565 15601439 15590111 15674846 15828860 16026336 16332805 16777393
12924 16777393 17322769 17903826 18445068 18954273 19525436 20245666 21151305 22205946 23346037
12915 23346037 24559507 25896019 27258333 28404009 29256253 29989010 30859041 32042409
12907 32042409 33569333 35400899 37541773 40005115 42806082 46017397 49763519 54183538
12899 54183538 59374831 65465359 72707697 81399291 91747091 103869073 118016229 134793380
$$ packed form
12959G8145052r299736p649895o366951n375019m534758l758599l111443k630789
12951C5417862k290255k086888j926340j730732j572008j446290j308748j156536
12943B1900065j002576q77306q23005p56578n90297m59398l95283l38097k95578
12934A6361947k72723k46586j65073p6126j1328Q4735J54014J97476L06469M44588
12924A6777393N45376N81057N41242N09205N71163P20230R05639J054641J140091
12915B3346037J213470J336512J362314J145676Q52244P32757Q70031J183368
12907C2042409J526924J831566K140874K463342K800967L211315L746122M420019
12899E4183538N191293O090528P242338Q691594J0347800J2121982J4147156J6777151
$$ plain form
12891 134793380 154956743 179165128 207856020 240879191 276774005 311661152 338155203
12884 338155203 347164516 334006333 302825502 263240943 223654265 188396012 158693658
12877 158693658 134296089 114420257 98231516 85057034 74349182 65582698 58320565
12870 58320565 52267073 47181976 42884237 39246798 36117387 33389787 31073934 29143932
12862 29143932 27453330 25905230 24553257 23408457 22346931 21267118 20232171 19343918
12854 19343918 18604509 18004935 17486162 16945381 16349458 15735881 15148109 14646661 14336483
12845 14336483 14247510 14336436 14511960 14649142 14655654 14534377 14356893 14192534 14117923 14149288
12835 14149288 14266616 14490103 14831894 15252400 15726856 16258106 16897055 17700595 18674892
$$ packed form
12891A34793380K0163363K4208385K8690892L3023171L5894814L4887147K6494051
12884C38155203R009313j3158183l1180831l9584559l9586678l5258253k9702354
12877A58693658k4397569j9875832j6188741j3174482j0707852q766484p262133
12870E8320565o053492n085097m297739l637439l129411k727600k315853j930002
12862B9143932j690602j548100j351973j144800j061526j079813j034947q88253
12854A9343918p39409n99574n18773n40781n95923o13577n87772n01448l10178
12845A4336483q8973Q8926J75524J37182O512j21277j77484j64359p4611L1365
12835A4149288J17328K23487L41791M20506M74456N31250O38949Q03540R74297
$$ plain form
12826 18674892 19730908 20830373 22008927 23313174 24848481 26614919 28550776 30715009
12818 30715009 33182232 35995539 39223889 42994007 47411161 52449891 58178889 64845240
12810 64845240 72637745 81691549 92228380 104670873 119541968 137333759 158496219
12803 158496219 183460244 212602005 245680395 280759346 312955397 334248932 336691415
12796 336691415 318221740 284739479 245473139 207531790 174316764 146625466 124039916
12789 124039916 105713961 90781990 78516984 68353259 59882194 52815729 46912430
12782 46912430 41970524 37845815 34420863 31581482 29192407 27082081 25111704 23235361
12774 23235361 21448610 19787335 18305302 17005856 15909476 15024078 14230474 13412959
$$ packed form
12826A8674892J056016J099465J178554J304247J535307J766438J935857K164233
12818C0715009K467223K813307L228350L770118M417154N038730N728998O666351
12810F4845240P792505R053804J0536831J2442493J4871095J7791791K1162460
12803A58496219K4964025K9141761L3078390L5078951L2196051K1293535K442483
12796C36691415j8469675l3482261l9266340l7941349l3215026k7691298k2585550
12789A24039916j8325955j4931971j2265006j0163725q471065p066465n903299
12782D6912430m941906m124709l424952k839381k389075k110326j970377j876343
12774B3235361j786751j661275j482033j299446j096380q85398p93604q17515
$$ plain form
12766 13412959 12586207 11766604 10962921 10276102 9791082 9447054 9071299 8549801 7940537
12757 7940537 7327166 6778873 6369945 6097659 5832617 5476709 5093364 4777398 4567440
12748 4567440 4459412 4398377 4342361 4285713 4199374 4031674 3782365 3482460 3240214 3153170
12738 3153170 3167068 3191538 3121350 2882289 2535312 2268087 2247440 2472146 2726744 2849103
12728 2849103 2844632 2770656 2624592 2455996 2379583 2384399 2371158 2269388 2082413 1900022 1830100
12717 1830100 1875445 1982471 2120895 2251947 2300056 2214768 2018283 1820466 1706935 1674392
12707 1674392 1724474 1822561 1907332 1942419 1871253 1628577 1311500 1043447 857764 758623
12697 758623 690219 604336 519883 444509 396322 453556 621570 853259 1066566 1183313 1161378
$$ packed form
12766A3412959q26752q19603q03683o86819m85020l44028l75755n21498o09264
12757G940537o13371n48293m08928k72286k65042l55908l83345l15966k09958
12748D567440j08028o1035n6016n6648q6339j67700k49309k99905k42246q7044
12738C153170J3898K4470p0188k39061l46977k67225k0647K24706K54598J22359
12728B849103m471p3976j46064j68596p6413M816j3241j01770j86975j82391o9922
12717A830100M5345J07026J38424J31052M8109q5288j96485j97817j13531l2543
12707A674392N0082R8087Q4771L5087p1166k42676l17077k68053j85683r9141
12697G58623o8404q5883q4453p5374m8187N7234J68014K31689K13307J16747k1935
$$ plain form
12686 1161378 1011495 829970 726264 745571 871092 988832 1008972 965112 864517 704109
12676 704109 518771 381746 327348 342393 399357 465838 504847 503807 496109 467858 407264
12665 407264 378933 382962 373908 361415 384103 502562 748578 1025845 1221740 1253664 1168799
12654 1168799 1075767 1015684 1027086 1093686 1160221 1226120 1265534 1236743 1179764 1164569 1162423
12643 1162423 1153480 1131133 1056082 939196 824438 705954 513724 286748 172452 220441
12633 220441 356642 531072 662619 619130 338205 -105074 -500150 -685181 -667483 -527122
12623 -527122 -340672 -159712 50592 308317 513290 570802 475736 315462 254297 393431
12613 393431 582898 614571 475121 302634 206618 152092 67020 36967 180825 464780
$$ packed form
12686A161378j49883j81525j03706J9307J25521J17740K0140m3860j00595j60408
12676G04109j85338j37025n4398J5045N6964O6481L9009j040p698k8251o0594
12665D07264k8331M029r054j2493K2688J18459K46016K77267J95895L1924q4865
12654A168799r3032o0083J1402O6600O6535O5899L9414k8791n6979j5195k146
12643A162423q943k2347p5051j16886j14758j18484j92230k26976j14296M7989
12633B20441J36201J74430J31547m3489k80925m43279l95076j85031J7698J40361
12623e27122J86450J80960K10304K57725K04973N7512r5066j60274o1165J39134
12613C93431J89467L1673j39450j72487r6016n4526q5072l0053J43858K83955
$$ plain form
12603 464780 739051 838687 731068 495860 241783 65647 -49959 -187446 -328521 -439520
12593 -439520 -554665 -681232 -798354 -854643 -805025 -646620 -424579 -200978 -50060 -8588
12583 -8588 -24733 39028 196092 305125 289502 201865 122936 79575 62621 74455 154287
12572 154287 260769 241092 92646 -42405 -116144 -176024 -283315 -527438 -806992 -959052
12562 -959052 -954354 -821804 -644117 -567080 -577571 -581546 -490363 -250931 55410 340598 595495
12551 595495 797699 940335 1007541 948659 797882 630919 452813 265463 96207 -31324
12541 -31324 -82616 -29793 94309 211712 266210 270922 281910 246281 114988 -1587 -24173
12530 -24173 -43889 -108971 -123171 -41654 80246 212992 349682 480524 631800 701558 564185
$$ packed form
12603D64780K74271R9636j07619k35208k54077j76136j15606j37487j41075j10999
12593d39520j15145j26567j17122n6289M9618J58405K22041K23601J50918M1472
12583h588j6145O3761J57064J09033j5623q7637p8929m3361j6954J1834P9832
12572A54287J06482j9677j48446j35051p3739n9880j07291k44123k79554j52060
12562i59052M698J32550J77687P7037j0491l975R1183K39432L06341K85188K54897
12551E95495K02204J42636O7206n8882j50777j66963j78106j87350j69256j27531
12541c1324n1292N2823J24102J17403N4498M712J0988l5629j31293j16575k2586
12530b4173j9716o5082j4200Q1517J21900J32746J36690J30842J51276O9758j37373
$$ plain form
12519 564185 287069 60379 -26154 -56417 -46237 3898 49906 148351 374322 629442 803943
12508 803943 873741 817636 688910 540966 362042 283314 420337 622791 682962 525393
12498 525393 228874 -30722 -153133 -165044 -169329 -264369 -432826 -559167 -573878 -468173
12488 -468173 -248035 -41127 17560 -17800 -45490 -46226 -15580 16694 -24001 -109876 -100550 82411
12476 82411 334066 522984 599545 596056 519140 323903 27624 -262657 -411943 -381057 -282592
12465 -282592 -156277 24147 121320 39078 -34076 15813 139980 267410 333184 383786 543007
12454 543007 782089 915200 876636 744383 538034 332613 329502 526644 735403 863833
12444 863833 888068 829579 758883 655615 502423 327926 188050 112676 48687 -30547 -50540
$$ packed form
12519E64185k77116k26690q6533l0263J0180N0135M6008R8445K25971K55120J74501
12508H03943O9798n6105j28726j47944j78924p8728J37023K02454O0171j57569
12498E25393k96519k59596j22411j1911m285r5040j68457j26341j4711J05705
12488d68173K20138K06908N8687l5360k7690p36L0646L2274m0695q5875R326J82961
12476H2411K51655J88918P6561l489p6916j95237k96279k90281j49286L0886R8465
12465b82592J26315J80424R7173q2242p3154M9889J24167J27430O5774N0602J59221
12454E43007K39082J33111l8564j32253k06349k05421l111J97142K08759J28430
12444H63833K4235n8489p0696j03268j53192j74497j39876p5374o3989p9234j9993
$$ plain form
12433 -50540 93512 330405 425309 287024 71380 -146534 -438833 -740090 -915305 -992159
12423 -992159 -1048267 -1060179 -1025486 -1040453 -1105794 -1037106 -780000 -479661 -238691 -40573 152164
12412 152164 310383 400336 439690 457897 498722 570958 586122 460404 185143 -145646 -431314
12401 -431314 -624150 -715187 -711299 -619653 -470225 -303489 -163897 -136590 -260879 -431071
12391 -431071 -500879 -455843 -397904 -372024 -362005 -364305 -394996 -458567 -568714 -727586 -879300
12380 -879300 -937342 -869414 -787832 -780510 -832053 -888940 -884591 -786418 -627436 -536447 -558504 -671113
12368 -671113 -839058 -910746 -815039 -624845 -407637 -189460 60562 349659 584357 683910
12358 683910 678233 647322 648729 739697 943629 1186981 1359263 1444510 1478156 1420236 1223038
$$ packed form
12433e0540J44052K36893R4904j38285k15644k17914k92299l01257j75215p6854
12423i92159n6108j1912L4693j4967o5341O8688K57106L00339K40970J98118J92737
12412A52164J58219Q9953L9354J8207M0825P2236J5164j25718k75261l30789k85668
12401d31314j92836r1037L888R1646J49428J66736J39592K7307j24289j70192
12391d31071o9808M5036N7939K5880J0019k300l0691o3571j10147j58872j51714
12380h79300n8042O7928Q1582P322n1543n6887M349R8173J58982R0989k2057j12609
12368f71113j67945p1688R5707J90194K17208K18177K50022K89097K34698R9553
12358F83910n677l0911J407R0968K03932K43352J72282Q5247L3646n7920j97198
$$ plain form
12347 1223038 894022 553548 363465 326059 345521 407524 477447 432072 265804 127298
12337 127298 32692 -127148 -341154 -557284 -768763 -904512 -909922 -867504 -890205 -972078 -1001425
12326 -1001425 -897132 -652096 -362476 -184095 -169443 -292189 -454958 -553277 -588873 -657351
12316 -657351 -848171 -1090798 -1238424 -1215320 -1046268 -865865 -771240 -736879 -704472 -617301
12306 -617301 -467302 -262910 -31887 178552 336418 366137 242710 68053 -67415 -143217
12296 -143217 -93740 74370 207321 150372 -81733 -274056 -306571 -239208 -188813 -225349 -322895
12285 -322895 -383954 -359795 -310853 -268114 -249316 -248132 -177649 -41338 33494 -13839 -122325
12274 -122325 -191866 -196580 -134705 -27421 52887 69425 66975 76369 98186 123259 96156 15419
$$ packed form
12347A223038l29016l40474j90083l7406J9462O2003O9923m5375j66268j38506
12337A27298r4606j59840k14006k16130k11479j35749n410M2418k2701q1873k9347
12326a001425J04293K45036K89620J78381J4652j22746j62769r8319l5596o8478
12316f57351j90820k42627j47626K3104J69052J80403R4625L4361L2407Q7171
12306f17301J49999K04392K31023K10439J57866K9719j23427j74657j35468p5802
12296a43217M9477J68110J32951n6949k32105j92323l2515O7363N0395l6536r7546
12285c22895o1059K4159M8942M2739J8798J184P0483J36311P4832m7333j08486
12274a22325o9541m714O1875J07284Q0308J6538k450R394K1817K5073k7103q0737
$$ plain form
12262 15419 -78117 -129536 -106790 -47219 11723 47334 71602 120738 176134 161040 54625
12251 54625 -54459 -88656 -81580 -86767 -75650 -1124 118188 177564 156666 119783 65673 -24605
12239 -24605 -111610 -130439 -113962 -114805 -125579 -102400 -7753 119718 217349 227026 170960 109781
12227 109781 70696 34962 -43087 -134201 -180819 -174780 -136728 -77846 -17863 -5344 -53722 -79533
12215 -79533 -67682 -175267 -439799 -670594 -748308 -718704 -644110 -500677 -261231 -26604
12205 -26604 109595 159677 169366 141467 -12913 -292847 -545078 -666284 -681987 -699790 -728547
12194 -728547 -709243 -593126 -370590 -125454 92556 335249 619971 849238 915265 771388
12184 771388 473463 193020 33031 -39747 -42342 9531 62992 15243 -148211 -275000 -234066
$$ packed form
12262A5419r3536n1419K2746N9571N8942L5611K4268M9136N5396j5094j06415
12251E4625j09084l4197P076n187J1117P4526J19312N9376k0898l6883n4110r0278
12239b4605q7005j8829J6477q43j0774K3179R4647J27471R7631R677n6066o1179
12227A09781l9085l5734p8049r1114m6618O039L8052N8882N9983J2519m8378k5811
12215g9533J1851j07585k64532k30795p7714K9604P4594J43433K39446K34627
12205b6604J36199N0082R689k7899j54380k79934k52231j21206j5703j7803k8757
12194g28547J9304J16117K22536K45136K18010K42693K84722K29267O6027j43877
12184G71388k97925k80443j59989p2778k595N1873N3461m7749j63454j26789M0934
$$ plain form
12173 -234066 -50609 176305 457586 789248 1042587 1144342 1165068 1132136 985154 744531
12163 744531 508834 328805 208736 157459 167254 204041 193288 68404 -147145 -384364
12153 -384364 -573335 -702190 -820808 -909066 -875449 -726000 -548522 -413017 -363669 -419467
12143 -419467 -488867 -446092 -318028 -230717 -217818 -200297 -148461 -80481 -77190 -219512 -484049
12132 -484049 -824706 -1138067 -1267684 -1201852 -1080611 -977968 -858693 -744794 -701143 -735696
12122 -735696 -758691 -669209 -499146 -380770 -350939 -334926 -307324 -338917 -420019 -421972 -298959
12111 -298959 -112519 34802 157016 316327 462768 540761 607252 704090 789190 828945
12101 828945 810478 715704 548374 402662 366165 388758 368836 348365 362694 380096 372420
$$ packed form
12173b34066J83457K26914K81281L31662K53339J01755K0726l2932j46982k40623
12163G44531k35697j80029j20069n1277R795L6787j0753j24884k15549k37219
12153c84364j88971j28855j18618q8258L3617J49449J77478J35505M9348n5798
12143d19467o9400M2775J28064Q7311J2899J7521N1836O7980L291j42322k64537
12132d84049l40657l13361j29617O5832J21241J02643J19275J13899M3651l4553
12122g35696k2995Q9482J70063J18376K9831J6013K7602l1593q1102j953J23013
12111b98959J86440J47321J22214J59311J46441P7993O6491R6838Q5100L9755
12101H28945j8467r4774j67330j45712l6497K2593j9922k0471J4329J7402p676
$$ plain form
12090 372420 329254 291771 318227 372610 316262 89080 -207178 -448542 -642548 -835057
12080 -835057 -941458 -862033 -653828 -478125 -423674 -501000 -683285 -898493 -1037121 -1042138
12070 -1042138 -987354 -959785 -953185 -927868 -887130 -850033 -829081 -847544 -932841 -1060489 -1173560
12059 -1173560 -1195891 -1057648 -806812 -549962 -346799 -209249 -125209 -75827 13851 172096
12049 172096 325817 410986 386049 347191 414370 528726 597551 620469 609294 543169 400225
12038 400225 149552 -160839 -424037 -599542 -684472 -703766 -685033 -589938 -413990 -206822
12028 -206822 -16074 150867 319905 465800 514954 401232 184619 -20997 -185295 -277167
12018 -277167 -261217 -72800 275905 604034 774865 792452 707244 585233 497713 485420
$$ packed form
12090C72420m3166l7483K6456N4383n6348k27182k96258k41364j94006j92509
12080h35057j06401P9425K08205J75703N4451p7326j82285k15208j38628n017
12070a042138N4784K7569O600K5317M0738L7097K0952j8463q5297j27648j13071
12059a173560k2331J38243K50836K56850K03163J37550Q4040M9382Q9678J58245
12049A72096J53721Q5169k4937l8858O7179J14356O8825K2918j1175o6125j42944
12038D00225k50673l10391k63198j75505q4930j9294J8733R5095J75948K07168
12028b06822J90748J66941J69038J45895M9154j13722k16613k05616j64298r1872
12018b77167J5950J88417L48705L28129J70831J7587q5208j22011q7520j2293
$$ plain form
12008 485420 535188 615749 660629 626756 557583 478586 397962 335268 333303 449336 635346
11997 635346 721848 628650 401155 100149 -234717 -619201 -967983 -1101797 -994705 -782055
11987 -782055 -563955 -361203 -244240 -245602 -243381 -103662 141702 334121 343921 156352 -100026
11976 -100026 -283739 -367991 -410514 -421826 -395470 -357221 -271096 -78890 193068 458092 623961
11965 623961 582585 324846 7452 -230811 -344313 -355694 -305306 -242397 -251706 -311250 -315837
11954 -315837 -241952 -221081 -280894 -286334 -205467 -40615 137233 221303 250079 317645 388521
11943 388521 385498 332522 274001 247640 231949 146316 4963 -144294 -291405 -411155 -488325
11932 -488325 -539540 -592620 -627352 -551456 -301274 -28325 45905 -120878 -415521 -677923
$$ packed form
12008D85420M9768Q0561M4880l3873o9173p8997q0624o2694j965J16033J86010
11997F35346Q6502r3198k27495l01006l34866l84484l48782j33814J07092K12650
11987g82055K18100K02752J16963j362K221J39719K45364J92419R800j87569k56378
11976a00026j83713q4252m2523j1312K6356L8249Q6125J92206K71958K65024J65869
11965F23961m1376k57739l17394k38263j13502j1381N0388O2909r309n9544m587
11954c15837P3885K0871n9813n440Q0867J64852J77848Q4070K8776O7566P0876
11943C88521l023n2976n8521k6361j5691q5633j41353j49257j47111j19750p7170
11932d88325n1215n3080l4732P5896K50182K72949P4230j66783k94643k62402
$$ plain form
11922 -677923 -770190 -704152 -582937 -449058 -315853 -240365 -264755 -347411 -374500 -300253 -147462
11911 -147462 44243 284589 573791 828169 1011534 1207066 1451609 1595350 1542005 1365206
11901 1365206 1138529 876020 622230 398631 210416 95063 45794 58082 103567 155752
11891 155752 239989 305924 284975 226153 172900 113845 111543 167122 204969 240644 303634 362889
11879 362889 417717 481519 534152 520233 431748 332620 294284 325152 364713 388749 384187 322485
11867 322485 238824 173745 115079 86124 116642 130030 69089 -12700 -61595 -125619 -230767
11856 -230767 -305210 -320843 -338904 -427670 -654347 -956996 -1159395 -1220616 -1191480 -1096448 -983221
11845 -983221 -881939 -796868 -715265 -603921 -460073 -294504 -124255 -27678 -1218 67429
$$ packed form
11922f77923r2267O6038J21215J33879J33205P5488k4390q2656k7089P4247J52791
11911a47462J91705K40346K89202K54378J83365J95532K44543J43741n3345j76799
11901A365206k26677k62509k53790k23599j88215j15353m9269J2288M5485N2185
11891A55752Q4237O5935k0949n8822n3253n9055k302N5579L7847L5675O2990N9255
11879C62889N4828O3802N2633j3919q8485r9128l8336L0868L9561K4036m562o1702
11867C22485q3661o5079n8666k8955L0518J3388o0941q1789m8895o4024j05148
11856b30767p4443j5633j8061q8766k26677l02649k02399o1221K9136R5032J13227
11845i83221J01282Q5071Q1603J11344J43848J65569J70249R6577K6460O8647
$$ plain form
11835 67429 224366 396031 485856 478222 414481 332954 278415 299407 430191 625247 756463
11824 756463 780179 781198 832103 893155 917135 881626 786832 673133 617066 657625 739354
11813 739354 850359 960431 1010286 1047077 1132852 1286261 1473804 1645000 1831954 2112504
11803 2112504 2566944 3245318 4005330 4609460 5028390 5376969 5696346 6013466 6414680
11794 6414680 6861771 7106550 6992206 6646303 6178496 5607773 4941070 4224509 3552644
11785 3552644 2921720 2274819 1709447 1356000 1119057 877348 670737 608700 712232 912803
11775 912803 1124364 1249716 1198672 1014439 786844 542029 365185 346936 522150 871221
11765 871221 1267991 1555478 1690893 1697281 1606929 1477929 1309137 1068661 810116 698909
$$ packed form
11835F7429J56937J71665Q9825p634o3741q1527n4539K0992J30784J95056J31216
11824G56463K3716J019N0905O1052K3980l5509r4794j13699n6067M0559Q1729
11813G39354J11005J10072M9855L6791Q5775J53409J87543J71196J86954K80550
11803B112504M54440O78374P60012O04130M18930L48579L19377L17120M01214
11794F414680M47091K44779j14344l45903m67807n70723o66703p16561o71865
11785C552644o30924o46901n65372l53447k36943k41709k06611o2037J03532K00571
11775I12803K11561J25352n1044j84233k27595k44815j76844j8249J75214L49071
11765H71221L96770K87487J35415O388r0352j29000j68792k40476k58545j11207
$$ plain form
11755 698909 836606 1100738 1326241 1498449 1611546 1581538 1416958 1225936 1152326 1197375
11745 1197375 1200538 1131255 1075207 1004981 845742 635489 439453 274643 160734 112319
11735 112319 145586 235171 316300 403432 564132 805885 1027973 1146467 1153450 1070252 1001455
11724 1001455 1036952 1122207 1198913 1301007 1439264 1553183 1618218 1655683 1742214 1941289
11714 1941289 2283106 2749801 3248206 3729174 4197729 4718758 5396614 6260893 7280317
11705 7280317 8476157 9929620 11629857 13566949 15798967 18383916 21296730 24458367
11697 24458367 27876335 31424730 34495613 35996540 35012054 31654426 27056818 22402396
11689 22402396 18239755 14718921 11878001 9660824 7934721 6584810 5539147 4734337
$$ packed form
11755F98909J37697K64132K25503J72208J13097l0008j64580j91022p3610M5049
11745A197375L163o9283n6048p0226j59239k10253j96036j64810j13909m8415
11735A12319L3267Q9585Q1129Q7132J60700K41753K22088J18494O983q3198o8797
11724A001455L5497Q5255P6706J02094J38257J13919O5035L7465Q6531J99075
11714A941289L41817M66695M98405M80968M68555N21029O77856Q64279J019424
11705G280317J195840J453463J700237J937092K232018K584949K912814L161637
11697B4458367L417968L548395L070883J500927r84486l357628m597608m654422
11689B2402396m162641l520834k840920k217177j726103j349911j045663q04810
$$ plain form
11681 4734337 4107935 3585113 3118766 2718779 2362118 2040933 1849441 1765115 1636942 1440017
11671 1440017 1305147 1339549 1488198 1589070 1537193 1334207 1088322 901263 807364 804824
11661 804824 827963 814267 722690 558851 383818 240427 108065 6815 32934 183933
11651 183933 337392 393138 356171 263391 158700 86701 9020 -95751 -131557 -10410 225026
11640 225026 408351 382466 162188 -113587 -276763 -237883 -65028 124560 339496 585693
11630 585693 775651 869939 895196 873093 823350 781613 759791 758677 833485 988319 1108426
11619 1108426 1074348 875255 626019 459463 441066 541058 647864 625185 442746 203314
11609 203314 9742 -126874 -243560 -292786 -208200 43839 444182 843322 1107637 1264734
$$ packed form
11681D734337o26402n22822m66347l99987l56661l21185j91492q4326j28173j96925
11671A440017j34870L4402J48649J00872n1877k02986k45885j87059r3899k540
11661H04824K3139j3696r1577j63839j75033j43391j32362j01250K6119J50999
11651A83933J53459N5746l6967r2780j04691p1999p7681j04771l5806J21147K35436
11640B25026J83325k5885k20278k75775j63176L8880J72855J89588K14936K46197
11630E85693J89958R4288K5257k2103m9743m1737k1822j114P4808J54834J20107
11619A108426l4078j99093k49236j66556j8397R9992J06806k2679j82439k39432
11609B03314j93572j36616j16686m9226Q4586K52039M00343L99140K64315J57097
$$ plain form
11599 1264734 1365409 1392451 1311422 1169477 1098577 1134827 1178377 1151134 1038593 879814
11589 879814 730769 611974 562555 639667 832858 1001422 1037436 983144 943535 1001938 1113638
11578 1113638 1166938 1170097 1185119 1194988 1144086 1047873 949489 800319 576788 341734 102927
11567 102927 -120992 -318696 -547104 -794676 -951062 -935901 -826168 -747264 -700590 -618337
11557 -618337 -496155 -357989 -232676 -207768 -325935 -540685 -731832 -792459 -780379 -812460
11547 -812460 -884096 -942555 -989987 -1052181 -1121485 -1116722 -1000310 -818657 -586686 -315280 -104246
11536 -104246 -5245 56354 122414 161952 164158 175132 216854 226993 174823 109705 75635 89820
11524 89820 177303 376566 647576 880170 977701 941675 840977 753258 763820 862485 942815
$$ packed form
11599A264734J00675K7042q1029j41945p0900L6250M3550k7243j12541j58779
11589H79814j49045j18795m9419P7112J93191J68564L6014n4292l9609N8403J11700
11578A113638N3300L159J5022R869n0902r6213r8384j49170k23531k35054k38807
11567A02927k23919j97704k28408k47572j56386J5161J09733P8904M6674Q2253
11557f18337J22182J38166J25313K4908j18167k14750j91147o0627J2080l2081
11547h12460p1636n8459m7432o2194o9304M763J16412J81653K31971K71406K11034
11536a04246R9001O1599O6060L9538K206J0974M1722J0139n2170o5118l4070J4185
11524H9820Q7483J99263K71010K32594R7531l6026j00698q7719J0562R8665Q0330
$$ plain form
11513 942815 981880 1004164 978689 859074 649126 382919 94716 -120439 -166728 -78031
11503 -78031 -8731 -26244 -48889 6329 94791 118880 71462 -5906 -28492 86103 248951
11492 248951 322331 328381 338872 384352 452837 535860 602663 631119 627916 591383 540128 516669
11480 516669 502285 476796 443868 355145 191361 -28193 -241670 -357560 -414094 -501586 -640507
11469 -640507 -836172 -1031005 -1070670 -930874 -798480 -828799 -969784 -1136564 -1335936 -1500769
11459 -1500769 -1489354 -1248800 -866163 -519441 -278031 -130469 -89698 -135485 -216373 -276098
11449 -276098 -315083 -347451 -370704 -379703 -423087 -539423 -701564 -882740 -1017355 -1075962 -1030627
11438 -1030627 -822031 -529246 -310036 -251602 -342000 -483733 -550933 -528829 -543236 -676231
$$ packed form
11513I42815L9065K2284k5475j19615k09948k66207k88203k15155m6289Q8697
11503g8031O9300j7513k2645N5218Q8462K4089m7418p7368k2586J14595J62848
11492B48951P3380O050J0491M5480O8485Q3023O6803K8456l203l6533n1255k3459
11480E16669j4384k5489l2928q8723j63784k19554k13477j15890n6534q7492j38921
11469f40507j95665j94833l9665J39796J32394l0319j40985j66780j99372j64833
11459a500769J1415K40554L82637L46722K41410J47562M0771m5787q0888n9725
11449b76098l8985l2368k3253q999m3384j16336j62141j81176j34615n8607M5335
11438a030627K08596K92785K19210N8434r0398j41733o7200K2104j4407j32995
$$ plain form
11428 -676231 -874637 -1032813 -995888 -711548 -336864 -44107 111309 131807 99177 94642
11418 94642 120875 171828 244467 307574 324304 267770 117351 -64525 -158243 -160574 -163359 -182343
11406 -182343 -213846 -200467 -92101 73930 231611 285291 202264 68626 23065 71763 127867
11395 127867 188343 243194 228702 119535 -12478 -84155 -129845 -235030 -402153 -575081
11385 -575081 -723699 -780294 -709743 -623149 -569554 -480384 -334612 -153969 14234 117467
11375 117467 134975 54103 -84052 -196914 -206077 -98342 23076 45113 -57261 -233275
11365 -233275 -436543 -636715 -744955 -704598 -591720 -503534 -435513 -327307 -169808 -20465
11355 -20465 64760 74035 16944 -75032 -265123 -532992 -713101 -769576 -748225 -688591 -646417
$$ packed form
11428f76231j98406j58176L6925K84340L74684K92757J55416K0498l2630m535
11418I4642K6233N0953P2639O3107J6730n6534j50419j81876r3718k331k785j8984
11406a82343l1503J3379J08366J66031J57681N3680q3027j33638m5561M8698N6104
11395A27867O0476N4851j4492j09167j32013p1677m5690j05185j67123j72928
11385e75081j48618n6595P0551Q6594N3595Q9170J45772J80643J68203J03233
11375A17467J7508q0872j38155j12862r163J07735J21418K2037j02374j76014
11365b33275k03268k00172j08240M0357J12878Q8186O8021J08206J57499J49343
11355b0465Q5225R275n7091r1976j90091k67869j80109n6475K1351N9634M2174
$$ plain form
11344 -646417 -645873 -584097 -414135 -254631 -202238 -203253 -159977 -86893 16383 113372 101863
11333 101863 -17229 -152101 -223592 -284340 -425870 -650617 -875172 -976793 -923048 -785989
11323 -785989 -653763 -608110 -719092 -960834 -1171380 -1145553 -898111 -670008 -598205 -614420
11313 -614420 -625649 -559870 -382837 -172354 -36310 27670 59526 120439 263929 439708
11303 439708 558399 556344 442750 291478 214566 246698 263311 205182 114614 3435 -127034
11292 -127034 -256700 -310404 -293155 -246930 -194377 -137868 -22457 145502 269739 281067 190834
11281 190834 69156 -50157 -214260 -397171 -514259 -534806 -452130 -292442 -159601 -149198
11271 -149198 -209227 -265905 -271087 -218708 -142754 -94990 -79547 -52380 -49881 -108244 -157534 -108941
$$ packed form
11344f46417N44O1776J69962J59504N2393j015M3276P3084J03276R6989j1509
11333A01863j19092j34872p1491o0748j41530k24747k24555j01621N3745J37059
11323g85989J32226M5653j10982k41742k10546K5827K47442K28103P1803j6215
11313f14420j1229O5779J77033K10483J36044O3980L1856O0913J43490J75779
11303D39708J18691k055j13594j51272p6912L2132J6613n8129r0568j11179j30469
11292a27034j29666n3704J7249M6225N2553N6509J15411J67959J24237J1328r0233
11281A90834j21678j19313j64103j82911j17088k0547Q2676J59688J32841J0403
11271a49198o0029n6678n182N2379P5954M7764J5443K7167K499n8363m9290M8593
$$ plain form
11259 -108941 -31238 -20211 -73687 -142955 -210768 -290379 -386027 -449320 -460549 -473098 -488928
11248 -488928 -445873 -340393 -222983 -159472 -223872 -347794 -339970 -184582 -46311 20953 58267
11237 58267 121470 231509 334351 371996 311479 152672 -43271 -238850 -405443 -510803
11227 -510803 -562406 -548427 -458577 -352435 -312624 -327505 -356199 -416152 -532116 -684140 -825352
11216 -825352 -913103 -900907 -854498 -891149 -962863 -969340 -893068 -755358 -630118 -621364 -697587
11205 -697587 -725673 -637745 -491668 -355031 -244585 -187004 -204467 -264228 -274008 -156914 33256
11194 33256 202458 306742 348808 322724 222447 109931 837 -156290 -352665 -473047
11184 -473047 -443802 -342310 -245584 -114234 54677 167810 143170 -8577 -254854 -547362
$$ packed form
11259a08941P7703J1027n3476o9268o7813p9611r5648o3293j1229j2549j5830
11248d88928M3055J05480J17410O3511o4400j23922P824J55388J38271O7264L7314
11237E8267O3203J10039J02842L7645o0517j58807j95943j95579j66593j05360
11227e10803n1603J3979Q9850J06142L9811j4881k8694n9953j15964j52024j41212
11216h25352q7751J2196M6409l6651p1714o477P6272J37710J25240Q754p6223
11205f97587k8086Q7928J46077J36637J10446N7581j7463n9761r780J17094J90170
11194C3256J69202J04284M2066k6084j00277j12516j09094j57127j96375j20382
11184d73047K9245J01492R6726J31350J68911J13133k4640j51747k46277k92508
$$ plain form
11174 -547362 -858785 -1106161 -1118479 -928509 -696432 -509408 -353982 -193852 -77302 -84330
11164 -84330 -213738 -344330 -367769 -306284 -191053 -66882 30448 106465 95101 -35674 -212526
11153 -212526 -404732 -588430 -722380 -784431 -737330 -518040 -187847 65329 118751 63550
11143 63550 49201 35473 -41931 -125729 -156972 -111780 19836 227981 446359 604457 731494
11132 731494 881758 1054800 1209929 1302264 1284085 1170773 1000433 779578 533348 291448
11122 291448 101065 -36523 -190173 -366856 -497747 -527471 -487336 -411677 -345059 -361878
11112 -361878 -437947 -516508 -614716 -757133 -896149 -950165 -907981 -789288 -613755 -405960
11102 -405960 -245036 -152147 -71792 11881 47806 3087 -81834 -173269 -287584 -433778 -569033
$$ packed form
11174e47362l11423k47376j2318J89970K32077J87024J55426J60130J16550p028
11164h4330j29408j30592k3439O1485J15231J24171R7330P6017j1364j30775j76852
11153b12526j92206j83698j33950o2051M7101K19290L30193K53176N3422n5201
11143F3550j4349j3728p7404q3798l1243M5192J31616K08145K18378J58098J27037
11132G31494J50264J73042J55129R2335j8179j13312j70340k20855k46230k41900
11122B91448j90383j37588j53650j76683j30891k9724M0135P5659O6618j6819
11112c61878p6069p8561r8208j42417j39016n4016M2184J18693J75533K07795
11102d05960J60924R2889Q0355Q3673L5925m4719q4921r1435j14315j46194j35255
$$ plain form
11091 -569033 -650598 -637126 -520601 -404055 -396566 -444226 -428190 -372307 -358650 -409141 -470185
11080 -470185 -472108 -410477 -334846 -293954 -270999 -226292 -176369 -150768 -90605 28908 119223
11069 119223 119992 54163 -17429 -108540 -287822 -514199 -660212 -702782 -676876 -589188 -524494
11058 -524494 -541311 -602167 -676987 -797446 -961100 -1060133 -1023938 -869384 -665027 -481276
11048 -481276 -362826 -321699 -282347 -210004 -180113 -201565 -168605 -34877 163125 345703 387220
11037 387220 256451 99295 42843 19704 -68261 -168411 -220611 -248589 -296257 -361701 -401324
11026 -401324 -368806 -235526 -21311 192247 327966 352342 285971 185857 86601 -35841
11016 -35841 -187187 -297845 -319513 -300849 -315219 -341431 -307364 -199983 -66318 34929 86679
$$ packed form
11091e69033q1565J3472J16525J16546P489m7660J6036N5883J3657n0491o1044
11080d70185j923O1631P5631M0892K2955M4707M9923K5601O0163J19513R0315
11069A19223P69o5829p1592r1111j79282k26377j46013m2570K5906Q7688O4694
11058e24494j6817o0856p4820j20459j63654r9033L6195J54554K04357J83751
11048d81276J18450M1127L9352P2343K9891k1452L2960J33728J98002J82578M1517
11037C87220j30769j57156n6452k3139q7965j00150n2200k7978m7668o5444l9623
11026d01324L2518J33280K14215K13558J35719K4376o6371j00114r9256j22442
11016c5841j51346j10658k1668J8664j4370k6212L4067J07381J33665J01247N1750
$$ plain form
11005 86679 42158 -155788 -468345 -792033 -1070480 -1306729 -1506176 -1643461 -1684647 -1651577
10995 -1651577 -1598154 -1464904 -1135772 -724754 -489075 -527315 -715995 -848042 -811095 -667895
10985 -667895 -541421 -459921 -383263 -290252 -188493 -122333 -73063 -24778 -40889 -129601 -229383
10974 -229383 -270251 -262115 -297029 -381399 -482914 -566722 -572937 -518187 -464169 -445494 -421361 -361059
10962 -361059 -275684 -141091 63520 277261 413865 490482 520106 499319 432296 328802
10952 328802 195232 21131 -154474 -245865 -184918 -14893 158872 328564 499755 623665
10942 623665 676886 655378 577486 473800 318554 96699 -106435 -249890 -351889 -412365
10932 -412365 -409722 -332521 -233512 -151444 -86562 -79611 -143209 -244115 -368995 -480494 -558256
$$ packed form
11005H6679m4521j97946l12557l23688k78447k36249j99447j37285m1186L3070
10995a651577N3423J33250L29132M11018K35679l8240j88680j32047L6947J43200
10985f67895J26474Q1500P6658R3011J01759O6160M9270M8285j6111q8712r9782
10974b29383m0868Q136l4914q4370j01515q3808o215N4750N4018J8675K4133O0302
10962c61059Q5375J34593K04611K13741J36604P6617K9624k0787o7023j03494
10952C28802j33570j74101j75605r1391O0947J70025J73765J69692J71191J23910
10942F23665N3221k1508p7892j03686j55246k21855k03134j43455j01999o0476
10932d12365K643P7201R9009Q2068O4882O951o3598j00906j24880j11499p7762
$$ plain form
10921 -558256 -624460 -657072 -639552 -628099 -606855 -538115 -509108 -539616 -534559 -458232 -345004
10910 -345004 -252123 -271209 -417433 -520026 -439047 -220783 -14710 76947 141614 242472
10900 242472 286408 193989 -8428 -203440 -301353 -302991 -259365 -278206 -399258 -511795 -556154
10889 -556154 -547391 -543630 -568746 -531781 -379477 -162592 33481 119254 91947 -9901 -118231
10878 -118231 -197664 -278504 -371709 -456410 -500523 -484459 -426384 -339710 -265668 -282082 -399277
10867 -399277 -583238 -806203 -1044034 -1195034 -1167430 -1047146 -938126 -879343 -832294 -695532
10857 -695532 -499690 -371094 -375003 -444549 -450062 -308953 -53134 202135 357412 363094 264708
10846 264708 176066 179852 275913 424388 563207 595308 501420 359113 233094 158680 118893
$$ packed form
10921e58256o6204l2612J7520J1453K1244O8740K9007l0508N057P6327J13228
10910c45004R2881j9086j46224j02593Q0979K18264K06073R1657O4667J00858
10900B42472M3936r2419k02417j95012r7913j638M3626j8841j21052j12537m4359
10889e56154Q763L761k5116L6965J52304K16885J96073Q5773k7307j01848j08330
10878a18231p9433q0840r3205q4701m4113J6064N8075Q6674P4042j6414j17195
10867c99277j83961k22965k37831j51000K7604J20284J09020N8783M7049J36762
10857f95532J95842J28596l909o9546n513J41109K55819K55269J55277N682r8386
10846B64708q8642L786R6061J48475J38819L2101r3888j42307j26019p4414l9787
$$ plain form
10835 118893 51088 -68888 -205157 -255159 -144328 37086 162870 200261 144335 84054
10825 84054 96554 114343 108970 66027 -27752 -166732 -333756 -467957 -546509 -604524 -663450
10814 -663450 -703659 -721388 -721632 -661626 -527691 -422204 -420404 -450211 -439570 -455933 -549381 -622845
10802 -622845 -600826 -494735 -335832 -163279 -28210 -26465 -203661 -465466 -658912 -690778
10792 -690778 -527671 -292775 -199541 -242275 -241736 -176357 -128615 -169806 -236731 -225040 -255445
10781 -255445 -442313 -703251 -913543 -949017 -754587 -454635 -244294 -175251 -176462 -179075 -103054
10770 -103054 79430 235516 220535 30581 -211811 -384825 -481496 -500814 -428263 -348628
10760 -348628 -371422 -476552 -559426 -572440 -591482 -701986 -847021 -930599 -916130 -871045 -887724
$$ packed form
10835A18893o7805j19976j36269n0002J10831J81414J25784L7391n5926o0281
10825H4054J2500J7789n373m2943r3779j38980j67024j34201p8552n8015n8926
10814f63450m0209j7729k44O0006J33935J05487J800k9807J0641j6363r3448p3464
10802f22845K2019J06091J58903J72553J35069J745j77196k61805j93446l1866
10792f90778J63107K34896R3234m2734N39O5379M7742m1191o6925J1691l0405
10781b55445j86868k60938k10292l5474J94430K99952K10341O9043j211k613P6021
10770a03054J82484J56086j4981j89954k42392j73014r6671j9318P2551P9635
10760c48628k2794j05130q2874j3014j9042j10504j45035q3578J4469M5085j6679
$$ plain form
10749 -887724 -959799 -1084226 -1236854 -1307277 -1297392 -1263008 -1164519 -978292 -712801 -426703 -239502
10738 -239502 -174014 -122601 20077 265507 513716 672209 794999 905759 928025 793387
10728 793387 538450 243480 -28814 -170907 -169097 -143853 -155867 -160906 -155746 -179262 -223821
10717 -223821 -322843 -476980 -610756 -690064 -744657 -805285 -812039 -710644 -551980 -437772 -467567
10706 -467567 -634697 -814829 -919176 -945028 -942402 -894012 -771359 -667518 -622038 -586900 -541170
10695 -541170 -455101 -374521 -396181 -546487 -744293 -922003 -1097318 -1297738 -1486652 -1606292
10685 -1606292 -1650020 -1616028 -1528038 -1419871 -1277259 -1137523 -1018880 -905350 -813984 -776702
10675 -776702 -826666 -1000542 -1253667 -1443714 -1486260 -1368746 -1109439 -777562 -491014 -326124
$$ packed form
10749h87724p2075j24427j52628p0423R885L4384R8489J86227K65491K86098J87201
10738b39502O5488N1413J42678K45430K48209J58493J22790J10760K2266j34638
10728G93387k54937k94970k72294j42093J810K5244j2014n039N160k3516m4559
10717b23821r9022j54137j33776p9308n4593o0628o754J01395J58664J14208k9795
10706d67567j67130j80132j04347k5852K626M8390J22653J03841M5480L5138M5730
10695e41170Q6069Q0580k1660j50306j97806j77710j75315k00420j88914j19640
10685a606292m3728L3992Q7990J08167J42612J39736J18643J13530R1366L7282
10675g76702m9964j73876k53125j90047m2546J17514K59307L31877K86548J64890
$$ plain form
10665 -326124 -226659 -106168 32547 130387 181116 218134 188970 123929 174411 345729 509805
10654 509805 607314 646430 637446 586244 498220 416699 397808 464794 568609 616605 592005
10643 592005 541284 466737 311587 64892 -176404 -312611 -322731 -225728 -83414 10402
10633 10402 -6531 -75498 -150075 -216462 -198384 -84087 38957 91502 88127 70027 -5045
10622 -5045 -172498 -388467 -571582 -666603 -666408 -604663 -544238 -529415 -542263 -537408 -535122 -580925
10610 -580925 -633176 -578725 -402796 -201392 -65207 -26782 -45092 -86051 -134274 -129635 -28004
10599 -28004 114058 204543 209996 115817 -93815 -357672 -598326 -768180 -832128 -835104 -831915
10588 -831915 -820392 -779412 -702378 -616693 -576390 -600995 -655717 -664027 -603089 -563229 -580754 -579087
$$ packed form
10665c26124R9465J20491J38715R7840N0729L7018k9164o5041N0482J71318J64076
10654E09805R7509L9116q984n1202q8024q1521j8891O6986J03815M7996k4600
10643E92005n0721p4547j55150k46695k41296j36207j0120R7003J42314R3816
10633A0402j6933o8967p4577o6387J8078J14297J23044N2545l375j8100p5072
10622e045j67453k15969j83115r5021J95O1745O0425J4823j2848M855K286m5803
10610e80925n2251N4451J75929K01404J36185L8425j8310m0959m8223M639J01631
10599b8004J42062R0485N453r4179k09632k63857k40654j69854o3948k976L189
10588h31915J1523M0980P7034Q5685M0303k4605n4722q310O0938L9860j7525J667
$$ plain form
10576 -579087 -490949 -344041 -228050 -203142 -277653 -373516 -354996 -200079 -2424 120533
10566 120533 130059 125994 166519 195887 140015 51748 23117 39014 19370 -59722 -166853 -243057
10554 -243057 -226459 -73096 118466 138448 -46323 -269917 -365473 -350484 -320641 -345403 -469376
10543 -469376 -563518 -482367 -362686 -370281 -472180 -535752 -494693 -419115 -324971 -185731 -60166
10532 -60166 -8079 -24280 -88948 -196753 -347111 -553785 -775718 -927677 -1012629 -1070448 -1032793
10521 -1032793 -850694 -624198 -442343 -316248 -209474 -103151 -23752 -17661 -64567 -138842
10511 -138842 -232548 -283812 -250140 -147826 -75112 -133081 -262578 -319910 -272731 -186686 -84134
10500 -84134 7452 46881 47123 32082 -17022 -151751 -296396 -306091 -166279 66126 343702
$$ packed form
10576e79087Q8138J46908J15991K4908p4511r5863J8520J54917J97655J22957
10566A20533R526m065M0525K9368n5872q8267k8631J5897j9644p9092j07131p6204
10554b43057J6598J53363J91562J9982j84771k23594r5556J4989K9843k4762j23973
10543d69376r4142Q1151J19681p595j01899o3572M1059P5578R4144J39240J25565
10532f0166N2087j6201o4668j07805j50358k06674k21933j51959q4952n7819L7655
10521a032793J82099K26496J81855J26095J06774J06323P9399O091m6906p4275
10511a38842r3706n1264L3672J02314P2714n7969j29497n7332M7179Q6045J02552
10500h4134R1586L9429K42j5041m9104j34729j44645r695J39812K32405K77576
$$ plain form
10489 343702 585658 684513 591502 309574 -91467 -434939 -574832 -567701 -554127 -532465 -467627
10478 -467627 -424049 -452865 -500868 -524272 -529804 -523110 -496337 -467194 -483246 -532199 -563746 -587214
10466 -587214 -614091 -604497 -563323 -558561 -588959 -582300 -489724 -286507 -59029 67711 87399
10455 87399 43295 -53633 -163297 -239895 -323022 -447219 -576032 -672620 -701714 -625336 -476510
10444 -476510 -325991 -183415 -39716 26033 -31782 -145463 -227921 -270035 -278551 -205344 -77742
10433 -77742 24298 41484 -53493 -193026 -291235 -289968 -196168 -38813 161138 347111 502960
10422 502960 619796 619500 445042 161746 -113383 -361406 -603084 -785770 -858264 -881106
10412 -881106 -913207 -921008 -872744 -789401 -771764 -831330 -876054 -873000 -820540 -722420 -606777 -522053
$$ packed form
10489C43702K41956R8855r3011k81928m01041l43472j39893P131J3574K1662O4838
10478d67627M3578k8816m8003k3404n532O694K6773K9143j6052m8953l1547k3468
10466e87214k6877R594M1174M762l0398O659R2576K03217K27478J26740J9688
10455H7399m4104r6928j09664p6598q3127j24197j28813r6588k9094P6378J48826
10444d76510J50519J42576J43699O5749n7815j13681q2458m2114q516P3207J27602
10433g7742J02040J7186r4977j39533r8209J267R3800J57355J99951J85973J55849
10422E02960J16836k96j74458k83296k75129k48023k41678j82686p2494k2842
10412h81106l2101p801M8264Q3343J7637n9566m4724L054N2460R8120J15643Q4724
$$ plain form
10400 -522053 -458494 -376465 -290464 -187306 -75463 -34226 -62498 -102090 -101078 -64197 -35667
10389 -35667 -7508 4416 -71529 -187668 -206781 -110970 64702 240420 294704 221696 88682
10378 88682 -48880 -154566 -255894 -414313 -624288 -772023 -765944 -692059 -614025 -458201
10368 -458201 -209472 88439 358103 492717 470325 355866 229274 94297 -50310 -123601
10358 -123601 -88481 -25184 -12988 -40420 -90328 -191960 -314398 -384798 -404949 -380188 -345682
10347 -345682 -319254 -264686 -148099 4974 43338 -78778 -249147 -430528 -660745 -850589
10337 -850589 -825925 -635357 -464843 -338191 -259763 -254077 -249124 -170574 -69029 -51889 -113752
10326 -113752 -169821 -226716 -358926 -557746 -796652 -1040997 -1194039 -1261699 -1330271 -1378332
$$ packed form
10400e22053O3559Q2029Q6001J03158J11843M1237k8272l9592J012L6881K8530
10389c5667K8159J1924p5945j16139j9113R5811J75672J75718N4284p3008j33014
10378H8682j37562j05686j01328j58419k09975j47735O079P3885P8034J55824
10368d58201K48729K97911K69664J34614k2392j14459j26592j34977j44607p3291
10358a23601L5120O3297J2196k7432m9908j01632j22438p0400k0151K4761L4506
10347c45682K6428N4568J16587J53073L8364j22116j70369j81381k30217j89844
10337h50589K4664J90568J70514J26652P8428N686M953P8550J01545J7140o1863
10326a13752n6069n6895j32210j98820k38906k44345j53042o7660o8572m8061
$$ plain form
10316 -1378332 -1321399 -1117864 -834010 -646628 -616898 -678389 -762704 -792183 -724818 -563752
10306 -563752 -349788 -141944 49034 204909 293650 287442 187710 76016 -249 -47949 -88737
10295 -88737 -147020 -197356 -247574 -300085 -371100 -479249 -598337 -652904 -610777 -564023 -575295
10284 -575295 -592873 -534379 -397799 -223882 -39699 141684 322432 487695 559852 497420
10274 497420 399693 333612 266260 173480 70558 -14662 -60685 -78851 -92170 -96595 -75183
10263 -75183 -5638 101468 198569 235621 204314 114905 1961 -84584 -152214 -235008 -289559
10252 -289559 -280194 -254183 -230421 -189630 -148792 -125441 -131963 -196126 -286683 -347982 -402422 -472221
10240 -472221 -538546 -554426 -480870 -305508 -62557 207328 405324 457901 430836 399854 337436
$$ packed form
10316a378332N6933K03535K83854J87382K9730o1491q4315k9479O7365J61066
10306e63752K13964K07844J90978J55875Q8741o208r9732j11694p6265m7700m0788
10295h8737n8283n0336n0218n2511p1015j08149j19088n4567M2127M6754j1272
10284e75295j7578N8494J36580J73917J84183J81383J80748J65263P2157o2432
10274D97420r7727o6081o7352r2780j02922q5220m6023j8166j3319m425K1412
10263g5183O9545J07106R7101L7052l1307q9409j12944q6545o7630q2794n4551
10252b89559R365K6011K3762M0791M0838K3351o522o4163r0557o1299n4440o9799
10240d72221o6325j5880P3556J75362K42951K69885J97996N2577k7065l0982o2418
$$ plain form
10229 337436 185963 2309 -76251 38883 305145 541348 571539 424173 257043 132446
10219 132446 28768 -47885 -91277 -134792 -206268 -318919 -430591 -489070 -458347 -349123 -264691
10208 -264691 -268955 -290711 -288996 -281485 -201575 13953 251641 327109 244307 142959 147847 252557
10196 252557 349114 406789 468180 560352 599821 458757 218137 30325 -70665 -93330 -78768
10185 -78768 -106796 -189820 -281777 -342457 -340627 -296020 -239558 -193155 -207644 -296507 -382228 -413586
10173 -413586 -396950 -342691 -303704 -288406 -269247 -293367 -351082 -347745 -260146 -142582 -679
10162 -679 164222 327155 476134 595974 694987 794398 890869 975584 1057312 1142217 1211082
10151 1211082 1269533 1360016 1457083 1444723 1275984 1047266 887578 821761 783641 709286 592786
$$ packed form
10229C37436j51473j83654p8560J15134K66262K36203L0191j47366j67130j24597
10219A32446j03678p6653m3392m3515p1476j12651j11672n8479L0723J09224Q4432
10208b64691m264k1756J715P511P9910K15528K37688P5468q2802j01348M888J04710
10196B52557R6557N7675O1391R2172L9469j41064k40620j87812j00990k2665J4562
10185g8768k8028q3024r1957o0680J830M4607N6462M6403j4489q8863q5721l1358
10173d13586J6636N4259L8987J5298J9159k4120n7715L337Q7599J17564J41903
10162f79J64901J62933J48979J19840R9013R9411R6471Q4715Q1728Q4905O8865
10151A211082N8451R0483R7067j2360j68739k28718j59688o5817l8120p4355j16500
$$ plain form
10140 592786 491017 417376 358456 310583 289491 365995 531280 663383 651954 482460 247682
10129 247682 9746 -242852 -464866 -587325 -583493 -479559 -382639 -398098 -504446 -585179
10119 -585179 -532900 -344043 -137890 -38868 -52904 -43929 92312 320343 487274 519588 504108
10108 504108 491170 460198 421138 384191 329091 248219 163837 121693 129227 172901 258513 329366
10096 329366 331242 370335 516604 662498 718786 688321 631286 569963 493806 406877 335868
10085 335868 343380 402073 426869 403518 405611 446379 464397 468638 506146 565958 559985 413978
10073 413978 203292 51819 -214 56853 205259 404229 556281 582397 562400 591283
10063 591283 632247 645910 647149 652645 732026 899892 1026935 972897 830065 762000 720394
$$ packed form
10140E92786j01769p3641n8920m7873k1092P6504J65285J32103j1429j69494k34778
10129B47682k37936k52598k22014j22459L832J03934R6920j5459j06348q0733
10119e85179N2279J88857K06153R9022j4036Q975J36241K28031J66931L2314j5480
10108E04108j2938l0972l9060l6947n5100q0872q4382m2144P534M3674Q5612P0853
10096C29366J876L9093J46269J45894N6288l0465n7035o1323p6157q6929p1009
10085C35868P512N8693K4796k3351K093M0768J8018M241L7508N9812n973j46007
10073D13978k10686j51473n2033N7067J48406J98970J52052K6116j9997K8883
10063E91283M0964J3663J239N496P9381J67866J27043n4038j42832o8065m1606
$$ plain form
10052 720394 616546 491771 436940 443600 452656 377135 206790 12066 -155465 -231494 -187608
10041 -187608 -101350 -21413 101437 240231 274693 169643 32982 12506 97342 182134 215300
10030 215300 227710 203159 116823 23724 -58651 -117859 -120824 -30209 147056 321388 444436
10019 444436 489900 429888 337534 337292 467676 650746 808389 900286 904797 872359 904731
10008 904731 978055 1029727 1085707 1148576 1193944 1290189 1421270 1480035 1428992 1272267 1035900
9997 1035900 812658 663506 613580 666352 792081 908586 972746 1046200 1120445 1147614 1140512
9986 1140512 1146303 1170414 1178492 1215495 1332100 1461187 1525239 1472130 1277443 1046751 868717
9975 868717 688326 500724 389441 397453 460655 484070 478275 485801 472244 444529 498562 663491
$$ packed form
10052G20394j03848j24775n4831O660R056p5521j70345j94724j67531p6029M3886
10041a87608Q6258P9937J22850J38794L4462j05050j36661k0476Q4836Q4792L3166
10030B15300J2410k4551q6336r3099q2375n9208k965R0615J77265J74332J23048
10019D44436M5464o0012r2354k42J30384J83070J57643R1897M511l2438L2372
10008I04731P3324N1672N5980O2869M5368R6245J31081N8765n1043j56725k36367
9997A035900k23242j49152m9926N2772J25729J16505O4160P3454P4245K7169p102
9986A140512N791K4111Q078L7003J16605J29087O4052n3109j94687k30692j78034
9975H68717j80391j87602j11283Q012O3202K3415n795P526j3557k7715N4033J64929
$$ plain form
9963 663491 854505 994867 1057252 1075484 1133127 1239878 1276630 1238812 1242093 1228908 1062250
9952 1062250 807200 627632 636734 805188 1003968 1095570 1000022 799481 590758 311909
9942 311909 -50503 -339795 -419185 -341799 -217809 -82338 65363 190473 259493 275983
9932 275983 270971 241513 160082 81859 35024 -9176 -114041 -294060 -422750 -377824 -220574
9921 -220574 -81032 1878 102150 299383 552502 765678 887494 933874 940306 879545 723693
9910 723693 514486 319939 198870 157637 155167 182033 207929 156724 8984 -186986 -385108
9899 -385108 -523236 -591242 -631911 -646559 -562349 -348776 -101855 99759 236680 311440 347181
9888 347181 372156 407435 478371 560875 581582 537662 501331 512355 528918 487886 392284 292406
$$ packed form
9963F63491J91014J40362O2385J8232N7643J06751L6752l7818L281j3185j66658
9952A062250k55050j79568R102J68454J98780R1602r5548k00541k08723k78849
9942C11909l62412k89292p9390P7386J23990J35471J47701J25110O9020J6490
9932B75983n012k9458q1431p8223m6835m4200j04865j80019j28690M4926J57250
9921b20574J39542Q2910J00272J97233K53119K13176J21816M6380O432o0761j55852
9910G23693k09207j94547j21069m1233k470K6866K5896n1205j47740j95970j98122
9899c85108j38128o8006m0669j4648Q4210K13573K46921K01614J36921P4760L5741
9888C47181K4975L5279P0936Q2504K0707m3920l6331J1024J6563m1032r5602r9878
$$ plain form
9876 292406 237805 218846 213763 232201 250830 233570 212191 207047 201643 173013 157762 204224
9864 204224 265338 276370 202644 80702 -101661 -376473 -631404 -796049 -919862 -995918
9854 -995918 -1006606 -994517 -928232 -819984 -762758 -760399 -750599 -688621 -574490 -440399 -332999
9843 -332999 -276028 -271328 -332634 -432031 -499764 -472705 -367597 -226123 -87285 47317 214783
$$ packed form
9876B92406n4601j8959n083J8438J8629j7260k1379n144n404k8630j5251M6462
9864B04224O1114J1032p3726j21942j82363k74812k54931j64645j23813p6056
9854i95918j0688J2089O6285J08248N7226K359R800O1978J14131J34091J07400
9843c32999N6971M700o1306r9397o7733K7059J05108J41474J38838J34602J67466
$$ [...]
##END NTUPLES=NMR SPECTRUM
##END=
