##TITLE=C13_SR92_oil
 d2O, 20800 sc

 28.10.2021
##JCAMPDX= 6.0         $$ Bruker NMR JCAMP-DX V2.0
##DATA TYPE= NMR SPECTRUM
##DATA CLASS= NTUPLES
##ORIGIN= UXNMR, Bruker Analytische Messtechnik GmbH
##OWNER= root
$$ XWIN-NMR		Version 3.5
$$ Fri Oct 29 11:05:19 2021 Russian Standard Time (UT+4h)  she@DPX200
##.OBSERVE FREQUENCY= 50.327896
##.OBSERVE NUCLEUS= ^13C
##.ACQUISITION MODE= SIMULTANEOUS
##.ACQUISITION SCHEME= undefined
##.AVERAGES= 23700
##.DIGITISER RES= 17
##SPECTROMETER/DATA SYSTEM= spect
##.PULSE SEQUENCE= zgpg30
##.SOLVENT NAME= CDCl3
##.SHIFT REFERENCE= (INTERNAL, CDCl3, 0, 222.653)
##AUDIT TRAIL= $$ (NUMBER, WHEN, WHO, WHERE, WHAT)
$$ ##TITLE= Audit trail, XWIN-NMR		Version 3.5
$$ ##JCAMPDX= 5.01
$$ ##ORIGIN= Bruker BioSpin GmbH
$$ ##OWNER= she
$$ F:/spectra/data/she/nmr/c13/1/pdata/1/auditp.txt
$$ ##AUDIT TRAIL=  $$ (NUMBER, WHEN, WHO, WHERE, WHAT)
(   1,<2021-10-29 11:04:11.92 +0400>,<she>,<DPX200>,
      <created by zg, POWCHK disabled, PULCHK disabled
       terminated by command 'halt'
       configuration hash MD5:
       00 E9 B6 7A A2 85 ED C7 34 08 36 98 17 FE 4E 26
       data hash MD5: 32K
       3B 45 1C DB 75 2A 46 7B E7 5E 5A D4 7A E8 E5 BE>)
(   2,<2021-10-29 11:04:14.93 +0400>,<she>,<DPX200>,
      <Start of raw data processing
       efp BC_mod = 2 LB = 1 FT_mod = 6 PKNL = 1 PHC0 = -341.6683 PHC1 = 37.16237 SI = 32K 
       data hash MD5: 32K
       15 B1 99 15 5A 41 5E E1 78 23 7D 60 C9 E1 2A 48>)
(   3,<2021-10-29 11:04:50.21 +0400>,<she>,<DPX200>,
      <pk PHC0 = 11.38911 PHC1 = -16.8 
       data hash MD5: 32K
       F7 DD E0 32 35 EE 47 87 3D F5 2D E5 E5 69 29 4E>)
(   4,<2021-10-29 11:04:53.50 +0400>,<she>,<DPX200>,
      <abs ABSG = 5 
       data hash MD5: 32K
       CC CE 3A FC 11 9E 9F EA D8 F8 8C 6D 61 15 5D C8>)
$$ ##END=
$$ 
$$ hash MD5
$$ 92 60 05 68 DA 81 EA 60 05 FC 53 A3 53 7C 3E 8D
##$RELAX= 
##$RELAX= 
##$RELAX= 
##$RELAX= 
##$RELAX= 
##$RELAX= 
##$RELAX= 
##$RELAX= 
$$ Bruker specific parameters
$$ --------------------------
##$DU= <F:/spectra>
##$EXPNO= 1
##$NAME= <c13>
##$PROCNO= 1
##$TYPE= <nmr>
##$USER= <she>
##$AMP= (0..31)
100 100 100 100 100 100 100 100 100 100 100 100 100 100 100 100 100 100 
100 100 100 100 100 100 100 100 100 100 100 100 100 100 
##$AQSEQ= 0
##$AQ_mod= 1
##$AUNM= <au_zg>
##$AUTOPOS= <>
##$BF1= 50.322709
##$BF2= 200.13
##$BF3= 50.322709
##$BF4= 500.13
##$BF5= 500.13
##$BF6= 500.13
##$BF7= 500.13
##$BF8= 500.13
##$BYTORDA= 1
##$CFDGTYP= 0
##$CFRGTYP= 5
##$CHEMSTR= <none>
##$CNST= (0..31)
1 1 145 1 1 1 1 1 1 1 1 1 1 1 1 1 1 1 1 1 1 1 1 1 1 1 1 1 1 1 1 1 
##$CPDPRG= <waltz16>
##$CPDPRG1= <>
##$CPDPRG2= <waltz16>
##$CPDPRG3= <>
##$CPDPRG4= <mlev>
##$CPDPRG5= <mlev>
##$CPDPRG6= <mlev>
##$CPDPRG7= <mlev>
##$CPDPRG8= <mlev>
##$CPDPRGB= <>
##$CPDPRGT= <>
##$D= (0..31)
0 2 0.00345 0 0 0 0 0 0 0 0 0.03 2e-05 3e-06 0 0 0 0 0 0 0 0 0 0 0 0 0 
0 0 0 0 0 
##$DATE= 1635410863
##$DBL= (0..7)
120 120 120 120 120 120 120 120 
##$DBP= (0..7)
150 150 150 150 150 150 150 150 
$$ [...]
##$SUBNAM4= <"">
##$SUBNAM5= <"">
##$SUBNAM6= <"">
##$SUBNAM7= <"">
##$SUBNAM8= <"">
##$SUBNAM9= <"">
##$SW= 239.972175391363
##$SWIBOX= (0..15)
0 1 3 0 0 0 0 0 0 0 0 0 0 0 0 0 
##$SW_h= 12077.2946859903
##$TD= 32768
##$TD0= 1
##$TE= 0
##$TE2= 300
##$TE3= 300
##$TEG= 300
##$TL= (0..7)
120 120 120 120 120 120 120 120 
##$TP= (0..7)
150 150 150 150 150 150 150 150 
##$TP07= 0
##$TPNAME0= <>
##$TPNAME1= <>
##$TPNAME2= <>
##$TPNAME3= <>
##$TPNAME4= <>
##$TPNAME5= <>
##$TPNAME6= <>
##$TPNAME7= <>
##$TPOAL= (0..7)
0.5 0.5 0.5 0.5 0.5 0.5 0.5 0.5 
##$TPOFFS= (0..7)
0 0 0 0 0 0 0 0 
##$TUNHIN= 0
##$TUNHOUT= 0
##$TUNXOUT= 0
##$USERA1= <user>
##$USERA2= <user>
##$USERA3= <user>
##$USERA4= <user>
##$USERA5= <user>
##$V9= 5
##$VALIST= <valist>
##$VCLIST= <CCCCCCCCCCCCCCC>
##$VD= 0
##$VDLIST= <DDDDDDDDDDDDDDD>
##$VPLIST= <PPPPPPPPPPPPPPP>
##$VTLIST= <TTTTTTTTTTTTTTT>
##$WBST= 1024
##$WBSW= 4
##$XGAIN= (0..3)
0 0 0 0 
##$XL= 0
##$YL= 0
##$YMAX_a= 134847009
##$YMIN_a= -98847857
##$ZGOPTNS= <>
##$ZL1= 120
##$ZL2= 120
##$ZL3= 120
##$ZL4= 120
##$ABSF1= 222.6533
##$ABSF2= -17.34351
##$ABSG= 5
##$ABSL= 3
##$ALPHA= 0
##$AQORDER= 0
##$ASSFAC= 0
##$ASSFACI= 0
##$ASSFACX= 0
##$ASSWID= 0
##$AUNMP= <proc_1d>
##$AZFE= 0.1
##$AZFW= 0.5
##$BCFW= 0
##$BC_mod= 2
##$BYTORDP= 0
##$COROFFS= 0
##$CY= -3
##$DATMOD= 1
##$DC= 0
##$DFILT= <>
##$DTYPP= 0
##$F1P= 0
##$F2P= 0
##$FCOR= 0.5
##$FTSIZE= 32768
##$FT_mod= 6
##$GAMMA= 0
##$GB= 0
##$INTBC= 1
##$INTSCL= 4.134877e-10
##$ISEN= 128
##$LB= 1
##$LEV0= 0
##$LPBIN= 0
##$MAXI= 10000
##$MC2= 0
##$MEAN= 0
##$ME_mod= 0
##$MI= 0.1934396
##$NCOEF= 0
##$NC_proc= -1
##$NLEV= 6
##$NOISF1= 120.0001
##$NOISF2= 80.00006
##$NSP= 0
##$NTH_PI= 0
##$NZP= 0
##$OFFSET= 222.6533
##$PC= 1.4
##$PHC0= -330.2792
##$PHC1= 20.36237
##$PH_mod= 1
##$PKNL= yes
##$PPARMOD= 0
##$PSCAL= 0
##$PSIGN= 0
##$REVERSE= no
##$SF= 50.3227301237032
##$SI= 32768
##$SIGF1= 140
##$SIGF2= 120
##$SINO= 11.81781
##$SIOLD= 32768
##$SREGLST= <13C.CDCl3>
##$SSB= 0
##$STSI= 32768
##$STSR= 0
##$SW_p= 12077.2946859903
##$SYMM= 0
##$S_DEV= 0
##$TDeff= 32768
##$TDoff= 0
##$TI= <>
##$TILT= no
##$TM1= 0
##$TM2= 0
##$TOPLEV= 0
##$USERP1= <user>
##$USERP2= <user>
##$USERP3= <user>
##$USERP4= <user>
##$USERP5= <user>
##$WDW= 1
##$XDIM= 32768
##$YMAX_p= 183952882
##$YMIN_p= -18602648
$$ End of Bruker specific parameters
$$ ---------------------------------
##NTUPLES= NMR SPECTRUM
##VAR_NAME=  FREQUENCY,     SPECTRUM/REAL,   SPECTRUM/IMAG
##SYMBOL=    X,             R,               I
##VAR_TYPE=  INDEPENDENT,   DEPENDENT,       DEPENDENT
##VAR_FORM=  AFFN,          ASDF,            ASDF
##VAR_DIM=   32768,         32768,           32768
##UNITS=     HZ,            ARBITRARY UNITS, ARBITRARY UNITS
##FACTOR=    0.368581032318806, 1,           1
##FIRST=     11204.5221813685, 0,            0
##LAST=      -872.772504621842, 0,           0
##MIN=       -872.772504621842, -18602648,   0
##MAX=       11204.5221813685, 183952882,    0
$$ Real data points
##PAGE= N=1
##DATA TABLE= (X++(R..R)), XYDATA
$$ [...]
##PAGE= N=2
##DATA TABLE= (X++(I..I)), XYDATA
8203 174006747 173692398 177078678 179426536 178624639 173003211 170106334 169457642 169311682 172975660
8194 172975660 173918258 172914470 171992927 172239853 172558669 175516277 178469317 182953386 186326315
8185 186326315 189100998 189932512 190245034 188555937 182298097 176121830 175184858 178529054
8177 178529054 179921604 180903654 185258733 187434405 184188996 180117953 181074644 181390225
8169 181390225 176806306 172068291 172271379 175342670 177027688 174991017 170658000 167647107
8161 167647107 171401258 172977119 168952957 166619224 167545362 169126559 170621541 170611632 169150868
8152 169150868 168301081 169908258 171604672 173865794 177056397 176448128 172563532 170254089
8144 170254089 171397678 175814019 179048396 180258776 178197557 176042819 174731208 172843288
8136 172843288 170497139 172501085 174605038 176528698 176440079 172958902 171882480 171620275
8128 171620275 171909101 173524952 174687068 177172248 178540568 177487995 177439203 178624089
8120 178624089 179294367 177183282 170358861 164318884 160952547 160139998 160989954 162763132
8112 162763132 165582754 163867594 160743619 157290792 155359342 153439320 155275178 160668983
8104 160668983 163637173 164000560 163262459 161740325 161186954 164374617 168103536 168341359 168493647
8095 168493647 169460587 170135651 175258572 178989138 177677738 175270007 172205163 167668629
8087 167668629 161003732 157110236 157579508 160271394 165655658 170507119 171542767 171623288
8079 171623288 169593158 166982124 166941028 166681776 165385065 166299675 169374325 173234887 172532963
8070 172532963 172757093 174407179 177952433 181887964 180925598 177375263 176546237 174974441
8062 174974441 175459956 177243878 176451418 174217989 176162970 176603828 173894104 176030856
8054 176030856 177686864 173390268 174580947 180125901 179732776 176151496 176733692 179230741
8046 179230741 180883417 178840439 173259445 170828975 173134975 175406990 179421257 181364056
8038 181364056 180353039 178467263 175105896 171082641 170289246 171100243 169630788 169201541
8030 169201541 168172554 169179405 172305477 172474476 169733828 167422840 170324259 173476767
8022 173476767 173995694 174767680 171471374 167776237 170447707 177542220 181953818 183698845
8014 183698845 182036035 179631887 177982333 173873318 171197473 171367966 174067149 175790273
8006 175790273 177742264 177378599 173465950 171984767 175982396 178911813 177082883 175807233
7998 175807233 175661517 175949685 175581718 173274385 175048447 176111035 178157614 182282535
7990 182282535 181661551 179458143 177500806 175951011 173546653 171857213 174015910 176757737
7982 176757737 177288864 174522150 169773057 165557175 166452930 167002453 165417531 169452846
7974 169452846 175409633 178635437 180787062 181066426 177373756 175117222 174384426 173752074
7966 173752074 176035708 179649841 181067032 182620146 185344084 184099157 183827839 183432900
7958 183432900 182353654 180875356 181507565 181055849 178520475 177577214 176086053 172317886
7950 172317886 168777381 168985347 170732575 171190959 177153298 184576996 186133210 185664858
7942 185664858 184251427 184264387 185723495 185357622 182853552 182123727 182154372 180040713 176062109
7933 176062109 174182653 173071003 174859019 173560107 170673877 171068881 174753657 178297439
7925 178297439 176173801 170009921 164909078 161556788 159234731 158067148 157713935 158741629
7917 158741629 159409481 159133665 159938894 162282907 164462033 164730839 163269211 159627611 159609652
7908 159609652 162165896 160773469 159616419 163215675 168349388 172289258 171815636 169360866
7900 169360866 166260676 165049354 166210943 169380635 171105299 168373411 164081958 161817288
7892 161817288 162759150 162808209 162124105 163467578 163814016 164488297 167514493 169506702 169406682
7883 169406682 165500500 163618926 165834398 166354954 165271411 168073036 171375268 171315464
7875 171315464 169690136 167712797 169129603 168265830 170030639 174280343 175350354 177884810
7867 177884810 180567855 180088333 178217144 176179444 177580946 181324042 186422389 190380804
7859 190380804 191200968 188578313 186636628 181575654 179049895 179315338 177182366 175641044
7851 175641044 171683688 169052307 168536239 168395918 169163697 171428952 175887477 178660271
7843 178660271 180854954 181960867 181223731 180568352 181089974 181697710 179997980 178348540 175003957
7834 175003957 172968700 173758921 175183345 178426608 178726828 174585773 172652862 175169539
7826 175169539 176546955 174933010 171653071 168294506 169475576 171990776 174827424 175979832
7818 175979832 176703046 178260963 179232744 177598705 176388902 177173991 175210435 169804208
7810 169804208 169266471 172636765 173881305 177493977 180917894 183825779 186932699 189343492
7802 189343492 187673183 183455250 181967646 182138113 184045456 186091907 182705142 180292800
7794 180292800 179945449 178619155 179734376 177746699 174936966 176906994 178585212 178903386
7786 178903386 175826758 176488176 179121841 179443781 178065488 178048436 178058082 177150106 178110205
7777 178110205 179613559 183350028 183376567 182013155 180560273 181798619 181727058 183262213 187195294
7768 187195294 190785282 191931413 189081128 188247385 187582734 185766961 183978240 182315122
7760 182315122 182294357 182077508 182357781 182550886 180329568 177730482 175851194 173645141 172219501
7751 172219501 172984422 177767023 181748794 181936130 180696429 178073425 177650928 177687587 177912848
7742 177912848 178554141 179520044 181256485 182413049 181836383 182786001 184020290 184085982 186720683
7733 186720683 188564544 190033700 190093795 186601612 184393851 185699981 189397294 193830748
7725 193830748 193599998 191289930 193923091 197138794 196872678 196211347 194563118 192093714
7717 192093714 188908781 186669667 185834252 185284943 186135053 186616238 183667040 178544046 177394987
7708 177394987 179101639 179836773 181265042 181418460 183618561 186676278 188282924 190383637
7700 190383637 189251109 186692547 186924542 187661355 187151296 186961297 186078702 183772969 184257211
7691 184257211 184765331 182814783 181604001 179722462 181169345 182584507 183503256 184593730
7683 184593730 182477390 181985569 184657779 187088350 188318170 187725085 185227034 183024341
7675 183024341 185194077 191840689 194656416 193999171 194539157 195377030 196237724 195909414 194157522
7666 194157522 194894765 197326268 195759649 194180024 193282330 194453509 194866715 190973095
7658 190973095 190659828 193804973 196784374 196967749 196369678 196197254 195306767 195320888 198635114
7649 198635114 200745950 201251494 204295307 208891714 209548940 206346330 204258320 203937674
7641 203937674 201868555 199805918 199672704 203824584 208143620 212695640 212150808 208342651
7633 208342651 209568513 212907932 213341670 213813668 211095411 205728029 199549314 193496657
7625 193496657 189211200 188175781 187833069 182041493 175496551 170647699 167460365 163432773
7617 163432773 156125342 148555151 140941242 133055459 129629834 127980487 127419947 127706668
7609 127706668 127229443 125764890 120326261 116174015 116039304 116345862 118726646 123119472
7601 123119472 126331316 126141058 128168557 132013433 133886025 131993039 132235383 133026883
7593 133026883 133237916 133333755 133161422 137294794 139501381 139619873 138228845 135651129 134365000
7584 134365000 138057442 143743421 144569839 143873837 144845016 148019561 149046868 146599510
7576 146599510 145303768 147679578 151551176 152752633 150922904 151077147 151951060 151265128
7568 151265128 151686769 154511586 155670276 155561504 154348016 152166056 150357062 150676380
7560 150676380 152468470 156903649 159792668 160379990 161906363 161720505 158913604 155956265
7552 155956265 154353217 156161665 159104372 161516483 162194825 161900403 164239075 162420606
7544 162420606 160328104 161099761 162211461 162449114 160773145 157879897 158414381 162307848
7536 162307848 163962300 164906482 165288121 167155434 168671936 166208371 161452595 153968159
7528 153968159 151765882 155733356 160666930 160637659 157696800 157465508 158414174 158977180 156185588
7519 156185588 156711355 159996868 162854910 161783545 163448683 165416316 164938641 165637418
7511 165637418 166758484 165141035 163894575 167014901 168977353 166049515 162817931 163535760
7503 163535760 166669392 171135676 172617787 172997613 172498852 168787125 166114673 163613219
7495 163613219 164511161 167019458 165025150 162041726 158745812 157994178 159939334 161009851
7487 161009851 160940726 162936678 162992921 161252632 158616082 160444873 161242076 162120596 165074084
7478 165074084 168563262 169757427 167398509 164415267 163267410 163827331 162633897 163440837
7470 163440837 161856761 158644151 159446136 159839835 161095005 163254443 163836637 165505421
7462 165505421 167289174 168238062 168885013 168552761 165030499 161353995 158723594 158280167 158858402
7453 158858402 161329629 160741657 158026146 156082386 156583754 158601126 157824678 157094513 160867846
7444 160867846 166444788 170212180 173172825 172676851 166796641 165452444 168507342 169701489
7436 169701489 168557643 167683821 168167442 166859705 167760789 166569846 164322449 164609541 167278983
7427 167278983 165705576 163085059 162399768 162866942 163943750 161090722 160357920 161880120
7419 161880120 164966914 168609890 167819226 167133093 169036062 168973664 167690441 165056782 163535571
7410 163535571 164254857 168529058 169437798 167159435 166681949 166309065 167445984 170416347 171040549
7401 171040549 170590657 168889399 165020437 163020359 161846239 161016945 161542499 163512282
7393 163512282 167391797 168129229 169366067 173127949 176447199 178019220 177433032 174394855
7385 174394855 171532393 169358640 167272437 168392315 171435176 174538368 176101400 172992360
7377 172992360 169182106 168222033 165643480 164295487 164419191 162328064 158651962 158693566 161031613
7368 161031613 162334132 163804878 163537515 162409466 163834604 163048954 162167066 165281203
7360 165281203 168848294 168569527 168639412 167960070 165261728 165066861 167058534 170495249 170206574
7351 170206574 167697832 165610252 163146353 162800272 160538853 158610131 161470163 164312894
7343 164312894 166700808 171785371 172601118 169800903 168812665 171501596 172886423 170710366
7335 170710366 168181637 167951906 169909483 172104045 172907866 170582520 166690057 165204289
7327 165204289 166306587 171431994 174117802 173492136 175714377 174281655 173141940 172172366
7319 172172366 174044325 179988789 185303026 186833475 182760241 174810694 171687595 170847379
7311 170847379 168019729 168802664 171485857 174267195 173421213 170373043 167663152 165780004
7303 165780004 164709505 162242850 161698828 166610366 169663365 171031811 172716506 174515874
7295 174515874 176718995 179158027 179713833 175918988 171533680 173194368 178617787 180199129
7287 180199129 180302858 178658929 176428242 174475560 173429976 176166038 178808301 178370152
7279 178370152 176846052 176261644 177051375 177409905 177174637 176423317 174442001 171843732 171961398
7270 171961398 172979385 171765359 172518803 173342183 173548708 175345008 175050904 172127668 173456020
7261 173456020 174809794 172599386 169779061 168747919 167986131 167678878 165794227 167702987
7253 167702987 169364615 167934954 166686639 167388798 168182814 170414747 173737860 177431198
7245 177431198 182304716 182668917 178397651 174880779 173008541 172958592 174585110 175812337
7237 175812337 177203690 176751680 173782813 174561656 174958681 171441262 168596143 167139729
7229 167139729 169843800 171847856 175112620 177379446 179222203 179562842 179278718 177119244
7221 177119244 175628823 176040182 177624808 176699572 175100033 175764706 179126879 180419907
7213 180419907 180614737 180581720 183845038 186730698 185469324 182975498 181942632 183266024
7205 183266024 180744029 177207063 178751633 182793785 181004285 176188368 172237996 171524072
7197 171524072 174525985 178792311 174565832 168209781 167469783 170980916 173555933 172795356
7189 172795356 170993298 169924018 170114218 168300761 169468654 167961439 164813498 163464735
7181 163464735 163454632 166588996 171803270 176682919 177302284 174603619 171521836 169317258
7173 169317258 169708978 169953216 170735065 172031266 173640012 175145478 174120181 175171977
7165 175171977 174462284 172483416 173586025 175660728 176050460 176560191 176698534 174199141 169664273
7156 169664273 167160363 168084898 168895627 170822781 172703574 174842953 176065584 176268149
7148 176268149 173982982 172799555 174658308 171998361 169533921 170803453 172288491 172877976
7140 172877976 172716012 170812129 170191068 171646910 171522444 170417869 170526366 173103128 171413768
7131 171413768 170393543 173305925 171438358 169708662 172743589 176322150 175743992 174456196
7123 174456196 173654085 172980042 169947832 169331427 170586397 171493983 172629987 171513659 170250378
7114 170250378 169578828 169350632 171063901 170959060 170963423 172436306 173018495 172872140 171176097
7105 171176097 170736458 168363364 167091451 170162066 171883964 172437391 172728148 172764569 173932980
7096 173932980 177531499 178034327 177422834 175237483 173483773 171797542 169648113 166976643
7088 166976643 164891078 165227042 170587261 177504871 178422759 176373853 174196314 171445432
7080 171445432 168295096 169597352 173855147 177851354 177151047 176614734 178628086 179130623
7072 179130623 179966713 178717074 174223622 174592651 178132886 180698073 182274025 179104742
7064 179104742 176167201 177632299 177490390 175575731 177242820 178675563 177043841 174077170
7056 174077170 171466326 170363503 168046563 169618979 175356973 179116480 179896788 178206759
7048 178206759 176548854 176134396 175387905 175224371 177561546 182695125 183944886 181985683
7040 181985683 183576362 183731023 179046432 175589176 175242576 177915296 177880072 178451572 181981715
7031 181981715 177011320 169769581 170356721 170530987 170303781 172284042 172569617 169795954 168403605
7022 168403605 169775688 169060344 167344046 168105735 170850509 173596033 174896316 171600441
7014 171600441 170074684 172134039 176350325 179247387 175372259 169278311 164679549 163738872
7006 163738872 165187623 166645850 166169535 166691432 170623441 173238130 171726808 171201728
6998 171201728 174378350 175542852 173286648 171898791 173524259 174411389 174151814 174244891 176139705
6989 176139705 178436002 177897278 177486263 178122503 179036650 180598234 182089122 182628283 179171939
6980 179171939 171425308 166883347 166100133 164250708 163727306 164262961 167113954 169791376
6972 169791376 176418630 181715213 182253669 182448053 181654554 180368178 178839256 177211068
6964 177211068 175899264 173963424 171869231 170532955 170397348 173639110 174306298 173398833
6956 173398833 174407195 175394113 175738056 174429512 174462051 175266931 171485967 170089057 171818283
6947 171818283 170813334 172914872 177167833 182153326 184022553 183154547 184114620 186268157
6939 186268157 185800936 186568045 184916777 176314431 170714075 168838319 167364561 169261075
6931 169261075 173269743 174249768 174639529 174537622 172803849 171411021 172832019 175077914
6923 175077914 177804770 180130665 181495954 178358265 172804432 167507225 167214419 168979917
6915 168979917 172700642 178343186 180782927 180346300 180976101 180813883 177620952 177025083 177354413
6906 177354413 176196268 179766660 183667375 185356241 185090154 182941458 182734027 183140138
6898 183140138 184784593 185428030 187674736 184655379 177369156 171526735 168644514 171135887
6890 171135887 176210175 179621891 179103907 177813769 178509547 179479240 179189158 177812915 177667664
6881 177667664 179740214 179451173 176420688 172398474 171428826 176821540 181489608 183948300
6873 183948300 185229352 185457194 184476724 185659604 187809276 187448549 185781808 182968984
6865 182968984 181476370 177862759 176102971 176192202 174638650 173849428 175691602 176963023
6857 176963023 176165277 177348728 178867743 179830866 178502884 178141676 179594894 183771343
6849 183771343 187309354 185402397 183029395 182011996 183897002 186382085 188810652 190531979
6841 190531979 189178623 186983353 187222508 187344809 186411246 184006070 181844862 179564521
6833 179564521 178894096 177414408 178739262 179073670 179399864 179872305 180594586 183558794 184753796
6824 184753796 181859015 182792993 186949462 188092248 188948440 189313753 185945219 180669622
6816 180669622 176565741 176877459 179195121 183545807 188189445 190323103 191320328 189552666
6808 189552666 187831455 187149472 185165977 182936014 182901400 183808787 181691693 180645333 181498237
6799 181498237 181699629 181117308 178175501 177611137 179683743 181621370 187543414 189977260
6791 189977260 187761815 188575505 188476482 187319021 184771995 181895835 182874865 186966403 189869615
6782 189869615 190282642 188845675 187726102 187930874 189550841 191848912 194372721 196544731
6774 196544731 194240292 188590028 186058361 189913641 190445969 186671246 184245170 182173428
6766 182173428 182699724 185512374 187692343 185844892 183047801 182239382 183747112 187425621
6758 187425621 190795799 190273430 187545493 183670846 179494425 176581988 176824494 176449582
6750 176449582 175419909 178980259 182854512 183367400 182418945 183671533 187877305 191515869
6742 191515869 191609926 188693927 188906945 189256685 186722290 185333172 184845540 184535114 184589723
6733 184589723 184403387 184954356 187848864 191247382 193439092 193329357 190360853 190177179 191705261
6724 191705261 190359191 191247175 193993533 191222917 187456353 191738551 194048999 187355092
6716 187355092 187458887 190160245 191646825 190447721 185658484 181810470 181896391 181019079 179558974
6707 179558974 181527074 185292986 187230651 189410039 190874568 190287327 191761165 194296508
6699 194296508 195544910 196628761 197795547 200570086 200757294 201675078 204381039 206257346
6691 206257346 207264346 210168942 211027376 210699386 209503227 209730130 211405620 210671521 208056826
6682 208056826 208711419 212117196 215675612 213623569 208881158 208270949 206623454 201742193
6674 201742193 200072731 199551685 199330492 199681565 201521959 201643445 197924222 196299488 192833984
6665 192833984 186274245 186320418 187183437 183735847 181971085 182815823 181523410 183490938 187180860
6656 187180860 189307527 190938458 193459574 195756902 195707728 193994258 194488688 202285043
6648 202285043 205585363 202341382 199249452 198573506 202093800 208010929 212248750 211512409
6640 211512409 210363642 210413225 203942803 201256437 200245520 197971754 201006562 203350950
6632 203350950 206967601 208141106 205779119 203976199 203532149 204263061 203938249 201776936
6624 201776936 200400729 203597025 205950037 206577030 204770610 202174588 203084661 205129301
6616 205129301 205739343 206108596 206953068 206514591 208845484 215262114 217523935 214499969 213994103
6607 213994103 215427065 218345220 223503598 227374675 229246696 228893460 227455579 229208994
6599 229208994 233616979 236176751 239618333 244548745 247221071 240230379 224974042 198127758
6591 198127758 164083545 133798309 114275612 103758111 95464725 86767743 81441546
6584 81441546 81541498 84325426 85077035 85526668 86157105 87315156 91646181 97857204 102299091
6575 102299091 104302240 104920992 107531388 110010616 113122423 116254818 118451886 120842940
6567 120842940 122066595 123779514 127479277 129682728 132443466 131138949 127296589 128371656
6559 128371656 133496497 138546774 143171256 145625746 147483064 150517512 151286942 152400379
6551 152400379 153070652 151762813 152377766 150784929 149558610 151136577 148867071 147121382
6543 147121382 151154501 152272365 151444150 151478288 153557224 157513547 158794961 157144365
6535 157144365 159580216 159634671 158141451 158467225 157460511 159243587 160862845 161599036 166011511
6526 166011511 170210120 170958135 168618100 169235094 173011614 173876252 172911417 171913747 171418352
6517 171418352 170968982 168973135 169075065 167464841 163677138 162750895 161021197 158192878
6509 158192878 158354188 160669795 162632755 164612369 163949531 161679482 164826886 167334820
6501 167334820 167869876 166588417 166091805 166060095 165260578 163498737 162003704 164878992 170813082
6492 170813082 169141064 164479790 161850133 163082435 163640641 162299856 162299325 163057859 166722522
6483 166722522 170229969 173325350 174956406 174447558 172386110 172022253 171509644 171968336 174469933
6474 174469933 174472535 173408371 175197916 176033565 177578478 179274360 183149522 184469522 183175144
6465 183175144 185551387 185369389 182220695 181463134 180988972 180440824 179426807 179139026 183617140
6456 183617140 187447989 189155834 189746017 186173281 186348244 189785613 190770270 188182501
6448 188182501 185473537 183156388 175764207 167104459 164149675 162630621 163226733 164302989
6440 164302989 164345444 160821245 159346023 160828363 160740096 160420837 162173128 164790279 166085982
6431 166085982 166691671 168017621 168742303 168204749 163283110 159003578 159824044 162520979 163943316
6422 163943316 160716974 156135708 157682437 158943046 158999728 159674280 159387089 161985337 162922792
6413 162922792 161348344 162558213 163917822 164103379 160571703 156999528 154967189 154591655
6405 154591655 154393108 155571053 158203458 158761681 157834797 157758800 157162850 157790297 159044676
6396 159044676 161386805 163033613 163540760 161625256 160011055 161549285 160946636 158963310
6388 158963310 157298003 162467756 165534300 164417465 165405531 168933616 171027044 168386940
6380 168386940 165916048 165133160 164845488 166895760 169027779 171937795 175282499 177947149
6372 177947149 178911661 177407620 178196584 176869344 176441401 178423849 176216997 172627265
6364 172627265 170012683 168189566 166065172 163927072 162909288 164502199 165671522 164108515
6356 164108515 165745973 171666383 174554911 172958748 171305049 171464768 172935037 170221343
6348 170221343 167293761 167077135 166733643 167546054 166034123 164483495 166696975 168422928
6340 168422928 172832680 174258040 172687992 170245235 166236072 164669501 163919072 166749647
6332 166749647 169496624 168419987 167439708 169211236 169652560 165652636 163432699 165048267
6324 165048267 163665788 163303365 164577974 165086219 165408873 168686107 173177012 174651087
6316 174651087 177951562 182177653 182605640 178177041 175015003 179076893 183899071 187634003
6308 187634003 188464942 188036535 187758156 187494733 187643080 188179987 189301014 189926286 190161767
6299 190161767 188902275 185619657 185919950 186139178 184476550 183798813 181287365 180061008
6291 180061008 179806945 179284743 175949718 171755905 173641024 176173781 178382635 182124355
6283 182124355 185669205 187938925 186211785 186394672 189345685 192347182 193343579 192978774
6275 192978774 191786407 189379240 185760448 184816234 188522280 193685285 195243841 194345370
6267 194345370 196519741 197191495 198725969 200318373 196465035 193144030 189478265 191559917
6259 191559917 194843842 197998573 202065893 203463477 202293881 202002407 201997743 203455632 207554950
6250 207554950 208887876 207644387 204412739 201463137 202583002 207589205 214969248 221481107
6242 221481107 224950735 227324993 226198576 227042248 228292873 227411289 224119366 222323142
6234 222323142 220732185 217874202 211994374 204738444 194090200 185473239 183708973 178562710
6226 178562710 169859772 165339593 162656004 159308810 159195310 161280694 162877305 161392973
6218 161392973 160595639 166235399 173126375 177897098 181635115 183809063 187610207 190305676
6210 190305676 192807018 195908949 195192794 196321820 199298492 202152403 202837858 200178160
6202 200178160 193704102 183338730 166775236 148256798 131417848 119989484 113840034
6195 113840034 107275946 99867550 96460109 95727144 92099948 91681660 95185099 98559457
6187 98559457 99424351 99064589 101625409 107182130 110752443 114642344 116120823 117116751 118216201
6178 118216201 121498495 125877597 131167621 131488625 131005702 133012384 133527860 135701197
6170 135701197 138588945 140277793 141194252 140148435 141385827 144311648 145013077 144502915
6162 144502915 139666453 134242128 134867798 137615015 137226300 137888297 135919964 135581902 138292837
6153 138292837 141512344 147347143 153143144 153793005 153310428 155737098 157756765 154590240
6145 154590240 145769659 140247568 142218141 145802056 147658950 149846570 150423015 149667841
6137 149667841 147198144 147004772 149750454 150916912 152660172 155145497 156285104 158215065
6129 158215065 163076838 165808271 166450831 164621245 159576691 159321585 160544734 159778539
6121 159778539 157148001 153329960 151967104 154220308 155998557 157305892 157661739 155065243
6113 155065243 152093757 153809617 156599259 155228575 157692298 159780869 156223035 151518338
6105 151518338 149306955 150009970 150716261 149327320 150661170 155167934 156520210 153271082
6097 153271082 150329376 153390297 155995875 153994143 154683206 155471670 156146223 156223944 157260430
6088 157260430 161560320 165619320 167750959 167318026 169794741 168609781 167009517 168702582
6080 168702582 171810979 173633179 171602979 171025926 168438303 167220458 167874208 166029812
6072 166029812 163115399 162461567 161605338 162614815 164336171 166533955 166384404 164878323
6064 164878323 162514284 157415605 151125752 148960221 147526258 146531929 150251994 154504748
6056 154504748 158984596 162544454 160256388 155221906 157801256 161184776 164172358 164111639
6048 164111639 160447331 157449016 153757094 153661751 155959429 158322487 157954109 153937261
6040 153937261 152345190 154932321 157967313 158338643 161051554 163476814 163365369 162218578
6032 162218578 159854688 157574850 157986817 160356230 161925089 166133903 167991559 165006060
6024 165006060 165607441 167953468 166510911 163808270 159854675 156257080 156143369 158149589
6016 158149589 159765865 163176798 167354089 171670954 170134418 162369485 152420834 145648447
6008 145648447 146246874 148560524 148394799 148658177 149777387 151171679 150305768 149834433 152704526
5999 152704526 157582722 163046536 161329774 156577733 154403356 153639500 154081450 155345958
5991 155345958 158037277 159089175 158082781 154499717 151840656 151253974 147327081 145335317
5983 145335317 149998396 154406705 157828884 159472357 155181431 150609764 149242190 148198279
5975 148198279 147874965 147421090 151013583 157159120 158489811 158687521 161251681 160611889 160078264
5966 160078264 160228657 159785570 162511688 165527361 169132073 171184193 171450983 170488229 169863334
5957 169863334 169809111 167500153 162026177 157997808 155866063 157394285 159435868 160837882
5949 160837882 161210858 163692354 165256999 165452287 162289588 158597678 159511721 160220775 157829868
5940 157829868 153727717 151767619 149781384 147749677 147907608 145290356 145256054 144206329
5932 144206329 144526365 149782430 155427725 158882055 157962461 155783775 160028202 166013601
5924 166013601 168012414 170574167 168315847 162012965 159418747 161907423 162044887 158625806
5916 158625806 157389420 158552358 161776392 166030048 166478701 165614020 168244163 174995441
5908 174995441 177668351 175066311 169350004 163657218 164968302 168267788 169914394 171293609
5900 171293609 171386170 168826669 170492459 172115712 171072741 172920777 172559173 171115313
5892 171115313 167559739 165171001 165896808 167237751 166330529 165160144 165487085 166811632
5884 166811632 166551397 166727370 169739440 170136161 169517249 171454094 174228824 173138560 169324535
5875 169324535 170082277 172871616 174571808 174078285 173491151 172994439 174898803 176011905 173938939
5866 173938939 173982834 175957994 176033733 173977364 173985390 173891480 170739265 167753531 161986832
5857 161986832 149936381 138191042 133452190 135126627 136500984 138316027 142745949 144701758
5849 144701758 147523873 151068054 153323543 151793031 151572629 151579918 149350944 149034616 152604538
5840 152604538 155011349 157186931 163023970 166653587 164550154 161625041 157086491 151972160
5832 151972160 148791677 148461929 151279058 155396354 159654371 161195324 162501643 164008446
5824 164008446 164567309 166077694 168564287 168051255 164704017 164157204 165942482 167042514
5816 167042514 166675974 165621269 164284755 162114190 161180362 161175918 162332904 163283993 160793575
5807 160793575 159009951 160320670 161632285 166551926 170214057 169251257 167890865 167997584
5799 167997584 167908519 164603892 161898657 161270375 163247028 164219110 161422016 157848514 157952120
5790 157952120 160369828 163501345 165706428 165304689 161776880 160727669 162638776 165308120
5782 165308120 167445435 161946815 156253079 154105610 156755114 162517009 165132701 164884358
5774 164884358 166081337 167655523 166736455 166075916 163690278 161522952 159953501 156189952
5766 156189952 154856770 156356870 163500872 168192969 166748103 164399339 163100698 162520868
5758 162520868 161008384 158650550 160490816 159771004 155998523 155920451 161349421 166451163
5750 166451163 169246641 168460465 168697964 169033390 170314876 170153728 169443114 171542870 173320876
5741 173320876 171033331 166703351 169069821 172461830 171386638 168442668 168365772 166397126
5733 166397126 165614563 166153420 165638743 163377704 161499368 161525432 163285145 164765709 167097632
5724 167097632 169834361 172705308 172396347 168200292 166216635 164318566 162978984 163670735
5716 163670735 164133346 163784385 162807700 161420618 161254777 160948136 163223061 167332814 170115445
5707 170115445 171428706 172416090 171460265 172657977 175889073 178363099 178196126 176420502
5699 176420502 172419053 170419470 170348850 169016017 169230561 170868159 173223033 171795730
5691 171795730 166822023 166380107 169541344 170049344 169599410 167733385 164868695 162196072
5683 162196072 161301523 162430398 164384084 164209163 166911266 173546632 176145154 177111969
5675 177111969 177897826 178257923 175264475 172141537 172681149 171863285 168536388 169004148 172368565
5666 172368565 174301299 173643850 173888649 172398332 169660765 169751954 173044101 172344661 168049103
5657 168049103 164590441 165667768 167906367 166934507 166070676 166461478 166685126 163924602 162753821
5648 162753821 161842700 160393199 160762457 162626340 167078272 168093152 166657287 166856347
5640 166856347 167327329 168328519 168029155 169137690 171967829 174192831 170976344 169798622
5632 169798622 169767761 167415186 166830438 168505652 169052937 167225189 166489581 168584737 169833322
5623 169833322 173469868 176548031 175642562 174140879 174810854 171685394 168779139 171420965
5615 171420965 173329430 173588408 172451441 173619025 174699824 169670031 163608467 163323821
5607 163323821 166699998 166579475 166674066 171101505 171972140 168023576 167816149 169788205 169658849
5598 169658849 167892849 166574317 164566961 161939898 164290219 166889071 170366728 170495982
5590 170495982 170098760 173640505 178171051 177551699 173508051 176295987 179825341 178098105
5582 178098105 174419690 173053958 171692159 169221462 169111881 170503809 170382457 171004374
5574 171004374 173895069 174301864 176206856 180267866 181378143 183248758 182320646 177653254
5566 177653254 174132771 172430971 169377632 168863974 170419351 169819735 171577867 172607799
5558 172607799 172228644 174842616 174561980 172204901 169139059 167304539 169996743 169864420
5550 169864420 165569374 163099147 164356951 170258646 173054873 171758195 171772613 173943677
5542 173943677 174895655 174617752 174221641 172206873 170588370 168632392 169213491 169479948 168825935
5533 168825935 168359144 166981728 168163476 169371186 169042975 171571991 177928843 183515850
5525 183515850 184639818 181777034 176157742 176599875 180421623 179956938 177448596 176377725
5517 176377725 176696593 175250824 172958173 173118162 171567968 167893432 162973416 158507793
5509 158507793 158562523 161355333 165318058 166368133 164159285 162026046 164374622 167590114
5501 167590114 171526109 174733336 171773205 171670488 174450640 171997917 168309335 166540875
5493 166540875 168842573 173008887 174587997 174942334 174286627 168215614 165830879 169055302
5485 169055302 174568861 178638901 177374980 175854031 175903032 175160337 172432912 170430957
5477 170430957 165991864 163027742 161989492 162308095 162655099 159202427 158773790 161063058
5469 161063058 162439124 162963462 163010176 163269536 164588125 167713139 170570162 171747761 172303017
5460 172303017 170950975 169946153 169991231 173211084 177761682 181029723 184730995 188452162
5452 188452162 187659199 185387000 183988012 180116516 174983234 172229443 173770453 177132881
5444 177132881 179137063 178232947 176608477 173763029 173084678 176305672 178870427 181218138
5436 181218138 179621037 173717759 168910327 167765292 167339154 169324140 172608654 172383490
5428 172383490 169458258 166837239 168102522 169782091 169696389 169547307 171576071 171921155 170117382
5419 170117382 170173625 170865182 168941057 167211455 167953870 172016525 172615697 170516660 168521757
5410 168521757 168209065 166413005 164861950 163947394 163043721 162814553 162206654 165417655 167830350
5401 167830350 167169362 166766839 168913250 168942164 167996068 167486841 164889017 159703738 157833222
5392 157833222 161801405 166889331 167919739 166006421 165155958 166070770 169151300 172891780
5384 172891780 176485393 179935529 180408878 178613058 175628793 173254224 172123153 172668913
5376 172668913 175522982 178077856 178182251 177651874 175519170 172487366 169457719 167640707
5368 167640707 167983109 169466356 171489989 174109579 174399323 173531580 172761908 175664322 175348857
5359 175348857 174067692 176470572 176242842 172071454 169786057 173614852 179713096 180423837
5351 180423837 178495182 176038717 174092123 175227194 178492711 176348806 171755027 172065954
5343 172065954 173543336 172200973 169865011 171540556 171854882 174445572 177299723 178639403
5335 178639403 177087871 176416384 178463580 178888498 177276498 176627855 177310570 177140014 177449403
5326 177449403 178062779 175182964 172585248 174589227 174624082 172631277 172354408 172383192 171958004
5317 171958004 170991855 169507483 168919128 169792876 168077674 170185612 173776551 174008718 172313084
5308 172313084 170573847 170714630 170027186 167113858 166410604 169631238 172321743 171862389 170146297
5299 170146297 168279437 168390816 168855698 167151868 166203736 170054082 168824502 165819196
5291 165819196 165125530 167232283 170328354 169494702 168321035 169351548 166855421 165736173
5283 165736173 169257237 172250988 171737349 172237507 172043427 169014155 166380875 164743031
5275 164743031 163886538 163980464 166680610 170745992 175818622 178566953 177636713 175651954 173469840
5266 173469840 171852193 173698744 178514892 179874577 177371933 176538105 175436865 175282610
5258 175282610 175863052 174436477 175127608 176309333 174949757 173051829 169835088 167748876
5250 167748876 165009515 164114616 167044442 165848363 164629328 166642561 170999309 171663557
5242 171663557 166013146 162700351 160396655 159141569 161884314 165386844 167075411 167241351
5234 167241351 166946567 170122633 173080866 170543945 167113446 165346591 164308841 166336897
5226 166336897 167916909 168638683 168522979 167052515 165747893 164709594 162629089 161214633
5218 161214633 163157816 164211184 167478640 169359826 171006682 173982849 171706464 168936751
5210 168936751 170728283 174112530 176675889 176793283 177195039 174812447 173185234 176382974
5202 176382974 179485537 180134042 179855662 179877872 178672469 174679752 170016399 173484897 177702585
5193 177702585 178522955 177846835 176200599 175235911 173149909 170843132 171366184 172592544 173522846
5184 173522846 172950778 171538913 171445436 171105801 172227684 175641480 178718693 178781732 179267378
5175 179267378 179353881 180445696 184043145 181795795 177894351 176222409 174775074 176416646
5167 176416646 176088954 176662853 175530355 171979472 170675596 173450985 178080337 179014205
5159 179014205 180754758 181085558 178274174 175592139 172628829 172542800 173398471 173790090 175539501
5150 175539501 175423552 174657695 171919259 170433551 171351158 174784041 175415296 168294270 164228487
5141 164228487 167015850 170705353 174277184 176118723 177196752 177599987 176657412 177734386
5133 177734386 178327513 175251493 176226141 178563806 175880443 174038139 177293227 175921263
5125 175921263 172673873 178216858 186656255 184548574 178245032 173731205 171303073 170859303
5117 170859303 167889794 164715968 162180860 164119003 170759477 176127690 179382810 178150752
5109 178150752 175970835 174943159 174101181 173328204 169187854 167155719 170509353 174893957
5101 174893957 177595773 180303927 182278129 181267139 179223173 174490006 171498745 172091908
5093 172091908 172130827 172173220 173266375 172684366 170824650 170076587 172122938 176358482 180410257
5084 180410257 180607685 177920089 176089372 175523426 175998636 177752672 177191555 174152313 175627512
5075 175627512 178048845 179040862 181210173 181323468 175542210 172148085 173191718 173571231
5067 173571231 173435991 172003735 169241892 168488044 170882212 172935992 176179386 177822691
5059 177822691 176012929 172569373 172383580 172715187 172893334 173019412 173386207 174273606 172946583
5050 172946583 171306708 170599365 172979268 173025356 173273776 175938969 176346521 173119018 171420420
5041 171420420 172944299 174816966 174990430 172908113 169112942 168635767 171259681 172774357
5033 172774357 174031940 177726177 181543044 181577580 181744113 178677082 175101571 173216670
5025 173216670 172454777 172408732 173808818 173225494 170451463 170090744 171568044 171941409 173731097
5016 173731097 177112488 177968768 176921215 175178612 172855869 172350673 176942130 181660676
5008 181660676 182156778 179782955 177831513 176338345 173905807 172397191 171436414 171887673
5000 171887673 172183295 171448237 173079226 175059417 175458266 176210465 177155306 175602214 173406700
4991 173406700 172016773 173043944 175013035 173535777 168424244 168138958 171469252 173987320
4983 173987320 174751627 174954755 173778506 173704407 173829955 176331641 179001509 179456858 180649318
4974 180649318 180764602 180344914 180527854 176757963 175282942 176366432 176440426 178567964 179152617
4965 179152617 177437920 177768670 176861685 174447196 174843172 175962412 177752419 179208654
4957 179208654 178593715 176829683 174498304 175653508 176197603 175328654 177747147 179892227
4949 179892227 179031485 177700483 178968065 180221946 178815475 177494992 181704786 183638716
4941 183638716 179998651 178589999 178622049 179299156 180164503 179662811 177731886 174642621 174521670
4932 174521670 174711446 171276015 168002514 167889101 170617631 172276785 174859987 176464121
4924 176464121 176746540 179720484 182913600 185176804 184450694 179352791 172422767 171572050
4916 171572050 173972770 177059130 176940167 174878227 175964610 178435605 180313109 179017001
4908 179017001 174897729 173568643 171690503 171218764 172891056 174377101 175772888 174000070
4900 174000070 172414637 174187906 174961095 174088189 175207896 176418380 177302185 178689844
4892 178689844 179388887 178274913 174912540 174629404 176166799 174932167 174608200 176129431
4884 176129431 176927508 174953776 175456200 174832674 172921085 177449043 180985529 179240067
4876 179240067 175803704 174853902 174268984 173990665 173664976 174294138 173969561 172777364 172921680
4867 172921680 171076114 170039405 171297190 171550585 168831307 169383923 173851427 177073413
4859 177073413 180866242 183353142 184096126 184074650 182042924 181417421 180772736 176548259 171687185
4850 171687185 172271909 174528288 176568417 177151079 177499523 178286611 175181058 170630941 169696526
4841 169696526 173601567 177997505 181705989 180843104 178822208 181517644 183361980 186385145
4833 186385145 189610948 186993490 183906934 183033809 184779954 186113062 184536891 180803062
4825 180803062 176943094 173424509 172995168 175299136 177094160 179993652 181277886 181300357
4817 181300357 179603148 176998202 176362458 176654783 176922682 176399060 177280048 180607037 184861653
4808 184861653 188212595 187643839 184981217 182817959 181705954 179263706 176639420 177340014
4800 177340014 180650447 182250290 180093791 180642221 183237895 181936715 181285162 183982026
4792 183982026 185508702 185742816 187752549 186433692 181904302 179073280 181259456 182064519
4784 182064519 181512656 181049276 178999900 174449636 171173221 174285553 180930447 185820213
4776 185820213 184131517 180593643 177562939 174669491 174027048 174834711 173989775 174349964 175442316
4767 175442316 172236094 169724059 168593301 168410455 170472127 176216753 180991777 181651752
4759 181651752 180328409 180505067 183136388 183495495 182748947 181633835 180513400 178673747
4751 178673747 177099041 178734294 182780119 182041469 178354717 179517668 180627128 180258278
4743 180258278 178547203 172560777 167843695 167147864 168307435 171761376 173978457 175695624
4735 175695624 176818539 177525671 177290164 175193670 171813523 171284842 172137691 171419722 171722812
4726 171722812 174007477 177343420 181255214 186029295 184975652 184209453 183275169 178695213
4718 178695213 173212374 167457946 165745945 170473135 175154042 175139407 174229876 173825539 175755725
4709 175755725 179953284 186145250 186541749 183958086 182569480 182738209 184133360 182633254
4701 182633254 182367119 180435247 179590625 185484255 191222394 190921223 187396714 186038990
4693 186038990 186348028 183965565 181507079 179564990 180703536 182943923 180884898 176282905
4685 176282905 172339136 170342508 172798190 176857161 178951234 177738628 175789941 175889748
4677 175889748 175227147 177476416 181500504 185724432 185841598 184396767 182990056 178462431
4669 178462431 177508076 178955620 179643640 179041165 180037739 180622557 179369964 178094226 178566199
4660 178566199 176997815 179566345 184568741 186874722 187153350 188282001 188818229 186144021
4652 186144021 183441789 180061627 178638572 176249534 175483917 176016301 174589357 170853999
4644 170853999 169445939 171551550 173398389 173726118 176375478 176321610 174325600 173488578 171584447
4635 171584447 172549835 175615683 176378483 175120492 172541146 173185348 177834008 182420232
4627 182420232 184335328 182897176 181079219 181956000 180656387 175940007 174344850 177008285
4619 177008285 179135529 177475710 174476921 176393859 181249778 179980902 176016462 177138109
4611 177138109 180795598 183431263 183829316 181723098 180895278 179013520 175106933 171215803
4603 171215803 171735383 172655861 174827662 176502929 175396453 173907705 175138079 176865551
4595 176865551 178316939 179643603 180240901 180595763 178919685 175663856 173722093 174279298
4587 174279298 174132641 172215197 174319034 176606128 177293844 175806975 177310030 179457965
4579 179457965 178979847 178412959 176787739 177923423 178022428 177961242 180366467 182255481 183436061
4570 183436061 183407470 184135534 183645174 183828597 182684140 183602369 186233231 187096472 184553823
4561 184553823 181752288 180652613 182202741 187204895 188839612 189217956 189184174 187030837
4553 187030837 181599250 180824672 183527481 183455838 183399980 183578360 182066148 181483492 182192455
4544 182192455 184500011 187851535 190402160 190599799 192164736 193488957 192741593 189664538
4536 189664538 186211464 182397822 179010541 179801584 180775007 182460111 181951236 183695499
4528 183695499 183189253 178802965 181822233 184916876 185858852 182179439 177790190 180202911
4520 180202911 182192872 183736192 185971801 182128669 177115798 173065430 170081852 172046311
4512 172046311 178729589 181753937 182084242 181496253 177015761 171779903 170441409 171858245
4504 171858245 170845558 168461749 168636997 174745985 181587669 178903639 175485688 172841273
4496 172841273 171678808 171965537 175911748 179791555 179679487 177993627 176255233 175211708
4488 175211708 176470633 179292963 178392583 178287353 181421534 183104219 183006151 183154471 186144073
4479 186144073 187049850 185864885 187422972 193577545 196159534 195618897 192711786 184740676
4471 184740676 176211973 172682513 176397181 175935201 175100148 177249535 176097508 174150261
4463 174150261 173565809 174490532 176234219 178000159 179585536 179043068 176224964 170977088
4455 170977088 166348014 168705562 172111097 174051049 175330916 178153395 180770741 184204016
4447 184204016 187929429 186363936 182516863 181000792 183796656 186225983 185081575 181968292
4439 181968292 176909421 175227879 176743714 181901255 187196393 187906181 186106289 185529775
4431 185529775 186736337 186656457 184365886 179820486 175366925 174942964 177305013 179930735
4423 179930735 180390171 178985155 179350805 179583272 178389932 178894683 177804153 175278138 175027280
4414 175027280 175406006 177698963 178168702 178238376 179023211 181369459 182326299 183062306 182232011
4405 182232011 183538506 184847784 186994671 189975641 190664937 187628404 183811724 183186689
4397 183186689 184561064 184478833 181936743 180586028 181148759 182517247 181602165 176086219 175342871
4388 175342871 177737791 181911036 183546246 180030941 177476521 179007696 178807878 175903473
4380 175903473 176072039 180249366 181764450 180403250 181631006 184287154 186032225 184660494
4372 184660494 181783003 181687167 181137345 180298070 179883640 176933922 175919847 179168503 184648061
4363 184648061 187321795 189270497 190706437 192413909 192128127 189158563 185889117 185582024
4355 185582024 186013197 184049512 185830186 190788984 193130798 190075219 188095504 188737727
4347 188737727 190405916 192991157 194016801 193235127 193450800 194780084 198247112 200811337
4339 200811337 199597442 194495034 189151986 186220685 186795226 187708652 186809369 185169381
4331 185169381 186983894 192740221 195030704 195280863 198622724 201089094 203013225 204116538
4323 204116538 203216841 200794097 198710452 197264237 196721672 196608657 197735263 199278966
4315 199278966 200804339 201364625 200794195 201220007 201898130 204772270 206544972 208510042 209331684
4306 209331684 210947373 214379738 217798999 217370382 217615591 220874675 221399246 217093487
4298 217093487 210194211 196464526 184819140 179138540 175245117 173878334 175719176 178542330
4290 178542330 181265034 184086724 182946044 183066868 182265420 184159363 189183897 191098202
4282 191098202 186420861 181542574 179123747 179893791 182101650 187171257 189559528 188525776
4274 188525776 188638435 192007490 196969278 200639528 202513415 202835687 203231384 205544798
4266 205544798 207104971 209712495 216465552 221119091 220961532 218213431 220320565 224852097
4258 224852097 226420921 229011209 231552415 236964440 242863042 245783094 251690236 259700129
4250 259700129 265396093 268276288 271505970 275643117 279701541 276749705 262149203 237820506
4242 237820506 202247134 168046348 145757466 130504664 124257429 124170440 121137200 112288207
4234 112288207 100301227 90330179 88253705 91202994 96346485 100655480 102082182 102497347
4226 102497347 103486020 106454647 112859675 121159916 129609912 134789907 137855829 138357076
4218 138357076 135206192 132139048 137986869 145541368 149111823 151575656 153444148 152421123
4210 152421123 152172196 152992951 155341882 157304157 156804144 155613168 156283801 159635188 163554007
4201 163554007 166700839 169890020 170071747 170903072 169247099 165753942 165992749 168297703
4193 168297703 170061901 172195262 171958199 171815786 173356065 176038713 180076588 182476762
4185 182476762 183245195 184374192 185837020 186390339 180208788 168163712 159872877 155941868
4177 155941868 152826885 155289961 159801741 161508930 163051275 163175915 158833460 149784159
4169 149784159 142445080 140270307 141819768 142658501 139890008 136591446 138792463 141367750
4161 141367750 143328339 143511865 143521260 145917818 146189389 143574706 143338332 146478707 150085379
4152 150085379 155510314 161647056 163110261 160156658 159381214 159275621 159012403 160509150
4144 160509150 163110499 163061874 160402590 158928827 158612957 157923212 157509002 160425260 161857596
4135 161857596 159522844 160116667 162602151 168161472 170568480 168567003 170151655 169480813
4127 169480813 166631407 164398047 161152690 159759620 160181609 160802060 162925516 163663730
4119 163663730 163926073 163276987 163439764 161037356 156154414 156146680 161721715 162360690 160027400
4110 160027400 160947519 164825414 170413429 174205789 173609666 171542058 170334190 166566886
4102 166566886 162029921 161822976 164097409 164549740 163772853 162929393 163714470 163117299 162538041
4093 162538041 169775526 176777647 178609236 178018680 175002361 173654650 174559046 171167803
4085 171167803 167277698 164295721 160298376 163755379 168433556 167111560 164522822 164548583
4077 164548583 167023155 170574971 171330738 170971777 172133878 173593831 173992312 173930679 172121594
4068 172121594 169783342 167262363 163346532 159689284 160339533 161954388 160646611 162212566
4060 162212566 163045474 162894110 162819138 163684289 163943927 163394045 164003469 165639611 169194730
4051 169194730 169077226 165449783 163679023 162390112 160981917 161934459 162110310 162463506 165092428
4042 165092428 168313141 166731411 162324489 161172315 162681441 165095457 169325502 174057127
4034 174057127 175652577 174188328 173262897 168631701 165633919 167748696 169145812 169416105
4026 169416105 169762910 170663792 170748735 169334224 169509329 172726367 171240459 170165809 171835214
4017 171835214 173433408 172942666 171089759 169594103 171512363 172008869 167967832 165356622
4009 165356622 165646084 166367440 166975595 168937156 170400561 170997356 170801395 171390481 172500483
4000 172500483 171274583 169311023 170471793 171154545 172108143 173841709 173492812 171357074
3992 171357074 169174350 168804259 171922921 173323433 173373343 171895498 170762210 171793551
3984 171793551 171704990 167321836 164661652 167420113 171693477 172771211 171626959 170359441
3976 170359441 169780474 169761845 167495491 168167799 170409646 173007182 173874942 172540697 174107370
3967 174107370 174905249 174712906 174931346 176693614 178883443 175381107 171749157 171493041 174255092
3958 174255092 175272899 176781001 181028025 182970248 181334034 176854226 171531004 173713055
3950 173713055 176027213 172962136 168474727 168769812 173094975 177055892 176851272 174284583
3942 174284583 173883025 175717504 176294178 174417395 175085232 174550276 173069933 171660952 169536722
3933 169536722 165974854 164776061 166042448 165742950 169053776 172490181 172810466 168864885
3925 168864885 166793731 164683132 160195609 158029726 160025618 163088833 164107173 166105879
3917 166105879 167709185 166914158 169990132 175950068 180271709 180322466 176611162 176381833 176086720
3908 176086720 175506686 174192391 169740996 164549955 162713214 164782246 171272502 176136192
3900 176136192 178970382 180318241 178105692 176305680 174291847 174843941 178411833 179928328
3892 179928328 180312907 182672289 182971020 181224088 178898410 176414565 172059172 169471612
3884 169471612 170164171 172873552 175692248 177604968 176907283 174481027 171096164 169794319
3876 169794319 170387522 170835780 173031003 175371957 176064996 175264898 172641448 171003719 172319448
3867 172319448 175240594 176235954 176330301 175946965 175015071 172880951 168683729 167613907 168026988
3858 168026988 170116223 170415869 169949617 171054973 171244573 172973072 175100501 174441821 175639826
3849 175639826 179505960 183099566 185215647 186847859 189602990 189181181 185950907 180107343
3841 180107343 175166314 176908127 179251549 179030315 178039002 174862289 174079415 179501028
3833 179501028 182366928 180176611 177052698 174955217 175042392 177982392 178001869 176347289 175329535
3824 175329535 175934495 178456605 179108200 177694039 176432591 170942433 167783929 167295237
3816 167295237 167862350 169373385 171566274 173483221 175426822 174660492 174362228 175112089 174588613
3807 174588613 173280868 171014391 170316177 170758782 173082116 173031110 172471714 172540516 172835371
3798 172835371 173205605 172364692 170516595 173539440 179222511 182180273 183270148 183451886
3790 183451886 182693600 184176843 184982520 181705594 178226191 179244597 180541785 179467986
3782 179467986 177935913 175236025 172056374 168133784 166940115 167614114 168339050 170405821
3774 170405821 173745440 177158954 178602248 179163622 180630767 178880116 175182870 175864980
3766 175864980 177603023 175512433 173765335 174320124 175803777 176251533 175041422 174339821
3758 174339821 172849700 173510745 174874452 173577857 172872260 170614788 170304176 172002065
3750 172002065 171277280 171997494 172870983 174378068 171543645 167769934 167977702 170958448 170438888
3741 170438888 170435275 174120176 175513311 173972060 175356391 177845110 180707765 182617444
3733 182617444 181290932 181269380 183165636 187011680 187211336 187069404 187729341 185409299 182950704
3724 182950704 182341869 180516063 178878915 180144074 181481730 182965613 182976375 184260868
3716 184260868 183487612 183156530 185958643 184870169 184359150 183699067 180350153 179829390 180028961
3707 180028961 178597048 176543932 173848510 171815812 172936304 177229451 178688497 177385621
3699 177385621 178004097 177505487 175895533 175310681 172405552 171665345 174045414 174997295 177188263
3690 177188263 179808845 182090640 183590971 181703561 182683443 185790006 186154987 184967452
3682 184967452 184385427 184660305 183800679 183596155 185234593 184749995 181574754 182303416 183256426
3673 183256426 181278608 180495984 178787286 178872332 178960533 176024951 174007524 173765373 174117824
3664 174117824 173600456 171726789 174236260 177447446 178444917 177422601 177587005 179861389
3656 179861389 180376111 178711631 178810609 181645423 184726376 182780734 179581053 179869866 181884920
3647 181884920 183690489 180278299 174985656 176605261 178715741 176143075 177069286 178400897
3639 178400897 177578588 177912651 180128263 182085792 180157071 181202858 183596194 184142569
3631 184142569 183534445 187093293 187696874 183264108 178439994 175675902 173881911 172660245
3623 172660245 172245959 171657569 172145488 177001656 183815923 184482076 181146497 178088576 176422916
3614 176422916 178312103 178575462 177076260 174802079 171243697 169289078 171844665 171620472
3606 171620472 170605862 173511905 173961208 171542342 173621508 178210536 181042448 184346476
3598 184346476 183180375 180400663 180030531 179695762 178029330 176707867 178363947 178834009
3590 178834009 177738460 179048435 179967092 181452007 184243795 182958879 180318193 176414858
3582 176414858 174710500 176294489 178675888 179739714 178625448 176326691 174845692 176160102
3574 176160102 177624425 180022444 181534236 184461634 188031513 188416908 186588028 184870622
3566 184870622 184170051 183602910 183683823 181549219 179480184 179843942 184568783 188907877 188585438
3557 188585438 187324753 188150264 189996761 188889670 186352635 182661558 177366909 172699258
3549 172699258 174143843 175692932 178485593 179423722 175072853 170728280 173114894 177851365
3541 177851365 179972338 179199083 178222851 178890093 178400391 180215809 181485207 180228698 180662367
3532 180662367 181146150 182064130 182676254 182704525 180112098 176242869 174432271 173912737 173217651
3523 173217651 170565059 166814979 163647322 161232737 163012845 168446052 175770406 178117440
3515 178117440 176083131 172436012 171169130 173184221 173409102 172605219 174118086 175786118
3507 175786118 177688068 177955488 175754191 173674843 172578017 172866003 173353865 173793811 173763392
3498 173763392 172211740 172880437 177518310 181324219 183181192 185085165 184840193 182237307
3490 182237307 178920121 178754693 177830834 179891971 184032886 183414326 180233091 177880254
3482 177880254 181321554 182560381 180926331 177995466 176582271 176596218 176086439 177439812
3474 177439812 178070078 180024793 181707783 185941135 189265119 188401042 185273130 181793507
3466 181793507 179520064 177490697 173800456 172097376 172653160 174644923 177204708 177197837 177043499
3457 177043499 177312183 176583622 176558918 177345687 180241003 183098944 184037860 184028131 183188810
3448 183188810 181861120 178625756 177348506 178203570 177923458 177891400 177537649 178397002 178527706
3439 178527706 177507910 178910853 177028238 172753797 168373054 166049045 168857725 170668256
3431 170668256 174263428 179139138 179081134 175368903 174497547 175030526 173363968 170316073 169628203
3422 169628203 168829941 169163186 173689664 176675407 178809263 180902111 181830376 181103946 177801120
3413 177801120 173033770 173663584 178172526 177827436 177113648 179943069 181415031 179905569
3405 179905569 177988578 178789065 180856725 181037408 179769476 179742199 179319091 176003006 172895963
3396 172895963 173956898 172207037 169574173 172303862 174722187 175909001 176697385 177359545
3388 177359545 178772786 179500355 179085492 179733885 181443926 181393582 182260456 182058169 181720035
3379 181720035 183364910 184033552 180784668 178416027 177004167 178490317 182881773 183329433
3371 183329433 179873649 180306258 184336596 188009483 187138597 183883204 184837865 186272215
3363 186272215 183664851 180299486 181439150 184250733 185388262 184161617 180167853 179661083
3355 179661083 183176648 185646751 185417654 185054048 183358864 181564351 182639622 179464777
3347 179464777 176566591 177843313 177124679 176861358 175400417 170049845 168445993 172275748
3339 172275748 174245404 171929077 172186869 177917296 179520544 175549744 169575095 166446686
3331 166446686 165852643 167854796 168698953 168537575 173577648 175035047 175680132 180042061 179249110
3322 179249110 179038723 179379288 177445284 178773606 178835528 178513122 176924455 174739857 175909025
3313 175909025 176547703 175545011 178435781 179528802 177224720 175421133 178114797 182517014
3305 182517014 185717587 185384671 182782314 178933166 172543543 171562141 171575968 171994296 174563602
3296 174563602 174544561 174914018 174440687 175025568 176089585 174025634 173211335 174824253 177977671
3287 177977671 180706581 183837287 186659429 186678294 183722155 180273611 181336868 181865542
3279 181865542 179640380 175679466 173772679 176354830 179653739 181092325 180932412 179280921
3271 179280921 176832458 174285545 170002613 167569067 168690885 172720632 175490261 175189577
3263 175189577 176769932 178482428 178184541 178729834 177548742 178625250 182989095 184874301
3255 184874301 184675677 183129842 180181739 179614972 178841304 175301804 174925062 177205979 176859221
3246 176859221 175594195 176566383 175932310 173590197 175920883 181395897 183345538 183323808 181829584
3237 181829584 179156653 176768303 175730625 178601691 182161049 183515947 185301209 186221038
3229 186221038 183980837 183496534 186636651 188617997 189946334 187570773 184063808 183483967
3221 183483967 183306224 182902960 181731755 180729167 183077750 185398887 185950747 183764350
3213 183764350 179925984 178333071 179697391 182922191 183853031 180836896 175994427 173990585
3205 173990585 175908492 179548082 181680390 183491068 183409784 183769500 185034490 184600116 182475419
3196 182475419 180614189 174920614 172326484 174034697 174723756 174364985 173735616 171600677
3188 171600677 173230938 176192046 176645279 178503308 179736091 178639327 177530598 177751599
3180 177751599 174458244 170606186 170508878 169637732 172009570 175621970 179949640 180782120 179951679
3171 179951679 180164629 179899722 178644935 177221357 175274745 173627835 169554397 167370449
3163 167370449 170073711 175827786 181156840 184241403 183483963 183782165 186567757 188954532
3155 188954532 187891284 182808663 179054074 178620987 179422271 178707598 178845587 179816146 180570731
3146 180570731 180249370 182087961 181259438 177830717 176428585 177690740 182337568 183362178
3138 183362178 183386930 183931002 184429132 184406376 181440195 180699794 180586985 179670325 179081948
3129 179081948 178857873 179235719 181573171 180651556 180703505 182032177 184255357 186930487 187744894
3120 187744894 184954828 183276659 184205923 184912538 183144362 180531761 182507480 183564607
3112 183564607 182752528 184146494 184172271 184302346 185670096 187961068 187974627 183515882 179002025
3103 179002025 177472166 179791817 183983184 187399185 188057077 186114571 184375408 180710702
3095 180710702 177790553 177741919 176596911 176859691 178123375 179258576 180975037 181754997 181494537
3086 181494537 182080157 184193865 185881461 187391089 187540479 185348834 184496702 183632029 182950736
3077 182950736 180895738 176933430 174656495 172748759 172388103 173083195 175779633 178678823
3069 178678823 180010318 181678680 184993217 185931299 187164036 187026161 186740344 185777345 184935975
3060 184935975 184095465 182338100 177223390 170860894 169536402 170654318 176686668 180714181
3052 180714181 180354604 177798776 174870037 177194825 180051873 181853481 181383490 178903681
3044 178903681 175373971 171435490 167542918 167475368 171565358 178051107 181808068 182589329
3036 182589329 183324488 183916446 181863240 177126254 180291897 186168374 185678044 183618690
3028 183618690 184583544 185095967 182133843 177479176 176248142 177533948 179705257 178981839
3020 178981839 178436740 178902711 177770704 178532480 181886609 182879941 181312906 182322066 182169353
3011 182169353 178019928 178491369 182521468 181908170 180554776 181710699 181421293 181243057 179328581
3002 179328581 177112178 174178334 170389360 171736488 172305400 173570932 174932235 177275667
2994 177275667 180967845 182376180 181514193 178694876 174868801 173927526 177273387 179984519
2986 179984519 182911386 184370661 183515115 181007789 177735226 178621535 178168489 177061593
2978 177061593 177924915 179730479 180469334 180044459 179961253 179116841 177582342 177162843 177730972
2969 177730972 180357989 179536613 180555414 183493156 186052694 185794469 185073993 183580570
2961 183580570 180831523 180448655 179296784 176198453 174095899 177012291 181209675 181563353
2953 181563353 180219318 178996502 178345030 175085421 171947449 170066439 168548144 167052254
2945 167052254 165284625 168352549 174394586 180111380 184719292 184551275 183010881 181030787
2937 181030787 179897895 182498971 185395183 186899604 184003638 179595638 179259926 180254952
2929 180254952 182897341 182671142 178795365 177065667 176150117 177563780 178835196 178761044 178386475
2920 178386475 183842010 186249009 181160699 175150723 173148930 173375851 178067808 184154117
2912 184154117 187555943 187934790 186671706 187989890 190001694 191213157 190988755 188782161
2904 188782161 186163514 183322899 180289303 178031843 176792258 177709062 182007317 183762796
2896 183762796 181281605 178498402 174199106 172447233 174056538 177584967 180243138 181575590
2888 181575590 182409541 181906523 182145950 181406814 181045045 178953218 175410895 174852524 175066639
2879 175066639 177719224 180110413 180143156 178109815 178296785 179611962 180615969 182049828
2871 182049828 184046115 185912736 187476249 189921973 188752586 183929920 182570176 185603531
2863 185603531 187433207 187524148 186876170 187387731 186424015 183853288 181923778 182358179 179876874
2854 179876874 180195159 183011296 182496690 183370577 186879416 188954933 190346451 192796271
2846 192796271 193602637 192811966 190124677 187165571 187499605 186063283 183891057 185857723
2838 185857723 189330478 190828183 190020184 186555190 185200495 185385717 186206030 188840672
2830 188840672 188312723 180715596 174820112 174551949 178724814 183227282 184878163 184104164
2822 184104164 179819993 177252141 176644350 173333419 169113703 170736191 173757211 175568461
2814 175568461 175493755 174668153 177313882 180882157 185813030 190211961 190588551 187890929 185102915
2805 185102915 182883480 182305590 181544196 184784689 188524928 190146861 190877409 190270436 188161509
2796 188161509 185108050 184379235 184012046 184811482 186609675 184457762 182823721 181082313
2788 181082313 182601035 185216815 182926640 180323377 180397467 184105559 188030382 189068796
2780 189068796 189547551 190650136 188578201 188565446 190417910 189322472 187419313 185261397
2772 185261397 183326060 182481059 182194150 181714416 181152253 177949508 176891294 179201006 181679400
2763 181679400 180872118 180994624 180083897 180010149 181295565 179612519 179835016 178050020 175363181
2754 175363181 177376790 181565864 183221908 184162881 181884521 178213487 179783401 181690653
2746 181690653 181167855 182545191 185137066 188372418 189801150 188503848 187204675 186520138
2738 186520138 186137584 187058579 186221534 185260943 186303441 186747270 186617524 190060483 191215240
2729 191215240 187724952 184169681 181499270 179377372 175559931 173902221 175971476 178500156
2721 178500156 181773073 183458635 185324304 186002506 183525987 179126100 177300642 178140065
2713 178140065 178595679 177401593 175330195 173880834 173298401 174035590 175751126 178523420
2705 178523420 178910157 177620798 178925738 180927312 179792431 176134965 177222278 178108522
2697 178108522 178166788 178890878 180044248 182373807 182842489 183342314 184909914 187925422 187534842
2688 187534842 188858644 189341119 185161218 182115176 178277400 175390386 177330751 178184041
2680 178184041 177084256 177503348 178981379 179926861 179739101 179488472 180234782 181411501 182087731
2671 182087731 181469003 180629068 179943252 177047876 176251037 175505409 174158861 170552730 172668817
2662 172668817 176982099 179395442 182887957 184846162 183726471 182118944 184435889 187551122
2654 187551122 185584147 180225449 177279670 174550627 174936587 176132418 177947838 177008440
2646 177008440 174577790 175371595 179729245 185235319 189707894 188491792 187838183 189301226
2638 189301226 187304930 181921788 178759766 176777826 175921638 176617277 176000397 175645746 173321946
2629 173321946 174647424 177675331 179237435 181899253 181686609 179561390 181380642 183975171
2621 183975171 186671204 189961480 189293367 186473472 185661051 186720598 187271321 185703729
2613 185703729 184400255 181888672 180533457 183116470 184227227 181922666 180683904 180354561
2605 180354561 180495029 179754981 179473103 181434005 182780103 180797349 180068014 179635200 178391999
2596 178391999 179273855 179959953 181989229 182864760 182396823 185501734 188444588 191051980 191023063
2587 191023063 188293472 186246327 183471178 179427809 175168035 175643473 179590504 182680325
2579 182680325 180983180 180409490 183705322 182945523 181584958 179990447 178097659 177754131
2571 177754131 176926785 173946877 173458244 176206023 177956911 179238116 180741138 180806986 178740473
2562 178740473 179553374 182601089 184645170 184798461 180637089 178188260 177686330 180289412
2554 180289412 184938260 187010953 188231802 189762277 188118120 187303533 187013089 182633230
2546 182633230 180293512 180581729 178990951 178378359 178540431 180344574 182421564 183077248 182180210
2537 182180210 180396098 177275479 175963847 178432814 179583202 181646461 184110721 183509722
2529 183509722 179875018 176229048 173082475 174131027 180465181 184058641 185521747 187003909
2521 187003909 186331955 187225900 189259021 186048525 184591620 183169513 178581808 176559175
2513 176559175 180688008 182232675 180503827 181443896 184892407 184977852 182369532 184008325
2505 184008325 185672127 183680046 180932616 179854990 180567392 182081112 184368037 185895007
2497 185895007 184775725 185196398 188247232 192312348 191397607 190292418 191958822 190439025
2489 190439025 189095597 191312237 189814089 186201366 186910482 191246976 192161996 189678321
2481 189678321 187496562 188155088 186825962 184971460 187229720 189848830 189941731 189158063 189002453
2472 189002453 187958123 184249341 179280246 175988657 180635006 185164125 182883623 180969176
2464 180969176 181672154 182466899 182424568 181875599 180361000 181724397 182540983 178363387 174564821
2455 174564821 174608874 180321241 182990997 183980187 186893185 184641313 184073178 185427024 185167548
2446 185167548 187198407 188625446 186399693 181831982 177944358 178671916 179682433 180940839
2438 180940839 182949622 183465840 181812739 178485087 176914763 177514277 177261526 178485595
2430 178485595 178934416 175930300 176190706 177371937 181411156 185156799 185638315 184011842
2422 184011842 180402720 176918800 176538886 179221985 182212322 181545966 178559447 179190321
2414 179190321 181853175 181423690 179756806 179576008 180725115 180857730 178676544 177447871
2406 177447871 180062904 183696794 185716241 185448958 180167527 175774073 177810859 179826585
2398 179826585 181311428 182729472 179474420 178555519 183225221 185634763 185820176 185235979
2390 185235979 187075438 189561440 187578974 184476051 186824521 190406748 189731081 188149270
2382 188149270 188279595 191606796 194591652 196030588 195540607 193720111 191777800 188786657
2374 188786657 187970355 192463563 199361366 199302935 193638628 189800915 187460297 187381732 185948568
2365 185948568 182267362 181608714 183264783 182617253 183008007 184369868 182523771 180049807
2357 180049807 179895353 181395742 182207542 184766564 187783691 188267406 188011001 188005066 187178489
2348 187178489 186333690 181945408 177519162 177382316 177603947 178830195 179997586 178521139
2340 178521139 178123398 180014522 180683358 180125373 180568081 182315624 186953239 190103834 188542600
2331 188542600 185915256 184261076 184520988 187266665 190122739 190285827 186987234 183489362
2323 183489362 182944770 182820944 182594321 181239544 182040487 181084121 176852644 177994996 180896241
2314 180896241 184828846 186566093 183127379 179781383 180094637 184081431 189015350 192172899
2306 192172899 190799876 188621794 186208398 186265337 188059447 188971362 187643058 184851546
2298 184851546 181429034 180729252 178826035 175660881 172995572 173796540 176125051 177357629
2290 177357629 179437437 183200366 185410306 183730567 181300753 180205296 180485966 180947414
2282 180947414 182618636 182963133 184688149 185164088 183754075 185047365 186939058 188036679
2274 188036679 187062719 181804417 178485668 180182591 178993124 175311788 173051885 174878912
2266 174878912 177652689 180558085 183735575 185811055 184500760 179770559 180505466 185145175
2258 185145175 188313461 189889169 186514350 182879715 181682937 181385371 181266768 179889197
2250 179889197 179780943 181851946 182714489 182814894 184225404 185504820 184162126 180476648
2242 180476648 177730497 178381176 180599531 182387530 182845674 182159932 181843338 179747373 178435737
2233 178435737 179853417 182924148 184786913 185178219 184305748 188012607 189844692 187731096
2225 187731096 184978186 181135896 179790092 181469261 180492047 176768033 175754588 178105102
2217 178105102 181260468 185315974 186836769 186575424 187064032 188092163 188052202 185393311 185482905
2208 185482905 185555863 183837853 182378671 180119956 181578245 182709984 184781415 186852354
2200 186852354 188261807 188789264 188375889 187601548 190185343 191316479 190048837 188978220
2192 188978220 186562159 185413408 182563397 182854928 185789241 186148710 183620078 180099867
2184 180099867 179518879 180770918 181121165 181020646 183370731 186846956 186732110 183872585 181140398
2175 181140398 180828916 179039490 175492807 175167168 177695387 181488849 184447183 187122665
2167 187122665 190851944 191242180 187828434 187116850 189768311 190532575 189794946 185389718 183233131
2158 183233131 186425383 188847193 188227965 189588259 191788781 193534644 196589317 199347573
2150 199347573 196167415 191241566 187394091 186908031 186826310 183521415 182929596 184801010 183224966
2141 183224966 181884400 182295388 179850869 177764380 178045243 178714097 181811034 185040555
2133 185040555 187193502 189562923 190405171 189078051 186621923 185129397 186465251 187349423
2125 187349423 187037725 185458150 181794762 177674410 176399103 180075050 184082983 187572628
2117 187572628 188520014 185143115 180028034 179027837 179964770 178864455 178516203 180351759
2109 180351759 182955186 181515070 180313790 178817512 176079530 174169787 177031357 179617056
2101 179617056 179878144 179602623 180152334 182695922 185603068 187238533 185675598 182425437
2093 182425437 181844356 184337305 186798615 185567306 180841837 177035037 176986701 180726455
2085 180726455 182171959 179654374 174730414 172002860 170898209 172024309 175589477 180306921
2077 180306921 182374603 182043101 182042690 183456497 182683533 181161629 182300661 183650154 183378871
2068 183378871 181260481 179945269 179953958 176752121 174767031 175160547 176233547 177531834 178440453
2059 178440453 180209568 184528832 188529762 191572629 190658895 189027248 187674051 186250692
2051 186250692 188276717 188117933 188787838 189239364 187651924 186996105 189395970 186315385 183018696
2042 183018696 185938617 189389307 189623076 187354128 182998491 179679736 179611021 184192911
2034 184192911 187291285 185023897 182581970 185867929 190926471 190014048 185049490 184347648
2026 184347648 187755859 188270961 185863591 183195731 183765737 184375628 179335255 178501346 182484726
2017 182484726 182653429 182301734 182185654 182803886 182329813 183246382 182721150 180942175 178687076
2008 178687076 181266663 187065660 189502600 189547811 190951166 191673224 193003496 191081012
2000 191081012 184852477 179813376 180344470 183046375 183759506 185220825 183572960 184329847
1992 184329847 185809240 185345983 185456989 183589156 182178941 179462768 176466864 180839812
1984 180839812 183867979 181991376 184370093 187286046 187344812 184670173 182662517 182552696
1976 182552696 181301324 183784246 187299852 186256555 184704235 182339840 178375808 175977200
1968 175977200 177033685 183287939 186525727 186930316 186861613 185978231 187266809 188139741 187274533
1959 187274533 186818179 187348249 185537459 184526843 187507795 188136780 186797550 188167305
1951 188167305 188752816 188980089 188590789 189374070 196071383 200557765 199638359 199741645 201266863
1942 201266863 200511142 198141088 195765958 192850180 189837702 186857022 184786691 184781082 186736619
1933 186736619 188294804 187914076 186578295 186443837 187161948 187090310 186917654 185662958 185274073
1924 185274073 187251143 187476909 186274393 181102466 178267296 182030119 184310086 184281632
1916 184281632 184422488 185569082 185222537 186437106 186165818 184034089 181517995 183170228
1908 183170228 184834159 186361164 188571358 189315959 186247619 181318680 178316294 177147419
1900 177147419 177691236 177488361 178737919 178849530 175697383 174148386 173395018 173887157 172742041
1891 172742041 170747669 172208830 175639863 179741513 181373503 180995081 178416722 178596913
1883 178596913 181197687 183786954 187027827 190969690 194209777 196175225 196845251 194325075
1875 194325075 191943223 190096211 189666870 188367774 188280075 187986931 185517548 184497587 183724430
1866 183724430 186903442 190994899 189422826 186625292 184524415 182082851 181962172 181493272
1858 181493272 180375668 181230693 185029689 186792203 184482349 183280816 183583792 181813869
1850 181813869 174851194 174516145 177207197 176798958 179413689 180936920 178391354 176583173
1842 176583173 176579106 178811359 181256480 183164908 183510343 183000431 188767216 189125858 188859675
1833 188859675 190417618 189934809 189114027 189996111 189057686 188231854 191067635 190582979 187401398
1824 187401398 185325934 185135753 185736854 185138039 183157289 183626495 188312070 190075669 187921397
1815 187921397 183926441 184927151 187136886 185579261 186654917 186866105 183982915 183002598
1807 183002598 182177105 182803236 181467941 181367569 182860113 186392059 187679861 187323696 187339228
1798 187339228 190641134 191149606 188278152 185719507 184552390 185884544 185330434 187005461
1790 187005461 187947902 184934400 181763273 181584575 183713556 182723890 181449795 182110120 181925322
1781 181925322 184756126 187351090 187563270 189963369 192909967 192032783 191459180 194574152
1773 194574152 199025287 198356194 193938071 191233205 192299411 192375020 189378646 186885914
1765 186885914 185833622 187674484 189899627 191864496 191607731 190490098 188437794 187871210
1757 187871210 190885694 192669710 193253004 195214380 196034575 194496522 191340001 188760402
1749 188760402 185772648 182063770 179035124 178843087 182954117 186168499 189570579 192007270
1741 192007270 192499048 188828184 183110052 182227947 181095126 179286044 180844855 183708343
1733 183708343 182765425 183170608 185716229 188342749 188849665 187951032 188896770 189402081 188622511
1724 188622511 187234620 187881402 188576758 189509734 190783508 189515274 189356271 190210670 189131996
1715 189131996 190273940 190486450 187127652 183786806 182012594 178999061 179411959 182245418
1707 182245418 184156186 183137966 183073256 186111408 188800785 188743366 189240255 190154613 190484973
1698 190484973 186665472 184465177 186514740 186487231 183059217 181577795 182247534 184456276
1690 184456276 183017607 178922746 176935224 176888939 179102353 182613991 185566285 181664922
1682 181664922 182621165 186820056 187031154 189363997 191833268 193124607 192761743 188630497
1674 188630497 184847200 183623955 182027014 179017371 178601219 180420086 182153566 181942212
1666 181942212 180925041 184692987 188447400 187767302 187099082 187215828 186556074 186473225 187256862
1657 187256862 185411297 182840456 182107635 181241886 181065605 180659996 182913252 182235495 178958586
1648 178958586 177330847 179792429 182353295 184132568 187814510 189635853 189309244 187031998
1640 187031998 185643438 186495619 187493967 188589179 185987200 180483953 180410127 185833697 188885005
1631 188885005 189578161 188049884 187750966 191053364 196291899 197478327 195221753 194012010
1623 194012010 191623349 186118634 183974900 185938933 187593411 186768803 186422363 185544159
1615 185544159 185572618 185245663 182117770 181228351 183218392 183356011 183431704 184628242 184303890
1606 184303890 187021033 189310628 188853253 189761745 191971789 193176097 191799819 191652030
1598 191652030 187165477 182618130 184971590 186750730 184352207 181441484 179493333 178283198
1590 178283198 179091148 183234325 188616625 191102797 193138328 195623300 195511261 194157271
1582 194157271 190680605 186776225 185454380 184758240 185005166 184586010 187622399 190781865
1574 190781865 189324756 185902050 183637083 181895014 180777669 182965215 188407391 192534624
1566 192534624 190193375 185807088 186176310 186319416 185374259 182843977 180177020 177518623
1558 177518623 177991179 182130643 182428594 181778678 182346269 180364834 179388319 180587004 182502260
1549 182502260 186352672 189965752 190370009 190135367 191885189 193740718 195200588 192984450
1541 192984450 193237966 196211664 196675835 192766109 188170065 186814638 186987484 187009653 186912466
1532 186912466 186109415 186106152 188009927 189482401 190215203 192193113 192484918 188443597 185734098
1523 185734098 184630544 185770452 188356205 191669613 189335089 183217392 177811658 177069265
1515 177069265 178331675 177861248 179539887 181714434 183258749 184447541 185430768 184903040
1507 184903040 181977135 180383836 180847928 182133690 183389837 183759243 184007875 184614893 184731200
1498 184731200 184100176 183012702 184565129 185460525 186157489 187995513 188816667 187719986 185821811
1489 185821811 186353151 188026043 188273910 186875891 184719842 184871630 184712971 183985648 183648051
1480 183648051 183111109 181112401 179876395 179140410 182079517 184198977 184195581 185484158 186378116
1471 186378116 184429417 181286227 181792726 185344967 184974737 183384057 185127814 187625072
1463 187625072 189692179 186577723 182166952 182362360 185095705 183972144 183954984 185959567
1455 185959567 186226606 186883052 186238931 181055476 175284986 173331096 175643156 179321959
1447 179321959 181282376 182118677 183200318 185733499 187193656 188780111 194619318 197477046
1439 197477046 193825072 188107990 183120143 181489246 179286506 177270070 180782606 182768117
1431 182768117 181351536 178526986 174703146 171379339 170354720 170777744 170717220 173023675
1423 173023675 173439696 175591605 177698526 176022415 175220078 178219291 181930608 182866122
1415 182866122 180804251 179641837 178453316 177987347 178008559 177198665 179568936 183897186 186351822
1406 186351822 186063531 189126656 191811518 193302125 189449948 184346580 182437310 184423795
1398 184423795 187963189 192971829 195558597 193317979 190642105 189886879 187360711 187274649
1390 187274649 189068974 187427559 187989100 190595167 193529262 197279305 197280136 194826933 192354364
1381 192354364 192199313 194412666 195479080 195972418 195141934 192759583 190398315 190518512 190498664
1372 190498664 189490030 187583759 185989873 187105701 188844773 188594574 188600578 189236310 190012630
1363 190012630 189116499 186497136 182169915 181376489 182762911 185201417 187278343 190096353
1355 190096353 190263112 188724891 188063405 190201057 190780422 188225896 184902170 184071935 184088884
1346 184088884 184240936 185646328 184733922 186969032 189836003 189858377 188690273 187785696 186598419
1337 186598419 185671295 185980553 185754736 186210046 188021416 191110521 194011345 195459359 194951215
1328 194951215 192355073 190561619 190880419 189468081 186106262 187518193 189534081 187711265
1320 187711265 188001889 186345157 183779748 184048292 184010252 187528656 190194950 187115095 183284578
1311 183284578 180827812 180187599 181278712 184721627 188895790 189600433 189100946 189099856 185787581
1302 185787581 180407914 176828170 177005474 180907969 183935562 183721618 178599357 176043249
1294 176043249 178140616 183149973 186730842 187154146 186515349 186730017 185907159 187800362 189845811
1285 189845811 188440061 186115981 184030334 184409153 183880577 183931348 186224959 188399643 186952405
1276 186952405 182735163 183427151 186982114 189375227 190262496 187404114 184622465 186052760
1268 186052760 185974539 182511153 180356423 178418984 178559774 181136872 184379962 187557020
1260 187557020 192885648 196571036 195683100 195164548 192868360 190537487 191055881 191311218 192019066
1251 192019066 194358691 196442227 196263354 195212200 191562970 186983225 186952565 188106230
1243 188106230 190943551 195197609 196712799 197403302 198942464 196726561 191802339 185496936
1235 185496936 180149280 179589561 180938642 183659097 186190676 187815479 191913635 195272364
1227 195272364 192462539 188934725 187820049 188138848 186479521 182900171 184371475 187595904
1219 187595904 187049924 185486515 185954381 188712349 188767080 187426005 185078722 185975063 188848312
1210 188848312 187985917 186731364 188224474 186302705 184047341 186184295 188231347 188270519
1202 188270519 186665997 185094440 185853646 186403328 186165122 190614338 192665113 187021108
1194 187021108 180873264 179789765 178843167 178078119 179313208 182307840 185606779 184239194
1186 184239194 181526994 181693672 182973037 184652282 185722357 185626634 187983490 191055382
1178 191055382 192714234 195365339 194603695 188765484 186099422 185258412 183692803 182221677
1170 182221677 179701920 180508675 183989872 188237590 192840790 195020892 191941623 186650530
1162 186650530 184782423 187716566 193277927 190387371 183872080 184104669 182536250 181605057
1154 181605057 185581830 188078600 189334253 187993441 182791135 181895021 182553092 184395874
1146 184395874 186070461 190197133 194888167 196581262 195533690 189384503 185704784 188160038
1138 188160038 194120964 199234841 198367111 193738977 190426913 187301025 187936108 188448998
1130 188448998 184931479 180995253 178014692 179283479 181999004 184311128 186908985 190985835
1122 190985835 191544907 189083928 187962707 187747468 186107329 184635833 181315861 181607647
1114 181607647 185461478 186100765 188720494 188700471 187341289 187123153 184426496 184502824 188008681
1105 188008681 190844403 192960004 195777066 199844963 201758693 199602757 195453792 195310065
1097 195310065 195103462 191943473 188983262 188054849 185702799 182256698 183102376 185463227
1089 185463227 186481515 188254600 190612606 192937693 194271968 193912390 194046798 196109401
1081 196109401 197375333 195741595 194164203 190754539 186817464 182145880 179477855 183825066
1073 183825066 188464668 189864344 186886317 183414180 182924541 183793968 186327548 187950893
1065 187950893 190597578 190467234 188616669 187884630 188543431 190779875 192282283 190838094
1057 190838094 188693122 187106878 183773415 181023830 180622830 180790693 182176075 183519620
1049 183519620 187589783 190686521 189089559 187436867 187459688 186695692 187494647 189746421 190123215
1040 190123215 188993677 187257133 190127350 196309121 196875471 194216868 190520122 186271530
1032 186271530 185436637 187294731 187820004 188866569 190293698 192417163 195434779 196143542
1024 196143542 194622013 191764167 190233864 193008184 194498305 195105221 193771415 189148217
1016 189148217 185539272 186480224 187268640 186803477 188476746 187266464 186119292 185628411 184432345
1007 184432345 182454259 179815744 178248735 179407722 183182889 186466333 188639383 190586549
999 190586549 191356962 189896128 186569343 185946266 184460648 183974191 189676765 195022635 196794818
990 196794818 194920020 191811107 191743688 191428943 186072503 178982254 175203175 174190643 173495165
981 173495165 172716743 175076265 177395053 177208983 179735278 181810266 182052427 182590318 183040979
972 183040979 185240505 189494207 192017702 190779400 189545567 190267918 191879548 191098972
964 191098972 188480550 187071372 184193470 180940581 182057999 184554085 187536022 189512742
956 189512742 191191926 193221324 189904864 185393618 181936041 178075117 178554149 183159863
948 183159863 186868288 183700633 182593178 187279870 194473313 198374682 196749980 196682608
940 196682608 198173765 196093244 191406191 187157069 184274171 184188423 185175003 189856600 194631612
931 194631612 195272475 196091032 196483571 193831101 188894611 185822505 183153874 182716209 184980897
922 184980897 185281837 183218794 182511740 183776868 184577143 185967344 186682625 188555986 191420193
913 191420193 192008575 191027336 189895419 190133007 187183340 187482316 190915233 191098616 187248944
904 187248944 185734048 186641652 189943652 192077248 191406097 189593789 189019947 191503445 194155834
895 194155834 195915096 199924301 199808588 196340203 195648627 195502151 193656511 191493848 191291198
886 191291198 194003357 195778881 193880674 189729285 188029279 190775448 192821046 193368461
878 193368461 193853618 192991923 193435789 195562636 196674163 197099768 196614228 192908600 187088561
869 187088561 185135826 188334709 191003062 190897904 191692377 195399491 197709042 197136124 191278192
860 191278192 187465021 187204300 189273821 191375285 192430552 192283599 189698216 187440914
852 187440914 187147439 190312176 190509845 186132347 183282894 183007857 185192865 185361606 185804872
843 185804872 187280142 189083298 191870299 191854971 191521977 193216829 195295832 194645036 193683649
834 193683649 191822578 191495990 191001027 192352952 192465653 190261294 187517646 185624157 185824015
825 185824015 186078711 183916674 180402744 177754656 177434185 179406727 184505286 189554323
817 189554323 191585739 190267381 190241049 188292451 184900577 183284012 181229606 179920607
809 179920607 179567168 181613652 185461982 189065078 188469291 188771707 191899969 193840815 196179075
800 196179075 198109734 198016477 192696248 188260577 187250615 183732118 180755280 181980544
792 181980544 186491948 190175485 190137215 185166600 182538894 180835778 176909771 177786043 184127400
783 184127400 186652170 186742800 187329343 187705215 186914286 184563026 183938943 186614087 192179670
774 192179670 195380069 194456611 191332441 189838053 191155901 191892963 190382171 188883953
766 188883953 187778633 187715323 186680405 187396566 188583117 189511281 191945517 194582471 190805964
757 190805964 186486420 184305341 184352153 183456070 182789516 186293268 188088528 186839182 184648005
748 184648005 184823543 186055166 183969734 183021585 184384453 184973792 185472324 185941621 186878518
739 186878518 185120036 180868842 175865472 172737493 174938870 180147370 183971297 186604227
731 186604227 187668831 187675112 187244293 186506877 184942016 182081263 181383137 185255435 187989469
722 187989469 187005265 187742401 188317845 185106318 182767716 181233829 181222837 181571868 184456772
713 184456772 190041076 189409330 186722496 185710689 187740420 188545557 188893865 191544106 194165927
704 194165927 194365764 192181015 191286489 192244256 191007691 188239312 186818697 187763427 187887899
695 187887899 187199433 189323691 191399163 191279215 193377479 190903940 186731161 185043625
687 185043625 185185611 185272803 185278892 186259155 186884493 189607407 189932153 188317763 186557361
678 186557361 187796058 189778852 188987120 188700655 191108099 192715572 193386751 192440558 192369491
669 192369491 191176680 189158982 187992697 188258544 191509450 195826318 199251218 198634971
661 198634971 195047992 190151051 187855731 188738592 190551572 191386851 190295137 189865678 189313916
652 189313916 186115775 184613647 186831369 189131955 187964633 185669502 185444552 187031167
644 187031167 187746294 185449371 184462682 184224309 185573745 186128900 186959227 189851295 190956762
635 190956762 189496798 190091276 189477884 184944721 180879269 178248664 177438245 179034428 182605686
626 182605686 185289968 190796486 194213052 194844546 196284251 196166796 193894559 191703827
618 191703827 191260172 192105753 192404868 190394139 189411338 191643350 191597924 190049445 189654178
609 189654178 191498118 192426604 192472364 191804020 189204313 184419589 182336474 184679806 186669178
600 186669178 188813514 188696687 187327709 184951279 184647405 183119501 179780825 178401672
592 178401672 179379184 180261167 179308989 178579537 180466960 183299041 182728514 180548374 180360734
583 180360734 183211551 186412659 185664491 183485902 183656632 187297501 190077725 188867192
575 188867192 188288113 188733939 189221876 186494630 186141455 187033052 187725936 188034673 186849502
566 186849502 187410165 188619258 188357055 189804855 192189911 193601363 193348742 191443282 189896671
557 189896671 186661146 184077057 182777202 182154593 182269899 179869742 178860804 183610175
549 183610175 186973794 187133004 186138265 184924768 186290481 189121243 185801220 181646376
541 181646376 183931936 187390953 190948100 194304639 193624856 192925651 193060017 190612728 191743893
532 191743893 193678949 194486715 193634736 189686044 187860073 190699985 191862847 189461624
524 189461624 185771304 184085893 185148516 186875591 187852293 186273165 183837391 184022494
516 184022494 184219104 181000489 175021430 172500803 175412305 177777482 176658148 177592719
508 177592719 181645440 183649852 180362413 172962423 170162170 173304675 176502620 175780565
500 175780565 174701839 177246759 180781402 181056778 182526359 186995483 191126055 191737644
492 191737644 189936715 184910313 179531754 179071307 179969973 178950571 177994496 178903926 179868816
483 179868816 179879765 178254172 178762117 182186756 182043283 181582654 185331979 184367916 179519249
474 179519249 178048580 177555295 178813639 178989045 177584367 177420414 181592718 184294038 184401148
465 184401148 181816769 180524908 181029302 178722756 177819964 179332085 182179871 185263814
457 185263814 185775793 187392730 186550024 184911230 184417166 182745199 182154957 179183142 179468181
448 179468181 182849569 185169915 185013318 182188006 180770841 181858509 182974300 183457227
440 183457227 181023523 175252929 169710996 167812406 171006265 172494362 174421820 175007097
432 175007097 174048225 173346924 171090512 171785309 174164873 175867981 179673106 181037173 182092060
423 182092060 183637493 178834736 175168081 175989491 179540866 181728042 181467696 179237761
415 179237761 177075483 175260623 171417717 168115716 167217816 166929028 165224406 163825885
407 163825885 165937299 169295833 170839021 169914426 166468984 165350167 167343085 169335863
399 169335863 168957662 166214342 163535202 163716876 166315622 168066163 168919082 171461281 172616435
390 172616435 169758824 164617720 161728846 160611014 159770928 159235163 162871453 168195762
382 168195762 169675764 168946634 167700065 165930109 164690576 166731750 168017064 168649235
374 168649235 171718927 171668629 170096708 167665185 164050729 161672312 161732530 161534461 159344390
365 159344390 157645054 160500049 161901661 160330038 160294325 163558979 165738711 166116734 169592503
356 169592503 172798257 171644403 168565981 166388382 164289758 162356932 159802693 156140708
348 156140708 155299239 158212895 161619626 161936684 159339948 158174583 158640195 159738618 162309966
339 162309966 162818900 159565658 156244353 157329151 157586962 155344174 152419175 149676905
331 149676905 148205736 148309629 149928971 149364834 148288266 147379922 146669346 147727223 148726085
322 148726085 149554495 151087529 154028115 159152170 160421402 159223309 157911645 157942251 157928777
313 157928777 157928903 156722966 154261256 153799807 156364496 156349511 155099344 152757861 149509106
304 149509106 151944345 155978460 155321024 154319931 152250025 151771485 152302923 149750159 150659342
295 150659342 151204672 149448015 149308221 148759684 150085641 149351626 145633780 142340093 139593886
286 139593886 136405537 138722343 143732891 146830359 148301253 146299379 142312493 139760812
278 139760812 142088778 145280128 145409752 143207694 140258325 139871733 141268267 141061292 139734197
269 139734197 139581754 138908915 139515728 143483615 146514457 147772806 147383677 144179300 140744652
260 140744652 141430037 141864242 138688743 134485906 132928658 133437369 137101535 139166231 137967865
251 137967865 136651812 136504422 136638481 136409929 136434420 135426346 133353255 130018565 127731029
242 127731029 126799362 129200203 131081108 129728248 127358309 125222853 125530157 128446795
234 128446795 130633006 130411362 127807397 122997262 122349833 124876782 127095690 129793662
$$ [...]
##END NTUPLES=NMR SPECTRUM
##END=
