##TITLE=C13_SR92_oil'
 d2O, 27000sc

 29.10.2021
##JCAMPDX= 6.0         $$ Bruker NMR JCAMP-DX V2.0
##DATA TYPE= NMR SPECTRUM
##DATA CLASS= NTUPLES
##ORIGIN= UXNMR, Bruker Analytische Messtechnik GmbH
##OWNER= root
$$ XWIN-NMR		Version 3.5
$$ Sat Oct 30 13:04:47 2021 Russian Standard Time (UT+4h)  she@DPX200
##.OBSERVE FREQUENCY= 50.327896
##.OBSERVE NUCLEUS= ^13C
##.ACQUISITION MODE= SIMULTANEOUS
##.ACQUISITION SCHEME= undefined
##.AVERAGES= 27001
##.DIGITISER RES= 17
##SPECTROMETER/DATA SYSTEM= spect
##.PULSE SEQUENCE= zgpg30
##.SOLVENT NAME= CDCl3
##.SHIFT REFERENCE= (INTERNAL, CDCl3, 0, 222.653)
##AUDIT TRAIL= $$ (NUMBER, WHEN, WHO, WHERE, WHAT)
$$ ##TITLE= Audit trail, XWIN-NMR		Version 3.5
$$ ##JCAMPDX= 5.01
$$ ##ORIGIN= Bruker BioSpin GmbH
$$ ##OWNER= she
$$ F:/spectra/data/she/nmr/c13/1/pdata/1/auditp.txt
$$ ##AUDIT TRAIL=  $$ (NUMBER, WHEN, WHO, WHERE, WHAT)
(   1,<2021-10-30 13:03:21.09 +0400>,<she>,<DPX200>,
      <created by zg, POWCHK disabled, PULCHK disabled
       terminated by command 'halt'
       configuration hash MD5:
       00 E9 B6 7A A2 85 ED C7 34 08 36 98 17 FE 4E 26
       data hash MD5: 32K
       EB 8B 8B 84 D1 AB C6 9C 00 C2 1D D9 C0 2A AB 64>)
(   2,<2021-10-30 13:03:24.48 +0400>,<she>,<DPX200>,
      <Start of raw data processing
       efp BC_mod = 2 LB = 1 FT_mod = 6 PKNL = 1 PHC0 = -336.0829 PHC1 = 30.16237 SI = 32K 
       data hash MD5: 32K
       40 35 E1 E2 91 AF E7 6A F1 49 84 48 CF D4 E2 6D>)
(   3,<2021-10-30 13:03:27.17 +0400>,<she>,<DPX200>,
      <abs ABSG = 5 
       data hash MD5: 32K
       F6 9D E0 CA 61 A0 CB 7F DD 29 03 02 3B 36 79 69>)
(   4,<2021-10-30 13:04:08.50 +0400>,<she>,<DPX200>,
      <pk PHC0 = 1.359541 PHC1 = -0.2000005 
       data hash MD5: 32K
       31 47 23 83 D1 30 B7 56 64 D6 30 D6 DF 7B 39 8A>)
(   5,<2021-10-30 13:04:12.84 +0400>,<she>,<DPX200>,
      <abs ABSG = 5 
       data hash MD5: 32K
       F8 5A EE 28 11 0F 0D FC 3F D5 FE 84 C5 B6 5B 2F>)
$$ ##END=
$$ 
$$ hash MD5
$$ 01 B9 7B 73 47 4E 39 8A 36 E8 84 66 05 29 2B 23
##$RELAX= 
##$RELAX= 
##$RELAX= 
##$RELAX= 
##$RELAX= 
##$RELAX= 
##$RELAX= 
##$RELAX= 
$$ Bruker specific parameters
$$ --------------------------
##$DU= <F:/spectra>
##$EXPNO= 1
##$NAME= <c13>
##$PROCNO= 1
##$TYPE= <nmr>
##$USER= <she>
##$AMP= (0..31)
100 100 100 100 100 100 100 100 100 100 100 100 100 100 100 100 100 100 
100 100 100 100 100 100 100 100 100 100 100 100 100 100 
##$AQSEQ= 0
##$AQ_mod= 1
##$AUNM= <au_zg>
##$AUTOPOS= <>
##$BF1= 50.322709
##$BF2= 200.13
##$BF3= 50.322709
##$BF4= 500.13
##$BF5= 500.13
##$BF6= 500.13
##$BF7= 500.13
##$BF8= 500.13
##$BYTORDA= 1
##$CFDGTYP= 0
##$CFRGTYP= 5
##$CHEMSTR= <none>
##$CNST= (0..31)
1 1 145 1 1 1 1 1 1 1 1 1 1 1 1 1 1 1 1 1 1 1 1 1 1 1 1 1 1 1 1 1 
##$CPDPRG= <waltz16>
##$CPDPRG1= <>
##$CPDPRG2= <waltz16>
##$CPDPRG3= <>
##$CPDPRG4= <mlev>
##$CPDPRG5= <mlev>
##$CPDPRG6= <mlev>
##$CPDPRG7= <mlev>
##$CPDPRG8= <mlev>
##$CPDPRGB= <>
##$CPDPRGT= <>
##$D= (0..31)
$$ [...]
##$SUBNAM4= <"">
##$SUBNAM5= <"">
##$SUBNAM6= <"">
##$SUBNAM7= <"">
##$SUBNAM8= <"">
##$SUBNAM9= <"">
##$SW= 239.972175391363
##$SWIBOX= (0..15)
0 1 3 0 0 0 0 0 0 0 0 0 0 0 0 0 
##$SW_h= 12077.2946859903
##$TD= 32768
##$TD0= 1
##$TE= 0
##$TE2= 300
##$TE3= 300
##$TEG= 300
##$TL= (0..7)
120 120 120 120 120 120 120 120 
##$TP= (0..7)
150 150 150 150 150 150 150 150 
##$TP07= 0
##$TPNAME0= <>
##$TPNAME1= <>
##$TPNAME2= <>
##$TPNAME3= <>
##$TPNAME4= <>
##$TPNAME5= <>
##$TPNAME6= <>
##$TPNAME7= <>
##$TPOAL= (0..7)
0.5 0.5 0.5 0.5 0.5 0.5 0.5 0.5 
##$TPOFFS= (0..7)
0 0 0 0 0 0 0 0 
##$TUNHIN= 0
##$TUNHOUT= 0
##$TUNXOUT= 0
##$USERA1= <user>
##$USERA2= <user>
##$USERA3= <user>
##$USERA4= <user>
##$USERA5= <user>
##$V9= 5
##$VALIST= <valist>
##$VCLIST= <CCCCCCCCCCCCCCC>
##$VD= 0
##$VDLIST= <DDDDDDDDDDDDDDD>
##$VPLIST= <PPPPPPPPPPPPPPP>
##$VTLIST= <TTTTTTTTTTTTTTT>
##$WBST= 1024
##$WBSW= 4
##$XGAIN= (0..3)
0 0 0 0 
##$XL= 0
##$YL= 0
##$YMAX_a= 172117656
##$YMIN_a= -64462852
##$ZGOPTNS= <>
##$ZL1= 120
##$ZL2= 120
##$ZL3= 120
##$ZL4= 120
##$ABSF1= 222.6533
##$ABSF2= -17.34351
##$ABSG= 5
##$ABSL= 3
##$ALPHA= 0
##$AQORDER= 0
##$ASSFAC= 0
##$ASSFACI= 0
##$ASSFACX= 0
##$ASSWID= 0
##$AUNMP= <proc_1d>
##$AZFE= 0.1
##$AZFW= 0.5
##$BCFW= 0
##$BC_mod= 2
##$BYTORDP= 0
##$COROFFS= 0
##$CY= -3
##$DATMOD= 1
##$DC= 0
##$DFILT= <>
##$DTYPP= 0
##$F1P= 0
##$F2P= 0
##$FCOR= 0.5
##$FTSIZE= 32768
##$FT_mod= 6
##$GAMMA= 0
##$GB= 0
##$INTBC= 1
##$INTSCL= 4.134877e-10
##$ISEN= 128
##$LB= 1
##$LEV0= 0
##$LPBIN= 0
##$MAXI= 10000
##$MC2= 0
##$MEAN= 0
##$ME_mod= 0
##$MI= 0.1934396
##$NCOEF= 0
##$NC_proc= 1
##$NLEV= 6
##$NOISF1= 120.0001
##$NOISF2= 80.00006
##$NSP= 0
##$NTH_PI= 0
##$NZP= 0
##$OFFSET= 222.6533
##$PC= 1.4
##$PHC0= -334.7234
##$PHC1= 29.96237
##$PH_mod= 1
##$PKNL= yes
##$PPARMOD= 0
##$PSCAL= 0
##$PSIGN= 0
##$REVERSE= no
##$SF= 50.3227301237032
##$SI= 32768
##$SIGF1= 140
##$SIGF2= 120
##$SINO= 11.81781
##$SIOLD= 32768
##$SREGLST= <13C.CDCl3>
##$SSB= 0
##$STSI= 32768
##$STSR= 0
##$SW_p= 12077.2946859903
##$SYMM= 0
##$S_DEV= 0
##$TDeff= 32768
##$TDoff= 0
##$TI= <>
##$TILT= no
##$TM1= 0
##$TM2= 0
##$TOPLEV= 0
##$USERP1= <user>
##$USERP2= <user>
##$USERP3= <user>
##$USERP4= <user>
##$USERP5= <user>
##$WDW= 1
##$XDIM= 32768
##$YMAX_p= 327758793
##$YMIN_p= -7637574
$$ End of Bruker specific parameters
$$ ---------------------------------
##NTUPLES= NMR SPECTRUM
##VAR_NAME=  FREQUENCY,     SPECTRUM/REAL,   SPECTRUM/IMAG
##SYMBOL=    X,             R,               I
##VAR_TYPE=  INDEPENDENT,   DEPENDENT,       DEPENDENT
##VAR_FORM=  AFFN,          ASDF,            ASDF
##VAR_DIM=   32768,         32768,           32768
##UNITS=     HZ,            ARBITRARY UNITS, ARBITRARY UNITS
##FACTOR=    0.368581032318806, 1,           1
##FIRST=     11204.5221813685, 0,            0
##LAST=      -872.772504621842, 0,           0
##MIN=       -872.772504621842, -7637574,    0
##MAX=       11204.5221813685, 327758793,    0
$$ Real data points
##PAGE= N=1
##DATA TABLE= (X++(R..R)), XYDATA
$$ [...]
$$ plain form
9346 -829242 -263591 -62961 -7374 1749430 3908659 3597004 1953084 1005129 -136756
9337 -136756 -940979 -1458579 -1699456 -2000555 -1913779 -1015857 -76073 161885 250546 228341
9327 228341 635990 712293 8345 -1129157 -1592514 -1709745 -1855287 -1357588 -1176810 -2000528
9317 -2000528 -2478114 -2493257 -2822933 -2464594 -1895851 -1205978 -902118 -1375952 -2463845 -2721998
9307 -2721998 -2579821 -1598451 -1118150 -1573615 -2046043 -1947177 -1958527 -2035899 -1392833 -1367668
9297 -1367668 -2029299 -2070744 -444461 33008 548646 1325056 1663885 1862246 1790059 850306
9287 850306 383762 1835964 2866176 2346547 866203 -413341 -723306 -232635 685064
9278 685064 912424 571670 213899 -382656 -828395 -688531 -329841 -53580 44202 482162
$$ packed form
9346h29242N65651K00630N5587J756804K159229l11655j643920r47955j141885
9337a36756q04223n17600k40877l01099Q6776Q97922R39784K37958Q8661k2205
9327B28341M07649P6303p03948j137502m63357j17231j45542M97699J80778q23718
9317b000528m77586j5143l29676L58339N68743O89873L03860m73834j087893k58153
9307b721998J42177R81370M80301m55465m72428R8866j1350p7372O43066K5165
9297a367668o61631m1445J626283M77469N15638P76410L38829J98361p2187r39753
9287H50306m66544J452202J030212n19629j480344j279544l09965M90671R17699
9278F85064K27360l40754l57771n96555m45739J39864L58690K76261R7782M37960
$$ plain form
9268 482162 28494 -1013226 -1151701 -1166014 -2285697 -3185583 -3394405 -2792840 -1867826 -2063786
9258 -2063786 -2711381 -3010696 -2599725 -2447109 -2107247 -1323876 -48211 211861 -120039
9249 -120039 224850 948397 1141494 818229 333503 202765 -221961 -247223 365896 428133
9239 428133 -932080 -2164844 -1153971 -304859 -212052 -475116 -701457 -966715 -1223120
9230 -1223120 -1257486 -1126728 -1514459 -2439497 -2978972 -2984951 -2615812 -2289765 -2684957 -2367254
9220 -2367254 -1287424 -369999 55362 217938 -100054 -564101 -1051616 -1202476 -1261899 -1578081
9210 -1578081 -1703717 -1683072 -1101128 -794680 -1578049 -2200750 -1574363 -925159 -449401 -448785
9200 -448785 -1225122 -1614251 -1018060 -658357 -987478 -1529279 -2124906 -2086685 -1536278 -1078406
$$ packed form
9268D82162m53668j041720j38475j4313j119683q99886k08822O01565R25014j95960
9258b063786o47595k99315M10971J52616L39862P83371J275665K60072l31900
9249a20039L44889P23547J93097l23265m84726j30738m24726k5262O13119O2237
9239D28133j360213j232764J010873Q49112R2807k63064k26341k65258k56405
9230a223120l4366J30758l87731r25038n39475n979L69139L26047l95192L17703
9220b367254J079830R17425M25361J62576l17992m64047m87515j50860n9423l16182
9210a578081j25636K0645N81944L06448p83369o22701O26387O49204M75758O16
9200d48785p76337l89129N96191L59703l29121n41801n95627L8221N50407M57872
$$ plain form
9190 -1078406 -811484 -432183 184675 1653015 2539106 1415296 184745 -530667 5850
9181 5850 6941 -897296 -1393610 -1208666 -1387090 -860667 69337 919140 1761338 1367658
9171 1367658 836631 272807 71554 555228 538783 286918 -222072 -827703 -1254817 -1391792
9161 -1391792 -1356970 -1357659 -1412499 -2301263 -2711098 -2482777 -2368228 -1930144 -1125518 -1102460 -697042
9150 -697042 -524673 -1622198 -2852369 -3119813 -3053194 -2505375 -1771573 -1131838 -1359745 -1922593
9140 -1922593 -2080843 -2586516 -2786632 -2333987 -2452300 -2766315 -2415885 -1827646 -1951353 -1392175
9130 -1392175 -900961 -1012828 -523939 -59365 -179070 -294786 -1048105 -2242132 -2300552 -450316
9120 -450316 1655618 1368872 148497 -431705 -1197036 -2308197 -2917000 -2640538 -1762710
$$ packed form
9190a078406K66922L79301O16858J468340Q86091j123810j230551p15412N36517
9181E850J091r04237m96314J84944j78424N26423R30004Q49803Q42198l93680
9171A367658n31027n63824k01253M83674j6445k51865n08990o05631m27114j36975
9161a391792L4822o89n4840q88764m09835K28321J14549M38084Q04626K3058M05418
9150f97042J72369j097525j230171k67444O6619N47819P33802O39735k27907n62848
9140a922593j58250n05673k00116M52645j18313l14015L50430N88239j23707N59178
9130a392175M91214j11867M88889M64574j19705j15716p53319j194027n8420J850236
9120d50316K105934k86746j220375n80202p65331j111161o08803K76462Q77828
$$ plain form
9111 -1762710 -731350 -166782 60403 355707 595482 1107804 1631576 2048766 1861802
9102 1861802 1188045 381886 13510 -45436 -118025 -1050130 -1466966 -1546488 -1562832 -1230713
9092 -1230713 -1088159 -1041153 -1352566 -1807091 -2003971 -1410223 -450479 211311 -1162051 -2674294
9082 -2674294 -2559764 -2147940 -1559331 -521834 533464 1663294 1819505 1309315 813729
9073 813729 -56286 -557305 -488296 -953788 -1368380 -1995360 -2278712 -2629688 -2587630 -2712078
9063 -2712078 -4094149 -4559282 -3284530 -1829220 -973607 -313928 -547939 -639191 -750132
9054 -750132 -937868 -501626 -96320 361645 853537 691982 -332818 -683795 126278 -224848
9044 -224848 -1263270 -1429228 -548272 42422 542951 1038738 1683503 1594054 1644809 1508740
$$ packed form
9111a762710J031360N64568K27185K95304K39775N12322N23772M17190j86964
9102A861802o73757q06159l68376n8946p2589r32105m16836p9522j6344L32119
9092a230713J42554M7006l11413m54525j96880N93748R59744O61790j373362j512243
9082b674294J14530M11824N88609J037497J055298J129830J56211n10190m95586
9073H13729q70015n01019O9009m65492m14592o26980k83352l50976M2058j24448
9063b712078j382071m65133J274752J455310Q55613O59679k34011r1252j10941
9054g50132j87736M36242M05306M57965M91892j61555j024800l50977Q10073l51126
9044b24848j038422j65958Q80956N90694N00529M95787O44765q9449N0755j36069
$$ plain form
9034 1508740 886126 21953 -1086664 -1913161 -1258067 -378804 238515 -147009 -544308
9025 -544308 -267817 44292 249721 892434 917134 643770 97111 -215847 61721 150388
9015 150388 668433 856970 1385015 1760842 1098369 1378105 1787139 1144197 1070301 872476
9005 872476 351403 -297454 -1220789 -1926880 -2386523 -2093596 -1459280 -1261426 29869 486865
8995 486865 -345770 -1022370 -703483 -671949 -1148823 -1265660 -275827 976150 1104973 777218
8985 777218 773107 255966 -20838 -620839 -807188 15740 600893 839235 640842 -153958
8975 -153958 -284143 -503393 -397616 -381987 31946 717718 130920 -280318 227907 935168
8965 935168 792794 -112336 -810565 -909356 -1043848 -993080 -399565 559785 765841 449183
$$ packed form
9034A508740o22614q64173j108617q26497O55094Q79263O17319l85524l97299
9025e44308K76491L12109K05429O42713K4700k73364n46659l12958K77568Q8667
9015A50388N18045J88537N28045L75827o62473K79736M09034o42942p3896j97825
9005H72476n21073o48857r23335p06091m59643K92927O34316J97854J291295M56996
8995D86865q32635o76600L18887L1534m76874j16837R89833J251977J28823l27755
8985G77218m111n17141k76804o00001j86349Q22928N85153K38342j98393p94800
8975a53958j30185k19250J05777J5629M13933O85772n86798m11238N08225P07261
8965I35168j42374r05130o98229r8791j34492N0768N93515R59350K06056l16658
$$ plain form
8955 449183 610566 287316 13464 1454607 2033120 1020443 -334838 -568546 -1034178
8946 -1034178 -1496343 -1686566 -1959656 -2302553 -2634196 -2747614 -2832591 -3176344 -2480589 -1820421
8936 -1820421 -1038544 -394341 -50795 42863 -820097 -1453195 -1066539 -340385 845918 1094385
8926 1094385 651145 1043334 164444 -83513 -549951 -1589771 -3446093 -4406704 -3773959
8917 -3773959 -3040934 -2743833 -2468524 -1807454 -1000847 -576899 -506811 -714697 -1012255 -1422975
8907 -1422975 -1953922 -2201783 -1746608 -681068 -348824 -321187 -903682 -1378523 -1319142 -905933
8897 -905933 -283788 -43452 -403368 -1367748 -1656463 -982591 -564115 -562752 393125 496023
8887 496023 -858381 -2623187 -2848756 -1935543 -796010 -368813 -684316 -854848 -1166590
$$ packed form
8955D49183J61383l23250k73852J441143N78513j012677j355281k33708m65632
8946a034178m62165j90223k73090l42897l31643j13418q4977l43753O95755O60168
8936a820421P81877O44203L43546R3658q62960o33098L86656P26154J186303K48467
8926A094385m43240L92189q78890k47957m66438j039820j856322r60611O32745
8917c773959P33025K97101K75309O61070Q06607M23948P0088k07886k97558m10720
8907a422975n30947k47861M55175J065540L32244K7637n82495m74841N9381M13209
8897i05933O22145K40336l59916r64380k88715O73872M18476J363R55877J02898
8887D96023j354404j764806k25569R13213J139533M27197l15503j70532l11742
$$ plain form
8878 -1166590 -1347528 -1253927 -1381788 -1665774 -970622 -1173043 -2023258 -1841218 -920873 -281851
8868 -281851 -1073664 -1109458 -19466 723953 1601057 2730651 2840138 1943185 968663 869501
8858 869501 1567146 2497742 2686619 2418145 2282697 2090300 2246269 1923615 998354 14885
8848 14885 -774174 -1579650 -1565594 -1469193 -1584573 -972063 132479 1283847 2423215 2097431
8838 2097431 1468738 1593596 1072673 746551 610664 704381 639405 719567 578802 399678
8828 399678 17452 -1016291 -1033612 -1255522 -2341592 -3334857 -3337586 -1719875 -253899 320867
8818 320867 192080 214164 552067 736692 832405 1316489 803793 188873 -1024377 -1561991
8808 -1561991 -885359 -36936 471355 1003635 966917 693151 732508 -177856 -874480 -622392
$$ packed form
8878a166590j80938R3601j27861k83986O95152k02421q50215J82040R20345O39022
8868b81851p91813l5794J089992P43419Q77104J129594J09487q96953r74522r9162
8858H69501O97645R30596J88877k68474j35448j92397J55969l22654r25261r83469
8848A4885p89059q05476J4056R6401j15380O12510J104542J151368J139368l25784
8838B097431o28693J24858n20923l26122j35887R3717o4976Q0162j40765j79124
8828C99678l82226j033743j7321k21910j086070r93265k729J617711J465976N74766
8818C20867j28787K2084L37903J84625R5713M84084n12696o14920j213250n37614
8808a561991O76632Q48423N08291N32280l6718k73766L9357r10364o96624K52088
$$ plain form
8798 -622392 -338583 -955200 -1025470 -962026 -740302 -466575 -75840 -507681 -445369 201505
8788 201505 -2902 -407749 -32137 366966 121760 198751 1499551 1552734 934510 639688
8778 639688 1003403 1680205 2560042 1936819 666996 121562 358145 863838 949855 975106
8768 975106 1084970 593374 -220591 -1214942 -995676 416683 1154082 840212 -132554 -731154
8758 -731154 -258633 131139 -681539 -1792264 -2315384 -2429874 -2344930 -1597711 -948577 -924087
8748 -924087 -184163 889134 1538451 2217618 3159356 3435411 3199893 3220315 3174353 2886311
8738 2886311 1975481 1636707 1705406 1886337 1807919 1556114 1983016 2216896 2055090 1632090
8728 1632090 1627133 2403064 3480224 4072782 4033911 2966153 1815383 1711693 1766889 2318425
$$ packed form
8798f22392K83809o16617p0270O3444K21724K73727L90735m31841O2312O46874
8788B01505k04407m04847L75612L99103k45206P6991J300800N3183o18224k94822
8778F39688L63715O76802Q79837o23223j269823n45434K36583N05693Q6017K5251
8768I75106J09864m91596q13965r94351K19266J412359P37399l13870r72766n98600
8758g31154M72521L89772q12678j110725n23120j14490Q4944P47219O49134K4490
8748i24087P39924J073297O49317O79167R41738K76055k35518K0422m5962k88042
8738B886311r10830l38774O8699J80931p8418k51805M26902K33880j61806m23000
8728A632090m957P75931J077160N92558l8871j067758j150770j03690N5196N51536
$$ plain form
8718 2318425 3267714 3950750 4302006 5080756 5284190 4479090 3496899 3337306 4378184
8709 4378184 5693149 6818380 7411358 7800442 7660715 7385979 6983898 6192543 6014099
8700 6014099 7348609 9554868 10509053 9947171 8661309 8108489 8065050 7719842 7786364
8691 7786364 7813366 7975683 8708748 8420135 7485709 7363165 6897129 6443290 5306285 4429178
8681 4429178 5609276 5770524 4730490 4895238 4919986 5186351 5361282 4444632 3956124
8672 3956124 4100858 4108732 4230548 4763422 5434622 5475241 5150826 4406484 3643115 3299263
8662 3299263 3019084 3225355 4289738 4913150 4082084 3304030 2923404 3600122 4177053
8653 4177053 4595219 4971045 5471942 5179046 4526662 4077683 3270679 2507448 2764422 4145344
$$ packed form
8718B318425R49289O83036L51256P78750K03434q05100r82191j59593J040878
8709D378184J314965J125231N92978L89084j39727k74736m02081p91355j78444
8700F014099J334510K206259R54185n61882j285862n52820m3439l45208O6522
8691G786364K7002J62317P33065k88613r34426j22544m66036m53839j137005q77107
8681D429178J180098J61248j040034J64748K4748K66365J74931r16650m88508
8672C956124J44734P874J21816N32874O71200M0619l24415p44342p63369l43852
8662C299263k80179K06271J064383O23412q31066p78054l80626O76718N76931
8653D177053M18166L75826N00897k92896o52384m48979q07004p63231K56974J380922
$$ plain form
8643 4145344 5394994 5673089 5142395 4487708 4723073 5925089 6413442 6078545 5596217
8634 5596217 4766880 3845256 3591064 3532665 4039148 4561613 4632312 4922579 5081618 4533036
8624 4533036 3853312 3074383 1422151 952442 1399975 1395226 949990 1583590 3051564 3474573
8614 3474573 2173265 884703 300147 61989 -162494 129176 1011069 1760021 2476693
8605 2476693 3680742 4214358 3362896 2405007 1818786 1530228 832369 932999 1512399
8596 1512399 1798800 1424915 333477 -711692 -1185123 -10584 1526359 2093243 1773771
8587 1773771 1453789 485208 -879538 -915748 -308043 -481682 -1538915 -2236980 -2079901
8578 -2079901 -1512300 -443341 699331 1505226 1777871 1397514 669027 -92203 -703647
$$ packed form
8643D145344J249650K78095n30694o54687K35365J202016M88353l34897m82328
8634E596217q29337r21624k54192n8399N06483N22465P0699K90267J59039n48582
8624D533036o79724p78929j652232m69709M47533m749m45236O33600J467974M23009
8614C474573j301308j288562n84556k38158k24483K91670Q81893P48952P16672
8605B476693J204049N33616q51462r57889n86221k88558o97859J00630N79400
8596A512399K86401l73885j091438j045169m73431J174539J536943N66884l19472
8587A773771l19982r68581j364746l6210O07705j73639j057233o98065J57079
8578b079901N67601J068959J142672Q05895K72645l80357p28487p61230o11444
$$ plain form
8569 -703647 -685868 -273967 1169384 2428430 1709535 269499 -669394 -133295 572917
8560 572917 -46142 -724807 -1854236 -2952996 -2550943 -1735106 -1240614 -707229 -174241
8551 -174241 84892 26703 -587761 -1922600 -2362527 -2224677 -1612624 -1117643 -962002 -811403
8541 -811403 -117818 521826 1540776 1753077 299076 -789288 -1477864 -901039 -144389
8532 -144389 -411014 -247349 54059 654971 652715 -283258 -160668 685016 1840837 2444078
8522 2444078 1328376 1101588 1695065 1707452 1371047 1036464 64151 -144991 29951 -544388
8512 -544388 -306259 90742 196424 475461 1185132 954494 -304422 -1413446 -1287422
8503 -1287422 -295940 620962 955125 1085058 1064094 993289 1134480 1538572 2056794 2567069
$$ packed form
8569g03647J7779M11901J443351J259046p18895j440036r38893N36099P06212
8560E72917o19059o78665j129429j098760M02053Q15837M94492N33385N32988
8551a74241K59133n8189o14464j334839m39927J37850O12053M94981J55641J50599
8541h11403O93585O39644J018950K12301j454001j088364o88576N76825P56650
8532a44389k66625J63665L01408O00912k256r35973J22590Q45684J155821O03241
8522B444078j115702k26788N93477J2387l36405l34583r72313k09142J74942n74339
8512e44388K38129L97001J05682K79037P09671k30638j258916j109024J26024
8503a287422R91482R16902L34163J29933k0964p0805J41191M04092N18222N10275
$$ plain form
8493 2567069 2502656 1202047 61049 -320888 -672953 -689617 82240 847169 2353895
8484 2353895 3354563 3102236 3686770 4480612 4163265 2968725 1840989 592698 -473800
8475 -473800 -66113 1214639 2217087 2247655 2123714 1380654 981654 1012334 642479 606883
8465 606883 799292 1294073 1883319 2424655 2971040 2817752 2814283 3617629 3589737 3491060
8455 3491060 4055887 4641061 4551204 4183989 2788656 1953953 2267266 3115521 3286497 3204002
8445 3204002 3386135 3785619 4032334 3668562 4115960 4762749 3954944 3552868 4290418 5104263
8435 5104263 5233094 5168641 5071257 5301331 5515918 5320520 6092022 7749767 8408830 8789800
8425 8789800 8962688 9009040 8097599 7077915 7134526 8330807 9530001 9418261 7987546
$$ packed form
8493B567069o4413j300609j140998l81937l52065j6664P71857P64929J506726
8484B353895J000668k52327N84534P93842l17347j194540j127736j248291j066498
8475d73800M07687J280752J002448L0568j23941p43060l99000L0680l69855l5596
8465F06883J92409M94781N89246N41336N46385j53288l469Q03346k7892r8677
8455C491060N64827N85174q9857l67215j395333q34703L13313Q48255J70976q2495
8445C204002J82133L99484K46715l63772M47398O46789q07805m02076P37550Q13845
8435E104263J28831o4453r7384K30074K14587j95398P71502J657745O59063L80970
8425H789800J72888M6352r11441j019684N6611J196281J199194j11740j430715
$$ plain form
8416 7987546 7157275 6942058 7094515 7619798 8013504 7464547 7140113 7025836 6756566 6891520
8406 6891520 6823822 6405358 6615765 6503721 6067795 6399349 7056791 6596127 5581276 4679169
8396 4679169 3824342 4145774 4710246 4266149 3061753 2894859 3317122 4614923 5772265
8387 5772265 6984227 7687781 7399126 6975347 6517354 6223997 4991628 4615390 5259577
8378 5259577 6046949 6408556 5822443 5992826 6522596 5872853 6184249 7082950 6815801 6608040
8368 6608040 7026984 7091362 7960275 9353599 10314125 11753631 12603568 12450190 12098466
8359 12098466 12972300 14363523 15168386 16193839 17110420 16981713 15990026 15547947 16048902
8350 16048902 16020218 15650177 15242783 14255205 13064332 11625431 10277597 8523340 7583718
$$ packed form
8416G987546q30271k15217J52457N25283L93706n48957l24434j14277k69270J34954
8406F891520o7698m18464K10407j12044m35926L31554O57442m60664j014851r02107
8396D679169q54827L21432N64472m44097j204396j66894M22263J297801J157342
8387E772265J211962P03554k88655m23779m57993k93357j232369l76238O44187
8378E259577P87372L61607n86113J70383N29770o49743L11396Q98701k67149k07761
8368F608040M18944O4378Q68913J393324R60526J439506Q49937j53378l51724
8359A2098466Q73834J391223Q04863J025453R16581j28707r91687m42079N00955
8350A6048902k8684l70041m07394r87578j190873j438901j347834j754257r39622
$$ plain form
8341 7583718 6828419 7046411 7927856 7507049 7183859 6995769 6564643 4995095 4173185
8332 4173185 4050115 3906005 4554237 5171599 4948380 4046522 3449922 3989025 4617635 4769957
8322 4769957 4462831 3724513 2511675 2461443 2071449 1414903 1070484 1227705 2085620 1634087
8312 1634087 1094180 1437390 1158645 1055768 882912 424424 334204 686103 107233 -1077779
8302 -1077779 -1700325 -1441673 -1336322 -1590621 -1773978 -1349358 -81239 738816 -83666
8293 -83666 -314785 -535812 -155869 59235 -344641 97188 644389 750650 536084 550461
8283 550461 566829 -23769 162285 1372634 1793031 1563447 780542 172253 -87125 249471
8273 249471 379171 15968 -194329 -194914 16464 54954 60131 -367083 -526832 -529200 -478057
$$ packed form
8341G583718p55299K17992Q81445m20807l23190j88090m31126j569548q21910
8332D173185j23070j44110O48232O17362k23219r01858n96600N39103O28610J52322
8322D769957l07126p38318j212838n0232l89994o56546l44419J57221Q57915m51533
8312A634087n39907L43210k78745j02877j72856m58488r0220L51899n78870j185012
8302a077779o22546K58652J05351k54299j83357M24620J268119Q20055q22482
8293h3666k31119k21027L79943K15104m03876M41829N47201J06261k14566J4377
8283E50461J6368n90598J86054J210349M20397k29584p82905o08289k59378L36596
8273B49471J29700l63203k10297n85K11378L8490N177m27214j59749k368N1143
$$ plain form
8262 -478057 -735893 -1086701 -748427 217742 1653147 1109666 37619 635545 1510083
8253 1510083 1581914 1398505 1806342 2263318 2501737 2490422 2258582 1425185 1115563 1192902
8243 1192902 495772 422992 899803 1551470 1646220 990316 904692 1186121 1302215 966718
8233 966718 826763 971386 998674 350339 -512414 -157351 -486404 -1780664 -1987735 -1673930
8223 -1673930 -1605842 -1253494 -1260091 -1789591 -1430967 -1160101 -2105836 -2149109 -1245741 -831633
8213 -831633 -396972 573992 1042489 1077596 1026457 1378892 892001 185273 -273321 -393470
8203 -393470 -391635 -314306 83758 123974 1352016 2344049 1895758 1565945 1807079 1874267
8193 1874267 1128361 351003 -19353 96188 561691 784832 485773 -57918 -1204739
$$ packed form
8262d78057k57836l50808L38274R66169J435405n43481j072047N97926Q74538
8253A510083P1831j83409M07837M56976K38419j1315k31840q33397l09622P7339
8243A192902o97130p2780M76811O51667R4750o55904q5624K81429J16094l35497
8233I66718j39955J44623K7288o48335q62753L55063l29053j294260k07071L13805
8223a673930O8088L52348o597n29500L58624K70866r45735m3273R03368M14108
8213h31633M34661R70964M68497L5107n1139L52435m86891p06728m58594j20149
8203c93470J835P7329L98064M0216J228042R92033m48291l29813K41134O7188
8193A874267p45906p77358l70356J15541M65503K23141k99059n43691j146821
$$ plain form
8184 -1204739 -1495294 -901258 -163453 297002 -6625 -260293 58587 1738257 3951753
8175 3951753 5158790 6250673 7157760 7602605 7515746 7047304 5957686 5567599 6250596
8166 6250596 6369490 5795402 5158640 5688933 5844253 5656534 5908141 6224243 7071386 8007945
8156 8007945 8660269 9776575 11695758 14047419 15700334 16112505 16461719 16254754 16491592
8147 16491592 18451307 20889464 22124690 23396996 25199618 26332756 27229209 27754757
8139 27754757 27126016 26000229 24516246 22869515 20863532 18034305 15184678 12746575
8131 12746575 9840998 7602229 7069276 6740914 7268138 7506194 7498092 7643156 7245440
8122 7245440 7122049 7706960 8657397 9648051 10759825 11811145 12588569 14074846 16331759
$$ packed form
8184a204739k90555N94036P37805M60455l03627k53668L18880J679670K213496
8175C951753J207037J091883R07087M44845q6859m68442j089618l90087O82997
8166F250596J18894n74088o36762N30293J55320j87719K51607L16102Q47143R36559
8156H007945O52324J116306J919183K351661J652915M12171L49214k06965K36838
8147A6491592J959715K438157J235226J272306J802622J133138Q96453N25548
8139B7754757o28741j125787j483983j646731k005983k829227k849627k438103
8131A2746575k905577k238769n32953l28362N27224K38056q102J45064l97716
8122G245440j23391N84911R50437R90654J111774J051320P77424J486277K256913
$$ plain form
8113 16331759 17563570 18059894 18109505 18647369 18893288 18668579 18752394 18067215 17300693 16920059
8103 16920059 16467063 15700082 14511962 12777180 11154779 10112590 10119422 10699459 11107236
8094 11107236 10902907 10842332 11674663 12722139 12365478 11762395 12842249 13338291 13346520 14339201
8084 14339201 15430947 16057576 16181494 15882031 15064665 13644997 12591393 12006807 11593657
8075 11593657 10218814 8953419 8143379 7046754 6214209 6386798 7332635 7695918 7141874
8066 7141874 6029076 5730508 5702120 4803899 4031926 4453400 4756857 4217421 3620938 3165107
8056 3165107 2885238 3034379 3501036 3606352 3423762 2721496 1986204 1771124 1892161 2569416
8046 2569416 2647585 1223514 427281 1195999 1407222 3276 -1425734 -1562216 228027
$$ packed form
8113A6331759J231811M96324M9611N37864K45919k24709Q3815o85179p66522l80634
8103A6920059m52996p66981j188120j734782j622401j042189O832N80037M07777
8094A1107236k04329o0575Q32331J047476l56661o03083J079854M96042Q229R92681
8084A4339201J091746O26629J23918k99463q17366j419668j053604n84586m13150
8075A1593657j374843j265395q10040j096625q32545J72589R45837L63283n54044
8066G141874j112798k98568k8388q98221p71973M21474L03457n39436n96483m55831
8056C165107k79869J49141M66657J05316j82590p02266p35292k15080J21037O77255
8046B569416P8169j424071p96233P68718K11223j403946j429010j36482J790243
$$ plain form
8037 228027 2129188 1867350 702005 -40568 47935 593916 2355638 3130615 2864621
8028 2864621 2662958 2442695 1784930 2207871 3348368 3180402 1488632 1021823 1882022
8019 1882022 2841668 3514527 3465311 3477707 3562441 2580271 1031256 1121474 1903984 1867730
8009 1867730 1507525 668725 -126200 335968 1583914 2371795 2486568 3159151 3701921
8000 3701921 3503156 3445827 4056896 4277252 4062548 3391875 3387887 4299269 3992441 2910157
7990 2910157 2688909 2590244 2595018 2602329 2902378 3145186 2832154 2424632 2195493 2431360
7980 2431360 3212026 4047651 4647001 4842709 5044102 4895791 4431883 4237582 4070466 5013469
7970 5013469 6285310 6829092 6017880 5008668 4638047 3849626 3399694 2639299 1090454
$$ packed form
8037B28027J901161k61838j165345p42573Q8503N45981J761722P74977k65994
8028B864621k01663k20263o57765M22941J140497j67966j691770m66809Q60199
8019A882022R59646O72859m9216J2396Q4734r82170j549015R0218P82510l6254
8009A867730l60205q38800p94925M62168J247946P87881J14773O72583N42770
8000C701921j98765n7329O11069K20356k14704o70673l988R11382l06828j082284
7990B910157k21248r8665M774P311L00049K42808l13032m07522k29139K35867
7980B431360P80666Q35625N99350J95708K01393j48311m63908j94301j67116R43003
7970E013469J271841N43782q11212j009212l70621p88421m49932p60395j548845
$$ plain form
7961 1090454 1228254 2349605 3302166 3963735 4318627 4833642 4755720 3760565 2805783 2150185
7951 2150185 1458901 1071718 1239738 1630645 2334179 3411346 3634109 3275116 2961841
7942 2961841 3632092 3763852 2853186 2135872 2321439 2897022 2890585 3299443 4242401 5556689
7932 5556689 6265195 5801394 5072654 4803791 4459615 4838405 5665643 5158346 3845937
7923 3845937 3250639 3470376 4444807 5525069 6286301 6332026 6042523 5956633 5871308 6552202
7913 6552202 6998242 6572073 6362959 6555716 6508431 6772488 6915097 7402901 8313647 10178164
7903 10178164 12408717 13449871 13851476 13784299 14362036 15198739 16294740 17506721 19109259
7894 19109259 20309554 21589066 22574467 23174812 23574261 23808316 24433954 25079272 25188198
$$ packed form
7961A090454J37800J121351R52561O61569L54892N15015p7922r95155r54782o55598
7951B150185o91284l87183J68020L90907P03534J077167K22763l58993l13275
7942B961841O70251J31760r10666p17314J85567N75583o437M08858R42958J314288
7932E556689P08506m63801p28740k68863l44176L78790Q27238n07297j312409
7923C845937n95298K19737R74431J080262P61232M5725k89503q5890q5325O80894
7913F552202M46040m26169k09114J92757m7285K64057J42609M87804R10746J864517
7903A0178164K230553J041154M01605o7177N77737Q36703J096001J211981J602538
7894A9109259J200295J279512R85401O00345L99449K34055O25638O45318J08926
$$ plain form
7885 25188198 25071143 25511387 26502201 26401631 26638113 26384426 25086121 23087734 20749393
7876 20749393 18532679 17245070 17167185 16592995 16041078 15087044 13702277 12136911 10878158
7867 10878158 9887999 9781477 9834330 9549939 10130894 9745815 7356510 4693951 3721347
7858 3721347 3936671 4757321 4929143 4072784 3888147 4024424 4900481 4801916 3844179 3073590
7848 3073590 2659296 3170761 3564769 4064106 4460735 4216768 3579107 2878392 3248275 3633481
7838 3633481 3675670 3346783 3051604 3120953 3071379 2767969 1587138 576617 1008559 1847917
7828 1847917 2755919 2722550 2053508 1361851 1604633 2652581 3422359 3573662 3727409 3321648
7818 3321648 2602102 1111702 -521923 -1234723 -1071993 -425889 364529 338719 476936
$$ packed form
7885B5188198j17055M40244R90814j00570K36482k53687j298305j998387k338341
7876B0749393k216714j287609p7885n74190n51917r54034j384767j565366j258753
7867A0878158r90159j06522N2853k84391N80955l85079k389305k662559r72604
7858C721347K15324Q20650J71822q56359j84637J36277Q76057r8565r57737p70589
7848C073590m14294N11465L94008M99337L96629k43967o37661p00715L69883L85206
7838C633481M2189l28887k95179O9349m9574l03410j180831j010521M31942Q39358
7828A847917R08002l3369o69042o91657K42782J047948P69778J51303J53747m05761
7818C321648p19546j490400j633625p12800J62730O46104P90418k5810J38217
$$ plain form
7809 476936 788509 596825 879300 2083363 2781497 2060298 1396534 1550062 1442348 1337617
7799 1337617 1619541 1843634 2009034 2100877 2274852 2454035 2566720 2511191 2871641 3687731
7789 3687731 3753122 2511783 1073521 110231 -120339 8385 706422 1834003 2239637
7780 2239637 909329 458919 2020590 3360784 3742053 3603921 3754603 3301362 2504046
7771 2504046 3054795 3334700 2495059 1669200 1130616 1753630 3283018 3731035 3145250
7762 3145250 2809990 2397416 2226930 2169737 2372717 2574567 2247703 2607751 3991274 4960149
7752 4960149 5769665 5550617 4958812 4758180 5173900 5656500 5679836 6756404 7990982
7743 7990982 8056484 8039771 8459691 9696856 11647399 13853472 15143228 15577325 15397313
$$ packed form
7809D76936L11573j91684K82475J204063O98134p21199o63764J53528j07714j04731
7799A337617K81924K24093J65400R1843J73975J79183J12685n5529L60450Q16090
7789C687731O5391j241339j438262r63290k30570J28724O98037J127581M05634
7780B239637j330308m50410J561671J340194L81269j38132J50682m53241p97316
7771B504046N50749K79905q39641q25859n38584O23014J529388M48017n85785
7762C145250l35260m12574j70486n7193K02980K01850l26864L60048J383523R68875
7752D960149Q09516k19048n91805k00632M15720M82600K3336J076568J234578
7743G990982O5502j6713M19920J237165J950543K206073J289756M34097j80012
$$ plain form
7734 15397313 15822481 16484347 16330811 15973520 15516344 15417710 15297876 14219376 13024847
7725 13024847 12430737 12122258 11655637 9751449 8064008 7858844 7694489 6654478 6548095
7716 6548095 7168253 7046451 6616934 6337434 6703293 6436012 5267270 5078529 6318309
7707 6318309 7719833 8489174 7988246 7034421 7009815 6968105 6823187 6719543 7052935 7382290
7697 7382290 7466773 7227837 7654531 7205139 6037103 5777033 6487137 7389188 7756532 7237364
7687 7237364 6969049 7158245 6741667 6456896 6889951 7088096 7329056 7451010 6990456 7664089
7677 7664089 8827492 8544847 8029248 7675783 6949747 6458151 6519552 5977766 6304541 6990307
7667 6990307 6937681 7369516 8152789 8126104 7605759 7057709 6910110 7272423 7195356 6751028
$$ packed form
7734A5397313M25168O61866j53536l57291m57176r8634j19834j078500j194529
7725A3024847n94110l08479m66621j904188j687441k05164j64355j040011j06383
7716F548095O20158j21802m29517k79500L65859k67281j168742j88741J239780
7707F318309J401524P69341n00928r53825k4606m1710j44918j03644L33392L29355
7697G382290Q4483k38936M26694m49392j168036k60070P10104R02051L67344n19168
7687G237364k68315J89196m16578k84771M33055J98145K40960J21954m60554O73633
7677G664089J163403k82645n15599l53465p26036m91596O1401n41786L26775O85766
7667F990307n2626M31835P83273k6685n20345n48050j47599L62313p7067m44328
$$ plain form
7657 6751028 6671894 7148440 8158571 8963912 9770262 10513218 10970014 10854216 10519785 9594782
7647 9594782 9060180 9055972 9285007 9838962 10663824 12037174 12503647 12082873 12217289 13638078
7637 13638078 15454203 16967753 17933855 17795519 18223315 19807446 21445485 22541406 23501713
7628 23501713 24437065 25234914 27482305 28584405 28642458 28750879 29005399 29577670 31612374
7619 31612374 33947446 36038792 38316546 41082977 43982412 46443951 49082292 51982995
7611 51982995 55557221 59687013 63385100 67360114 71375654 75571604 80218963 84671823
7603 84671823 89688628 95206171 100666203 106807064 113029697 119325609 126650461 134250806
7595 134250806 141312854 147315665 152760871 158103664 163213733 167155367 169935025 172023494
$$ packed form
7657F751028p9134M76546J010131Q05341Q06350P42956M56796j15798l34431r25003
7647I594782n34602m208K29035N53955Q24862J373350M66473m20774J34416J420789
7637A3638078J816125J513550R66102j38336M27796J584131J638039J095921R60307
7628B3501713R35352P97849K247391J102100N8053J08421K54520N72271K034704
7619C1612374K335072K091346K277754K766431K899435K461539K638341K900703
7611E1982995L574226M129792L698087L975014M015540M195950M647359M452860
7603H4671823N016805N517543N460032O140861O222633O295912P324852P600345
7595A34250806P062048O002811N445206N342793N110069L941634K779658K088469
$$ plain form
7587 172023494 173069379 172706629 170230334 166292112 161133042 155058249 148262128 139608339
7579 139608339 130222236 121624938 113363722 105090917 96512816 88188668 81079966 74331729
7571 74331729 68157070 62683388 57727801 52607735 47290155 42731979 39065849 35772029
7563 35772029 33687750 32507324 31540379 30809299 28949615 26842450 24583624 22363767
7555 22363767 20674809 19625427 18795504 17822789 17421613 17320267 17007123 16429429 15945023
7546 15945023 14916684 13265792 11410998 11059044 11402108 11605421 10574129 9426994 9493353
7537 9493353 10178432 10500070 10635408 11157694 10898710 9731374 9158410 9629051 9751442
7528 9751442 8886221 8187151 7808638 8192336 8498947 8337163 7742973 7428105 7913334 8931271
$$ packed form
7587A72023494J045885l62750k476295l938222n159070o074793o796121q653789
7579A39608339r386103q597298q261216q272805q578101q324148p108702o748237
7571G4331729o174659n473682m955587n120066n317580m558176l666130l293820
7563C5772029k084279j180426r66945p31080j859684k107165k258826k219857
7555B2363767j688958j049382q29923r72715m01176j01346l13144n77694m84406
7546A5945023j028339j650892j854794l51954L43064K03313j031292j147135O6359
7537I493353O85079L21638J35338N22286k58984j167336n72964M70641J22391
7528I751442q65221o99070l78513L83698L06611j61784n94190l14868M85229J017937
$$ plain form
7518 8931271 10027659 10123335 8977654 7354947 7488347 8890239 10317949 11764311 11577541
7509 11577541 11548046 12203657 12771361 13614271 14395835 15003258 15479891 15757043 16178020 16980033
7499 16980033 17477456 17817686 18284489 18311301 18159493 18330901 18446182 18551534 18779454 19965605
7489 19965605 21104750 20303072 18095809 16812078 16782259 17476069 18340379 18072290 16400933
7480 16400933 15295071 14777663 13661247 12618953 12492368 12542628 13038542 13582518 13257095
7471 13257095 12186656 11967358 11695277 11554698 12119794 13220936 14119867 14158792 13829079
7462 13829079 13442435 12546531 10923727 10145926 10480617 10386857 10969744 12233709 12547102
7453 12547102 11732747 10554595 9930057 9710780 9795614 9690038 9573756 9169776 8243910
$$ packed form
7518H931271J096388R5676j145681j622707J33400J401892J427710J446362j86770
7509A1577541k9495O55611N67704Q42910P81564O07423M76633K77152M20977Q02013
7499A6980033M97423L40230M66803K6812j51808J71408J15281J05352K27920J186151
7489A9965605J139145q01678k207263j283731k9819O93810Q64310k68089j671357
7480A6400933j105862n17408j116416j042294j26585N0260M95914N43976l25423
7471A3257095j070439k19298k72081j40579N65096J101142Q98931L8925l29713
7462A3829079l86644q95904j622804p77801L34691r3760N82887J263965L13393
7453A2547102q14355j178152o24538k19277Q4834j05576j16282m03980r25866
$$ plain form
7444 8243910 7205711 5543960 4571207 5032768 5207518 5187675 4872610 5191022 6173376
7435 6173376 5440712 4243256 4070180 4277339 4113368 3934168 3432475 2619697 2865145
7426 2865145 3174290 2336719 1834782 1933683 1836125 1991172 1377136 1326720 1734955 2228927
7416 2228927 2598234 2201233 1247262 439168 -3472 -287712 101577 1070113 1906331 2337879
7406 2337879 2311405 1591704 576510 -230311 -208694 161092 649730 1240349 960350 1059227
7396 1059227 1799410 2388270 3064270 3132437 2618187 2084499 1407211 812136 147995 4903
7386 4903 161692 -195649 -1182432 -1884324 -451303 1145428 1061793 319787 482707 594956
7376 594956 -316296 -1023679 -783943 -275244 -106538 686131 1505328 1543602 2209951 2304973
$$ packed form
7444H243910j038199j661751r72753M61561J74750j9843l15065L18412R82354
7435F173376p32664j197456j73076K07159j63971j79200n01693q12778K45448
7426B865145L09145q37571n01937R8901r7558J55047o14036n0416M08235M93972
7416B228927L69307l97001r53971q08094m42640k84240L89289R68536Q36218M31548
7406B337879k6474p19701j015194q06821K1617L69786M88638N90619k79999R8877
7396A059227P40183N88860O76000O8167n14250n33688o77288n95075o64141j43092
7386D903J56789l57341r86783p01892J433021J596731q3635p42006J62920J12249
7376E94956r11252p07383K39736N08699J68706P92669Q19197L8274O66349R5022
$$ plain form
7366 2304973 1186514 548679 -46784 -368055 -248431 -138616 -454125 -352370 -54915
7357 -54915 79593 711703 845438 640921 364809 -533687 -1224667 -1045362 -498193 -21665
7347 -21665 754362 1776124 2136389 2643489 2027943 1387234 1123882 953876 20906 -1288648
7337 -1288648 -1624088 -1479632 -2034176 -1852158 -1158751 -637436 -52787 527117 1271643 1058990
7327 1058990 555372 629074 -277331 -942105 -355019 307110 237845 499910 -75988 -813808
7317 -813808 -1186828 -1358398 -1487426 -1538187 -1149653 -1239732 -255409 1208248 941015 -566169
7307 -566169 -962141 -205090 807657 821467 307061 -431543 -1134672 -1480336 -2501245 -3164997
7297 -3164997 -2566666 -1889981 -2745745 -3149454 -2818232 -2703862 -1544983 171217 474185
$$ packed form
7366B304973j118459o37835n95463l21271J19624J09815l15509J01755K97455
7357e4915J34508O32110J33735k04517k76112q98496o90980J79305N47169M76528
7347b1665P76027J021762L60265N07100o15546o40709k63352j70006r32970j309554
7337a288648l35440J44456n54544J82018O93407N21315N84649N79904P44526k12653
7327A058990n03618P3702r06405o64774N87086O62129o9265K62065n75898p37820
7317h13808l73020j71570j29028n0761L88534r0079R84323J463657k67233j507184
7307e66169l95972P57051J012747J3810n14406p38604p03129l45664j020909o63752
7297c164997N98331O76685q55764m03709L31222J14370J158879J716200L02968
$$ plain form
7288 474185 454645 329644 574265 1804925 1922347 1091320 224760 -548753 -941444 -860371
7278 -860371 -373304 28431 -214624 468637 1054362 993581 681343 1040833 1418004 514892
7268 514892 -244526 -799859 -1328903 -899342 -106038 177810 203010 851840 1042060 181952
7258 181952 -596124 -1444482 -2024601 -1489033 -1206060 -229597 743639 980545 477818 1087915
7248 1087915 1414688 873431 1437328 1618165 876313 209130 -297219 -1094774 -1583310 -1000984
7238 -1000984 -392134 -409882 19294 717021 1409370 2114355 2041583 1909947 2165539 1571556
7228 1571556 691351 306195 208271 34025 446974 1169742 1546662 1367483 817101 350729
7218 350729 633776 1670998 2195183 1660155 1397466 2251742 3571059 4014559 4005356 3682455
$$ packed form
7288D74185j9540j25001K44621J230660J17422q31027q66560p73513l92691Q1073
7278h60371M87067M01735k43055O83261N85725o0781l12238L59490L77171r03112
7268E14892p59418n55333n29044M29561P93304K83848K5200O48830J90220q60108
7258A81952p78076q48358n80119N35568K82973R76463R73236K36906n02727O10097
7248A087915L26773n41257N63897J80837p41852o67183n06349p97555m88536N82326
7238a000984O08850j7748M29176O97727O92349P04985p2772j31636K55592n93983
7228A571556q80205l85156r7924j74246M12949P22768L76920j79179n50382m66372
7218C50729K83047J037222N24185n35028k62689Q54276J319317M43500r203l22901
$$ plain form
7208 3682455 3029126 2980397 3119850 2970589 2459432 2251634 2690202 2654114 1661368 929663
7198 929663 858312 1144521 1589775 2547834 3315320 3841004 4250353 4130766 3462501 3138042
7188 3138042 2642271 2025264 2491976 2959661 3669274 4432496 5299730 7591697 9468435
7179 9468435 9628673 9216490 9075565 9284845 8700852 8429311 9562939 11083973 12670313
7170 12670313 12978034 13562593 15111888 16681162 18045411 18899344 18496591 19120612 20120417
7161 20120417 20703710 20587520 19681257 19072906 18507260 18062162 17679999 16692834 15626266
7152 15626266 15199684 15289013 15769326 17104832 17206464 16099628 15735634 15363589 14487456
7143 14487456 13638742 13943912 14936536 16036122 16932300 17817330 18577232 18376894 18186313
$$ packed form
7208C682455o53329m8729J39453j49261n11157k07798M38568l6088r92746p31705
7198I29663p1351K86209M45254R58059P67486N25684M09349j19587o68265l24459
7188C138042m95771o17007M66712M67685P09613P63222Q67234K291967J876738
7179I468435J60238m12183j40925K09280n83993k71541J133628J521034J586340
7170A2670313L07721N84559J549295J569274J364249Q53933m02753O24021R99805
7161B0120417N83293j16190r06263o08351n65646m45098l82163r87165j066568
7152A5626266m26582Q9329M80313J335506J01632j106836l63994l72045q76133
7143A4487456q48714L05170R92624J099586Q96178Q85030P59902k00338j90581
$$ plain form
7134 18186313 18591413 18772215 19179109 18704785 18025560 16476275 14712985 13324303 12002869
7125 12002869 11873591 11533764 10948653 9897776 8766046 7852466 7227750 7459495 7945583
7116 7945583 8073371 6820295 6033139 5832075 5891471 5839866 4083991 2965486 3314467
7107 3314467 3107941 2392046 2518098 3045729 2888482 2366754 2524346 3172610 2689143 2116450
7097 2116450 2604326 3086455 4270001 6456905 7855079 7280430 5692786 4893201 3745560
7088 3745560 1942481 1135058 1491917 1522082 1077498 649613 723403 217017 -60345 576233
7078 576233 860583 1122648 1849873 2647452 3482570 4086025 3332543 2992436 2449743 1183575
7068 1183575 181322 -534215 -317615 -1101085 -1714996 -1600861 -1230095 -587039 -308791
$$ packed form
7134A8186313M05100J80802M06894m74324o79225j549285j763290j388682j321434
7125A2002869j29278l39827n85111j050877j131730r13580o24716K31745M86088
7116G945583J27788j253076p87156k01064N9396n1605j755875j118505L48981
7107C314467k06526p15895J26052N27631j57247n21728J57592O48264m83467n72693
7097B116450M87876M82129J183546K186904J398174n74649j587644p99585j147641
7088C745560j803079q07423L56859L0165m44584m27885P3790n06386k77362O36578
7078E76233K84350K62065P27225P97579Q35118O03455p53482l40107n42693j266168
7068A183575j002253p15537K16600p83470o13911J14135L70766O43056K78248
$$ plain form
7059 -308791 -796992 -323779 646530 987124 250853 -747645 -792943 79052 716771 413148
7049 413148 640444 1361667 1850452 1532815 750573 328055 271941 913201 1136472 1087484
7039 1087484 1814477 1906294 1672782 1664325 1192297 607087 615951 380003 -312023 -1134365
7029 -1134365 -2333618 -2330029 -1455633 -759549 -1186061 -1874049 -1358502 -144550 18048 -449678
7019 -449678 -263494 774346 861488 -1244 -755507 -692533 137527 338678 -109304 -173799
7009 -173799 85515 841573 1415578 148983 -1126317 -660271 512047 1252497 1502366
7000 1502366 1626735 1825941 1177343 953819 1251438 1202777 984958 944876 522388 522232
6990 522232 1335453 2425937 3889107 5081613 5026430 3996748 2853863 2674595 2945384
$$ packed form
7059c08791m88201M73213R70309L40594p36271r98498m5298Q71995O37719l03623
7049D13148K27296P21223M88785l17637p82242m22518n6114O41260K23271m8988
7039A087484P26993R1817k33512q457m72028n85210Q864k35948o92026q22342
7029a134365j199253L589Q74396O96084m26512o87988N15547J213952J62598m67726
7019d49678J86184J037840Q7142q62732p54263O2974Q30060K01151m47982o4495
7009a73799K59314P56058N74005j266595j275300M66046J172318P40450K49869
7000A502366J24369J99206o48598k23524K97619m8661k17819m0082m22488j56
6990E22232Q13221J090484J463170J192506n5183j029682j142885j79268K70789
$$ plain form
6981 2945384 4032133 3877500 2688594 2162549 2560350 2894246 2613346 2706147 3525531
6972 3525531 3401281 3081044 3117870 2681744 2434938 2302467 2277419 2858091 3076173 3761198
6962 3761198 3998780 2684560 1374796 75544 -276280 -20336 723821 931794 573468
6953 573468 -296639 78130 1082263 1658034 2438312 3305337 3752393 2454549 941683
6944 941683 409343 792233 1652521 1766951 997006 1102820 1449244 2025399 2674657 4205369
6934 4205369 5105506 4823735 4171632 3485157 3445997 2673096 1965454 2372759 2085199 1144323
6924 1144323 624151 836570 943084 1536097 1467346 925546 1039028 2097407 2669933 3055202
6914 3055202 3616566 2975425 2537212 1922762 536134 49923 386223 446079 -468555 -820954
$$ packed form
6981B945384J086749j54633j188906n26045L97801L33896k80900R2801Q19384
6972C525531j24250l20237L6826m36126k46806j32471k5048N80672K18082O85025
6962C761198K37582j314220j309764j299252l51824K55944P44157K07973l58326
6953E73468q70107L74769J004133N75771P80278Q67025M47056j297844j512866
6944I41683n32340L82890Q60288J14430p69945J05814L46424N76155O49258J530712
6934D205369R00137k81771o52103o86475l9160p72901p07642M07305k87560r40876
6924A144323n20172K12419J06514N93013o8751n41800J13482J058379N72526L85269
6914C055202N61364o41141m38213o14450j386628m86211L36300N9856r14634l52399
$$ plain form
6904 -820954 -84052 158626 -539630 -548383 222805 542213 1097634 1305998 891480 -585529
6894 -585529 -531264 353092 1122138 1610639 1753539 858545 216668 586616 600162 -194990
6884 -194990 -744693 96952 724067 636339 709428 214604 489907 1258032 1677600 2132440
6874 2132440 2034712 1842770 1863920 1623331 988197 490312 171309 874774 1709577 1793486
6864 1793486 1714347 1300288 -34983 -2234020 -1950856 -568780 -215186 382160 751073
6855 751073 917631 642483 244911 -283243 35625 808117 1019209 626593 523921 785108
6845 785108 864618 926370 688720 239125 636644 1782089 1552346 1587855 1668394 878562
6835 878562 874759 963084 745912 1046494 1655487 1937538 2084532 1923948 1668089 1109423
$$ packed form
6904h20954P36902K42678o98256q753P71188L19408N55421K08364m14518j477009
6894e85529N4265Q84356P69046M88501J42900q94994o41877L69948J3546p95152
6884a94990n49703Q41645O27115q7728P3089m94824K75303P68125M19568M54840
6874B132440r7728j91942K1150k40589o35134m97885l19003P03465Q34803Q3909
6864A793486p9139m14059j335271k199037K83164J382076L53594N97346L68913
6855G51073J66558k75148l97572n28154L18868P72492K11092l92616j02672K61187
6845G85108P9510O1752k37650m49595L97519J145445k29743L5509Q0539p89832
6835H78562l803Q8325k17172L00582O08993K82051J46994j60584k55859n58666
$$ plain form
6825 1109423 -34519 -758723 -285820 756069 1820456 2542936 2643712 2341975 2222742
6816 2222742 2906791 3156306 3511417 4360190 4817405 4733431 4011268 2403634 1374730
6807 1374730 1360994 2449531 2493914 1780064 1099542 890058 1110138 1365361 1990422 2609987
6797 2609987 2865121 2339817 1268968 449720 604100 1254035 2006950 2224622 2730431
6788 2730431 3646053 3525317 2690291 2504288 1850311 1240136 883492 -184702 -887067
6779 -887067 39343 705772 436941 654988 1449607 879983 704644 1916104 3173573
6770 3173573 3379093 2866769 3197012 3103018 1927533 623942 81469 682550 1686835
6761 1686835 2716173 4438063 5362984 6332278 6454594 5368587 4414830 5026093 6158966
$$ packed form
6825A109423j143942p24204M72903J041889J064387P22480J00776l01737j19233
6816B222742O84049K49515L55111Q48773M57215q3974p22163j607634j028904
6807A374730j3736J088537M4383p13850o80522k09484K20080K55223O25061O19565
6797B609987K55134n25304j070849q19248J54380O49935P52915K17672N05809
6788B730431R15622j20736q35026j86003o53977o10175l56644j068194p02365
6779h87067R26410O66429k68831K18047P94619n69624j75339J211460J257469
6770C173573K05520n12324L30243r3994j175485j303591n42473O01081J004285
6761A686835J029338J721890R24921R69294J22316j086007r53757O11263J132873
$$ plain form
6752 6158966 6563522 6796961 6838843 6240194 6469181 6545720 5661407 5633863 5355413 4590288
6742 4590288 3943470 4310002 4858911 5867903 7572339 8427161 8605861 7768639 7433395
6733 7433395 8286447 8431463 7771474 7943401 8769365 8932899 8708508 8767699 8376832 8273112
6723 8273112 9274449 9991480 10089454 10585356 11082905 11737122 12696886 13315344 13629317 13959710
6713 13959710 14066879 13963835 14149958 13302825 12463887 11439655 10021642 9756368 9682662
6704 9682662 8959215 8472837 8185447 8062557 8329054 8210285 8301320 8164551 8073911 8337565
6694 8337565 7994034 7917288 8219069 8658802 8698905 8645141 8015227 7410833 7714070 7740927
6684 7740927 8038291 8020474 8275297 7780820 7710074 8467756 10461584 12389220 13460020
$$ packed form
6752F158966M04556K33439M1882n98649K28987P6539q84313k7544k78450p65125
6742D590288o46818L66532N48909J008992J704436Q54822J78700q37222l35244
6733G433395Q53052J45016o59989J71927Q25964J63534k24391N9191l90867j03720
6723H273112J001337P17031R7974M95902M97549O54217R59764O18458L13973L30393
6713A3959710J07169j03044J86123q47133q38938j024232j418013k65274p3706
6704I682662p23447m86378k87390j22890K66497j18769R1035j36769r0640K63654
6694H337565l43531p6746L01781M39733M0103n3764o29914o04394L03237K6857
6684G740927K97364j7817K54823m94477p0746P57682J993828J927636J070800
$$ plain form
6675 13460020 13422807 12837645 13090133 13003714 13021241 13444966 14244439 14549509 14604954 15305428
6665 15305428 16255714 17684176 19503597 19856660 19946213 20163063 21597058 24159799 27191752
6656 27191752 30523530 32932158 34194864 34748595 35307304 36171165 36273800 36443939 36524005
6647 36524005 35855154 35709214 36035269 35974905 35487337 35708558 36252899 36127993 35405144 34218074
6637 34218074 33322051 32932934 32973236 32941912 32617443 32068375 31808439 31698140 31194357 30087192
6627 30087192 30699361 33957460 37306512 39405559 41918751 44784923 48404332 53888724
6619 53888724 59201407 62372801 63589853 63443551 62965060 62465299 62395166 63094154 65120462
6610 65120462 67816839 71022891 74007532 75660311 76339488 75019868 71489986 68995097
$$ packed form
6675A3460020l7213n85162K52488q6419J7527M23725P99473L05070N5445P00474
6665A5305428R50286J428462J819421L53063Q9553K16850J433995K562741L031953
6656B7191752L331778K408628J262706N53731N58709Q63861J02635J70139Q0066
6647C6524005o68851j45940L26055o0364m87568K21221N44341j24906p22849j187070
6637C4218074q96023l89117M0302l1324l24469n49068k59936j10299n03783j107165
6627C0087192O12169L258099L349052K099047K513192K866172L619409N484392
6619E3888724N312683L171394J217052j46302m78491m99761p0133O98988K026308
6610F5120462K696377L206052K984641J652779O79177j319620l529882k494889
$$ plain form
6602 68995097 66791552 65421886 65157138 65696569 66909043 67443045 66428388 64499713 62746262
6593 62746262 62116696 62626587 64054474 65753771 68157779 72284809 77926748 84516526
6585 84516526 93431643 105407437 118437883 133100809 148301004 165388235 186066069
6578 186066069 210390623 237840534 267930707 297342372 318746704 327758793 320993190
6571 320993190 299554396 269110700 236035020 204544514 176771633 153252500 133971769
6564 133971769 117882331 103538432 91848491 82178770 73974747 66963960 60280774 54241285
6556 54241285 48948498 45164916 42307736 38949991 35541714 32550062 30223652 28486737
6548 28486737 26525499 25499813 24797918 23880002 23072122 22605540 22846814 23284822 22822648
$$ packed form
6602F8995097k203545j369666k64748N39431J212474N34002j014657j928675j753451
6593F2746262o29566N09891J427887J699297K404008M127030N641939O589778
6585H4516526Q915117J1975794J3030446J4662926J5200195J7087231K0677834
6578A86066069K4324554K7449911L0090173K9411665K1404332R012089o765603
6571C20993190k1438794l0443696l3075680l1490506k7772881k3519133j9280731
6564A33971769j6089438j4343899j1689941r669721q204023p010787o683186o039489
6556E4241285n292787l783582k857180l357745l408277k991652k326410j736915
6548B8486737j961238j025686p01895r17916q07880m66582K41274M38008m62174
$$ plain form
6539 22822648 21677632 21694954 22414621 21811012 21086657 20718794 19924416 20297112 21197850
6530 21197850 20925504 20450473 21453455 21943297 21265130 19713592 17632768 16237813 15978074
6521 15978074 15584083 14775015 13878722 13310804 12444691 11639976 11851406 12779875 12848004 12344534
6511 12344534 11871915 11442524 12090881 13252184 13196229 12422622 11647420 11400648 11850945
6502 11850945 12094005 11739749 11494706 11068810 11888054 13217888 13788435 13268733 13517343
6493 13517343 14454575 15028859 14684463 14313315 14715172 14970899 14877399 14755716 14941114 15244563
6483 15244563 15074400 14544115 14338890 14089910 14267827 14498278 15273329 16879034 17939808
6474 17939808 17459527 17419844 18167903 18713090 19534877 20909661 21334511 20591961 20400637
$$ packed form
6539B2822648j145016J7322P19667o03609p24355l67863p94378L72696R00738
6530B1197850k72346m75031J002982M89842o78167j551538k080824j394955k59739
6521A5978074l93991q09068q96293n67918q66113q04715K11430R28469O8129n03470
6511A2344534m72619m29391O48357J161303n5955p73607p75202k46772M50297
6502A1850945K43060l54256k45043m25896Q19244J329834N70547n19702K48610
6493A3517343R37232N74284l44396l71148M01857K55727r3500j21683J85398L03449
6483A5244563j70163n30285k05225k48980J77917K30451P75051J605705J060774
6474A7939808m80281l9683P48059N45187Q21787J374784M24850p42550j91324
$$ plain form
6465 20400637 20516046 21305846 21853853 22522880 23336641 24366910 24641184 23120064 21974491
6456 21974491 21765496 22072269 21813827 21214858 20902431 20734856 21224143 21499684 21051280
6447 21051280 19584502 17605928 16809698 17267600 16820346 16046074 14992444 13845026 12984843
6438 12984843 12885754 13436857 13603516 13523432 13880682 14476321 14525288 14437475 14819558 15519107
6428 15519107 16419337 17281941 17145871 17727161 19343978 20406002 20870486 20982210 21131570
6419 21131570 21326767 21310562 21231909 20916503 21457454 23214262 24712819 26266499 28082375
6410 28082375 30000987 32068184 33773847 35593756 37478692 38838217 39967152 41500102
6402 41500102 42684462 43563284 45131619 47199113 48754593 49429385 49160031 48961472 49298675
$$ packed form
6465B0400637J15409P89800N48007O69027Q13761J030269K74274j521120j145573
6456B1974491k08995L06773k58442n98969l12427j67575M89287K75541m48404
6447B1051280j466778j978574p96230M57902m47254p74272j053630j147418q60183
6438A2984843r9089N51103J66659q0084L57250N95639M8967q7813L82083O99549
6428A5519107R00230Q62604j36070N81290J616817J062024M64484J11724J49360
6419B1131570J95197j6205p8653l15406N40951J756808J498557J553680J815876
6410B8082375J918612K067197J705663J819909J884936J359525J128935J532950
6402D1500102J184360Q78822J568335K067494J555480O74792k69354j98559L37203
$$ plain form
6393 49298675 49354465 50031267 50913754 52227194 53172449 53973048 54315080 54426874 54014890
6384 54014890 53368244 52461640 51161288 49830861 48229729 46320422 44069489 42240039
6376 42240039 39643156 37409776 36310433 36248476 35193788 33155519 31405128 30304650
6368 30304650 29909510 30123210 29216280 27372084 24587721 22517349 21790869 20594997 18586999
6359 18586999 17988696 18177676 18724016 19149467 18978347 18060867 17066854 16211959 14991707
6350 14991707 13516838 12051384 11871548 12670166 13119442 12734559 12210980 10898686 10148156
6341 10148156 10265486 10290119 9300193 8290101 8397719 8692140 8087047 7820631 8056800
6332 8056800 7941823 7688655 7320735 6465553 6219906 7664447 8993159 9354510 9038020
$$ packed form
6393D9298675N5790O76802Q82487J313440R45255Q00599L42032J11794m11984
6384E4014890o46646r06604j300352j330427j601132j909307k250933j829450
6376D2240039k596883k233380j099343o1957j054688k038269j750391j100478
6368C0304650l95140K13700r06930j844196k784363k070372p26480j195872k007998
6359A8586999n98303J88980N46340M25451j71120r17480r94013q54895j220252
6350A4991707j474869j465454j79836P98618M49276l84883n23579j312294p50530
6341A0148156J17330K4633r89926j010092J07618K94421o05093k66416K36169
6332H056800j14977k53168l67920q55182k45647J444541J328712L61351l16490
$$ plain form
6323 9038020 8275986 8398170 9170954 9317526 9418411 9657170 9350830 8888122 9262736 9547324
6313 9547324 10381776 10353054 8994948 8739646 9494455 9561843 9176804 9217781 9016027 9579683
6303 9579683 9813438 9188728 8528210 8518512 9158804 9601262 9862179 10011229 10531116 10930941
6293 10930941 10571019 10354671 10396970 10972359 12145177 12018927 11557855 11137761 10845271
6284 10845271 10908481 11317185 12441590 13198537 13052583 12985255 13169368 12819946 12067473 11327452
6274 11327452 10732159 9906864 8814392 9216927 10304715 10881466 11180394 10931082 11080069
6265 11080069 11733372 11768664 12065100 12472228 12869289 13063196 12911986 13374619 14292210 14679017
6255 14679017 14107471 13894813 14412098 14617023 15381297 16187587 15968316 15899456 15535188 14987825
$$ packed form
6323I038020p62034J22184P72784J46572J00885K38759l06340m62708L74614K84588
6313I547324Q34452k8722j358106k55302P54809O7388l85039M0977k01754N63656
6303I579683K33755o24710o60518r698O40292M42458K60917J49050N19887L99825
6293A0930941l59922k16348M2299N75389J172818j26250m61072m20094k92490
6284A0845271O3210M08704J124405P56947j45954o7328J84113l49422p52473p40021
6274A1327452n95293q25295j092472M02535J087788N76751K98928k49312J48987
6265A1080069O53303L5292K96436M07128L97061J93907j51210M62633R17591L86807
6255A4679017n71546k12658N17285K04925P64274Q06290k19271o8860l64268n47363
$$ plain form
6245 14987825 15560598 16297229 17191351 18668623 19408922 20164000 20356205 19909779 19998123
6236 19998123 21066102 24289064 27597806 29764634 31451976 33307790 34953703 37048733
6228 37048733 40014054 43230535 47476196 53135987 59258070 64930681 69980762 74033515
6220 74033515 78632070 84734266 91607911 99546262 107751661 115375912 123046895 129958179
6212 129958179 136126644 140124929 141473992 139916397 136022890 130913905 124102347 116756826
6204 116756826 110419524 104775131 99539122 94831832 91086570 87802404 85171128 83564913
6196 83564913 83529238 85449629 87679855 89426181 92575437 97164304 101863919 106522568
6188 106522568 111875888 118070071 124251523 129829215 135914822 143256049 149186353 153648376
$$ packed form
6245A4987825N72773P36631Q94122J477272P40299P55078J92205m46426Q8344
6236A9998123J067979L222962L308742K166828J687342J855814J645913K095030
6228C7048733K965321L216481M245661N659791O122083N672611N050081M052753
6220G4033515M598555O102196O873645P938351Q205399P624251P670983O911284
6212A29958179O168465L998285J349063j557595l893507n108985o811558p345521
6204A16756826o337302n644393n236009m707290l745262l284166k631276j606215
6196H3564913l5675J920391K230226J746326L149256M588867M699615M658649
6188A06522568N353320O194183O181452N577692O085607P341227N930304M462023
$$ plain form
6180 153648376 156439386 155001765 149756740 141746089 131129090 119937119 109568689 99613884
6172 99613884 90564723 82184853 74381724 66985030 60439306 55781831 52430405 49302904
6164 49302904 46633977 43590444 40791882 39052721 38089699 36371816 35194728 35185067 35043229
6155 35043229 34859399 34771501 35259369 36681660 38649945 40699663 42546548 45359504 48158021
6146 48158021 49567244 50234115 51521433 53287699 53469623 52902411 53026114 52662016 51176907
6137 51176907 48423782 45628458 44195074 43154000 41717293 39474496 37189813 34977120
6129 34977120 32536485 29936437 28405233 27838263 26746395 25324373 23853218 21777899
6121 21777899 20606318 20020694 19259062 18517716 17848887 15660252 13281430 12759160 13188315
$$ packed form
6180A53648376K791010j437621n245025q010651j0616999j1191971j0368430r954805
6172I9613884r049161q379870p803129p396694o545724m657475l351426l127501
6164D9302904k668927l043533k798562j739161r63022j717883j177088r661j41838
6155C5043229j83830q7898M87868J422291J968285K049718J846885K812956K798517
6146D8158021J409223O66871J287318J766266J81924n67212J23703l64098j485109
6137E1176907k753125k795324j433384j041074j436707k242797k284683k212693
6129C4977120k440635k600048j531204n66970j091868j422022j471155k075319
6121B1777899j171581n85624p61632p41346o68829k188635k378822n22270M29155
$$ plain form
6112 13188315 13079050 13314516 12637158 12003220 12338222 11840033 11216683 11686536 11260884
6103 11260884 9753678 9168870 9433459 9357437 8725495 8668063 9266344 10184732 11020342 11536197
6093 11536197 11333321 12013391 11642833 10691140 11248509 12120930 12568853 12919738 12976643 13459043
6083 13459043 14777205 16216495 17353231 17329535 16494471 16163687 16792577 17155279 16125784
6074 16125784 15284867 14887980 14094560 13486353 13042370 12922941 13512437 13688137 14046229
6065 14046229 14853991 15860355 16669836 18164702 19293944 19512229 19960886 20921074 22709853
6056 22709853 24364714 25900334 27058342 26939410 25229475 23504423 22292531 21051494
6048 21051494 19146791 17961272 16806073 15869015 15760264 15459662 14133472 13264938 12856580
$$ packed form
6112A3188315j09265K35466o77358o33938L35002m98189o23350M69853m25652
6103A1260884j507206n84808K64589p6022o31942n7432N98281R18388Q35610N15855
6093A1536197k02876O80070l70558r51693N57369Q72421M47923L50885N6905M82400
6083A3459043J318162J439290J136736k3696q35064l30784O28890L62702j029495
6074A6125784q40917l96887p93420o08207m43983j19429N89496J75700L58092
6065A4046229Q07762J006364Q09481J494866J129242K18285M48657R60188J788779
6056B2709853J654861J535620J158008j18932j709935j725052j211892j241037
6048B1051494j904703j185519j155199r37058j08751l00602j326190q68534m08358
$$ plain form
6039 12856580 11824353 10782887 10319456 10301610 9896614 8890233 8770513 8565323 7564998
6030 7564998 7262043 6781327 6644369 6338339 6503371 6766207 7260096 8778525 9294053
6021 9294053 9411902 9768546 9703303 9800371 10745755 10758557 9719314 9641460 9936855 9626516
6011 9626516 9518652 10205006 11471449 12281477 11891623 11553073 11300297 11627136 12512424
6002 12512424 12864916 13032516 13827107 15217957 17653786 21274435 24113376 26573843 29987095
5993 29987095 32890566 34652447 35588267 37456870 38536399 36916219 35332167 32478471
5985 32478471 27830945 23321271 20531381 18761914 17367046 15632628 13494343 11999595
5977 11999595 10970965 9549016 7959684 7757404 8060256 8151253 8517532 7860358 6819422
$$ packed form
6039A2856580j032227j041466m63431j7846m04996j006381j19720k05190j000325
6030G564998l02955m80716j36958l06030J65032K62836M93889J518429N15528
6021I294053J17849L56644o5243R7068R45384J2802j039243p7854K95395l10339
6011I626516j07864O86354J266443Q10028l89854l38550k52776L26839Q85288
6002A2512424L52492J67600P94591J390850K435829L620649K838941K460467L413252
5993B9987095K903471J761881R35820J868603J079529j620180j584052k853696
5985C2478471m647526m509674k789890j769467j394868j734418k138285j494748
5977A1999595j028630j421949j589332k02280L02852R0997L66279o57174j040936
$$ plain form
5968 6819422 6125693 6375610 6946813 7286340 7616654 7146590 6219981 5356283 4540143 4088213
5958 4088213 4570739 5072487 4755309 4894374 4206279 2497834 1552179 1171280 1055402
5949 1055402 1247795 2355852 3445987 2999605 2891830 3278313 2750548 3018716 3703324
5940 3703324 4417113 4269667 3384645 2920326 2967155 3296860 2451260 1659866 1248455 535080
5930 535080 158832 1013865 1523578 2619391 2948650 3067077 3915860 4258375 3959599 3711671
5920 3711671 3383269 2159716 1357832 981555 1054292 745460 666557 617571 133740 -86639
5910 -86639 -375532 -504750 834959 2404227 2753852 2631943 2888593 2804767 2691263 2570740
5900 2570740 2384746 2158494 2113995 3100404 4165368 3929381 3367545 3008301 2758631 2168172
$$ packed form
5968F819422o93729K49917N71203L39527L30314m70064r26609q63698q16140m51930
5958D088213M82526N01748l17178J39065o88095j708445r45655l80899j15878
5949A055402J92393J108057J090135m46382j07775L86483n27765K68168O84608
5940C703324P13789j47446q85022m64319M6829L29705q45600p91394m11411p13375
5930E35080l76248Q55033N09713J095813L29259J18427Q48783L42515k98776k47928
5920C711671l28402j223553q01884l76277P2737l08832p8903m8986m83831k20379
5910h6639k88893j29218J339709J569268L49625j21909K56650q3826j13504j20523
5900B570740j85994k26252m4499R86409J064964k35987n61836l59244k49670n90459
$$ plain form
5890 2168172 1273136 795214 1421882 1939630 1798105 1748424 2386684 2634616 1661965 918079
5880 918079 1251012 2085615 2602766 2160265 1684406 1768627 2782584 3862985 4115858 3847449
5870 3847449 3714105 3277612 2350404 2326256 3015711 2732210 2890847 4301625 5882322
5861 5882322 6208673 6175384 6232104 5913424 5802746 7513173 9950723 11972094 14191860
5852 14191860 17130919 20689480 25737418 31997208 39178427 44580616 45617758 41709746
5844 41709746 34724135 28008956 22623969 18190003 14858233 12573414 10581041 8941381
5836 8941381 8194066 7423279 7174411 6947608 6632852 6608765 7150878 7376416 6325781 5174485
5826 5174485 5096127 4813507 3646146 2785268 1220616 135835 561988 2036244 2573934
$$ packed form
5890B168172q95036m77922O26668N17748j41525m9681O38260K47932r72651p43886
5880I18079L32933Q34603N17151m42501m75859Q4221J013957J080401K52873k68409
5870C847449j33344m36493r27208k4148O89455k83501J58637J410778J580697
5861E882322L26351l3289N6720l18680j10678J710427K437550K021371K219766
5852A4191860K939059L558561N047938O259790P181219N402189J037142l908012
5844D1709746o985611o715179n384987m433966l331770k284819j992373j639660
5836H941381p47315p70787k48868k26803l14756k4087N42113K25538j050635j151296
5826E174485p8358k82620j167361q60878j564652j084781M26153J474256N37690
$$ plain form
5817 2573934 3504447 4185380 4095204 3834075 2800436 1955782 2012752 1686177 1226623 1841246
5807 1841246 1828485 1194438 121614 -944672 -1073589 -691733 21900 1355677 2721895
5798 2721895 3268684 3489365 2878251 1796739 919049 235503 626906 1447126 2387563
5789 2387563 3362323 2660700 2200492 2017594 2413063 3024514 2680184 2227923 2272446 1895773
5779 1895773 1255756 1634608 1972836 2060587 2137398 1838596 2324907 2049928 1606788 2231625
5769 2231625 2787619 3113794 2351336 1209625 988880 1212857 2574163 3475126 2889922
5760 2889922 1584951 1003533 1783864 2014262 2031139 3038563 3665657 4223753 4534815
5751 4534815 4210181 3832677 2998123 1834643 1387848 1126431 1472351 789340 -187345
$$ packed form
5817B573934R30513O80933r0176k61129j033639q44654N6970l26575m59554O14623
5807A841246j2761o34047j072824j066286j28917L81856P13633J333777J366218
5798B721895N46789K20681o11114j081512q77690o83546L91403Q20220R40437
5789B387563R74760p01623m60208j82898L95469O11451l44330m52261M4523l76673
5779A895773o40017L78852L38228Q7751P6811k98802M86311k74979m43140O24837
5769B231625N55994L26175p62458j141711k20745K23977J361306R00963n85204
5760B889922j304971n81418P80331K30398J6877J007424O27094N58096L11062
5751D534815l24634l77504q34554j163480m46795k61417L45920o83011r76685
$$ plain form
5742 -187345 9099 782209 1466382 1621998 1814806 2050512 1388371 401582 -502586 -1019308
5732 -1019308 -898337 -308296 -491117 -1251511 -1216969 -948268 -1071094 -1433793 -843204 862084
5722 862084 1654810 866252 333558 520282 541637 660495 682735 -67096 -1047421 -537395
5712 -537395 -325988 -597682 -111424 408778 1152295 1532605 1028441 692281 954377 950293
5702 950293 1062093 690565 363394 892828 430530 -418883 -439399 -745624 -852999 -1195341
5692 -1195341 -920494 -426653 -872654 -1336310 -1235513 -41439 801468 430579 1020212
5683 1020212 1898469 1613823 675438 64731 -662434 -1474374 -1662985 -1397948 -1545723 -1583637
5673 -1583637 -1015074 -511700 637910 2245096 2833821 2025254 320146 -874872 -1536529
$$ packed form
5742a87345J96444P73110O84173J55616J92808K35706o62141r86789r04168n16722
5732a019308J20971N90041j82821p60394L4542K68701j22826l62699N90589J705288
5722H62084P92726p88558n32694J86724K1355J18858K2240p49831r80325N10026
5712e37395K11407k71694M86258N20202P43517L80310n04164l36160K62096m084
5702I50293J11800l71528l27171N29434m62298q49413k0516l06225j07375l42342
5692a195341K74847M93841m46001m63656J00797J194074Q42907l70889N89633
5683A020212Q78257k84646r38385o10707p27165q11940j88611K65037j47775l7914
5673a583637N68563N03374J149610J607186N88725q08567j705108j195018o61657
$$ plain form
5664 -1536529 -1540800 -1381762 -927062 -928146 -820179 -359830 -61553 260108 61450 -467668
5654 -467668 -564452 -420605 -115763 -88436 -330644 -212601 -560879 -811296 -591275 -87837
5644 -87837 362262 740260 697166 302614 906468 1043012 -446622 -1602216 -2416827 -2478273
5634 -2478273 -2381490 -2612842 -2388432 -1583606 -1223337 -792772 -657199 -407268 -185750 -344969
5624 -344969 -481980 -843222 -1057255 -1729761 -1456494 -253011 -984737 -2049975 -2210333
5615 -2210333 -2526391 -2653084 -1759670 -488067 -102750 -8754 425382 381455 551320 745244
5605 745244 779773 976721 1316115 1914726 2103277 1294994 -369093 -1760650 -2975304
5596 -2975304 -2748743 -2214444 -2151161 -1075596 -332226 -613605 -735491 -820677 -1375816 -2694771
$$ packed form
5664a536529m271J59038M54700j084J07967M60349K98277L21661j98658n29118
5654d67668r6784J43847L04842K7327k42208J18043l48278k50417K20021N03438
5644h7837M50099L77998m3094l94552O03854J36544j489634j155594q14611o1446
5634b478273R6783k31352K24410Q04826L60269M30565J35573K49931K21518j59219
5624c44969j37011l61242k14033o72506K73267J203483p31726j065238j60358
5615b210333l16058j26693Q93414J271603L85317R3996M34136m3927J69865J93924
5605G45244L4529J96948L39394N98611J88551q08283j664087j391557j214654
5596b975304K26561N34299O3283J075565P43370k81379j21886q5186n55139j318955
$$ plain form
5586 -2694771 -2674825 -1590125 -869485 -6670 790107 551537 -36454 2089 -52651 -1222381
5576 -1222381 -2279619 -2329178 -1536825 -1558612 -1990577 -1561367 505529 2099490 2528033
5567 2528033 2211587 2013933 1421442 660766 149737 -602280 -1023286 -1330575 -1751730 -1301434
5557 -1301434 -617876 80431 93181 -64544 295346 770749 1266718 1768088 1736882 683212
5547 683212 -4960 8000 -121201 146681 629093 1094312 737289 19385 -477592 -689959
5537 -689959 -929778 -1372522 -1734389 -1087982 -294432 37928 192425 -113178 -298375 -878719
5527 -878719 -1621297 -2183302 -2620821 -1754336 -782939 -957536 -554297 -68988 470615 654957
5517 654957 231311 -776657 -1330405 -1559565 -1232178 -1019077 -989267 -760978 -301461 -46900
$$ packed form
5586b694771J9946J084700P20640Q62815P96777k38570n87991L8543n4740j169730
5576a222381j057238m9559P92353k1787m31965M29210K066896J593961M28543
5567B528033l16446j97654n92491p60676n11029p52017m21006l07289m21155M50296
5557a301434O83558O98307J2750j57725L59890M75403M95969N01370l1206j053670
5547F83212o88172J2960j29201K67882M82412M65219l57023p17904m96977k12367
5537f89959k39819m42744l61867O46407P93550L32360J54497l05603j85197n80344
5527h78719p42578n62005m37519Q66485R71397j74597M03239M85309N39603J84342
5517F54957m23646j007968n53748k29160L27387K13101K9810K28289M59517K54561
$$ plain form
5507 -46900 33157 471220 348135 -406228 -451061 -442008 -463185 -804870 -1266080 -1962536 -1977523
5496 -1977523 -1106680 -712057 -1052780 -1430420 -1285967 -962921 -1138363 -1181645 -585240 -43755
5486 -43755 393089 -117291 -929002 -351575 820095 1155226 1111929 1686697 1894207 1631921
5476 1631921 789071 400309 388563 449790 869256 399430 -231153 -136697 -367277 -819057
5466 -819057 97731 297426 26975 1034223 1846724 2038179 1709769 1009692 -184259
5457 -184259 -506628 -208168 -161870 113803 -755385 -874356 310968 309101 -294344 -404888
5447 -404888 297372 316759 -193646 208409 343894 -101596 -619366 -678895 -16489 63651
5437 63651 -613356 -1533784 -1998343 -1283402 -196939 -412716 -831381 -1157359 -1252590 -999438
$$ packed form
5507d6900Q0057M38063j23085p54363m4833R053k1177l41685m61210o96456j4987
5496a977523Q70843L94623l40723l77640J44453L23046j75442m3282N96405N41485
5486d3755M36844n10380q11711N77427J171670L35131m3297N74768K07510k62286
5476A631921q42850l88762j1746O1227M19466m69826o30583R4456k30580m51780
5466h19057R16788J99695k70451J007248Q12501J91455l28410p00077j193951
5457a84259l22369K98460M6298K75673q69188j18971J185324j867o03445j10544
5447d04888P02260J9387n10405M02055J35485m45490n17770n9529O62406Q0140
5437F3651o77007r20428m64559P14941J086463k15777m18665l25978r5231K53152
$$ plain form
5427 -999438 -1276750 -2206297 -2377661 -2398913 -2599937 -2694135 -2731765 -2267536 -1243000 -340051
5417 -340051 -804780 -969876 -527550 -730071 -601266 -73045 709131 390979 -444484 -690083
5407 -690083 -746192 -572227 -461076 -333232 375378 225058 -5722 359142 -111333 -624582
5397 -624582 -743934 -1246422 -1624525 -1364961 -1713253 -1235760 7682 391905 -308274 -92910
5387 -92910 1124357 1990407 1656987 724397 -236820 -3382 531161 -55648 -1116635 -1403328
5377 -1403328 -377752 250378 -6741 -466065 -805309 -587238 137891 667907 781543
5368 781543 861935 407815 -497648 -754195 -609448 -273476 -466309 -819141 -808809 -1381456
5358 -1381456 -1842587 -1851272 -1715726 -1111862 -501565 205215 366790 288459 372888 264700
$$ packed form
5427i99438k77312r29547j71364k1252k01024r4198l7630M64229J024536R02949
5417c40051m64729j65096M42326k02521J28805N28221P82176l18152q35463k45599
5407f90083n6109J73965J11151J27844P08610j50320k30780L64864m70475n13249
5397f24582j19352n02488l78103K59564l48292M77493J243442L84223p00179K15364
5387i2910J217267Q66050l33420r32590r61217K33438N34543n86809j060987k86693
5377a403328J025576O28130k57119m59324l39244K18071P25129N30016J13636
5368G81543Q0392m54120r05463k56547J44747L35972j92833l52832J0332n72647
5358a381456m61131q685J35546O03864O10297P06780J61575p8331Q4429j08188
$$ plain form
5348 264700 -95773 -169154 -180005 -1083083 -1755909 -1104700 262319 703652 347748 106605
5338 106605 -371474 -1252567 -2061103 -3297497 -4858470 -5472231 -5250453 -4392323 -3467939
5329 -3467939 -2292279 -1165060 -1232932 -1940111 -2319631 -2717121 -3364401 -3010499 -1586093
5320 -1586093 -369619 -636869 -1235087 -1972999 -2389292 -1393791 -792705 -1369142 -1226194
5311 -1226194 -890711 -1466490 -1697837 -953184 380820 1177311 1339909 1274684 798701 -192150
5301 -192150 -1215746 -1650813 -924255 -392464 -691559 -1234833 -725260 -390616 -1148716 -864402
5291 -864402 -1007712 -1220304 -1394925 -1640597 -1470625 -1233071 -1479946 -1333124 -1478543 -1696554
5281 -1696554 -1194849 -1040553 -1594202 -1606856 -510663 499915 454240 -403990 -1102661 -1883492
$$ packed form
5348B64700l60473p3381j0851r03078o72826O51209J367019M41333l55904k41143
5338A06605m78079q81093q08536j236394j560973o13761K21778Q58130R24384
5329c467939J175660J127219o7872p07179l79520l97490o47280L53902J424406
5320a586093J216474k67250n98218p37912m16293R95501O01086n76437J42948
5311a226194L35483n75779k31347P44653J334004P96491J62598o5225m75983r90851
5301a92150j023596m35067P26558N31791k99095n43274N09573L34644p58100K84314
5291h64402j43310k12592j74621k45672J69972K37554k46875J46822j45419k18011
5281a696554N01705J54296n53649j2654J096193J010578m5675q58230o98671p80831
$$ plain form
5271 -1883492 -2123887 -2296359 -2476207 -2295345 -1582339 -777954 246880 1096708 700836
5262 700836 5000 1092 550820 161221 -930229 -1457252 -1003644 -649372 -1495338 -2519178
5252 -2519178 -2976321 -2591227 -2162123 -2143453 -1443335 -86256 498643 908428 598514 55971
5242 55971 -448932 -1368803 -1890519 -2360541 -2882445 -3342012 -3805274 -4271565 -4587708 -4896955
5232 -4896955 -4540740 -3296400 -2239250 -1813699 -1522946 -938000 278249 916901 1218316
5223 1218316 1648075 998682 -575296 -1315410 -1461436 -993592 -565057 -686845 -539953
5214 -539953 317347 816448 186852 -809013 -2437623 -2767048 -2323742 -1337474 -1102539 -2474391
5204 -2474391 -2748068 -1883794 -1157451 -113422 1173244 871074 -147434 -794783 -785475
$$ packed form
5271a883492k40395j72472j79848J80862P13006Q04385J024834Q49828l95872
5262G00836o95836l908N49728l89599j091450n27023M53608L54272q45966j023840
5252b519178m57143L85094M29104J8670P00118J357079N84899M09785l09914n42543
5242E5971n04903r19871n21716m70022n21904m59567m63262m66291l16143l09247
5232d896955L56215J244340J057150M25551K90753N84946J216249O38652L01415
5223A218316M29759o49393j573978p40114j46026M67844M28535j21788J46892
5214e39953Q57300M99101o29596r95865j628610l29425M43306R86268K34935j371852
5204b474391k73677Q64274P26343J044029J286666l02170j018508o47349R308
$$ plain form
5195 -785475 -1259568 -1897835 -1972234 -2401218 -2657713 -1408852 -199482 384176 680900 -336436
5185 -336436 -1233684 -968427 -1390843 -2292244 -3621591 -4745909 -4145855 -4265787 -4801108
5176 -4801108 -4427226 -2611756 -1198449 -649444 -537938 -1061121 -1689398 -2625229 -2945100
5167 -2945100 -2511607 -2144493 -2450437 -2030676 -1786769 -833604 100492 128357 -283593 -213409
5157 -213409 109577 404320 1298933 1464692 580219 -190505 -625386 -522447 -192079 -702315
5147 -702315 -1394371 -2745141 -3375048 -2253908 -1973850 -2487025 -1950284 -766770 327031
5138 327031 813111 2292996 3876902 4917556 5031624 3891728 3198057 1242241 -380564
5129 -380564 -214678 -261188 -686052 -438416 -505589 -1160662 -1406941 -1654486 -1914781 -2244288
$$ packed form
5195g85475m74093o38267p4399m28984k56495J248861J209370N83658K96724j017336
5185c36436q97248K65257m22416r01401j329347j124318O00054j19932n35321
5176d801108L73882J815470J413307N49005J11506n23183o28277r35831l19871
5167b945100M33493L67114l05944M19761K43907R53165R34096K7865m11950P0184
5157b13409L22986K94743Q94613J65759q84473p70724m34881J02939L30368n10236
5147g02315o92056j350770o29907J121140K80058n13175N36741J183514J093801
5138C27031M86080J479885J583906J040654J14068j139896o93671j955816j622805
5129c80564J65886m6510m24864K47636o7173o55073k46279k47545k60295l29507
$$ plain form
5119 -2244288 -1609051 -1066582 -1060929 -2035698 -2900148 -2297837 -847682 -548798 -394254 513822
5109 513822 1172650 548760 -22086 -83214 -715834 -990526 -1931246 -2940217 -3291601 -3543095
5099 -3543095 -3389615 -2901187 -2439941 -2626898 -2412267 -1998960 -2267746 -1624543 -332594
5090 -332594 -424876 -1804038 -1888810 -971971 -208742 26887 -53462 -688495 -1398059 -2028434
5080 -2028434 -1974367 -1501830 -993866 -479360 -453476 -730317 -363136 -101274 -279813 -394444
5070 -394444 -557535 -1361847 -2131533 -1991355 -1449933 -1316459 -1224503 -656802 -307686 175489
5060 175489 1110238 2126556 2684064 2435537 1493902 643665 -34397 -1191554 -2130196
5051 -2130196 -1774609 -1383343 -2214188 -2486618 -1449959 -840669 -588558 -416353 -120523
$$ packed form
5119b244288O35237N42469N653r74769q64450O02311J450155K98884J54544R08076
5109E13822O58828o23890n70846o1128o32620k74692r40720j008971l51384k51494
5099c543095J53480M88428M61246j86957K14631M13307k68786O43203J291949
5090c32594r2282j379162q4772R16839P63229K35629q0349o35033p09564o30375
5080b028434N4067M72537N07964N14506K5884k76841L67181K61862j78539j14631
5070c94444j63091q04312p69686J40178N41422J33474R1956N67701L49116M83175
5060A75489R34749J016318N57508k48527r41635q50237o78062j157157r38642
5051b130196L55587L91266q30845k72430J036659O09290K52111J72205K95830
$$ plain form
5042 -120523 143541 455869 91933 -879744 -822938 -231597 207272 315934 -3645 257668
5032 257668 137738 -205360 -455913 -164405 70447 -257037 -1042346 -2262699 -2356608 -1463898
5022 -1463898 -94603 174477 -874119 -1372814 -1646865 -1993212 -2116899 -1797130 -873011
5013 -873011 -402993 -921134 -848364 -724491 -867332 -1295199 -953268 71058 124046 -669542
5003 -669542 -651930 -627625 -1045743 -200580 495070 44275 -1087791 -1943861 -2023053 -2210721
4993 -2210721 -2465887 -2507258 -1067014 350823 -53264 -1336420 -1968293 -2631296 -2752519
4984 -2752519 -2411779 -1511721 -689288 -468872 -658469 -1060151 -1654373 -2413080 -2576036 -1664173
4974 -1664173 -1188955 -763838 -651869 -705920 92940 -4021 -641405 -716446 263087 1134221
$$ packed form
5042a20523K64064L12328l63936r71677N6806N91341M38869J08662l19579K61313
5032B57668j19930l43098k50553K91508K34852l27484p85309j220353r3909Q92710
5022a463898J369295K69080j048596m98695k74051l46347j23687L19769R24119
5013h73011M70018n18141P2770J23873j42841m27867L41931J024326N2988p93588
5003f69542J7612K4305m18118Q45163O95650m50795j132066q56070p9192j87668
4993b210721k55166m1371J440244J417837m04087j283156o31873o63003j21223
4984b752519L40740R00058Q22433K20416j89597m01682n94222p58707j62956R11863
4974a664173M75218M25117J11969n4051P98860r6961o37384p5041R79533Q71134
$$ plain form
4964 1134221 947900 888445 892722 296335 279476 82872 -498143 -1263364 -1664764 -1388268
4954 -1388268 -1232460 -890598 -651328 296518 357111 -107772 -83000 -472923 -630010 -332878
4944 -332878 -249321 -977145 -2341699 -3501533 -3932902 -3181291 -1539507 -321605 920516
4935 920516 706213 -222113 -153529 576973 -58864 -1454562 -2376888 -3257938 -3201384 -2665977
4925 -2665977 -2142259 -1402847 -408737 146181 -673306 -1176204 -794188 -767650 -1382834 -2658508
4915 -2658508 -3587266 -2951018 -2350824 -2335988 -2652273 -3050612 -3591661 -3869839 -4304053 -4364657
4905 -4364657 -4184472 -3694649 -3669325 -2944704 -1594482 -1247763 -2425962 -2812735 -2596873
4896 -2596873 -2059895 -2185816 -2188369 -1295176 -655693 -1019346 -1303500 -1188593 -1107473 -1555070
$$ packed form
4964A134221j86321n9455M277n96387j6859j96604n81015p65221m01400K76496
4954a388268J55808L41862K39270R47846O0593m64883K4772l89923j57087K97132
4944c32878Q3557p27824j364554j159834m31369P51611J641784J217902J242121
4935I20516k14303r28326O8584P30502o35837j395698r22326q81050N6554N35407
4925b665977N23718P39412R94110N54918q19487n02898L82016K6538o15184j275674
4915b658508r28758O36248O00194J4836l16285l98339n41049k78178m34214o0604
4905d364657J80185M89823K5324P24621J350222L46719j178199l86773K15862
4896b596873N36978j25921k553Q93193O39483l63653k84154J14907Q1120m47597
$$ plain form
4886 -1555070 -1607567 -730949 178882 235377 -1083431 -735483 -141369 -852701 -704348 194353
4876 194353 342374 -442678 -932509 -1393473 -1335555 -874732 -230806 267931 570510 -551151
4866 -551151 -2013187 -2812013 -2570520 -1864156 -873203 -81108 -285076 -702678 -877333 -613659
4856 -613659 -1041839 -1374149 -714165 -359129 -541510 -430326 -482403 -552618 -613644 -534759
4846 -534759 -410753 -811636 -862877 -187390 -795312 -1656925 -1531947 -304042 -513649 -1909563
4836 -1909563 -2703466 -3121063 -2814703 -1840969 -1042312 -1060904 -1106192 -846886 -109786 309112
4826 309112 -765828 -1254297 -886923 -847161 -66468 892709 748903 211662 297556 384267
4816 384267 530845 516781 88113 -984207 -1933241 -1699644 -1214247 -344980 -296649 -1127617
$$ packed form
4886a555070n2497Q76618R09831N6495j318808L47948N94114p11332J48353Q98701
4876A94353J48021p85052m89831m60964N7918M60823O43926M98737L02579j121661
4866e51151j462036p98826K41493P06364R90953P92095k03968m17602j74655K63674
4856f13659m28180l32310O59984L55036j82381J11184n2077p0215o1026P8885
4846e34759J24006m00883n1241O75487o07922q61613J24978J227905k09607j395914
4836a909563p93903m17597L06360R73734P98657j8592m5288K59306P37100M18898
4826C09112j074940m88469L67374L9762P80693R59177j43806n37241Q5894Q6711
4816C84267J46578j4064m28668j072320r49034K33597M85397Q69267M8331q30968
$$ plain form
4806 -1127617 -1325120 -1778275 -3127966 -3357837 -2590696 -1935509 -1483814 -1457982 -1630963 -1235203
4796 -1235203 -913318 101223 1014476 495909 -911088 -1530308 -1977395 -2302933 -1984657
4787 -1984657 -854352 320600 453844 111505 -66598 -1531762 -2581866 -1413113 21610
4778 21610 541760 529686 -226985 -7155 526006 588138 767325 1794358 2022467 1470111
4768 1470111 506308 -876340 -1181371 -655076 506624 48842 -1023703 -1274162 -809921
4759 -809921 957654 1700026 1091821 369762 -343814 -1098856 -1313508 -1244469 -1012046 -1483060
4749 -1483060 -2910801 -2873417 -1125199 -379014 -667361 -1552615 -1474684 -926831 -1486114 -1815247
4739 -1815247 -894922 326960 31907 205286 114487 -678625 -420626 554733 1823369
$$ packed form
4806a127617j97503m53155j349691k29871P67141O55187M51695K5832j72981L95760
4796a235203L21885J014541R13253n18567j406997o19220m47087l25538L18276
4787a984657J130305J174952J33244l42339j78103j465164j050104J168753J434723
4778B1610N20150j2074p56671K19830N33161O2132J79187J027033K28109n52356
4768A470111r63803j382648l05031N26295J161700m57782j072545k50459M64241
4759h09921J767575P42372o08205p22059p13576p55042k14652O9039K32423m71014
4749a483060j427741L7384J748218P46185k88347q85254P7931N47853n59283l29133
4739a815247R20325J221882k95053J73379r0799p93112K57999R75359J268636
$$ plain form
4730 1823369 2007408 809095 5284 -230358 -315722 -128430 -39483 -82647 -338044 -1644683
4720 -1644683 -2590404 -2932409 -3218262 -2834352 -1665251 -1508111 -1549138 -1586573 -1494527 -1834144
4710 -1834144 -1726642 -1535170 -2263782 -2268586 -1218684 -1415733 -1748365 -1855012 -1746540 -1548371
4700 -1548371 -448142 583772 541433 252193 203765 308977 -3305 74906 -316466 -844871
4690 -844871 -2055271 -2975557 -2862444 -2107375 -1567991 -1290188 -978842 -16461 10867 -224523
4680 -224523 -232592 -541566 -646384 -878526 -492265 -263849 440075 1375061 1664834 1970832
4670 1970832 1870376 1754451 1716131 894228 -52125 -67770 -434511 -1497176 -1738201 -1349984
4660 -1349984 -634914 -666105 -270675 6902 -89117 385107 1297382 2306216 2242347 1805239
$$ packed form
4730A823369J84039j198313q03811k35642q5364J87292Q8947m3164k55397j306639
4720a644683r45721l42005k85853L83910J169101J57140m1027l7435R2046l39617
4710a834144J07502J91472p28612m804J049902j97049l32632j06647J08472J98169
4700a548371J100229J031914m2339k89240m8428J05212l12282P8211l91372n28405
4690h44871j210400r20286J13113P55069N39384K77803L11346R62381K7328k35390
4680b24523q069l08974j04818k32142L86261K28416P03924R34986K89773L05998
4670A970832j00456j15925l8320q21903r46353j5645l66741j062665k41025L88217
4660a349984P15070l1191L95430K77577r6019M74224R12275J008834o3869m37108
$$ plain form
4650 1805239 1775172 2895012 3929156 4853033 6307783 8670241 11112951 12491701 11652667
4641 11652667 9146957 6883201 4565097 2809171 1700231 1411764 1804356 2198464 1121273
4632 1121273 -516478 -621747 -749222 -797276 -731508 -747360 5670 787583 1057464 900648
4622 900648 313454 -94119 -747344 -1142508 -800565 -727989 -705910 -464639 -684428 -871488
4612 -871488 -638970 -606370 -1019717 -1682376 -1099431 -547587 -1393725 -1766765 -1299337 -1579707
4602 -1579707 -1797647 -1369598 -1651981 -2232521 -3542999 -4324113 -3886643 -3054307 -3197716
4593 -3197716 -2946886 -1985411 -811260 893672 1608705 1288216 1031939 758459 881955
4584 881955 807268 1035639 505942 -314466 -1035190 -2439186 -3687418 -4123958 -3185271 -1719339
$$ packed form
4650A805239l0067J119840J034144R23877J454750K362458K442710J378750q39034
4641A1652667k505710k263756k318104j755926j108940k88467L92592L94108j077191
4632A121273j637751j05269j27475m8054O5768j5852P53030P81913K69881j56816
4622I00648n87194m07573o53225l95164L41943P2576K2079K41271k19789j87060
4612h71488K32518L2600m13347o62659N82945N51844q46138l73040M67428k80370
4602a579707k17940M28049k82383n80540j310478p81114M37470Q32336j43409
4593c197716K50830R61475J174151J704932P15033l20489k56277k73480J23496
4584H81955p4687K28371n29697q20408p20724j403996j248232m36540R38687J465932
$$ plain form
4574 -1719339 -426749 201926 275411 -340244 -519078 421643 724154 1143869 1580776 1769537
4564 1769537 916136 786384 1408963 1644391 2677274 3280539 3208208 3000683 2650899 2088367
4554 2088367 1328328 906925 834300 222011 -84824 -435350 -821224 -538869 -164900 925270
4544 925270 1515720 820302 -442127 -2475298 -3508064 -3296808 -3382337 -4053519 -3050907
4535 -3050907 -1792345 -1693009 -1041290 -133606 510198 991291 808916 1158346 630356 -422567
4525 -422567 -441732 -79630 24747 -52513 -36577 -175090 -61860 723925 919799 813039
4515 813039 1022665 2227994 2875868 3243271 3988410 3755665 3784463 4340081 5780086 6815673
4505 6815673 5947910 5130748 4425643 4053389 3670957 3190695 2171074 2318292 2931470
$$ packed form
4574a719339J292590O28675P3485o15655j78834R40721L02511M19715M36907J88761
4564A769537q53401j29752O22579K35428J032883O03265p2331k07525l49784n62532
4554B088367p60039m21403p2625o12289l06835l50526l85874K82355L73969J090170
4544I25270N90450o95418j262429k033171j032766K11256q5529o71182J002612
4535c050907J258562R9336O51719R07684O43804M81093j82375L49430n27990j052923
4525d22567j9165L62102J04377p7260J5936j38513J13230P85785J95874j06760
4515H13039K09626J205329O47874L67403P45139k32745K8798N55618J440005J035587
4505F815673q67763q17162p05105l72254l82432m80262j019621J47218O13178
$$ plain form
4496 2931470 2507645 2074548 2618479 3475905 3495173 2931574 1919509 1578239 1282444 1300456
4486 1300456 1797313 2406906 2773976 2231373 1926866 1496518 1258968 1484977 2190081 3029748
4476 3029748 3724407 4257396 5084414 5133024 4178263 3647626 2760085 2226054 1676305 1717963
4466 1717963 2135699 2527809 3555273 4310438 3843392 3533980 3209132 2457273 1871641
4457 1871641 1914913 2503856 2162625 911545 254265 1216893 2259917 1982101 607224
4448 607224 -567355 -729859 -453028 795472 1920743 1684385 250024 -1485928 -3490182
4439 -3490182 -4880014 -4227128 -2758626 -2331629 -2454342 -2519840 -2026992 -1577499 -2039003
4430 -2039003 -1640963 -1610703 -1912972 -2421991 -2418647 -1601868 -1832782 -1813176 -1540508 -1733224
$$ packed form
4496B931470m23825m33097N43931Q57426J9268n63599j012065l41270k95795J8012
4486A300456M96857O09593L67070n42603l04507m30348k37550K26009P05104Q39667
4476C029748O94659N32989Q27018M8610r54761n30637q87541n34031n49749M1658
4466A717963M17736L92110J027464P55165m67046l09412l24848p51859n85632
4457A871641M3272N88943l41231j251080o57280R62628J043024k77816j374877
4448F07224j174579j62504K76831J248500J125271k36358j434361j735952k004254
4439c490182j389832O52886J468502M26997j22713o5498M92848M49493m61504
4430b039003L98040L0260l02269n09019L344Q16779k30914J9606K72668j92716
$$ plain form
4420 -1733224 -1671880 -1433235 -872247 -813087 -872423 -376752 576533 1557581 1807938 905323
4410 905323 -32922 -559621 -1182450 -1768124 -1803056 -2451909 -2863928 -2493297 -2068577 -1504936
4400 -1504936 -1952174 -3111918 -3391158 -2648310 -1599591 -468068 593820 804390 405971
4391 405971 258768 971592 749364 -261232 54367 939738 793743 429936 14916 -75566
4381 -75566 -210739 -207328 -533100 -495728 -557298 -658320 -221345 912167 1639786 1110776
4371 1110776 1180069 361116 -724184 -1429371 -1869281 -1929150 -1757314 -1619832 -1586497 -1431857
4361 -1431857 -659697 -197733 127072 239003 49807 688632 914622 -203215 -1461333
4352 -1461333 -2100818 -2411971 -2044648 -1278033 -209480 366387 427709 475735 731586 1346797
$$ packed form
4420a733224O1344K38645N60988N9160n9336M95671R53285R81048K50357r02615
4410I05323r38245n26699o22829n85674l4932o48853m12019L70631M24720N63641
4400a504936m47238j159744k79240P42848J048719J131523J061888K10570l98419
4391D05971j47203P12824k22228j010596L15599Q85371j45995l63807m15020r0482
4381g5566j35173L411l25772L7372o1570j01022M36975J133512P27619n29010
4371A110776O9293q18953j085300p05187m39910n9869J71836J37482L3335J54640
4361a431857P72160M61964L24805J11931j89196O38825K25990j117837j258118
4352a461333o39485l11153L67323P66615J068553N75867O1322M8026K55851O15211
$$ plain form
4342 1346797 1894768 2151125 2236388 2434604 2355601 2072601 1492843 340372 -248016 185266
4332 185266 981689 1593504 1273371 670850 -215192 -1097617 -924195 -710457 -958142 -704081
4322 -704081 -758199 -476241 -1166209 -1552927 -1335453 -1220942 -1347051 -1137612 43477 390282
4312 390282 -5775 925089 1574296 966314 -19232 -304 707007 995072 1437265 1907787
4302 1907787 1634738 2585091 3882476 4514265 5876799 7863191 10481882 13573365 17402973
4293 17402973 23265458 31701367 42447202 55721091 69368445 73254039 63544365 49872243
4285 49872243 38217869 29683264 24602388 21696660 20314009 19587885 19861006 21211845
4277 21211845 21647648 19400979 16371433 14097779 12452298 11726929 11157819 9395299 8329735
$$ packed form
4342A346797N47971K56357Q5263J98216p9003k83000n79758j152471n88388M33282
4332A85266P96423O11815l20133o02521q86042q82425J73422K13738k47685K54061
4322g04081n4118K81958o89968l86718K17474J14511j26109K09439J181089L46805
4312C90282l96057R30864O49207o07982r85546J8928P07311K88065M42193M70522
4302A907787k73049R50353J297385O31789J362534J986392K618691L091483L829608
4293A7402973N862485Q435909J0745835J3273889J3647354L885594r709674j3672122
4285D9872243j1654374q534605n080876k905728j382651p26124K73121J350839
4277B1211845M35803k246669l029546k273654j645481p25369n69110j762520j065564
$$ plain form
4268 8329735 7465678 6978706 7323215 6634465 6118573 6799043 8039221 8536608 8078650
4259 8078650 7956631 7862934 7710989 7568133 7984155 9774676 11455218 12897467 14408424
4250 14408424 16145514 19466639 24373536 29155039 33177145 38653229 45405612 53473325
4242 53473325 64450940 79818466 99006294 121817050 149166904 178537447 203252503
4235 203252503 218167586 222750718 219909690 215041090 211541934 206707620 196203565 180251659
4227 180251659 160510864 140551507 123438262 108995901 96831388 85985869 74381173
4220 74381173 62124940 52065099 44627836 38406372 32846289 27975499 24687854 22136054
4212 22136054 19577117 17718937 15791211 13640836 11758041 10314361 9211423 9113223
$$ packed form
4268H329735q64057m86972L44509o88750n15892O80470J240178M97387m57958
4259H078650j22019r3697j51945j42856M16022J790521J680542J442249J510957
4250A4408424J737090L321125M906897M781503M022106N476084O752383Q067713
4242E3473325J0977615J5367526J9187828K2810756K7349854K9370543K4715056
4235B03252503J4915083M583132k841028m868600l499156m834314j0504055j5951906
4227A80251659j9740795j9959357j7113245j4442361j2164513j0845519j1604696
4220G4381173j2256233j0059841p437263o221464n560083m870790l287645k551800
4212B2136054k558937j858180j927726k150375j882795j443680j102938r8200
$$ plain form
4204 9113223 8477993 7000837 6542807 5982142 5372932 4918026 4610604 4499308 4478782 4947315
4194 4947315 6171150 7116243 7360901 6660389 6019530 6330114 7174065 7690229 8526131
4185 8526131 9639467 10474684 12214124 14424075 15806091 17707053 20460167 23276151
4177 23276151 26631715 32074956 39727355 49387524 58598979 65730198 69103945 69373874
4169 69373874 68722763 66875044 62996568 57205211 49821803 42467181 36159542 32099323
4161 32099323 30315739 28957950 27287200 24580154 22045039 19156684 16303585 14241961
4153 14241961 13102415 11846991 9615044 8129138 6948713 6090207 5475476 4964597 5527661
4144 5527661 6169360 6988690 6615042 5580447 4952568 4363831 3580400 2872647 3127794
$$ packed form
4204I113223o35230j477156m58030n60665o09210m54906l07422j11296k0526M68533
4194D947315J223835R45093K44658p00512o40859L10584Q43951N16164Q35902
4185H526131J113336Q35217J739440K209951J382016J900962K753114K815984
4177B3276151L355564N443241P652399R660169R211455P131219L373747K69929
4169F9373874o51111j847719l878476n791357p383408p354622o307639m060219
4161C2099323j783584j357789j670750k707046k535115k888355k853099k061624
4153A4241961j139546j255424k231947j485906j180425q58506o14731n10879N63064
4144E527661O41699Q19330l73648j034595o27879n88737p83431p07753K55147
$$ plain form
4135 3127794 3172365 2568023 1643965 1429206 1578738 1700865 1322809 1338016 1549493 725062
4125 725062 455849 1224357 1778379 2048332 2072371 1738178 604462 -1165776 -2175247
4116 -2175247 -1849364 -640927 -148402 327911 1058234 684102 262538 514851 849983
4107 849983 497206 -620753 -889294 -397537 315741 1088542 1881768 2163535 1957201 1356684
4097 1356684 756279 444076 383244 -162105 -1421913 -1679310 -1216109 -696913 -181980 -184856
4087 -184856 -1305964 -2120611 -1965397 -1616964 -1554777 -1981866 -1664606 -681558 208779 1106756
4077 1106756 1328090 1576368 1081227 776308 1604120 2479973 2890546 2284022 1048149
4068 1048149 -27396 -964029 -1356201 -1123210 -1159208 -833799 -1103862 -717545 705262
$$ packed form
4135C127794M4571o04342r24058k14759J49532J22127l78056J5207K11477q24431
4125G25062k69213P68508N54022K69953K4039l34193j133716j770238j009471
4116b175247L25883J208437M92525M76313P30323l74132m21564K52313L35132
4107H49983l52777j117959k68541M91757P13278P72801P93226K81767k06334o00517
4097A356684o00405l12203o0832n45349j259808k57397M63201N19196N14933k876
4087a84856j121108q14647J55214L48433O2187m27089L17260R83048Q90337Q97977
4077A106756K21334K48278m95141l04919Q27812Q75853M10573o06524j235873
4068A048149j075545r36633l92172K32991l5998L25409k70063L86317J422807
$$ plain form
4059 705262 1208592 520727 -822525 -1608399 -2276310 -1734102 -1532105 -2324647 -2163402 -1539820
4049 -1539820 -1386934 -350737 991896 1737636 2083742 1782329 1006957 1039960 1492570
4040 1492570 1191918 812706 564577 -285421 -1117132 -1117483 -632493 -331552 -175981 -619884
4030 -619884 -1545431 -1540796 -802809 -475501 -321255 168833 229977 -43010 -597519 -1142628
4020 -1142628 -834361 -323084 -430728 -1464978 -1703462 -1009116 162996 623415 408427
4011 408427 130955 -332012 -330958 -1017215 -1521181 -1299186 -961951 157050 335188 -457660
4001 -457660 -940834 -1673781 -2630610 -3290221 -3697315 -2882368 -2490894 -2660212 -2175497 -1830145
3991 -1830145 -1535106 -391081 1296818 1781724 1242714 506155 -478585 -1663567 -1908379
$$ packed form
4059G05262N03330o87865j343252p85874o67911N42208K01997p92542J61245O23582
4049a539820J52886J036197J342633P45740L46106l01413p75372L3003M52610
4040A492570l00652l79212k48129q49998q31711l51M84990L00941J55571m43903
4030f19884r25547M635P37987L27308J54246M90088O1144k72987n54509n45109
4020a142628L08267N11277j07644j034250k38484O94346J172112M60419k14988
4011D08427k77472m62967J054o86257n03966K21995L37235J119001J78138p92848
4001d57660m83174p32947r56829o59611m07094Q14947L91474j69318M84715L45352
3991a830145K95039J144025J687899M84906n39010p36559r84740j184982k44812
$$ plain form
3982 -1908379 -1450661 -621268 -244056 -234703 -261434 -13238 -473211 -1256364 -1420106 -1226564
3972 -1226564 -975379 -1779912 -1775251 -1049452 -1344863 -1400911 -920006 -111293 -302104 -1067127
3962 -1067127 -2218117 -2816322 -2543969 -2029016 -1370951 -1106969 -1158824 -622943 -1260 -4295
3952 -4295 -955502 -2701844 -3192543 -2995096 -3106493 -3613329 -3748260 -3284593 -2612762 -2101048
3942 -2101048 -1741145 -1452294 -2075962 -2976128 -3796822 -4048471 -3505642 -2293458 -1642035
3933 -1642035 -1551791 -1453847 -1517527 -1140600 -1275008 -652065 -8180 -450344 -424367 -427508 -772667
3922 -772667 -94481 1070205 1623919 1842647 1120593 10491 273063 521460 -58213
3913 -58213 -966747 -1773095 -1368937 -411707 -950608 -1189150 -1555715 -2030823 -2583782 -2095993
$$ packed form
3982a908379M57718Q29393L77212R353k6731K48196m59973p83153j63742J93542
3972a226564K51185q04533M661P25799k95411n6048M80905Q08713j90811p65023
3962a067127j150990n98205K72353N14953O58065K63982n1855N35881O21683l035
3952d295r51207j746342m90699J97447j11397n06836j34931M63667O71831N11714
3942b101048L59903K88851o23668r00166q20694k51649N42829J212184O51423
3933a642035R0244R7944o3680L76927j34408O22943O43885m42164K5977l141l45159
3922g72667O78186J164686N53714K18728p22054j110102K62572K48397n79673
3913e8213r08534q06348M04158R57230n38901k38542l66565m75108n52959M87789
$$ plain form
3903 -2095993 -771172 -452640 -776639 -1178775 -1470576 -874465 -457309 -231600 -115267
3894 -115267 35322 80888 -495855 -639976 -776732 -603315 -764453 -1194389 -1945535 -2899576
3884 -2899576 -3303624 -2702022 -2269685 -2024031 -1284615 -1082302 -1384758 -843513 -550138 -101924
3874 -101924 18366 66620 8648 -695323 -1341766 -1398131 -1869943 -1634822 -1259375 -1309985
3864 -1309985 -1791295 -2151555 -1514632 -779837 -282335 581 368786 2264341 4049239
3855 4049239 3470619 1924917 665230 -638096 -2011883 -2166418 -1751039 -1343639 -982909
3846 -982909 -903036 -615027 -405645 -913942 -1243063 -989271 -1671842 -2472707 -2023056 -1816998
3836 -1816998 -2138822 -1658202 -1332131 -1428579 -2078090 -2851040 -2763225 -2117524 -1278843 -342569
$$ packed form
3903b095993J324821L18532l23999m02136k91801N96111M17156K25709J16333
3894a15267J50589M5566n76743j44121j36756J73417j61138m29936p51146r54041
3884b899576m04048O01602M32337K45654P39416K02313l02456N41245K93375M48214
3874a01924J20290M8254n7972p03971o46443n6365m71812K35121L75447n0610
3864a309985m81310l60260O36923P34795M97502K82916L68205J895555J784898
3855D049239n78620j545702j259687j303326j373787j54535M15379M07400L60730
3846i82909P9873K88009K09382n08297l29121K53792o82571q00865M49651K06058
3836a816998l21824M80620L26071r6448o49511p72950Q7815O45701Q38681R36274
$$ plain form
3826 -342569 16034 510473 397501 -353349 -505023 -991794 -1632159 -1281323 -1191578 -915131
3816 -915131 -348564 -182953 95429 381209 670397 713469 761634 238990 -1145719 -1703013
$$ packed form
3826c42569L58603M94439j12972p50850j51674m86771o40365L50836Q9745K76447
3816i15131N66567J65611K78382K85780K89188M3072M8165n22644j384709n57294
$$ [...]
##END NTUPLES=NMR SPECTRUM
##END=
