##TITLE=C13_SR90_k_vak
 CDCl3, 2200 sc

 26.10.2021
##JCAMPDX= 6.0         $$ Bruker NMR JCAMP-DX V2.0
##DATA TYPE= NMR SPECTRUM
##DATA CLASS= NTUPLES
##ORIGIN= UXNMR, Bruker Analytische Messtechnik GmbH
##OWNER= root
$$ XWIN-NMR		Version 3.5
$$ Wed Oct 27 10:41:28 2021 Russian Standard Time (UT+4h)  she@DPX200
##.OBSERVE FREQUENCY= 50.327896
##.OBSERVE NUCLEUS= ^13C
##.ACQUISITION MODE= SIMULTANEOUS
##.ACQUISITION SCHEME= undefined
##.AVERAGES= 22000
##.DIGITISER RES= 17
##SPECTROMETER/DATA SYSTEM= spect
##.PULSE SEQUENCE= zgpg30
##.SOLVENT NAME= DMSO
##.SHIFT REFERENCE= (INTERNAL, DMSO, 0, 222.653)
##AUDIT TRAIL= $$ (NUMBER, WHEN, WHO, WHERE, WHAT)
$$ ##TITLE= Audit trail, XWIN-NMR		Version 3.5
$$ ##JCAMPDX= 5.01
$$ ##ORIGIN= Bruker BioSpin GmbH
$$ ##OWNER= she
$$ F:/spectra/data/she/nmr/c13/1/pdata/1/auditp.txt
$$ ##AUDIT TRAIL=  $$ (NUMBER, WHEN, WHO, WHERE, WHAT)
(   1,<2021-10-27 10:39:40.70 +0400>,<she>,<DPX200>,
      <created by zg, POWCHK disabled, PULCHK disabled
       terminated by command 'halt'
       configuration hash MD5:
       00 E9 B6 7A A2 85 ED C7 34 08 36 98 17 FE 4E 26
       data hash MD5: 32K
       44 9B B2 47 E9 F9 75 FF 78 DC B5 A7 AA 54 18 D5>)
(   2,<2021-10-27 10:39:46.96 +0400>,<she>,<DPX200>,
      <Start of raw data processing
       efp BC_mod = 2 LB = 1 FT_mod = 6 PKNL = 1 PHC0 = -344.2579 PHC1 = 45.36238 SI = 32K 
       data hash MD5: 32K
       C9 94 FD 99 E0 B2 23 01 2D 7E F6 B7 23 EB 1B E7>)
(   3,<2021-10-27 10:40:11.56 +0400>,<she>,<DPX200>,
      <pk PHC0 = 14.5607 PHC1 = -12.6 
       data hash MD5: 32K
       63 78 A2 D5 7C DF F7 70 BE DC 90 60 A4 33 A5 67>)
(   4,<2021-10-27 10:40:15.20 +0400>,<she>,<DPX200>,
      <abs ABSG = 5 
       data hash MD5: 32K
       00 49 63 9A 78 62 CF 3B 96 4E 87 60 DD DA 30 60>)
(   5,<2021-10-27 10:40:43.09 +0400>,<she>,<DPX200>,
      <pk PHC0 = -3.500772 PHC1 = 5.400001 
       data hash MD5: 32K
       E1 B6 02 E4 F0 DD 79 44 8D C1 C9 E3 D5 15 18 F5>)
(   6,<2021-10-27 10:40:46.17 +0400>,<she>,<DPX200>,
      <abs ABSG = 5 
       data hash MD5: 32K
       48 D3 89 F9 F7 09 46 72 AE 74 32 20 2D 8B 33 69>)
$$ ##END=
$$ 
$$ hash MD5
$$ 60 53 6A 0A 1C C6 AB 4C 2B 76 39 83 92 2C 76 DF
##$RELAX= 
##$RELAX= 
##$RELAX= 
##$RELAX= 
##$RELAX= 
##$RELAX= 
##$RELAX= 
##$RELAX= 
$$ Bruker specific parameters
$$ --------------------------
##$DU= <F:/spectra>
##$EXPNO= 1
##$NAME= <c13>
##$PROCNO= 1
##$TYPE= <nmr>
##$USER= <she>
##$AMP= (0..31)
100 100 100 100 100 100 100 100 100 100 100 100 100 100 100 100 100 100 
100 100 100 100 100 100 100 100 100 100 100 100 100 100 
##$AQSEQ= 0
##$AQ_mod= 1
##$AUNM= <au_zg>
##$AUTOPOS= <>
##$BF1= 50.322709
##$BF2= 200.13
##$BF3= 50.322709
##$BF4= 500.13
##$BF5= 500.13
##$BF6= 500.13
##$BF7= 500.13
##$BF8= 500.13
##$BYTORDA= 1
##$CFDGTYP= 0
##$CFRGTYP= 5
##$CHEMSTR= <none>
##$CNST= (0..31)
1 1 145 1 1 1 1 1 1 1 1 1 1 1 1 1 1 1 1 1 1 1 1 1 1 1 1 1 1 1 1 1 
##$CPDPRG= <waltz16>
##$CPDPRG1= <>
##$CPDPRG2= <waltz16>
##$CPDPRG3= <>
$$ [...]
##$SUBNAM4= <"">
##$SUBNAM5= <"">
##$SUBNAM6= <"">
##$SUBNAM7= <"">
##$SUBNAM8= <"">
##$SUBNAM9= <"">
##$SW= 239.972175391363
##$SWIBOX= (0..15)
0 1 3 0 0 0 0 0 0 0 0 0 0 0 0 0 
##$SW_h= 12077.2946859903
##$TD= 32768
##$TD0= 1
##$TE= 0
##$TE2= 300
##$TE3= 300
##$TEG= 300
##$TL= (0..7)
120 120 120 120 120 120 120 120 
##$TP= (0..7)
150 150 150 150 150 150 150 150 
##$TP07= 0
##$TPNAME0= <>
##$TPNAME1= <>
##$TPNAME2= <>
##$TPNAME3= <>
##$TPNAME4= <>
##$TPNAME5= <>
##$TPNAME6= <>
##$TPNAME7= <>
##$TPOAL= (0..7)
0.5 0.5 0.5 0.5 0.5 0.5 0.5 0.5 
##$TPOFFS= (0..7)
0 0 0 0 0 0 0 0 
##$TUNHIN= 0
##$TUNHOUT= 0
##$TUNXOUT= 0
##$USERA1= <user>
##$USERA2= <user>
##$USERA3= <user>
##$USERA4= <user>
##$USERA5= <user>
##$V9= 5
##$VALIST= <valist>
##$VCLIST= <CCCCCCCCCCCCCCC>
##$VD= 0
##$VDLIST= <DDDDDDDDDDDDDDD>
##$VPLIST= <PPPPPPPPPPPPPPP>
##$VTLIST= <TTTTTTTTTTTTTTT>
##$WBST= 1024
##$WBSW= 4
##$XGAIN= (0..3)
0 0 0 0 
##$XL= 0
##$YL= 0
##$YMAX_a= 151569321
##$YMIN_a= -36461552
##$ZGOPTNS= <>
##$ZL1= 120
##$ZL2= 120
##$ZL3= 120
##$ZL4= 120
##$ABSF1= 222.6533
##$ABSF2= -17.34351
##$ABSG= 5
##$ABSL= 3
##$ALPHA= 0
##$AQORDER= 0
##$ASSFAC= 0
##$ASSFACI= 0
##$ASSFACX= 0
##$ASSWID= 0
##$AUNMP= <proc_1d>
##$AZFE= 0.1
##$AZFW= 0.5
##$BCFW= 0
##$BC_mod= 2
##$BYTORDP= 0
##$COROFFS= 0
##$CY= -3
##$DATMOD= 1
##$DC= 0
##$DFILT= <>
##$DTYPP= 0
##$F1P= 0
##$F2P= 0
##$FCOR= 0.5
##$FTSIZE= 32768
##$FT_mod= 6
##$GAMMA= 0
##$GB= 0
##$INTBC= 1
##$INTSCL= 4.134877e-10
##$ISEN= 128
##$LB= 1
##$LEV0= 0
##$LPBIN= 0
##$MAXI= 10000
##$MC2= 0
##$MEAN= 0
##$ME_mod= 0
##$MI= 0.1934396
##$NCOEF= 0
##$NC_proc= 3
##$NLEV= 6
##$NOISF1= 120.0001
##$NOISF2= 80.00006
##$NSP= 0
##$NTH_PI= 0
##$NZP= 0
##$OFFSET= 222.6533
##$PC= 1.4
##$PHC0= -333.198
##$PHC1= 38.16238
##$PH_mod= 1
##$PKNL= yes
##$PPARMOD= 0
##$PSCAL= 0
##$PSIGN= 0
##$REVERSE= no
##$SF= 50.3227301237032
##$SI= 32768
##$SIGF1= 140
##$SIGF2= 120
##$SINO= 11.81781
##$SIOLD= 32768
##$SREGLST= <13C.CDCl3>
##$SSB= 0
##$STSI= 32768
##$STSR= 0
##$SW_p= 12077.2946859903
##$SYMM= 0
##$S_DEV= 0
##$TDeff= 32768
##$TDoff= 0
##$TI= <>
##$TILT= no
##$TM1= 0
##$TM2= 0
##$TOPLEV= 0
##$USERP1= <user>
##$USERP2= <user>
##$USERP3= <user>
##$USERP4= <user>
##$USERP5= <user>
##$WDW= 1
##$XDIM= 32768
##$YMAX_p= 346739644
##$YMIN_p= -1251669
$$ End of Bruker specific parameters
$$ ---------------------------------
##NTUPLES= NMR SPECTRUM
##VAR_NAME=  FREQUENCY,     SPECTRUM/REAL,   SPECTRUM/IMAG
##SYMBOL=    X,             R,               I
##VAR_TYPE=  INDEPENDENT,   DEPENDENT,       DEPENDENT
##VAR_FORM=  AFFN,          ASDF,            ASDF
##VAR_DIM=   32768,         32768,           32768
##UNITS=     HZ,            ARBITRARY UNITS, ARBITRARY UNITS
##FACTOR=    0.368581032318806, 1,           1
##FIRST=     11204.5221813685, 0,            0
##LAST=      -872.772504621842, 0,           0
##MIN=       -872.772504621842, -1251669,    0
##MAX=       11204.5221813685, 346739644,    0
$$ Real data points
##PAGE= N=1
##DATA TABLE= (X++(R..R)), XYDATA
$$ [...]
16058C06865k9779j26669k9198q8546j53687M3542j2024Q367L3616J51997N9525
$$ 306865 277086 150417 121219 32673 -121014 -77472 -89496 -81129 -47513 104484 164009
16047A64009N8437P4005j44025j12773k28362m9649R9741L5894O1264j58395j78683
$$ 164009 222446 296451 152426 39653 -188709 -238358 -138617 -102723 -41459 -199854 -378537
16036c78537R4168J50397O3034O3830o0256j69870r9067Q7568J95438J47852R4728
$$ -378537 -284369 -133972 -70938 -7108 -67364 -237234 -336301 -248733 -53295 94557 189285
16025A89285K1854j52974l27824k12682m2383J54076J44266o4513q9120o9959
$$ 189285 211139 58165 -269659 -482341 -524724 -370648 -226382 -290895 -380015 -449974
16015d49974n2715K37916L24276K16778L0228j57328k22843p9567K2441k7740
$$ -449974 -502689 -264773 59503 276281 306509 149181 -73662 -153229 -130788 -158528
16005a58528J48787J45763j16631j92707k04445J08981K09982J21763n9489k25096
$$ -158528 -9741 136022 19391 -173316 -377761 -268780 -58798 62965 3476 -221620
15995b21620j42865j11462P7736L22362J40519j08291j97664M9665P4521j7634
$$ -221620 -364485 -475947 -398211 -75849 64670 -43621 -241285 -191620 -117099 -134733
15985a34733L6919P0320j56224o337K22466K4532n0050m0583O6645p5180j6137
$$ -134733 -97814 -27494 -183718 -190055 32411 56943 6893 -33690 32955 -42225 -58362
15974e8362P2882j32764N7K3212K0504o596J9999K04561J41977J21763j65848
$$ -58362 14520 -118244 -118187 -94975 -74471 -81067 -61068 143493 285470 407233 241385
15963B41385k36059R8997K97661J24923J56812J83475q3459k37846k00538M2070
$$ 241385 5326 104323 401984 526907 683719 867194 783735 545889 345351 387421
15953C87421Q9844j08775l21434p7584l5466j49574P3369J03607j53166l69148
$$ 387421 477265 368490 47056 -30528 -65994 -215568 -142199 -38592 -191758 -560906
15943e60906j11711J61231J9717l1827J60560J88877J41286K16107R1477p7459
$$ -560906 -672617 -511386 -491669 -523496 -362936 -174059 -32773 183334 274811 197352
15933A97352j33351k0896K24696P626j13887J53776N3045j59138j00045P550n442
$$ 197352 64001 43105 267801 275427 161540 315316 368361 209223 109178 116728 111286
15922A11286j60646k06039k27211k13163O9902K80795K28602K6681j55438N09
$$ 111286 -49360 -255399 -482610 -695773 -625871 -345076 -116474 -89793 -245231 -244722
15912b44722L4381m0458k6337O778p4189k32520j32831K39433M09786L1079j42838
$$ -244722 -210341 -250799 -277136 -270358 -344547 -577067 -709898 -470465 -60679 -29600 -172438
15901a72438P4991O4201j26918j49434J11150L01852J24550J08146J3993o2737
$$ -172438 -97447 -33246 -160164 -309598 -198448 103404 227954 336100 350093 287356
15891B87356j81043j98077j75236k06529k8647J37331K48242K22912J6053O2048
$$ 287356 106313 -91764 -267000 -473529 -502176 -364845 -116603 106309 122362 184410
15881A84410J37604M2076P5894Q6583j02680k03679j35894o8248j53691j12717
$$ 184410 322014 364090 439984 526567 423887 220208 84314 16066 -137625 -250342
15871b50342J321r6937o6306n4696p5445J34240M7280N9148K04678J29452j47754
$$ -250342 -249021 -345958 -412264 -466960 -542405 -408165 -360885 -301737 -97059 32393 -115361
15860a15361N684J64544P5006J35630J39961J6099j23311k95704j38877K705J491
$$ -115361 -109677 54867 129873 265503 405464 421563 298252 2548 -136329 -133624 -132133
15849a32133N1818J41363K06456P6927o4608k0380M2304n2499p0637j49148j49822
$$ -132133 -80315 61048 267504 344431 279823 259443 301747 249248 178611 29463 -120359
15838a20359n6013K99293J49287q0116j71501n4586J13130O8953j4776N8973R1847
$$ -120359 -176372 122921 272208 192092 20591 -33995 79135 148088 133312 192285 284132
15827B84132r0521n6942k570j70021l37581q5643L62239K33775J56982P4423q4671
$$ 284132 193611 136669 134099 -35922 -373503 -459146 -96907 136868 293850 368273 283602
15816B83602n7149P7509L977q0053j54752k38789L0063L16573K90629M4120k11339
$$ 283602 226453 303962 307939 227886 73134 -165655 -135592 180981 471610 515730 304391
15805C04391j25173J0844j53960r5559j04618j08369j19485R0104J89885P7702
$$ 304391 179218 190062 36102 -59457 -164075 -272444 -391929 -301825 -111940 -34238
15795c4238L06902R7179Q6175m4375k47863j11342j69564n6214r1400l89997j52835
$$ -34238 272664 369843 456018 411643 163780 52438 -117126 -173340 -264740 -654737 -807572
15784h07572J27714J04618L51482K13932J54217J68399J60669J07770j26770j67403
$$ -807572 -679858 -575240 -223758 -9826 144391 312790 473459 581229 454459 287056
15774B87056l05444O1218J62616j85937j25694J66722O1993m1360J08550R2194
$$ 287056 -18388 42830 205446 19509 -106185 60537 122530 81170 189720 281914
15764B81914k23004j24218J82322K64785Q8032P8717J08271p0413r4655j7273
$$ 281914 58910 -65308 117014 381799 469831 548548 656819 586406 491751 474478
15754D74478j17545q2909j17989j96748k35606p9993M7838O6330P8053Q6340j12078
$$ 474478 356933 274024 156035 -40713 -276319 -356312 -308474 -242144 -164091 -77751 -189829
15743a89829l5109P7862l1071j62414N9228J49220j24300j33150m3472J22735
$$ -189829 -224938 -147076 -178147 -340561 -281333 -132113 -256413 -389563 -433035 -310300
15733c10300K52262K07600J77705J40443M1116l2061j99841j37539n7725j27960
$$ -310300 -58038 149562 327267 467710 508826 476765 276924 139385 81660 -46300
15723d6300P1216K89900L76227N6036p9146K9120l08341k73253j13903j81227
$$ -46300 24916 314816 691043 747079 667933 697053 388712 115459 1556 -179671
15713a79671j95965J40740K37451J53952o2060m9859n0088j0146J81559r7865
$$ -179671 -375636 -234896 2555 156507 94447 44588 -5500 -15646 165913 68048
15703F8048k55158k14188M3273J89696J97743K53253P0192p2357j91022j07829
$$ 68048 -187110 -401298 -358025 -168329 29414 282667 352859 280502 89480 -18349
15693a8349m3170J5545L1489q1176L7823J59412R2341j03509j59043J14947K48282
$$ -18349 -61519 -45974 -14485 -95661 -57838 101574 193915 90406 -68637 46310 294592
15682B94592R6971R647L3649m5477n1206m8813j57403j40728J25425r4824k34403
$$ 294592 391563 401210 434859 389382 338176 289363 131960 -8768 116657 21833 -212570
15671b12570k99961j82226J75072K98752J44015M7444K1181j4504P2017j8739
$$ -212570 -512531 -694757 -519685 -220933 -76918 -29474 -8293 -22797 49220 30481
15661C0481o8448r8911R294n265J36090p4231j78740n2473J53370M9001j25836
$$ 30481 -37967 -136878 -127584 -132849 3241 -70990 -249730 -302203 -148833 -99832 -225668
15650b25668j6762M938J62420J37578l9036n8539k0731K6773J66055J42191p2485
$$ -225668 -242430 -237492 -75072 62506 23470 -35069 -55800 -29027 137028 279219 206734
15639B06734k20753j09499N4129R18j22517M1314O2053K58071K39727p1247j75920
$$ 206734 -14019 -123518 -69389 -68471 -190988 -149674 -87621 170450 410177 338930 163010
15628A63010j00937j31825P008K2850K1729J8639n4966j03888J84455J98321N0238
$$ 163010 62073 -69752 -62744 -39894 -18165 474 -54492 -158380 26075 224396 274634
15617B74634K4000m7639j19369j39040j25587m4686L8509k04641j22135O1829
$$ 274634 298634 250995 131626 -7414 -133001 -177687 -139178 -343819 -465954 -404125
15607d04125J76858o048n6847J77128O7369J3448j19794n4820J09831J65564O9462
$$ -404125 -227267 -233315 -290162 -113034 -45665 -32217 -152011 -206831 -97000 68564 138026
15596A38026J42831P4876j93304k31899K1782o9035q1787n6941k47624j3706M2127
$$ 138026 280857 355733 162429 -69470 -47688 -116723 -198510 -255451 -503075 -516781 -474654
15585d74654K4676O1421K31879K75937K02897O2840j56448j99157O4725J81910
$$ -474654 -449978 -388557 -156678 119259 322156 384996 228548 29391 94116 276026
15575B76026K9979J70713j52689k24168o2990k56659k22345J42123R8618J26733
$$ 276026 306005 476718 324029 99861 36871 -219788 -442133 -300010 -201392 -74659
15565g4659K70463K69231K8707k56254j58088N9400J36140J38301O292k14758
$$ -74659 195804 465035 493742 237488 79400 138800 274940 413241 419533 204775
15555B04775j88629j37742j68711l7395L91473K99833l3715k984J30869J70807
$$ 204775 16146 -121596 -290307 -327702 63771 363604 329889 326905 457774 628581
15545F28581q5223l38168j19591J514j9892j61093k30834k3883P9875m5111K4436
$$ 628581 543358 205190 85599 87113 67221 -93872 -324706 -348589 -268714 -313825 -289389
15534b89389P1750L6795j35814J705K37009L02443J27433n2709l9143J10524j08257
$$ -289389 -217639 -180844 -316658 -314953 -77944 224499 351932 299223 260080 370604 262347
15523B62347k85111k98895j52438J43507L09159m0515k7250K80389K21123j5463
$$ 262347 -22764 -321659 -474097 -330590 -21431 -61946 -89196 191193 412316 396853
15513C96853r4087j0211J72001J04901l65392l28930r723J22534n6355k6989J98816
$$ 396853 302766 292555 464556 569457 204065 -124865 -134588 -12054 -68409 -95398 103418
15502A03418J26806j71823k16590k06458m1558K96914K93964M9874j12718n1293
$$ 103418 230224 58401 -158189 -364647 -406205 -109291 184673 234547 121829 70536
15492G0536j07835n146O7017p173m6132j17563j3019Q9243m9240j5829j5836r7046
$$ 70536 -37299 -42445 24572 17399 -28733 -146296 -159315 -70072 -119312 -135141 -150977 -248023
15480b48023j54092l4616K78275K26241l39r9549j79496l09779J1437J4657n433
$$ -248023 -402115 -436731 -158456 67785 67446 -32103 -211599 -521378 -509941 -495284 -500717
15469e00717J43080Q7764J482M3657J50322m1351j75978p0435P3589J02401J15954
$$ -500717 -357637 -269873 -268391 -224734 -74412 -115763 -291741 -362176 -288587 -186186 -70232
15458g0232J76496Q584j98168k98769l07791L1690K25263J55173q6824m0893K06375
$$ -70232 106264 114848 -83320 -382089 -689880 -658190 -432927 -277754 -364578 -405471 -199096
15447a99096J10933O1010M4347j6978J87979J25519k312K7097n0998p6816p2386
$$ -199096 -88163 -27153 17194 216 188195 313714 311402 338499 287501 210685 138299
15436A38299L3737M2227P5455R4227j22354q5981j97812j47631q04J009n8470
$$ 138299 172036 214263 289718 383945 261591 175610 -22202 -169833 -170637 -169628 -228098
15425b28098J01710k17173k96419p3623o0091J38950J11835M3649q0082K11389
$$ -228098 -126388 -343561 -639980 -713603 -773694 -634744 -522909 -479260 -559342 -347953
15415c47953K16430L7815m1872k4561j45489J42926L28304K01748L0483j87835
$$ -347953 -131523 -93708 -135580 -160141 -305630 -162704 165600 367348 397831 209996
15405B09996k11824q5360n437J81820J09108p3002k08130r9246k42882r5906n767
$$ 209996 -1828 -87188 -92625 89195 198303 125301 -82829 -182075 -424957 -520863 -526630
15394e26630q8286q0345j6752K4403M469K8970J05840P3170M7094J03223k7674
$$ -526630 -614916 -695261 -712013 -687610 -683141 -654171 -548331 -475161 -428067 -324844 -352518
15383c52518n7009N5472Q7598R9390J5646J73984L1314K3702l5643o0359k15791
$$ -352518 -409527 -354055 -266457 -167067 -151421 22563 53877 77579 41936 -18423 -234214
15372b34214m18392j33204K22336K29758L2169N1350J13415J59264J94544O2753
$$ -234214 -652606 -785810 -563474 -333716 -301547 -250197 -136782 22482 217026 279779
15362B79779o6723k00366k44331L5830K30427J66935j15253m1149O2370J51911
$$ 279779 213056 12690 -231641 -195811 34616 201551 86298 45149 107519 259430
15352B59430O9557n6056k10043l05714k72212M0460J72589J00764k01459j72674
$$ 259430 328987 272931 62888 -242826 -515038 -474578 -301989 -201225 -402684 -575358
15342e75358K1158J29760J11227K00909R7840J8237q9122k6220j38994o9386J78852
$$ -575358 -554200 -424440 -313213 -112304 -14464 3773 -85349 -111569 -250563 -319949 -141097
15331a41097J81400l7693j44271k32726k16688r4555j1J73264J20100J03037J14575
$$ -141097 40303 2610 -141661 -374387 -591075 -685630 -685641 -512377 -392277 -289240 -174665
15320a74665J96921J35714q9429q2233j72628m0402J23233K46911J77236k0750
$$ -174665 22256 157970 68541 -13692 -186320 -226722 -103489 143422 320658 299908
15310B99908N5874j09671k29227k93066m28385j53932J58776J63007J73105K39059
$$ 299908 355782 246111 16884 -276182 -704567 -858499 -699723 -536716 -363611 -124552
15300a24552O1395l2015o3197j21513R3543P7917j36180n2281l6004o7940O8247
$$ -124552 -63157 -95172 -158369 -279882 -186339 -108422 -244602 -296883 -332887 -400827 -332580
15289c32580K57353J98270K11702K1953j24903q7103j23865o0727r0014j44379
$$ -332580 -75227 123043 334745 356698 231795 144692 20827 -39900 -129914 -274293
15279b74293m8387q415J6005J66039n0939j79381J55685L45900K37238j15999
$$ -274293 -322680 -331095 -315090 -149051 -199990 -379371 -223686 122214 359452 243453
15269B43453k2752J10093q5174j45662N3203P7986R188J5707p1431o5262q8509
$$ 243453 220701 330794 245620 99958 153161 231147 240335 256042 184611 119349 30840
15258C0840J2266o634K4778P5684j07413j99457j53822j20708L1135J80523K46631
$$ 30840 43106 36472 61250 136934 29521 -169936 -323758 -444466 -413331 -232808 13823
15247A3823K23241P8212p7473k68472j43724L22029K61454j39311p9926j9702
$$ 13823 237064 315276 237803 -30669 -174393 147636 409090 269779 189853 170151
15237A70151K0251J0878j62407j95004k0839J03969J64780J01245l1596Q6550
$$ 170151 190402 201280 38873 -156131 -176970 -73001 91779 193024 161428 247978
15227B47978J7723J00382r6875k82039P519K60308J7558p8188k40370k04175J8524
$$ 247978 265701 366083 269208 -12831 -5312 254996 272554 194366 -46004 -250179 -231655
15216b31655J96434P8168n0162m5451j52801n0241p2511k19642o8999k5660O6676
$$ -231655 -35221 42947 -7215 -52666 -205467 -255708 -328219 -547861 -616860 -642520 -575844
15205e75844J55342j40781J0815J54191R3155N4461J36253J98593P6837k5031
$$ -575844 -420502 -561283 -550468 -396277 -303122 -248661 -112408 86185 163022 137991
15195A37991L2052J30386O7185j72764n7385J1683j53135N441N7288l6904r4131
$$ 137991 170043 300429 367614 194850 137465 149148 -3987 1454 58742 21838 -72293
15184g2293p4463r1314j71823O3024K19886n8799o8190K47096J05481j48983k94200
$$ -72293 -146756 -238070 -409893 -346869 -126983 -185782 -253972 -6876 98605 -50378 -344578
15173c44578j2459M958O523J15121K85818K54374K2656p2900o5833m0219j10117
$$ -344578 -357037 -352079 -345556 -230435 55383 309757 332413 259513 193680 153461 43344
15162D3344o1650R0728J5275J4561J76052J81784L6108k82853m32895j55399P9379
$$ 43344 -18306 72422 87697 102258 278310 460094 496202 213349 -219546 -374945 -295566
15151b95566K95554M72408Q2549j60038l11150j66024K0995Q4774l4737k02276
$$ -295566 -12 472396 554945 394907 83757 -82267 -61272 23502 -11235 -213511
15141b13511J6657K71847J54631O0315m5129j57949L4872J4455r3168k6342j45307
$$ -213511 -196854 74993 229624 289939 244810 86861 121733 136188 43020 16678 -128629
15130a28629r8552Q0187N0485j22613j23378l2791N4262q1301j57425o8940K57143
$$ -128629 -227181 -146994 -96509 -219122 -342500 -375291 -321029 -402330 -559755 -628695 -371552
15119c71552K07083J66704k4084j74512k08312o1157J50296l0619j2732P6377
$$ -371552 -164469 2235 -21849 -196361 -404673 -465830 -315534 -346153 -358885 -282508
15109b82508l2373J6625R9064R0280j13328q311r8144q1694Q0319l452L5414L13831
$$ -282508 -314881 -298256 -199192 -108912 -222240 -230551 -328695 -410389 -330070 -333522 -298108 15723
15097A5723J81147K7846J56765N1694j14730m27033l94427Q711L35741R4210K1600
$$ 15723 196870 224716 381481 433175 318445 -108588 -503015 -494304 -158563 -64353 -42753
15086d2753J97002R2653j41516l30037j81652R3879J79349J36719J66815K08948
$$ -42753 154249 246902 105386 -224651 -406303 -312424 -133075 3644 170459 379407
15076C79407Q0243p4069P921j67194k80000l09397r5111P8490J27151Q3312k3665
$$ 379407 459650 385581 393502 226308 -53692 -363089 -458200 -379710 -252559 -169247 -192912
15065a92912p4490K4966N2564L4816N1424p2642j73179j9968J59980J12093j10894
$$ -192912 -267402 -242436 -189872 -155056 -103632 -176274 -349453 -369421 -209441 -97348 -208242
15054b08242m8760J48958l0989O2315J26690J04661m8753L0820k9373k7776m1897
$$ -208242 -257002 -108044 -139033 -76718 49972 154633 105880 136700 107327 79551 37654
15043C7654j65666j47893m3512j14291j7094L06565K57983j44962k59993J130
$$ 37654 -128012 -275905 -319417 -433708 -450802 -144237 113746 -31216 -291209 -290079
15033b90079P4003P5809O9766R7088J54981o8854J5954l9138n718M8766k8171
$$ -290079 -216076 -140267 -70501 26587 181568 112714 128668 89530 83812 132578 104407
15022A04407q7597j12426q6155k27969j22392k5862Q4628O0160O1247M6061k8548
$$ 104407 16810 -95616 -181771 -409740 -532132 -557994 -473366 -413206 -351959 -305898 -334446
15011c34446L6023J44908J15174O3553L5406q0536j13605N1994J5057j22970j14528
$$ -334446 -298423 -153515 -38341 25212 60618 -19918 -133523 -81529 -66472 -189442 -303970
15000c03970N7626J1632P1789K002M1336N6707n1997R9973K78692J96593P1438
$$ -303970 -246344 -234712 -162923 -160921 -119585 -62878 -114875 -14902 263790 460383 531821
14989E31821J9308j05890k7804m6797m20478m40961J27222K96623K12768j22362
$$ 531821 551129 445239 417435 370638 -49840 -490801 -363579 -66956 145812 23450
14979B3450j13442o5247j27827r5258P2804L00612M22202L7070l28286l15239
$$ 23450 -89992 -155239 -283066 -378324 -305520 -4908 417294 454364 126078 -189161
14969a89161k10830j08709P7811K44504N7596j70647J1345J20886j1557P8192
$$ -189161 -399991 -508700 -430889 -186385 -128789 -299436 -288091 -167205 -178762 -100570
14959a00570j078j6006Q0117k6579j19322l0817r440j66346j59573k1467P2554
$$ -100570 -101648 -117654 -37537 -64116 -183438 -214255 -223695 -390041 -549614 -571081 -498527
14948d98527J00316m9121O6517K67848O0809p473j97432j11395N4979M5040p9278
$$ -498527 -398211 -447332 -380815 -112967 -52158 -59631 -257063 -368458 -313479 -268439 -347717
14937c47717j80276J2835K78491J34434j61522r4467J44531K43529J85701j38498
$$ -347717 -527993 -515158 -236667 -102233 -263755 -358222 -213691 29838 215539 77041
14927G7041k13999j50259j98739Q4841K93761P478k27932j38648J88945K16094
$$ 77041 -136958 -287217 -485956 -401115 -107354 -99876 -327808 -466456 -277511 -61417
14917f1417K59511L16642j37248j76189l3251p8377j86067j89301r4187M3947
$$ -61417 198094 514736 377488 201299 168048 89671 -96396 -285697 -379884 -335937
14907c35937J85222K18373N9198o8074n062o7041j20006k29335q2216M7564J23845
$$ -335937 -150715 67658 126856 58782 53720 -13321 -133327 -362662 -444878 -397314 -273469
14896b73469K65592J69987r2391j72572P1861J69546m2168p6516Q0028P7169k90829
$$ -273469 -7877 162110 69719 -102853 -30992 138554 96386 19870 99898 177067 -113762
14885a13762k78342Q7881N1916m5155N7907K19953L13712J20104p3021j04325
$$ -113762 -392104 -304223 -252307 -297462 -239555 -19602 294110 414214 341193 236868
14875B36868k7306j17124p9561R1955J52551J85267J722k53777j00280J31899
$$ 236868 209562 92438 12877 104832 257383 442650 444372 190595 90315 222214
14865B22214j77983l08101O4544J16461P6372J46680m485j13733q3143m334q8239
$$ 222214 44231 -263870 -199326 -82865 -6493 140187 135702 21969 -61174 -65508 -153747
14854a53747j71101J0816O4288M2415J87910J38174p5235o5095o1929m6085n1718
$$ -153747 -324848 -314032 -249744 -207329 -19419 118755 43520 -21575 -83504 -129589 -181307
14843a81307j00174J64177J90689j0897k13491j64011K03519l3371m34386l67602
$$ -181307 -281481 -117304 73385 62488 -151003 -315014 -111495 -144866 -579252 -946854
14833i46854j94475j10340J79476L26811K17938K19444o3656J39058J89833O1100
$$ -946854 -1141329 -1251669 -1072193 -745382 -527444 -308000 -371656 -232598 -42765 18335
14823A8335J6009j08630K0606N3533K5794M8376m0768J9544q9565k89011j35689
$$ 18335 34344 -74286 -53680 -147 25647 74023 33255 52799 -36766 -325777 -461466
14812d61466k1091j164M3488q394M4305J57876J21771R9397K315j77590k16622
$$ -461466 -482557 -483721 -440233 -448627 -404322 -246446 -124675 -25278 -22963 -200553 -417175
14801d17175l7514J35562N4291L043J48455K64865P8739j72868l25296k59472
$$ -417175 -454689 -319127 -264836 -261793 -113338 151527 230266 57398 -267898 -527370
14791e27370q8552l5608P0239K15049K29233Q0915o5334l1129n2097o8181R6393
$$ -527370 -615922 -651530 -581291 -366242 -137009 -56094 -121428 -152557 -204654 -272835 -176442
14780a76442Q2178J21943J747k19068k04542O2363J68701J61338l591J727j1932
$$ -176442 -94264 27679 29426 -189642 -394184 -331821 -163120 -1782 -5373 -3646 -15578
14769a5578r8538J0910P9957l2518o983q0927O07K63718K40306R5748n4437q0409
$$ -15578 -114116 -103206 -23249 -55767 -62750 -143677 -143070 120648 360954 456702 402265 321856
14757C21856k68793j04527M3432Q1034r2389r1713J75066K44386L5872j22180
$$ 321856 53063 -51464 -8032 73002 -19387 -111100 63966 308352 344224 222044
14747B22044j32161J6521r7975k09356j03775P320k2879o871K972l7465j31205
$$ 222044 89883 106404 8429 -200927 -304702 -297382 -320261 -327132 -324160 -361625 -492830
14736d92830j34702O4235l8189p7889n1472K3969M9022J69972K53684P4900M3605
$$ -492830 -627532 -563297 -601486 -679375 -730847 -706878 -657856 -487884 -234200 -159300 -115695
14725a15695k5271p6773R904K03144O6504J9872Q4232Q0408k7621M0115l9225
$$ -115695 -140966 -217739 -207835 -4691 61813 81685 165917 246325 218704 258819 219594
14714B19594j8448j0881m7819r9234o3121k2677P4551K47725O7216j51011j51016
$$ 219594 201146 190265 142446 43212 -19909 -42586 31965 279690 346906 195895 44879
14703D4879K5066J13098p985j36474j61432O6180L07484R9642j52341j87007l99052
$$ 44879 69945 183043 175058 38584 -122848 -56668 250816 350458 198117 11110 -387942
14692c87942k94418J71904K28050k412P8108Q2312o6984o2084o1248o1584J20901
$$ -387942 -682360 -510456 -282406 -284818 -206710 -124398 -191382 -253466 -314714 -376298 -255397
14681b55397K86989J15621J2913q4660j84502J5877J17096j8348q2726q8340o3401
$$ -255397 31592 147213 160126 75466 -109036 -93159 23937 5589 -77137 -165477 -228878
14670b28878o1904j08649n6398J84222P5105n2311J88789K24727Q4389J56912
$$ -228878 -290782 -399431 -455829 -271607 -196502 -248813 -60024 164703 249092 406004
14660D06004Q4921L5647L966j09843j97321j63303o9423l6988k3136L1441r8514
$$ 406004 490925 526572 530538 420695 223374 60071 -9352 -46340 -69476 -38035 -136549
14649a36549k62170k17857j77646n6838J03976J24366K73224J93797m7153o7100
$$ -136549 -398719 -616576 -794222 -851060 -747084 -622718 -349494 -155697 -202850 -269950
14639b69950j24559j00526O4442Q2471J99046L08960K86270O8960l29942k69730
$$ -269950 -394509 -495035 -430593 -348122 -149076 159884 446154 515114 185172 -84558
14629h4558m4984q9890l82169k36845P8217K58389J95559M5803J4417k11738j27981
$$ -84558 -129542 -219432 -601601 -838446 -760229 -501840 -306281 -260478 -246061 -457799 -585780
14618e85780r701L5J38985K68334N7857J0826O2113L0690m8286K5169Q4634R2641
$$ -585780 -595481 -595446 -456461 -188127 -130270 -119444 -57331 -26641 -74927 -49758 34876 127517
14606A27517J14457m0633J1285J55253M2934j47016O0110K14320N9382k09030
$$ 127517 241974 201341 212626 367879 410813 263797 323907 538227 597609 388579
14596C88579j37707q7379Q29J57719m4447J03071K20399m5645p5464N7050n0474
$$ 388579 250872 163493 164322 322041 277594 380665 601064 555419 479955 537005 486531
14585D86531k23943k96J96861m5435k87043j98668o2495M484R5057k3976J691
$$ 486531 262588 262292 459153 413718 126675 -71993 -134488 -130004 -34947 -58923 -57232
14574e7232J05103R2311m0719L2713Q8147P7980N2972k36786l89853l17700J13867
$$ -57232 47871 140182 99463 132176 220323 298303 351275 114489 -275364 -593064 -479197
14563d79197J11774J81320R7649k13266j26044J21963J47752j96626k38449j8908
$$ -479197 -367423 -186103 -88454 -301720 -427764 -305801 -158049 -354675 -593124 -612032
14553f12032J63242J89578K44882K4966j47039j24979R5443P7337J86789K38270
$$ -612032 -448790 -259212 -14330 10636 -136403 -261382 -165939 -88602 98187 336457
14543C36457J11580L9441r3496j40489o4067j32556j90721j70435J09310L47641
$$ 336457 448037 487478 393982 253493 189426 56870 -133851 -304286 -194976 152665
14533A52665J19990M4695m8869k61338j16974q1454R8270M87840J38153p2446
$$ 152665 272655 317350 268481 7143 -109831 -191285 -93015 394825 532978 460532
14523D60532Q59l6901q3842k46603j40645R2034O595k25389j38361O5080J29077
$$ 460532 461391 424490 340648 94045 -46600 45434 52029 -173360 -311721 -246641 -117564
14512a17564K23164P6514N1536j11443j72566N6764k2953k78933m01134q1818
$$ -117564 105600 182114 233650 122207 -50359 6405 -16548 -295481 -696615 -778433
14502g78433J63109J54520J72531J60960O7844j28064o6985K80398L65520n041
$$ -778433 -615324 -460804 -288273 -127313 -59469 -187533 -254518 25880 391400 386359
14492C86359N1080j21670j86396m9995o6681q11j9765R3173K84352J67326k18367
$$ 386359 437439 315769 129373 79378 12697 11886 -7879 85294 369646 536972 318605
14481C18605l43530k41934j62330j4126K641n961k7332M8832M6330j24715L9455
$$ 318605 -24925 -266859 -429189 -443315 -440674 -446635 -473967 -425135 -378805 -503520 -464065
14470d64065K40572J68085r9201k7498K9758M4115j11941p1221K8061n9824R5653
$$ -464065 -223493 -55408 -154609 -182107 -152349 -108234 -220175 -291396 -263335 -323159 -227506
14459b27506M22633K65737n1028q1170n4496q7926L74414L55741j68304l17109
$$ -227506 195127 460864 409836 328666 274170 186244 560658 916399 748095 430986
14449D30986j21540o088n0877q5008J30561J21710j11592r4920j04723j07694
$$ 430986 309446 303358 252481 167473 298034 419744 308152 213232 108509 815
14439H15m3133k880J5142J20710J29026r2281j44231l2901p7592J00575M22596
$$ 815 -42318 -45198 -30056 90654 219680 127399 -16832 -49733 -127325 -26750 395846
14428C95846J77279j99749k37530k19181j6929J72810J65888J15616l20k93349
$$ 395846 573125 373376 135846 -83335 -100264 72546 238434 354050 353730 60381
14418F0381j85008r2841r5358j221k1857l5591p1023J02200M5226p5733o1243
$$ 60381 -124627 -217468 -312826 -314047 -335904 -371495 -442518 -340318 -295092 -370825 -432068
14407d32068n1288J11127M4587J01845J3288m2452J20323K01067J80328n9092
$$ -432068 -483356 -372229 -327642 -225797 -212509 -254961 -134638 66429 246757 187665
14397A87665k89911l42916j66328J34943J76858O2750J3876p3109k1841R9618
$$ 187665 -102246 -445162 -611490 -476547 -299689 -236939 -223063 -296172 -318013 -218395
14387b18395R5438R7115j18801m53233l13920J33627L90792K41823K07091o6342
$$ -218395 -122957 -25842 -144643 -597876 -911796 -778169 -387377 -145554 61537 -4805
14377d805j35728j6376M6333K32139J20837j33020n5656K42420J51415r9221l4944
$$ -4805 -140533 -156909 -110576 121563 242400 109380 53724 296144 447559 348338 313394
14366C13394K3845L2520j46319j69030M8421m8725j78264N281l4590k06419m3088
$$ 313394 337239 369759 223440 54410 102831 54106 -124158 -118877 -153467 -359886 -402974
14355d02974o14l4481K6997J12543J56723J1585q5649r5607j2369l7212J3340
$$ -402974 -403588 -438069 -411072 -298529 -141806 -130221 -215870 -311477 -323846 -361058 -347718
14344c47718J86136M2394j40005j71911j90625m8331J73072K27180L59694J14315
$$ -347718 -161582 -119188 -259193 -431104 -621729 -670060 -496988 -269808 89886 204201
14334B04201j38509j81878M4114J70259o20m0991j76005j46972J59420K23619
$$ 204201 65692 -116186 -72072 98187 97567 56576 -119429 -266401 -106981 116638
14324A16638K04266j26898j60464J70681J26323k23523k46528j06871N4808m990
$$ 116638 320904 194006 33542 204223 330546 107023 -139505 -246376 -191568 -196558
14314a96558J6830Q3165P6353N874j563M8496R4979J48191n8986m1729j05020
$$ -196558 -179728 -96563 -20210 -14336 -15899 32597 127576 275767 216781 175052 70032
14303G0032l1276O5537K5964r0489j38080m6250n5031R2386P2318J18013j7740
$$ 70032 38756 104293 130257 39768 -98312 -144562 -199593 -107207 -34889 83124 65384
14292F5384J18340K13128k258k00638k84553j88660R7489J95667J85085r037J7198
$$ 65384 183724 396852 394594 193956 -90597 -279257 -181768 13899 198984 189947 207145
14281B07145m6715j15642m8441k1009J14421P4228j39926j27909N7976M43553
$$ 207145 160430 44788 -3653 -24662 89759 163987 24061 -103848 -45872 397681
14271C97681K28818k21045k12815j42484p1468m9787q8l9549K00455J83359R4405
$$ 397681 626499 405454 192639 50155 -21313 -71100 -71188 -110737 89718 273077 367482
14260C67482L3568k41765k27902J6164p5513j25761k4542p2262j67393o1854P2569
$$ 367482 401050 159285 -68617 -52453 -127966 -253727 -278269 -350531 -517924 -579778 -507209
14249e07209J04775n1157k3882j0730l4363j15683o2526J13624L23537J23951
$$ -507209 -402434 -453591 -477473 -488203 -522566 -638249 -700775 -587151 -263614 -139663
14239a39663o8475p8925J84009L20974L28544q451l04317k20206j21804m2413
$$ -139663 -208138 -287063 -103054 217920 546464 538013 233696 13490 -108314 -150727
14229a50727K5696M3659R6479n9850k1862k739R5110L0666m7662r1818j60747
$$ -150727 -125031 -81372 15107 -44743 -66605 -69344 25766 56432 8770 -83048 -243795
14218b43795j6018J40539J98501L0824j7386J43590J71924p4964l56145j91590
$$ -243795 -259813 -119274 79227 110051 92665 236255 408179 333215 -22930 -214520
14208b14520J3645k077J29022M7790N7267J26274j27399l55543p2219p703K9413
$$ -214520 -200875 -202952 -73930 -26140 31127 157401 30002 -325541 -397760 -405463 -376050
14197c76050Q8549k8780P8332K09653P8089Q5033J69540J93444N2514p7809l04090
$$ -376050 -287501 -316281 -237949 -28296 49793 134826 304366 497810 550324 472515 168425
14186A68425j94252J01666J12897j07325j47653Q0700J12156n9136m315K7971
$$ 168425 -25827 75839 188736 81411 -66242 14458 126614 67478 63163 91134
14176I1134j63061P1162J36471L4901P8323J58054K01329M7206O6328l0281m43384
$$ 91134 -71927 -765 135706 170607 248930 406984 608313 655519 721847 691566 248182
14165B48182l93138r0920P5139Q7119K5860m2517j56130j55869j360J26002N8541
$$ 248182 -144956 -235876 -160737 -73618 -47758 -90275 -246405 -402274 -403634 -277632 -219091
14154b19091K4925N6352J38936Q7908M3648l5368r5530j33650n9087j7214j28807
$$ -219091 -194166 -137814 1122 89030 132678 97310 1780 -131870 -190957 -208171 -336978
14143c36978J38179K34221J40012J3100n5479k35961j31932K84987J81493j21783
$$ -336978 -198799 35422 175434 188534 133055 -102906 -234838 50149 231642 109859
14133A09859j75198j14315l6594M7362J51676j36078j44695J0684o7263r2149
$$ 109859 -65339 -179654 -216248 -168886 -17210 -153288 -297983 -287299 -354562 -446711
14123d46711L8379J72575k6119o5545Q5246K04883K99599K07753j49230k17397
$$ -446711 -408332 -235757 -261876 -327421 -242175 -37292 262307 470060 320830 103433
14113A03433k86868j68443L6475J24056J17311N1710L0979J4297k2859n2437Q0223
$$ 103433 -183435 -351878 -315403 -191347 -74036 -22326 8653 22950 91 -52346 27877
14102B7877N5663k07251j92989K7912K54725K24561l49j11904J7692m0442j38755
$$ 27877 83540 -123711 -316700 -288788 -34063 190498 190149 78245 95937 55495 -83260
14091h3260k04400k28228J9132L41040p499j66681n5401J91687K11527O8966k06692
$$ -83260 -287660 -515888 -496756 -155716 -163215 -329896 -385297 -193610 17917 86883 -119809
14080a19809l42090l57949M5554M13340L20879K9362m7568M6738j0251j87861
$$ -119809 -461899 -819848 -774294 -360954 -40075 -10713 -58281 -11543 -21794 -209655
14070b09655k02648j40219n2510r598K89526L73526K81347Q5187j83401k26137
$$ -209655 -412303 -552522 -605032 -614630 -325104 48422 329769 414956 231555 5418
14060E418j47674M0222k2296K724k6261Q089L4986J36184J03799n545j10227j92951
$$ 5418 -142256 -102034 -124330 -121606 -147867 -139778 -104792 31392 135191 129646 19419 -173532
14048a73532m9964Q7952M5088N8405N1971N8409J09342L8493j3235P5373M9736
$$ -173532 -223496 -135544 -90456 -32051 19920 78329 187671 226164 212929 288302 338038
14037C38038M5201l9511m5356K4773J97888J45552n5020j75861j49902n4865j62947
$$ 338038 383239 343728 298372 323145 521033 666585 611565 435704 285802 230937 67990
14026F7990O9051K78132K44043J3060m21836l19885j09595l0532R254L0290j36874
$$ 67990 137041 415173 659216 672276 250440 -69445 -179040 -209572 -200318 -170028 -306902
14015c06902p0983O957M7100L27627M89121O7188l58726l66661J11249P2554k90043
$$ -306902 -377885 -370928 -323828 3799 492920 560108 201382 -165279 -54030 18524 -271519
14004b71519j45571J28030J32851l4761n5064l3323J33408M07410L13453m2270
$$ -271519 -417090 -289060 -156209 -190970 -246034 -279357 -145949 261461 574914 532644
13994E32644k52018o350K26711r2091j71503M3573J48278j40156j54006K00911
$$ 532644 280626 274276 500987 408896 237393 280966 429244 289088 135082 335993
13984C35993P022j47136j41471j10229k71050l12720O4090K31183J13504O2651
$$ 335993 343015 195879 54408 -55821 -326871 -639591 -575501 -344318 -230814 -168163
13974a68163j8542j14188n0118J26776K2066M9528J19218O2348J54438J95250
$$ -168163 -186705 -300893 -351011 -224235 -202169 -152641 -33423 28925 183363 378613
13964C78613k8276r0233k63955j2901K94789J16297o8435k43922l01663j01876
$$ 378613 350337 260104 -3851 -16752 278037 394334 325899 81977 -219686 -321562
13954c21562J40233N1901j19572L6770K31262L10702l5845j22621O1037j36261
$$ -321562 -181329 -129428 -249000 -212230 19032 329734 293889 171268 232305 96044
13944I6044k91921l7449K69947O4041j21246j52729l1943O7729O7971M9179J02284
$$ 96044 -195877 -233326 36621 100662 -20584 -173313 -205256 -137527 -69556 -20377 81907
13933H1907R9172j99990j49610J33366R7839O0188j00743N3420J32086L7102l0664
$$ 81907 181079 -18911 -168521 -35155 62684 122872 22129 75549 207635 244737 214073
13922B14073L4335L16594J71622j80682j78982M7266j7214p6531r6514J716m3500
$$ 214073 248408 565002 736624 555942 376960 424226 407012 330481 233967 235683 192183
13911A92183k2579N494l1225K4389m7678n6236O0448P8551j37848j49790M4615
$$ 192183 169604 175098 143873 168262 120584 64348 124796 203347 65499 -84291 -39676
13900c9676l311k19962m550J28208K2805n3489Q8833K89279J46289j50134j30564
$$ -39676 -42987 -262949 -267499 -139291 -116486 -169975 -81142 208137 354426 204292 73728
13889G3728r5810j26793j61200l3366J37706M2038M1473J94934O131j97332j58591
$$ 73728 -22082 -148875 -310075 -343441 -205735 -163697 -122224 72710 78841 -118491 -277082
13878b77082q26K88198K53614Q8428j94315l00907r3599J6193m4568j73918J14374
$$ -277082 -277908 10290 263904 352332 158017 -142890 -236489 -220296 -264864 -438782 -324408
13867c24408M14240J16391n7548N3641O3995J8073m4306n0194q588o7899j76991
$$ -324408 89832 206223 148675 202316 266311 284384 240078 189884 181296 113397 -63594
13856f3594n7312Q1748n9581J37967J4157j86852o2781J12111J92076L2009j87402
$$ -63594 -120906 -39158 -98739 39228 53385 -133467 -196248 -84137 107939 139948 -47454
13845d7454k29762R6063K15326K30814J52400L4523m5572j91756j65334J45994
$$ -47454 -277216 -181153 34173 264987 417387 451910 406338 214582 49248 195242
13835A95242j8655j16993N1090j46335Q3057J54869n9887l5086j10267k37846
$$ 195242 176587 59594 110684 -35651 47406 202275 142388 107302 -2965 -240811
13825b40811k39700R5340K95503K00066J68795m2047j35377p245J20616K4232
$$ -240811 -480511 -385171 -89668 110398 279193 237146 101769 94524 215140 239372
13815B39372o5860N273K8857l328r2361j83322p1099J5627J45384J73972l2575
$$ 239372 173512 178785 207642 204314 111953 -71369 -142468 -126841 18543 192515 159940
13804A59940l1129j7397l2475k56767o1408O4290j41957r1493j6041Q0740o1272
$$ 159940 128811 111414 78939 -177828 -239236 -174946 -316903 -408396 -424437 -343697 -404969
13793d04969o5053K00755L14659K25822q2236p4628m8555r1058j60014k3140J65165
$$ -404969 -470022 -269267 45392 271214 188978 114350 65795 -25263 -185277 -208417 -43252
13782d3252K58346l8903j90803N9627l0970j48064n5640L3584l6712J012M0451
$$ -43252 215094 176191 -14612 45015 14045 -134019 -189659 -156075 -192787 -191775 -151324
13771a51324j89645k45656o1078K02768K54304N6417n6240j3373J62228J42617
$$ -151324 -340969 -586625 -647703 -444935 -190631 -134214 -190454 -203827 -41599 101018
13761A01018M2909O7893o0873r7256p5101k21102j02807J67095J43081j21069
$$ 101018 143927 211820 150947 53691 -21410 -242512 -345319 -178224 -35143 -156212
13751a56212k60310j39283O9645K70610K31625j8732j3845J11192L9555P888N1186
$$ -156212 -416522 -555805 -486160 -215550 16075 -2657 -16502 94690 134245 142133 193319
13740A93319K40039J8129j62749o9869J3301J8672L8002R8476m2298l28948k49492
$$ 193319 433358 451487 288738 218869 232170 250842 288844 387320 345022 16074 -233418
13729b33418j68757K0873J44669M6823p6089r6513L1375J84841K6781l6156O5738
$$ -233418 -402175 -381302 -236633 -189810 -265899 -362412 -331037 -146196 -119415 -155571 -89833
13718h9833J73117O7634O1757J86404O4716p7476l6271L7760k0040o2386j16415
$$ -89833 83284 150918 212675 399079 463795 386319 350048 387808 367768 305382 188967
13707A88967l05402k19070q3569k3023K96949P3771Q207K5438Q0637p6210P618
$$ 188967 -116435 -335505 -419074 -442097 -145148 -71377 -63170 -37732 42905 -33305 -25687
13696b5687L34477K04468j00887j73753k94881l80743j55940o4238J3056K18441
$$ -25687 308790 513258 412371 238618 -56263 -437006 -592946 -657184 -644128 -425687
13686d25687J96831J33877R2797M5344q5605N1069j2787J22589J38409J01037
$$ -425687 -228856 -94979 -2182 43162 -42443 8626 -4161 118428 256837 357874
13676C57874P9395k21868k44899o6892Q8104O4206r0756j07443K7956J45972k08471
$$ 357874 437269 215401 -29498 -96390 -8286 55920 -34836 -142279 -114323 31649 -176822
13665a76822j75293J11822j35908m3541J09145P6379Q579Q2386K48070l4926j67696
$$ -176822 -352115 -240293 -376201 -419742 -310597 -234218 -225639 -143253 104817 69891 -97805
13654i7805J83115J84022j40148j95154K78600J64512k10770k5454J62334J47876
$$ -97805 85310 269332 129184 -65970 212630 377142 166372 140918 303252 451128
13644D51128j1660K8557k8258j63555k34303j08629k7489n4174q7944m0103O2457
$$ 451128 439468 468025 439767 276212 41909 -66720 -94209 -148383 -236327 -276430 -213973
13633b13973K26482K84873j47152l78217j49123K2027P0210L2822o8945j15002
$$ -213973 12509 297382 150230 -227987 -377110 -355083 -284873 -252051 -320996 -435998
13623d35998m9840L2145K61413J51905k29543r0230J07307K02819M9761m538k91884
$$ -435998 -485838 -453693 -192280 -40375 -269918 -360148 -252841 -50022 -261 -4799 -296683
13612b96683k98482n8865J60509J15785J25739N4712j1343K39677K94125K7338
$$ -296683 -595165 -654030 -493521 -377736 -251997 -197285 -208628 31049 325174 352512
13602C52512r067j24230m01024k00329J13422K60369J55657J0299k11054j13512
$$ 352512 343445 219215 -181809 -382138 -268716 -8347 147310 157609 -53445 -166957
13592a66957k8503o6218N0129L11986J65842q0916L876N2256J6119j05645n9225
$$ -166957 -195460 -261678 -211549 100437 266279 185363 189239 241495 257614 151969 92744
13581I2744k17826j26635J10423N5235J3995n4762l05741n4763Q3015P3301J60599
$$ 92744 -125082 -251717 -141294 -86059 -72064 -126826 -432567 -487330 -404315 -331014 -170415
13570a70415J30711J77136J1187k89833j92244J72570J93854J72418K6353k56229
$$ -170415 -39704 137432 148619 -141214 -333458 -160888 32966 205384 231737 -24492
13560b4492k7063J88421J23471l61987m07462j08197J85691K25540J37414M8349
$$ -24492 -51555 136866 260337 -101650 -509112 -617309 -431618 -206078 -68664 -20315
13550b0315p4830l8537K02632R9279j92659n9107J78229K52036j47296l27611
$$ -20315 -95145 -133682 68950 168229 -24430 -83537 94692 346728 199432 -128179
13540a28179j59056P1031L7296o3463j56381L7137R4584m0391J4099J11398o1921
$$ -128179 -287235 -216204 -178908 -242371 -398752 -361615 -267031 -307422 -293323 -181925 -243846
13529b43846R9677P9008r5878P698Q2217J41370O6908P1882L5563J03539K1472
$$ -243846 -144169 -65161 -161039 -153341 -71124 70246 137154 209036 244599 348138 369610
13518C69610j20825p5657J3633l6004Q4947J63891K1352j99471j89608j2740J78914
$$ 369610 248785 173128 186761 150757 235704 399595 420947 221476 31868 19128 198042
13507A98042J92279J32886N1506j23671r0987J1800R460r8620j36736O4855M9965
$$ 198042 390321 523207 574713 451042 360055 371855 381315 282695 145959 210814 260779
13496B60779j01618N0360Q0987r8256k85141j26407J42782J84288k14513k61261
$$ 260779 159161 209521 290508 192252 -92889 -219296 -76514 107774 -106739 -368000
13486c68000k29919L0564O5699P2797k4966O0266M7406J9898O5087L3556O5271
$$ -368000 -597919 -567355 -501656 -428859 -453825 -393559 -346153 -326255 -261168 -227612 -162341
13475a62341P1442o5593j52438m0875Q3779N2951o9418k35567n1016J85026J56882
$$ -162341 -90899 -156492 -308930 -349805 -266026 -213075 -282493 -518060 -569076 -384050 -227168
13464b27168K83529K57081q620k85867r2583j24720k71538k60123J3702K17855
$$ -227168 56361 313442 304822 18955 -73628 -198348 -469886 -730009 -716307 -498452
13454d98452J18198K09790J30322J184J13058K20507R295j80968N7780J96286
$$ -498452 -380254 -170464 -40142 -38958 74100 294607 303902 122934 180714 377000
13444C77000K6780j13571O7666Q5654N9059J13067j12360k70025j66680j81815
$$ 377000 403780 290209 357875 443529 502588 615655 503295 233270 66590 -115225
13434a15225j361O7240J50460O0591J61888L27076K14362Q1114K1039j04281k75622
$$ -115225 -116586 -49346 101114 161705 323593 650669 865031 946145 967184 862903 587281
13423E87281r2216j22438k54241k80758k3344J21251j49920k05435J94851J13041
$$ 587281 495065 372627 118386 -162372 -185716 -64465 -214385 -419820 -224969 -111928
13413a11928P0067L8398n4478j07776j68754q5564K09268J30485N7128J87093
$$ -111928 -41861 -3463 -57941 -165717 -334471 -420035 -210767 -80282 -23154 163939
13403A63939J15080J43550j3467j71422j09003j91442m3068n7213j81399Q8679
$$ 163939 279019 422569 409102 237680 128677 -62765 -105833 -163046 -344445 -255766
13393b55766Q8426j95094o1711J08828J69908J56659J97300Q0728j45079o8323
$$ -255766 -167340 -362434 -424145 -315317 -145409 11250 208550 289278 144199 75876
13383G5876l3295Q6819Q0979j24912M9822N5045n7274J01876J73300P2195j4013
$$ 75876 42581 129400 210379 85467 135289 190334 133060 234936 408236 480431 466418
13372D66418p7313j82159j05926L2901J08429R3055P3291o8693k99509j36848
$$ 466418 389105 206946 101020 133921 242350 335405 408696 340003 40494 -96354
13362i6354O5647q858m9339j05466n1989J46798K46436N6689j66184l09255j59514
$$ -96354 -30707 -39565 -88904 -194370 -246359 -99561 146875 203564 37380 -271875 -431389
13351d31389J31940K28025J26166J12576J02392L9666r4549p49N7043K6330M6514
$$ -431389 -299449 -71424 54742 167318 269710 309376 214827 214078 271121 297451 343965
13340C43965K7410r2795k16310j00903J9441J20497K05130N9416k4109K4918N1338
$$ 343965 371375 278580 62270 -38633 -19192 101305 306435 365851 341742 366660 417998
13329D17998j04071j48319n6418K3988J20736J34909R335j56646k28685j28191
$$ 417998 313927 165608 109190 133178 253914 388823 398158 241512 12827 -115364
13319a15364J18645J61504r8437k03714m2444K84424J81255R3756m1752k04500
$$ -115364 3281 164785 66348 -137366 -179810 104614 285869 379625 337873 133373
13309A33373k01663l4829K87867J01726l15528k24141J93175K15174M1282l0479
$$ 133373 -68290 -103119 184748 286474 -29054 -253195 -60020 155154 196436 165957
13299A65957r0791j45898R2338J48944J0045j62353k3121K48909K18496n93K7995
$$ 165957 75166 -70732 21606 170550 180595 18242 -4879 244030 462526 461933 489928
13288D89928j50135o0661K96965O2852j48736R6960J13961q048n5445q7310p1705
$$ 489928 339793 279132 576097 638949 490213 587173 701134 693086 637641 550331 478626
13277D78626l40665k14877P5235k4126j44584O5316K89255R0299n0375O531L8757
$$ 478626 137961 -76916 -1681 -25807 -170391 -105075 184180 274479 224104 230635 269392
13266B69392K950j9887m4234k612J75616J46274K4337k2902j15210k67707l19228
$$ 269392 272342 252455 208221 205609 381225 527499 551836 528934 413724 146017 -173211
13255a73211R8538J19669k8765J15873p1182k31212j93711L9696K52362P6791
$$ -173211 -74673 44996 16231 132104 60922 -170290 -364001 -324305 -71943 4848
13245D848j41241j58340j40791J08314K16697J19853L4699J21233J56919Q709
$$ 4848 -136393 -294733 -435524 -327210 -110513 9340 44039 165272 322191 330900
13235C30900J91320K37011J11322K1906J017o7076j59089K6714J51829L7966o0890
$$ 330900 522220 759231 870553 892459 893476 826400 667311 694025 845854 883820 822930
13224H22930j71969k64426l2113M6401K7486j6869k12820m0484R52n1877J12022
$$ 822930 650961 386535 354422 400823 428309 411440 198620 158136 159088 107211 219233
13213B19233Q4257J21005Q2032J07849l9781k20629j2897L0214M5528R4815K8915
$$ 219233 303490 424495 506527 614376 574595 353966 341069 371283 416811 511626 540541
13202E40541j7363p9295J8516r9913j09559N5482K349j06136j80115k52013j58089
$$ 540541 523178 443883 462399 362486 252927 308409 310758 204622 24507 -227506 -385595
13191c85595J94007K49220K75533L05313K43360J24101r1445j78591j05543K04851
$$ -385595 -191588 57632 333165 638478 881838 1005939 914494 735903 630360 835211
13181H35211q5304j59720j25828q7272J66455L97610P7317j32517j0366j40574
$$ 835211 749907 590187 464359 377087 543542 941152 1018469 885952 875586 735012
13171G35012j77672p1364j94833r8367n2061j53945K03062L99357L71831O250
$$ 735012 557340 485976 291143 192776 140715 -13230 189832 589189 961020 967270
13161I67270q9725j193l7355q8759j21362k81244l01786J53144J51915J20773
$$ 967270 877545 876352 838997 750238 628876 347632 45846 198990 350905 471678
13151D71678L3242k5264j69973k75967j78774J87452K89867K39148K03502O9558
$$ 471678 504920 479656 309683 33716 -145058 42394 332261 571409 774911 844469
13141H44469N0813l8705l79603k06087P5888P0725K81682L06511J63974J40976
$$ 844469 895282 856577 476974 270887 346775 417500 699182 1005693 1169667 1310643
13131A310643Q3538k64804m9363O7795j5624Q6553n5940j04692l6839J16098p53
$$ 1310643 1394181 1129377 1080014 1147809 1132185 1218738 1162798 1058106 1021267 1137365 1136612
13120A136612j73321k49787k17234j23366R7970L11763m482j06314k9102j44939
$$ 1136612 963291 713504 496270 372904 470874 782637 778155 671841 642739 497800
13110D97800q9829K02212J71700j01994L1006J62739J81791J78743M1631j63811
$$ 497800 407971 610183 781883 679889 710895 873634 1055425 1234168 1275799 1111988
13100A111988l3331j2739k05447J384J63859m2400Q9405J27913j3851j52842j13145
$$ 1111988 1078657 1065918 860471 861855 1025714 983314 1072719 1200632 1186781 1033939 920794
13089I20794J47805J62941J5920o2691j20111q9410O493J2868L9373J11804P2773
$$ 920794 1068599 1231540 1247460 1184769 1064658 975248 981741 994609 1033982 1145786 1218559
13078A218559j8218j11925n0508J34543K04854J28294J36969K22807R5634l6337
$$ 1218559 1200341 1088416 1037908 1172451 1377305 1505599 1642568 1865375 1961009 1924672
13068A924672j44664Q360K3985p2965o5930N204N568j00787o3870M9882K36040
$$ 1924672 1780008 1788368 1812353 1739388 1673458 1678662 1684230 1583443 1519573 1569455 1805495
13057A805495K39427j07044j47033n3715R5724O0180R4248J64357J73128p2813
$$ 1805495 2044922 1937878 1790845 1737130 1832854 1893034 1987282 2151639 2324767 2251954
13047B251954j31167J17935J73844J77960J6833m6149K7731q1101j20041J66554
$$ 2251954 2120787 2238722 2412566 2590526 2607359 2561210 2588941 2507840 2387799 2554353
13037B554353j6651j64484k33401j30461J67354L21926J88095J90610J57645J41849
$$ 2554353 2537702 2373218 2139817 2009356 2176710 2498636 2686731 2877341 3034986 3176835
13027C176835K65364K48878J29715m874M5340j24137j51318j23344J1046J83607
$$ 3176835 3442199 3691077 3820792 3815918 3861258 3737121 3585803 3462459 3473505 3657112
13017C657112K75225l6147k8623K00839J72486K57042L87688K35154K05013K66550
$$ 3657112 3932337 3896190 3867567 4068406 4240892 4497934 4885622 5120776 5325789 5592339
13007E592339M54695K55574J32582J99976J64529K36822M25025O40149N22598
$$ 5592339 6047034 6302608 6435190 6635166 6799695 7036517 7461542 8101691 8624289
12998H624289K23308L48035M47238M24215O03226N65507O98628R03627J015520
$$ 8624289 8847597 9195632 9642870 10067085 10670311 11235818 11934446 12838073 13853593
12989A3853593J135842J284082J555995J652814J955793K411287K977975L686734
$$ 13853593 14989435 16273517 17829512 19482326 21438119 23849406 26827381 30514115
12981C0514115M493101N621975O910212Q296128J0309344J3237119J7158774K2234882
$$ 30514115 35007216 40629191 47539403 55835531 66144875 79381994 96540768 118775650
12973A18775650K9169413L8061403M7414376N2550908M3651868J4482708k1069296
$$ 118775650 147945063 186006466 233420842 285971750 329623618 344106326 323037030
12966C23037030m2866455m7265597m2291561l4331632k6896993k1147143j6880799
$$ 323037030 280170575 232904978 190613417 156281785 129384792 108237649 91356850
12959I1356850j3658841j0940417q910888p207435n956148n059232m279524l684569
$$ 91356850 77698009 66757592 57846704 50639269 44683121 39623889 35344365 31659796
12951C1659796l190715k696442k321156k086638j751578j461546j256030j255513
$$ 31659796 28469081 25772639 23451483 21364845 19613267 18151721 16895691 15640178
12943A5640178j016948r78543r19799p81003o14414k40706j50207m41699m65978
$$ 15640178 14623230 13644687 12724888 11943885 11329471 11088765 10938558 10496859 10030881
12934A0030881l30213k15227p6301J22231k0731j37571j55741j76516n6766J77028
$$ 10030881 9700668 9485441 9409140 9531371 9510640 9373069 9217328 9040812 8984046 9161074
12924I161074K83080L41593L81813J38005J72326L81610O22870Q32731J002828
$$ 9161074 9444154 9785747 10167560 10305565 10477891 10859501 11482371 12315102 13317930
12915A3317930J432286J949491K680000L369400L759020K993955R84018q96234
$$ 13317930 14750216 16699707 19379707 22749107 26508127 29502082 30486100 29589866
12907B9589866k002701k101317j616576j199530o61032O9335L76478O58894J095628
$$ 29589866 27587165 25485848 23869272 22669742 22008710 22078045 22454523 23113417 24209045
12898B4209045J452230K045155K858370L505028M309437N329255O766860Q931268
$$ 24209045 25661275 27706430 30564800 34069828 38379265 43708520 50475380 59406648
12890E9406648J1390839J4561687J8585634K3865356L1393196M1021474N0668907
$$ 59406648 70797487 85359174 103944808 127810164 159203360 200224834 250893741
12883B50893741N3665031L8465418L715454l0911603m7425235m7590121m0453246
$$ 250893741 304558772 343024190 346739644 315828041 268402806 220812685 180359439
12876A80359439l2234875k5460284k0140300j5963847j2757251j0252939q375524
$$ 180359439 148124564 122664280 102523980 86560133 73802882 63549943 55174419
12869E5174419o955394n905536m886116l925882l487605k887226k380556k295302
$$ 55174419 48219025 42313489 37427373 33501491 30013886 27126660 24746104 22450802
12861B2450802k124760j554334j322030j228659j338578j056898q39648n81289
$$ 22450802 20326042 18771708 17449678 16221019 14882441 13825543 12985895 12404606
12853A2404606o29174p34680m04328l25676l32273m20896m47642l07126k13215
$$ 12404606 11775432 11040752 10636424 10310748 9978475 9557579 9109937 8802811 8589596
12844H589596m88357j94642J11688K9497r2033n6681O155m2662k0244M1465q0519
$$ 8589596 8101239 7906597 8018285 8047782 7955749 7899068 7905223 7862561 7842317 7883782 7803263
12833G803263o2727K03194J45307Q1636J03086K04832M05386K70576K10624M03580
$$ 7803263 7740536 7943730 8089037 8170673 8273759 8478591 8883977 9154553 9365177 9768757
12823I768757N68462M47334L15859N57405N40681N73571Q37051J042530J332515
$$ 9768757 10337219 10784553 11100412 11657817 12198498 12772069 13609120 14651650 15984165
12814A5984165J384969J516780J986172K347045K559163L207423M190851N167381
$$ 15984165 17369134 18885914 20872086 23219131 25778294 28985717 33176568 38343949
12806C8343949O311618P604090R458433J2050435J5488442J9850657K5987950
$$ 38343949 44655567 52259657 61718090 73768525 89256967 109107624 135095574
12799A35095574L3848759M3020533N1163324N0060915K9113840o686973l6334816
$$ 135095574 168944333 211964866 263128190 313189105 342302945 335615972 299281156
12792B99281156m7716706m5431086l7895244l0178847k3543600j8723243j5243647
$$ 299281156 251564450 206133364 168238120 138059273 114515673 95792430 80548783
12785H0548783j2126480r592585p882688o572727n518752m570059l810665l240660
$$ 80548783 68422303 58829718 50947030 44374303 38855551 34285492 30474827 27234167
12777B7234167k918848k652079k321083j935687j593289j172274j210166j189061
$$ 27234167 24315319 21663240 19342157 17406470 15813181 14640907 13430741 12241680
12769A2241680j009815q88473p53437r77974q22294n55447m00467k67774k53758
$$ 12241680 11231865 10343392 9589955 8611981 7789687 7234240 6833773 6565999 6312241
12760F312241l94455l95179j88055m16349l54892j53425l8492j09450k80832j07760
$$ 6312241 5917786 5522607 5334552 4918203 4563311 4409886 4371394 4261944 3981112 3873352
12750C873352L7379j71720k40929j14836j86361k19154n3295o9822R719j63475
$$ 3873352 3910731 3739011 3498082 3383246 3196885 2977731 2924436 2854614 2864333 2700858
12740B700858j17406J69637M5735k33748j08277J15434k08592l67619k68159j42154
$$ 2700858 2583452 2753089 2798824 2565076 2456799 2572233 2363641 1996022 1727863 1585709
12730A585709N6558Q910k5384k28244r6320K04957Q0781r4893j17564m2367j27992
$$ 1585709 1642267 1651177 1625793 1397549 1301229 1506186 1586967 1492074 1374510 1332143 1204151
12719A204151j5434K0998J10095j2000p523n2686k6803j37996k57857j20615M5913
$$ 1204151 1188717 1209715 1319810 1307810 1300287 1247601 1220798 1082802 824945 704330 750243
12708G50243J44896N299m2397j67673k66886p4417R9676O6217o5455p9674J0432
$$ 750243 895139 900438 858041 690368 423482 349065 448741 514958 449503 369829 380261
12697C80261j2825l6079m5791m4111O5881K19490K01385l5960j86694k87582k29551
$$ 380261 367436 331357 285566 241455 307336 526826 728211 692251 505557 217975 -11576
12686a1576j7896K74575K53824n6119k9974P3744J03897o5082j85331n2615J05006
$$ -11576 -29472 245103 498927 442808 412834 486578 590475 525393 340062 287447 392453
12675C92453J46202m1632j95788k21239J43356M43763J79771j16711p0106k02570
$$ 392453 538655 497023 301235 79996 223352 667115 846886 730175 660069 457499
12665D57499j24991J40044l0782q3883O25R8658L4508j55665k17304o6372M7019
$$ 457499 332508 472552 441770 357887 358512 457170 491678 336013 118709 52337 99356
12654I9356K42847K16838q5m8019M0549j77645j65768p6525p221K8815k2177j13535
$$ 99356 342203 559041 558956 510937 551486 373841 208073 131548 124327 153142 130965 17430
12642A7430l1304p9286j29829N1281O0473J03496Q3526O8023J54210K0104j16151
$$ 17430 -13874 -93160 -222989 -171708 -111235 -7739 75787 143810 298020 318124 201973
12631B01973j18149j20670J22650Q9829K35555J89815j42077j01174O6749j66615
$$ 201973 83824 -36846 85804 175633 411188 601003 458926 357752 424501 257886
12621B57886k08498j56809j75198J10118K44587J47617j37160j25236J47836K48253
$$ 257886 49388 -107421 -282619 -172501 72086 219703 82543 -42693 105143 353396
12611C53396K29654J25930k5926j76715k27808k77774j00939K7930J3648J70897
$$ 353396 583050 708980 683054 506339 278531 757 -100182 -72252 -58604 112293
12601A12293L20397J65143L8211o8186k83096l26121k9576k8609Q216M8558J90821
$$ 112293 432690 597833 636044 567858 284762 -41359 -70935 -99544 -91328 -42770 148051
12590A48051K08728n972N1098L989j1192O5345O3954q5214l60560j75820j17221
$$ 148051 356779 350807 401905 405894 394702 460047 524001 438787 78227 -97593 -214814
12579b14814M3383J41233l8251j21480n2360J33670J9426J12580Q0217K0423Q8015
$$ -214814 -171431 -30198 -68449 -189929 -242289 -108619 -89193 23387 103604 124027 212042
12568B12042J63278K8956j08337P8365J76496j9571k19202k65749Q1372K08285
$$ 212042 375320 404276 295939 374304 550800 531229 312027 46278 127650 335935
12558C35935r69j32968m0179J55875m2252k9035K5033R152q3644q9864k1790R220
$$ 335935 334966 201998 161819 317694 275442 246407 271440 280592 196948 107084 85294 94514
12546I4514J38733J56826k80051l69475q5369L7591J73553Q2797j3116J43815
$$ 94514 233247 390073 110022 -259453 -344822 -307231 -133678 -50881 -63997 79818
12536G9818M5085K20824J06420k3700q2570j82981k39184j24122K21042K2555
$$ 79818 124903 345727 452147 428447 345877 162896 -76288 -200410 20632 43187
12526D3187l01798k36203o2897Q3947K58348L82874J41135j34272j83647M2981
$$ 43187 -258611 -494814 -557711 -473764 -215416 167458 308593 174321 -9326 33655
12516C3655K15882O3581m8496n7494q0777J11498J00355p5908n3036k8578n2659
$$ 33655 249537 313118 264622 207128 126351 237849 338204 262296 209260 180682 128023
12505A28023k3257J61944M3127j85676j47296P2061O5715k5137J22779L6495k00420
$$ 128023 104766 266710 309837 124161 -23135 48926 114641 89504 212283 248778 48358
12494D8358k12572J11636J70214J00780R1566j00172m855o1053j76064K30420
$$ 48358 -164214 -52578 117636 218416 309982 209810 204955 143902 -32162 198258
12484A98258J99570p4251p3474q2041k15992l62K11365k3634m7832j42342q5612
$$ 198258 397828 323577 250103 168062 -47930 -48292 163073 139439 91607 -50735 -136347
12473a36347k6234o5997m641K9056j31402k39560k33540j83812j18751J66373
$$ -136347 -162581 -228578 -233219 -204163 -335565 -575125 -808665 -992477 -1111228 -944855
12463i44855L31007O6054k39787O9183K82235J28278M398r4196o4727K28208K37987
$$ -944855 -613848 -547794 -787581 -718398 -436163 -307885 -303487 -397683 -462410 -234202 3785
12452C785P0111o835M7695N6830J07897K31099K33902Q8085r3222k97518m85737
$$ 3785 73896 67061 114756 171586 279483 510582 744484 832569 739347 441829 -43908
12441d3908q5130K0259K3814J29138O4765J08107j00090q9119P4228n9549L2658
$$ -43908 -129038 -108779 -84965 44173 108938 217045 116955 27836 102064 42515 75173
12430G5173J80801K08272m2333k46026k15427M996J57684P9516K13750K05944
$$ 75173 255974 464246 421913 175887 -39540 -34544 123140 202656 416406 622350
12420F22350m9806j71754j29163j29750l33606j71254J18640J9857N070o896m3442
$$ 622350 572544 400790 271627 141877 -191729 -362983 -244343 -224486 -219416 -226312 -269754
12409b69754O5050n0395j75974j43873K02688M61507K57899P539k61938k95743
$$ -269754 -204704 -255099 -431073 -574946 -372258 89249 347148 354687 92749 -202994
12399b02994k1453K14302J14022O8770J70199n1689p7885J26051K10157J06588
$$ -202994 -224447 -10145 103877 172647 342846 291157 213272 339323 549480 656068
12389F56068j53252n7049p8479l35912m78291k95416J55593J50654L6620K5166
$$ 656068 502816 445767 367288 31376 -446915 -742331 -586738 -436084 -399464 -374298
12379c74298O0316K19693q489K4319K05185Q5116k01314k52102O745J60088J37963
$$ -374298 -313982 -94289 -102778 -78459 126726 211842 10528 -241574 -234829 -74741 63222
12368F3222l751r6998k42497j69463M7878k8403o7377J7410m6702j4949l5164
$$ 63222 59471 -37527 -280024 -449487 -401609 -430012 -497389 -479979 -526681 -541630 -576794
12357e76794L0129N9319j31873J1625K10079J65808J26680j01632J31713K26930
$$ -576794 -546665 -487346 -619219 -607594 -397515 -231707 -105027 -206659 -74946 151984
12347A51984k8610j5563P8239O1812J2975j84502k58059q5264j05638J0666k6196
$$ 151984 123374 107811 186050 247862 260837 76335 -181724 -266988 -372626 -361960 -388156
12336c88156N0826J49749r434J4831J80928J00168p8503j9742m7328p2273j49071
$$ -388156 -337330 -187581 -197015 -182184 -1256 98912 20409 667 -46661 -118934 -268005
12325b68005j6915P5978J00697p5605j43036P0722K64579p1314j01269J01849
$$ -268005 -284920 -208942 -108245 -183850 -326886 -256164 8415 -62899 -164168 -62319
12315f2319J3263j01434M8670K18302J78313J02294j49733j65558j56673j52123
$$ -62319 -49056 -150490 -101820 116482 294795 397089 247356 81798 -74875 -226998
12305b26998q012o8169k53671j82558k8012R3837J86437O2938Q1181L34640J77005
$$ -226998 -235010 -303179 -556850 -739408 -767420 -673583 -487146 -424208 -343027 -8387 168618
12294A68618o3314k14644J2122P5654J72945J28137q0433o3236J32237k5288k88107
$$ 168618 105304 -109340 -97218 -21564 151381 279518 199085 135849 268086 242798 -45309
12283d5309l29604l83030j00617L9368j16027j55548l609K69488L82584J65325
$$ -45309 -374913 -757943 -858560 -819192 -935219 -1090767 -1094376 -824888 -442304 -276979
12273b76979k1382J03269O0830j07275r0785J83849K85309N7572O6592M5210p9108
$$ -276979 -298361 -195092 -134262 -241537 -332322 -148473 136836 194408 261000 306210 227102
12262B27102q6782M7528J50380o19J13333m8211k26426j37518j62059k66984l6875
$$ 227102 140320 187848 338228 337609 450942 402731 176305 38787 -123272 -390256 -427131
12251d27131J23408J46813l4166j74471J28863L51425J36824m4570J95152J21310
$$ -427131 -303723 -156910 -191076 -365547 -236684 114741 251565 206995 402147 523457
12241E23457j56339j41445O2699O715p5307n1954j52234n1695K07500K26825j5551
$$ 523457 367118 225673 288372 295087 219780 167826 15592 -36103 171397 398222 382671
12230C82671j84583k67425n1591K34049J38396n9086l9958O7897J63622P5523
$$ 382671 198088 -69337 -120928 113121 251517 192431 152473 220370 383992 459515
12220D59515j26456j58147m7041j03129j29015p8276P7719K01033N4821j40935
$$ 459515 333059 174912 127871 24742 -104273 -182549 -104830 96203 151024 10089
12210A0089K2512N2691j6384r8264k08841l46470j72567K86504L10402N6747m4292
$$ 10089 32601 85292 68908 -29356 -238197 -584667 -757234 -470730 -160328 -103581 -147873
12199a47873j3550o1618j20238J8884J01661K04175J29723N6222J23100R6607
$$ -147873 -161423 -223041 -343279 -324395 -222734 -18559 111164 167386 290486 387093
12189C87093j47002k24445j63944j88030p5923M7852Q1815k33965j73178J20415
$$ 387093 240091 15646 -148298 -336328 -412251 -364399 -282584 -516549 -689727 -569312
12179e69312J27045J8797j12284J2397l327J71048J02658N1707K14439J92182
$$ -569312 -442267 -423470 -535754 -523357 -526684 -355636 -252978 -201271 13168 205350
12169B05350n402P0349R1287M038J95044n8949k08758q1567q017l2874J19322
$$ 205350 199948 270297 361584 365622 560666 501717 292959 211392 203375 170501 289823
12158B89823J27472j09715l41313j35264K3478o86p8277n8364N2978O0146o7364
$$ 289823 417295 307580 -33733 -168997 -145519 -146205 -224482 -282846 -229868 -169722 -237086
12147b37086P7745J05095J1750q689q1042O4305m8521J4139j891J5388J02116
$$ -237086 -159341 -54246 -42496 -51185 -132227 -67922 -116443 -102304 -104195 -88807 13309
12136A3309O9816j58560j46807j27447j44575j27751j74924n1899K14419J47543
$$ 13309 83125 -75435 -222242 -349689 -494264 -622015 -796939 -848838 -634419 -486876
12126d86876K96114M04742q9391p1491J17677J41464M5413n6463j9715j34620
$$ -486876 -190762 213980 124589 53098 170775 312239 357652 301189 281474 146854
12116A46854k5095J73951m2264j79532j35768Q328l5517q9329J30321J14825K6839
$$ 146854 121759 295710 253446 73914 -61854 -53526 -89043 -178372 -48051 66774 93613
12105I3613K7921J27767J31766k18704q9204J65100J5264j0412M2593L7175j21328
$$ 93613 121534 249301 381067 162363 73159 238259 253523 243111 285704 322879 201551
12094B01551j28993R0447L6850p0893j17125p7384J21747J37044M0186j19832
$$ 201551 72558 163005 199855 128962 11837 -65547 56200 193244 233430 113598
12084A13598q3080J25577Q5057N4851o7848k08310l9666R4424j12782q2972j89767
$$ 113598 30518 156095 241152 296003 228155 19845 -19821 74603 -38179 -121151 -310918
12073c10918k27347M0230J65508J76279M6375r2166j14389o321J46122J13260
$$ -310918 -538265 -498035 -332527 -156248 -109873 -202039 -316428 -322749 -176627 -63367
12063f3367m8758m5610J73229J02911q1777n4486m8760k12460k39127M716J73717
$$ -63367 -112125 -157735 15494 118405 36628 -17858 -66618 -279078 -518205 -513489 -339772
12052c39772O7598Q5761K74710K32403l6841k65985j12708K5349k60444l54296
$$ -339772 -272174 -186413 88297 320700 283859 17874 -94834 -69485 -329929 -684225
12042f84225q8553R5657O3752N2351K64421J98717K6003n0987k8351r6377j28296
$$ -684225 -772778 -677121 -613369 -561018 -296597 -97880 -71877 -122864 -151215 -247592 -375888
12031c75888j67448j37240k0888N9721J68632K13787J20297J55497J25022k13323
$$ -375888 -543336 -680576 -701464 -641743 -473111 -259324 -139027 16470 141492 -71831
12021g1831l09341j99266j4630J22212J02917K18757K48735J01758j9868j58517
$$ -71831 -381172 -580438 -595068 -472856 -369939 -151182 97553 199311 179443 20926
12011B0926k4388j02292k8086J04829N1326j16553k4428o4300M3159R7716J47868
$$ 20926 -3462 -105754 -133840 -29011 22315 -94238 -118666 -182966 -139807 -42091 105777
12000A05777J20718P9689o0065j42930j46809j43070q2965n9429r0554k6631J79492
$$ 105777 226495 306184 246119 103189 -43620 -186690 -269655 -329084 -419638 -446269 -266777
11989b66777L29885J77237L3608K845n2963o1699j43782q7432j13865k973J98075
$$ -266777 63108 240345 273953 276798 223835 162136 18354 -69078 -182943 -185916 12159
11978A2159J88539K41823J5469j05306q6157J5978K1535q039J29730n7530k77385
$$ 12159 200698 442521 457990 352684 266527 282505 304040 296001 425731 368201 90816
11967I0816m7811j38242j67247l032J49940J16505m5153p004P1882L1786k962
$$ 90816 43005 -95237 -262484 -265516 -115576 929 -44224 -51228 20654 52440 49478
11956D9478K170l9547N9505K23760J9818j58247m5709N9206q0788k19078l4052
$$ 49478 51648 12101 71606 295366 315184 156937 111228 170434 89646 -129432 -163484
11945a63484J34010k6989l2422M3455J9610J01054K16885K35117O1862j23471
$$ -163484 -29474 -56463 -88885 -45430 -25820 75234 292119 527236 589098 465627
11935D65627q7253j21525l1154j32371l39721o7398R4258m3698O3673K27783L75355
$$ 465627 378374 256849 225695 93324 -246397 -313795 -219537 -263235 -199562 28221 403576
11924D03576J75925q1125q913K1031j53769l24619k66600j24688K42703K38768
$$ 403576 579501 498376 489463 510494 356725 32106 -234494 -359182 -116479 122289
11914A22289j46885j19238M8306J24214J99728J46303R4770p3522j74432j16530
$$ 122289 -24596 -143834 -95528 28686 228414 374717 469487 395965 221533 105003
11904A05003O241k9195k61754j16148K37863K44282J10115J07028P5754l868q5665
$$ 105003 111244 82049 -179705 -295853 -57990 186292 296407 403435 479189 475321 389656
11893C89656j53181k44859m4378J07482J04951R6339R5133J41095J66447J41299
$$ 389656 236475 -8384 -52762 54720 159671 256010 351143 492238 658685 799984
11883G99984P4291m5967k21834n0383J9119p2821j46599k43623l26468j30556
$$ 799984 874275 828308 606474 556091 575210 502389 355790 112167 -214301 -344857
11873c44857M5418K06989P7653M3364P2842J44701m8030j19146J12360J15957
$$ -344857 -299439 -92450 -14797 28567 101409 246110 198080 78934 191294 307251
11863C07251m8611M0157K27182J97571J32258K7262L7132R672m0005N9118m8516
$$ 307251 258640 298797 525979 723550 855808 883070 920202 929874 889869 948987 900471
11852I00471r7404Q4607J58403J80173n0475j13980J10863p0551p7481k3905j00012
$$ 900471 803067 887674 1046077 1226250 1175775 1061795 1172658 1102107 1024626 1000721 900709
11841I00709n9705n2146O5257L95277K39379J07706N9666j11528k6667K49668
$$ 900709 841004 788858 854115 1249392 1488771 1596477 1656143 1544615 1517948 1767616
11831A767616q161j38369M1754J16568O7211q7165j57482p9620j13971o5550j0473
$$ 1767616 1759455 1621086 1662840 1779408 1846619 1759454 1601972 1522352 1408381 1342831 1332358
11820A332358j46738l25141j58461J18523K13026J28437k7627j78459l32868j46205
$$ 1332358 1185620 860479 702018 820541 1033567 1162004 1134377 955918 623050 476845
11810D76845j44557L8997L71634K42462p1022j80136j53809k09326k07634o7075
$$ 476845 332288 371285 742919 985381 914359 734223 580414 371088 163454 96379
11800I6379M4034j40671k8157K55853K26170J12533M2142M9235P3009K2121k08150
$$ 96379 140413 -258 -28415 227438 453608 566141 608283 657518 730527 752648 544498
11789E44498j02482m0552j21471J9891K3701j6283J83967K77216k7762j34860
$$ 544498 442016 401464 279993 299884 323585 307302 491269 768485 740723 605863
11779F05863J98987L52482j28052o1970L9615J3671j0143Q1043J44806K5828j18642
$$ 605863 804850 1157332 1029280 967310 1006925 1020596 1010453 1091496 1236302 1262130 1143488
11768A143488m130J33238R9295J90593J67489M0198n437K16713L14962K06307
$$ 1143488 1139358 1272596 1371891 1562484 1729973 1770171 1764734 1981447 2296409 2502716
11758B502716K53204O5869o1639J87494L05986J85958K53081L24320K28608J61705
$$ 2502716 2755920 2821789 2760150 2947644 3253630 3439588 3692669 4016989 4245597 4407302
11748D407302J62269J15918J98063K30066j4729j07287j15059k71056l08383j15273
$$ 4407302 4569571 4685489 4883552 5113618 5098889 4991602 4876543 4605487 4297104 4181831
11738D181831k53054l92755J555J93893j82279n55836k27002k75784m33820k45953
$$ 4181831 3928777 3536022 3537577 3731470 3549191 2993355 2766353 2490569 2056749 1810796
11728A810796j21915j24235j68840k87920k31021J9364J6980J00141J55079q5914
$$ 1810796 1688881 1564646 1395806 1107886 876865 896229 913209 1013350 1168429 1082515
11718A082515j08550j33155k16281l3957J03699K43034K55036J70314j37448k4851
$$ 1082515 973965 840810 624529 590572 694271 937305 1192341 1362655 1225207 1200356
11708A200356j36416r5360k5404j36216j16409L8647R762k80829j57889O9329
$$ 1200356 1063940 968580 943176 806960 690551 729198 738960 458131 300242 369571
11698C69571K58409K04772R9289N0819J0833o6128k77258k12231q5374j01622
$$ 369571 627980 832752 932041 982860 993693 927565 650307 438076 352702 251080
11688B51080m2669o6176n4236J1339J64040J96544J15288o0091o7607r9871K7483
$$ 251080 208411 142235 87999 99338 263378 459922 575210 515119 447512 347641 375124
11677C75124n7433j92382n5559j91229k06048k49633j60374K06422L60468J99961
$$ 375124 317691 125309 69750 -121479 -327527 -577160 -737534 -531112 -170644 29317
11667B9317L3881r7989j30950J0608l9936k46435J70894M70534J82335q026J19443
$$ 29317 63198 -34791 -165741 -155133 -195069 -441504 -270610 199924 382259 374233 493676
11656D93676m0897k01646k15131l7168M8415M576l2849N0615K03112J21917j42011
$$ 493676 452779 251133 36002 -1166 47249 51825 18976 69591 272703 394620 252609
11645B52609j40788K0109m0316j5721K67219N5684k00476j1787r1039k64130j07225
$$ 252609 111821 131930 91614 75893 343112 398796 198320 186533 95494 -168636 -275861
11634b75861M0845Q4264K1527j64301K2543K48127J87284o0674o260J02352R0816
$$ -275861 -235016 -150752 -129225 -293526 -270983 -22856 164428 103754 97494 199846 290662
11623B90662J82034Q0080j82800l4608L332k05035m0065O567p8227k08J44644
$$ 290662 472696 552776 369976 335368 338700 133665 93600 100167 21940 21732 166376
11612A66376L8765r3363m159q4967K8982J28811Q2456J4201j92960j99036j5699
$$ 166376 205141 111778 107619 22652 51634 180445 262901 277102 84142 -114894 -130593
11601a30593m7204P6212O0212m9468o7951o6425j63477l2424J21639J30484J15806
$$ -130593 -177797 -101585 -41373 -90841 -158792 -225217 -388694 -421118 -299479 -168995 -53189
11590e3189J60945K03210j410l742O2054P0673j15566n1648l56802k38711m737
$$ -53189 107756 310966 309556 305814 367868 438541 322975 271327 -85475 -324186 -328923
11579c28923O0341j2704J40727p9995k02785k7853n8094K3787J08015j69852j48001
$$ -328923 -268582 -281286 -140559 -220554 -423339 -451192 -509286 -485499 -377484 -547336 -695337
11568f95337J86566K2366O0257Q7660j02731l9788K12055K06712Q3281l6519j00253
$$ -695337 -508771 -486405 -426148 -338488 -441219 -481007 -268952 -62240 21041 -15478 -115731
11557a15731J18231r9927l42231j50274p3022m3235K8106J58872J07072J6056
$$ -115731 2500 -97427 -439658 -589932 -662954 -706189 -678083 -519211 -412139 -396083
11547c96083Q1672J75646J52866K6378j67352M3103N6835k7051j4951J88605J50088
$$ -396083 -314411 -138765 14101 40479 -126873 -83770 -26935 -53986 -68937 119668 269756
11536B69756J45875k1361j99945k73088k62425k42025q6087J42033K16706J90728
$$ 269756 415631 394270 194325 -78763 -341188 -583213 -669300 -527267 -310561 -119833
11526a19833k65748k38755k1234K39633L40752J95424N8369M8315j96929j89649
$$ -119833 -385581 -624336 -645570 -405937 -65185 130239 188608 236923 39994 -149655
11516a49655j6366o98p6900K3710J66972J18246m7844O3378Q1880J48992R982
$$ -149655 -166021 -166719 -243619 -219909 -52937 65309 17465 80843 162723 311715 321697
11505C21697r2365k62108r6470K57629O2994r7312R660J45207q0975j34923Q450
$$ 321697 229332 -32776 -129246 128383 191377 94065 103725 248932 167957 33034 41484
11494D1484j5607K5838l640R5653n8210k6797J75603K15850K06945j35546k97303
$$ 41484 25877 51715 48075 143728 85518 58721 234324 450174 657119 521573 224270
11483B24270j41955j54466j92201N2206k8174k42863j70356r1878J97555J32131
$$ 224270 82315 -72151 -264352 -212146 -240320 -483183 -653539 -745417 -547862 -415731
11473d15731j88515j7216J59839J62003K82393J71181k4268Q3075J93104Q4988
$$ -415731 -604246 -621462 -461623 -299620 -17227 153954 129686 212761 405865 490853
11463D90853l07554l55047k98927j61539N3414N3390J42987n433j10207J3418
$$ 490853 183299 -171748 -470675 -632214 -578800 -525410 -382423 -387856 -498063 -484645
11453d84645O3317J92469K46361K88862k8326k50507j14276k91605j97226J73436
$$ -484645 -421328 -228859 17502 306364 278038 27531 -86745 -378350 -575576 -402140
11443d02140L11988J93370j87107j38885j2388k87752k68336K47380M75885L44965
$$ -402140 -90152 103218 -83889 -222774 -235162 -522914 -791250 -543870 -67985 276980
11433B76980P4960L0131k43946k62392k9574J03389J86384j55285j99664M6711
$$ 276980 351940 382071 138125 -124267 -153841 -50452 135932 -19353 -219017 -172306
11423a72306P0252n6766l1075J2011q165K17958K06781M2810L9814j37089k79853
$$ -172306 -102054 -158820 -189895 -177884 -186049 31909 238690 281500 321314 184225 -95628
11412i5628q8513J20941J71236k9175r8628r6000O7320J08178K734K636L4917
$$ -95628 -184141 -63200 108036 78861 -19767 -115767 -48447 59731 62465 65101 100018
11401A00018o9728l5090l099l851N1486o4858l8182q0043k18695j84031k3301
$$ 100018 30290 -4800 -7899 -11750 39736 -25122 -63304 -143347 -362042 -546073 -569374
11390e69374Q4517R6877R467R2806j47L0978O4371J6488M751J02430l3507n0610
$$ -569374 -484857 -387980 -378513 -285707 -285854 -254876 -190505 -174017 -169266 -66836 -100343 -150953
11378a50953p0938q3519J69227R2944p6619k04498l4760J91303J37373j0757j54322
$$ -150953 -221891 -305410 -136183 -43239 -119858 -324356 -359116 -167813 -30440 -41197 -195519
11367a95519p7151Q0344O7771J19359K3870p1308j9041R1538K45456J92822o3846
$$ -195519 -272670 -192326 -124555 -5196 18674 -52634 -71675 19863 265319 458141 394295
11356C94295j27532k15652j31004r8748j3965q5819k14269r7563J61412J42355
$$ 394295 266763 51111 -79893 -178641 -192606 -278425 -492694 -590257 -428845 -286490
11346b86490O3647j95237k63665q0268J6454M825J08569M62050L49921l5379j75011
$$ -286490 -222843 -418080 -681745 -762013 -745559 -740734 -632165 -170115 179806 144427 -30584
11335c0584j63045j65626k238Q5915J31120p1309q9825J03015J47166j75095k76046
$$ -30584 -193629 -359255 -361493 -275578 -144458 -215767 -305592 -202577 -55411 -230506 -506552
11324e06552J85940J69740N2270J87556J97862k5867j04669L5838L1050m6150
$$ -506552 -320612 -150872 -98602 88954 286816 260949 156280 192118 223168 177018
11314A77018M2182n4302m8406L201k7879q9898j70101M9469J85745J31110J27490
$$ 177018 219200 164898 116492 119693 91814 1916 -168185 -118716 67029 198139 325629
11303C25629p5827k07723q8898M1006k1086k5240J09742J86378l5926j48714j44868
$$ 325629 249802 42079 -46819 -5813 -26899 -52139 57603 243981 208055 59341 -85527
11292h5527o0383P7033J23758J31940J48178J83214p5840l69586k43403J44222
$$ -85527 -145910 -68877 54881 186821 334999 518213 442373 72787 -170616 -26394
11282b6394K45802J87150J28870o0802k00276j89157j29852J65295K39485J7331
$$ -26394 219408 406558 535428 474626 274350 85193 -44659 120636 360121 377452
11272C77452l04925j97585n0800k21636k04355j00624P253J0975K02870R9046
$$ 377452 72527 -125058 -175858 -397494 -601849 -702473 -695220 -684245 -481375 -382329
11262c82329J13297p9322j24802K33185K14775K9661O083J6642r1326n4304l0356
$$ -382329 -269032 -348354 -473156 -239971 -25196 4465 10548 27190 -64136 -118440 -148796
11251a48796L4874K1001l6915k51431l2581K06581J57520L7722j08216M4946K02570
$$ -148796 -113922 -92921 -129836 -381267 -413848 -207267 -49747 -12025 -120241 -75295 127275
11240A27275J53576p297k45981j40137J878P708n6326R3816O3252J8666J4803
$$ 127275 280851 273554 27573 -112564 -110686 -102978 -159304 -65488 -2236 16430 31233
11229C1233O3069J70359r4552o6794K32276J60372M7081j8660k1939j42670j09779
$$ 31233 94302 264661 170109 103315 335591 495963 543044 524384 502445 359775 249996
11218B49996p9820j90514k05343j0562q022l1937R9053R4785N3316Q9375J49J2398
$$ 249996 170176 -20338 -225681 -236243 -244265 -276202 -177149 -82364 -29048 60327 60476 72874
11206G2874j1776j74877j40406J3993J61974p2923J00153J11296J07368J03294
$$ 72874 61098 -113779 -254185 -240192 -78218 -151141 -50988 60308 167676 270970
11196B70970m7904k85760l70106Q666L07249K19699K19669J84706j34999j37771
$$ 270970 223066 -62694 -432800 -424134 -116885 102814 322483 507189 372190 234419
11186B34419K08242L31483L21953L69949N69530P08531O92732P22643K63017n30838
$$ 234419 442661 774144 1096097 1466046 2035576 2744107 3436839 4159482 4422499 3891661
11176C891661q80648p53109n42515m29967l02128k26096r6783p7605p8005m3606
$$ 3891661 3011013 2257904 1715389 1285422 983294 757198 660415 582810 504805 461199
11166D61199k17742k15985k75108j46650J04663J26293l903l5262m63o9193m3669
$$ 461199 243457 27472 -247636 -394286 -289623 -163330 -167233 -202495 -202958 -272151 -315820
11155c15820l9835j87221j33800J30462K8300L9856J08500O9905K08881J69215
$$ -315820 -355655 -542876 -676676 -546214 -517914 -478058 -369558 -299653 -90772 78443
11145G8443k2501k10962j02452R1886K17559J13567m2114M5155J19002J15297
$$ 78443 55942 -155020 -257472 -165586 51973 165540 123426 168581 287583 402880
11135D02880R0721Q764j60775J7940L3796r6826q3882P6671l0014j06978J15776
$$ 402880 493601 502365 341590 359530 393326 296500 212618 289289 259275 152297 268073
11124B68073K25462P8248j19048k29469k16669l06932j80571p0574J04509J65206
$$ 268073 493535 571783 452735 223266 6597 -300335 -480906 -551480 -446971 -281765
11114b81765K6414K13644J98951k33222k71566J05705R558j48749k35009o036
$$ -281765 -255351 -41707 157244 -75978 -347544 -241839 -232281 -381030 -616039 -622075
11104f22075K07322K2618J5105Q0077J5508l0876N7570j2404k06051o4479K1127
$$ -622075 -414753 -392135 -377030 -296953 -281445 -312321 -254751 -267155 -473206 -537685 -516558
11093e16558P0330O9698Q0320N7738L2636K2327K6026O163J69328J20882j62922
$$ -516558 -446228 -376530 -296210 -238472 -205836 -183509 -157483 -151320 18008 138890 -24032
11082b4032j88833J85149J29659k00119j06087p25J77600J54544M0519j23390
$$ -24032 -212865 -27716 101943 -98176 -204263 -204988 -27388 127156 167675 44285
11072D4285k46677j98183j92916M568L20934L00352J51539j07266Q9811J54554
$$ 44285 -202392 -400575 -593491 -588923 -267989 32363 183902 76636 166447 321001
11062C21001k0514j88932j14919N0832O3702J90537J83693J29278O3606j50576
$$ 321001 300487 111555 -3364 47468 111170 301707 485400 614678 678284 527708
11052E27708l26266j40930j30593j97277J193n382J8411J19491j31276J8672K20269
$$ 527708 201442 60512 -70081 -267358 -266165 -271547 -253136 -133645 -264921 -246249 -25980
11041b5980M5216j37892n5305r8333l5479Q1535l5829l6572J31862n2934q157
$$ -25980 19236 -118656 -173961 -272294 -307773 -226238 -262067 -298639 -166777 -219711 -227868
11030b27868N1298p5063k2299J17757J20521j99796k79558m6307K47509M31894
$$ -227868 -176570 -251633 -273932 -156175 -35654 -235450 -515008 -561315 -313806 118088
11020A18088K05698j74445k28894k53491m6761J65404J89803M727j61257p8069
$$ 118088 323786 149341 -79553 -333044 -379805 -214401 -24598 -19871 -181128 -259197
11010b59197k7131N0922K03540L46791J46054o2281k12325l49896k85919M412
$$ -259197 -286328 -235406 -31866 314925 460979 398698 186373 -163523 -449442 -445030
11000d45030K32949J4497j02857j2957L8255O1579J24808J17533J06522L1595
$$ -445030 -212081 -197584 -300441 -313398 -275143 -213564 -88756 28777 135299 166894
10990A66894l03444j22455J83811J47797r003r9883M5064K22854j56487k88628
$$ 166894 -136550 -259005 -75194 72603 63600 -36283 8781 231635 75148 -213480
10980b13480o0773O2931M9579o4818r4702J57899L07984O1007j36424j6056k2885
$$ -213480 -274253 -211322 -161743 -226561 -321263 -163364 144620 205627 69203 53147 30262
10969C0262K4791P328j49638R9930P3583k23621n7877J75085K16922J51790k8695
$$ 30262 55053 62381 -87257 12673 86256 -137365 -195242 -20157 196765 348555 319860
10958C19860m7514k31001j35692j5N0592r509k3970l053j1031J70921O8237L2740
$$ 319860 272346 41345 -94347 -94362 -43770 -53279 -77249 -80302 -91333 79588 147825 180565
10946A80565L9757n3919m1808M0092l8293p7700j19020j75525J0124R6097r4490
$$ 180565 220322 166403 124595 164687 126394 48694 -70326 -245851 -235727 -139630 -234120
10935b34120j68519q6557k7749k2273J20767K64987J44125r127m6621J42823L43742
$$ -234120 -402639 -489196 -516945 -539218 -418451 -153464 -9339 -18466 -65087 77736 421478
10924D21478o1407k41324j39422k52815K3678K10855L06414K17483q5651j98928
$$ 421478 360071 118747 -20675 -273490 -249812 -38957 267457 484940 399289 200361
10914B00361l24661p812J99296N2124l3156K0093j12941l47916j42329J40057
$$ 200361 -124300 -132112 67184 119308 86152 106245 -6696 -354612 -496941 -356884
10904c56884K7402q5137K98639M66594K03824j15937j79527j17181J34861J33581
$$ -356884 -329482 -414619 -115980 350614 554438 438501 258974 141793 276654 410235
10894D10235M6129J91408o8747k87650j96182j74013q1161J69243O0114K4297
$$ 410235 456364 647772 579025 291375 95193 -78820 -159981 9262 69376 93673
10884I3673K31993L2494j53234J41J27070J01646j67838j54011n0202O7792q469
$$ 93673 325666 358160 204926 205067 332137 433783 265945 111934 61732 129524 121055
10873A21055j05808j86993l53312k71467k6523O4800O8775N228Q452K73830J90659
$$ 121055 15247 -171746 -525058 -796525 -823048 -758248 -689473 -684245 -675793 -401963 -211304
10862b11304N1177Q5895N2781K2531N5418J7456q5653r7684p424J17402N0550
$$ -211304 -160127 -74232 -21451 1080 56498 73954 -11699 -109383 -116807 595 51145
10851E1145j64506j0956K8017K5892n9105j47004r4223l7565K74862M25453q596
$$ 51145 -113361 -124317 -96300 -70408 -129513 -276517 -370740 -408305 -133443 292010 283414
10840B83414j63524k00036j22414q5943k8974n157R0832K0788j3392o7796j27107
$$ 283414 119890 -80146 -202560 -288503 -317477 -322634 -231802 -211014 -224406 -292202 -419309
10829d19309J53542R4180J99021j13562k64067P9222J852j353J3461n4822L0638
$$ -419309 -265767 -171587 27434 -86128 -350195 -270973 -269121 -270474 -257013 -311835 -281197
10818b81197J21687L24231J03930j61374q2260O948J9364l6352j0018K9261n7903
$$ -281197 -159510 164721 268651 107277 25017 31965 51329 14977 4959 34220 -23683
10807b3683k8844J10313R1342j01797l57427j49282j8130M9461L04893J76459
$$ -23683 -52527 57786 149128 47331 -310096 -459378 -477508 -428047 -123154 53305
10797E3305j08456r5283J13261J70619j57012k63814o7743J30961k0598q0821
$$ 53305 -55151 -150434 -37173 133446 -23566 -287380 -355123 -224162 -244760 -325581
10787c25581N1506L7460J59111K02070k38982k39854j19399o2985K0794N2534
$$ -325581 -274075 -236615 -77504 124566 -114416 -354270 -473669 -536654 -515860 -463326
10777d63326J67499J68242J43588m7364j19892p0855Q0190J88284J07253j64633
$$ -463326 -295827 -127585 16003 -31361 -151253 -222108 -141918 46366 153619 -11014
10767a1014j96222o4179J01077J88595q264p4313P0740J23947M6990r736O8507
$$ -11014 -207236 -271415 -170338 18257 9993 -64320 6420 130367 177357 167621 236128
10756B36128L1078j54024j35594k6632J38619J76281J06847N5133l0552j74813
$$ 236128 267206 113182 -22412 -49044 89575 265856 372703 427836 397284 222471
10746B22471j34341n6269K45270K47247p0871j29953j26460j02251N3612k1352
$$ 222471 88130 31861 277131 524378 453507 323554 197094 94843 148455 127103
10736A27103l0188R8458j1635J2102R4050P8814K3308j42032k6473q0630l30893
$$ 127103 96915 195373 183738 195840 289890 368704 392012 249980 223507 142877 -188016
10725a88016m10594j75651J06445J29756P4274J53218J64833m2139J1854O4526
$$ -188016 -598610 -774261 -667816 -538060 -463786 -310568 -145735 -187874 -176020 -111494
10715a11494L5321O8177J34388n6168j31959j47260j10942n4946J84249J76962
$$ -111494 -76173 -7996 126392 70224 -61735 -208995 -319937 -374883 -190634 -13672
10705a3672K7867R5514K28930R7823k01384k53272o7761J44877R3611k5158N3439
$$ -13672 14195 109709 338639 436462 235078 -18194 -85955 58922 152533 127375 180814
10694A80814K37418K12375J15828m7555k82114l10226p7055P104q8532o8845j14322
$$ 180814 418232 630607 746435 698880 416766 106540 29485 36589 -51943 -120788 -235110
10683b35110k54389k5473K08071P5910L9125J19190L48748K58272j10751k32018
$$ -235110 -489499 -514972 -306901 -230991 -191866 -72676 276072 534344 423593 191575
10673A91575k21789R500K80591n0017k27056r0717m4678j50108n1542p9415j34895
$$ 191575 -30214 -20714 259877 209860 -17196 -107913 -152591 -302699 -354241 -433656 -568551
10662e68551O6715J62122K15538J71428k2982j37401m4293o4613n2199P9696J16278
$$ -568551 -501836 -339714 -124176 47252 24270 -113131 -157424 -222037 -274236 -194540 -78262
10651g8262K2178k10792k16432n7410J49335J58653J93890K22001o5575k19525
$$ -78262 -56084 -266876 -483308 -540718 -391383 -232730 -38840 183161 117586 -101939
10641a01939j54447J40232P0020o7039l8247j34015r6938j6004J72935K40059
$$ -101939 -256386 -116154 -46134 -113173 -151420 -285435 -382373 -398377 -225442 14617
10631A4617j7864j68955k76157J33002L94900Q5617j00036p3554l2450j22794
$$ 14617 -3247 -172202 -448359 -315357 79543 165160 65124 -8430 -40880 -163674
10621a63674M6508Q0213K6194J1581q1112j04042J49705K13155J16922K2215k51660
$$ -163674 -117166 -36953 -10759 822 -80290 -184332 -34627 178528 295450 317665 66005
10610F6005j64956J69208J30992k24981p787J44096P7063o8055k31455r1016k835
$$ 66005 -98951 70257 201249 -23732 -31519 112577 189640 121585 -109870 -200886 -203721
10599b03721k3919o527m3997n260J36194K68970J45327j44940j88164k49611M0996
$$ -203721 -227640 -234167 -278164 -283424 -147230 121740 267067 122127 -66037 -315648 -274652
10588b74652J32108j4264M367m7859L211J39308m3424j29564j53064q0968J85388
$$ -274652 -142544 -156808 -152441 -200300 -197089 -57781 -101205 -230769 -383833 -464801 -279413
10577b79413K53760K24581n3349l50025j00613L1062O9401J21208K654J62525
$$ -279413 -25653 198928 145579 -204446 -305059 -273997 -204596 -83388 -80734 81791
10567H1791J566q0388j1575J38051R8555J47249R0643j12696j47511j83813j31642
$$ 81791 83357 2969 -8606 129445 228000 375249 465892 353196 205685 21872 -109770
10556a09770N1311j82210k11266J63513J45432N5754K09231L11957J36260j15313
$$ -109770 -58459 -240669 -451935 -288422 -142990 -87236 121995 433952 570212 454899
10546D54899J62413K7471j41517j16461j73889j12976j79435k17300k36505P4078
$$ 454899 617312 644783 503266 386805 212916 99940 -79495 -296795 -533300 -459222
10536d59222J53667o196j7807J08015J81159M5650j29854r7983K04465J48510
$$ -459222 -305555 -311751 -329558 -221543 -40384 5266 -124588 -222571 -18106 130404
10526A30404k33351k58587M6938J29055j52811l24230l9240J89339K68286P3780
$$ 130404 -102947 -361534 -314596 -185541 -338352 -662582 -701822 -512483 -244197 -170417
10516a70417p3509L8652l9544K0200N9598k676Q4931L5208j31958j74379o5272
$$ -170417 -243926 -205274 -244818 -224618 -165020 -167696 -82765 -47557 -179515 -353894 -419166
10505d19166m6264J96297J71905k6396K9101J2627J0065j51083j47003J11460
$$ -419166 -465430 -269133 -97228 -123624 -94523 -81896 -71831 -222914 -369917 -258457
10495b58457L16145J01798J1029r6542q0371m5601j8979J08743n9396p8467M3872
$$ -258457 57688 159486 170515 73973 -6398 -51999 -70978 37765 -21631 -100098 -56226
10484e6226K0223M6798R8661N2479j79717j22795p80k2052j04340q5282M0651
$$ -56226 -36003 10795 109456 161935 -17782 -140577 -141357 -163409 -267749 -353031 -312380
10473c12380J93375J48145K1518l4177M5407J35474K09525O9372j24007j92951
$$ -312380 -119005 29140 50658 16481 61888 197362 406887 476259 352252 159301
10463A59301k68334l14808k25157n642K50293J89676m6243j88273k09251q4720
$$ 159301 -109033 -423841 -648998 -654640 -404347 -214671 -260914 -449187 -658438 -743158
10453g43158J50045K13000J59942L2072o8207J745J08011J06759J15228j5181
$$ -743158 -593113 -380113 -220171 -188099 -256306 -254561 -146550 -39791 75437 60256
10443F0256k96893j45120K19779J44056m4631p7751j41598o6273J89700J98370
$$ 60256 -236637 -381757 -161978 -17922 -62553 -140304 -281902 -348175 -158475 39895
10433C9895n7696k27738j23602N2275P9160J46029J21092l4591j22891q7547p0187
$$ 39895 -17801 -245539 -369141 -316866 -237706 -91677 29415 -5176 -128067 -215614 -285801
10422b85801r6559L1821N6443j5703L7536N1362j03490J645o6770j90558j32181
$$ -285801 -382360 -350539 -294096 -309799 -272263 -220901 -324391 -322746 -389516 -580074 -712255
10411g12255j113J53130J91913K79803J77409J20651p5034o4731J4499O9968J10080
$$ -712255 -713368 -560238 -368325 -88522 88887 209538 134504 69773 84272 154240 264320
10400B64320j52692j77431j66228m3748m6075m4959K26899K38761L23783J81665
$$ 264320 111628 -65803 -232031 -275779 -321854 -366813 -139914 98847 422630 604295
10390F04295j29238k20953j94233j84743q3027J63560K06844L1367k10762o2088
$$ 604295 475057 254104 59871 -124872 -207899 -44339 162505 193872 -16890 -78978
10380g8978o422J7305K73113J00850k34012k16171K09863K56670L5388q6567j09145
$$ -78978 -85400 -68095 205018 305868 71856 -144315 65548 322218 357606 271039 161894
10369A61894Q170q0101m6869O6684K45735J84475j93222l37340q2016j0051m8397
$$ 161894 170064 89963 43094 109778 355513 539988 346766 9426 -72590 -82641 -131038
10358a31038K0294R2925J54944p834k16819j09599l6848n2879Q2573n510r9255
$$ -131038 -110744 -17819 137125 129291 -87528 -197127 -233975 -286854 -204281 -209791 -309046
10347c09046l2538Q0637J81040K12128J40466o8147j45436j62887j6711R557L9042
$$ -309046 -341584 -260947 -79907 132221 272687 204540 59104 -103783 -120494 -110937 -71895
10336g1895Q5351r1572k09063k03710L3884o766N4339L57434N21378K44242j20907
$$ -71895 13456 -78116 -287179 -490889 -457005 -463771 -409432 -51998 469380 713622 592715
10325E92715k66972j80378j40829j8641J14850L3224r8149p4312m8731r0359J15061
$$ 592715 325743 145365 4536 -14105 100745 133969 35820 -38492 -87223 -177582 -62521
10314f2521K66832J37701j291k60848k18243j17945l0130M9680p9336k8987K58625
$$ -62521 204311 342012 340721 79873 -138370 -256315 -286445 -236765 -316101 -345088 -86463
10303h6463L10114j19170l54586j87130N3870K8673n2457L7898J01467K20006
$$ -86463 223651 104481 -250105 -437235 -383365 -354692 -407149 -369251 -267784 -47778
10293d7778M8930k93129k39545O8675K89966J30130J74930L37709K54157j00622
$$ -47778 1152 -291977 -531522 -462847 -172881 -42751 132179 469888 724045 623423
10283F23423j76664k68829k95940k13473k49376j53659K52006L63374R8642Q4803
$$ 623423 446759 177930 -118010 -331483 -580859 -734518 -482512 -119138 -20496 64307
10273F4307R4670q9991p0371m9291O1415j10825j60522L5989k7111o9886L6195
$$ 64307 158977 68986 -1385 -50676 10739 -100086 -260608 -224619 -251730 -321616 -285421
10262b85421J04941o277L1376J39074J04794N8430k207k5745J8373j33793m2667
$$ -285421 -180480 -186757 -155381 -16307 88487 146917 144710 118965 137338 3545 -39122
10251c9122L527l8416Q90r9849o6491j48916j75530J01687Q6808n6812N943L03510
$$ -39122 -35595 -74011 -73121 -172970 -239461 -388377 -563907 -462220 -375412 -432224 -426281 -122771
10239a22771K12319l1375O2438N5881j30971m6526L2014j03908j34102n3681k10787
$$ -122771 89548 58173 120611 176492 45521 -1005 31009 -72899 -207001 -260682 -471469
10228d71469q6216J70467K8414j08817J19300K06663j018q8348j43190p5669K971
$$ -471469 -557685 -387218 -358804 -467621 -348321 -141658 -142676 -231024 -374214 -449883 -446912
10217d46912j04881M1370L8208m102n8457l6839J42865J31384j36923k19668j44329
$$ -446912 -551793 -510423 -472215 -476317 -534774 -571613 -428748 -297364 -434287 -653955 -798284
10206g98284M6596K51378L20845J32627k3231J13737n1352k35406m558Q9020M4073
$$ -798284 -751688 -500310 -179465 -46838 -70069 43668 -7684 -243090 -247648 -158628 -114555
10195a14555P863o9183r3035K7366L4153J34100m7435k70232l0640J88408j16962
$$ -114555 -106692 -175875 -268910 -241544 -207391 -73291 -120726 -390958 -421598 -233190 -350152
10184c50152M0435K1453j20640J0835p9332o9581J54357K18419J38381J81922
$$ -350152 -309717 -288264 -408904 -398069 -477401 -546982 -392625 -174206 -35825 146097
10174A46097J59823n1758l02529k12780J45697J69499k4574q1167o8688m1021
$$ 146097 305920 254162 -48367 -261147 -115450 54049 29475 -51692 -120380 -161401
10164a61401J6034o4680R460J18271L5234P4861Q0624k9892k35667j26782n7290
$$ -161401 -145367 -210047 -200587 -82316 -47082 27779 108403 78511 -157156 -283938 -341228
10153c41228r104M8855J99232K39330J78896O8570j34971j82778j85148j97485
$$ -341228 -350332 -301477 -102245 137085 315981 384551 249580 66802 -118346 -315831
10143c15831j08196l0225j00027l8188J95873L39198J75234r2927j96415j73257
$$ -315831 -424027 -454252 -554279 -592467 -396594 -57396 117838 24911 -171504 -344761
10133c44761j15972m7710n6033q6142L06649L46701K8513k68648j56378r4269
$$ -344761 -460733 -508443 -564476 -650618 -343969 2732 31245 -237403 -393781 -488050
10123d88050q5115k8006N791L62269L10387P8869j22588j76073o0075K5386m1794
$$ -488050 -573165 -601171 -595380 -233111 77276 156145 33557 -142516 -202591 -177205 -218999
10112b18999N6401M5421j3986J63986N7022j04333M4361l5416j9494N5306Q8449
$$ -218999 -162598 -117177 -131163 32823 89845 -14488 29873 -5543 -25037 30269 118718
10101A18718o6121j66025k0582K2147P0918P1384J3095k0604o7662m3501L9279
$$ 118718 52597 -113428 -134010 -111863 -40945 30439 43534 22930 -44732 -88233 -48954
10090d8954J50349K51420j7752l01928j25140M7843K211q6841m6957m0501J6571
$$ -48954 101395 352815 335063 33135 -92005 -44162 -41951 -128792 -175749 -216250 -199679
10079a99679J45049j0407j88670K6369O7248J19870K27820p8227k551l5186j85153
$$ -199679 -54630 -65037 -253707 -227338 -160090 -40220 187600 109373 106822 71636 -113517
10068a13517j07034j4447J6356J67650J41357J87782K0891k13883k33369L4776
$$ -113517 -220551 -234998 -218642 -50992 90365 278147 299038 85155 -148214 -113438
10058a13438J46246P2154j15737l06888j91620O6131K3852k0874J86551j3309
$$ -113438 32808 104962 -10775 -317663 -509283 -443152 -419300 -440174 -253623 -266932
10048b66932l46971l3911K28497J55213J53456N6788R3796Q5930m3887k4594N369
$$ -266932 -613903 -647814 -419317 -264104 -110648 -53860 39936 125866 81979 57385 62754
10037F2754J6352K040m090O8665j9265J835O51M0964J34576j64581j18734P5438
$$ 62754 79106 81146 77056 145721 126456 128291 128942 169906 304482 139901 21167 96605
10025I6605J04033m3320j25677L3286M4170r74r0403q7932j37142j81471j6208
$$ 96605 200638 157318 31641 64927 109097 108123 17720 -70212 -207354 -388825 -405033
10014d05033J92093K80681M3419n5617L8062J83179Q8388n4077j13274R3173J54825
$$ -405033 -212940 67741 111160 55543 93605 276784 365172 311095 197821 290994 445819
10003D45819n5405j18978k02925j10448Q0973J00341P3766P2171J16983j80259
$$ 445819 390414 271436 68511 -41937 39036 139377 213143 285314 402297 222038
9993B22038j26599K0883j02869j48648j18727Q989j03409o6836l6229r5174j4780
$$ 222038 95439 116322 13453 -135195 -253922 -244933 -348342 -415178 -451407 -546581 -561361
9982e61361J74863J80801K95310J13874k11190R3809K05336K46027n3299k03333
$$ -561361 -386498 -205697 89613 203487 -7703 86106 291442 537469 484170 280837
9972B80837k32175l04192j38054J71585J61349j16589L5279K2897n8924l8007
$$ 280837 48662 -255530 -393584 -221999 -60650 -177239 -141960 -119063 -177987 -215994
9962b15994q9310j1838q057k18804j11666J23069J10019J94750K20615J48380
$$ -215994 -305304 -317142 -325199 -544003 -655669 -532600 -422581 -227831 -7216 141164
9952A41164J05928n5771l9958k6600l4848O5085k1759J0918K6611Q3257n4132
$$ 141164 247092 191321 151363 124763 89915 155000 133241 144159 170770 254027 199895
9941A99895j08655J0098K08350M14524k0965j97754r3609K9084q4732K0961J03113
$$ 199895 91240 101338 309688 724212 703247 505493 411884 440968 356236 377197 480310
9930D80310j42950k08614j24694r9222j39561L4524J62641o9411k76288j37826
$$ 480310 337360 128746 4052 -95170 -234731 -200207 -37566 -106977 -383265 -521091
9920e21091K65565L4442k50224j98404M9380J84650K05169J10938k8002J7095
$$ -521091 -255526 -221084 -471308 -669712 -620332 -435682 -230513 -119575 -147577 -130482
9910a30482q8289j96039J9702K07555M1127L6134J78989q4536k81145p0039J40648
$$ -130482 -218771 -414810 -395108 -187553 -146426 -110292 68697 -15839 -296984 -367023 -226375
$$ [...]
##END NTUPLES=NMR SPECTRUM
##END=
