##TITLE=C13_SR8_r2_TFA
 CDCl3, 21200 sc

 29.10.2020
##JCAMPDX= 6.0         $$ Bruker NMR JCAMP-DX V2.0
##DATA TYPE= NMR SPECTRUM
##DATA CLASS= NTUPLES
##ORIGIN= UXNMR, Bruker Analytische Messtechnik GmbH
##OWNER= root
$$ XWIN-NMR		Version 3.5
$$ Fri Oct 30 09:55:35 2020 Russian Standard Time (UT+4h)  she@DPX200
##.OBSERVE FREQUENCY= 50.327896
##.OBSERVE NUCLEUS= ^13C
##.ACQUISITION MODE= SIMULTANEOUS
##.ACQUISITION SCHEME= undefined
##.AVERAGES= 21200
##.DIGITISER RES= 17
##SPECTROMETER/DATA SYSTEM= spect
##.PULSE SEQUENCE= zgpg30
##.SOLVENT NAME= CDCl3
##.SHIFT REFERENCE= (INTERNAL, CDCl3, 0, 222.661)
##AUDIT TRAIL= $$ (NUMBER, WHEN, WHO, WHERE, WHAT)
$$ ##TITLE= Audit trail, XWIN-NMR		Version 3.5
$$ ##JCAMPDX= 5.01
$$ ##ORIGIN= Bruker BioSpin GmbH
$$ ##OWNER= she
$$ F:/spectra/data/she/nmr/c13/1/pdata/1/auditp.txt
$$ ##AUDIT TRAIL=  $$ (NUMBER, WHEN, WHO, WHERE, WHAT)
(   1,<2020-10-30 09:53:35.06 +0400>,<she>,<DPX200>,
      <created by zg, POWCHK disabled, PULCHK disabled
       terminated by command 'halt'
       configuration hash MD5:
       00 E9 B6 7A A2 85 ED C7 34 08 36 98 17 FE 4E 26
       data hash MD5: 32K
       BA 6E 82 03 4A C1 89 81 0B 63 F8 EF E8 C2 D3 08>)
(   2,<2020-10-30 09:53:59.00 +0400>,<she>,<DPX200>,
      <Start of raw data processing
       efp BC_mod = 2 LB = 1 FT_mod = 6 PKNL = 1 PHC0 = -226.1819 PHC1 = 18.36241 SI = 32K 
       data hash MD5: 32K
       42 8E 40 C6 A3 7D E3 D0 D8 08 69 D6 10 FC D5 C2>)
(   3,<2020-10-30 09:54:02.85 +0400>,<she>,<DPX200>,
      <abs ABSG = 5 
       data hash MD5: 32K
       CC A1 1B 7E 39 6A 03 4E B3 98 93 07 F0 11 5C 26>)
(   4,<2020-10-30 09:54:47.62 +0400>,<she>,<DPX200>,
      <pk PHC0 = -1.94484 PHC1 = 8.200001 
       data hash MD5: 32K
       E3 C4 9B 46 85 2E 9F 60 DF B7 E7 70 08 68 6D 2A>)
(   5,<2020-10-30 09:54:50.96 +0400>,<she>,<DPX200>,
      <abs ABSG = 5 
       data hash MD5: 32K
       94 F7 E9 6B E6 EE 4F 6C B7 86 F0 F3 DB 3F 73 50>)
$$ ##END=
$$ 
$$ hash MD5
$$ 9A 3E F5 BF D4 16 A1 C1 B8 07 33 4B 00 8B D0 ED
##$RELAX= 
##$RELAX= 
##$RELAX= 
##$RELAX= 
##$RELAX= 
##$RELAX= 
##$RELAX= 
##$RELAX= 
$$ Bruker specific parameters
$$ --------------------------
##$DU= <F:/spectra>
##$EXPNO= 1
##$NAME= <c13>
##$PROCNO= 1
##$TYPE= <nmr>
##$USER= <she>
##$AMP= (0..31)
100 100 100 100 100 100 100 100 100 100 100 100 100 100 100 100 100 100 
100 100 100 100 100 100 100 100 100 100 100 100 100 100 
##$AQSEQ= 0
##$AQ_mod= 1
##$AUNM= <au_zg>
##$AUTOPOS= <>
##$BF1= 50.322709
##$BF2= 200.13
##$BF3= 50.322709
##$BF4= 500.13
##$BF5= 500.13
##$BF6= 500.13
##$BF7= 500.13
##$BF8= 500.13
##$BYTORDA= 1
##$CFDGTYP= 0
##$CFRGTYP= 5
##$CHEMSTR= <none>
##$CNST= (0..31)
1 1 145 1 1 1 1 1 1 1 1 1 1 1 1 1 1 1 1 1 1 1 1 1 1 1 1 1 1 1 1 1 
##$CPDPRG= <waltz16>
##$CPDPRG1= <>
##$CPDPRG2= <waltz16>
##$CPDPRG3= <>
##$CPDPRG4= <mlev>
##$CPDPRG5= <mlev>
##$CPDPRG6= <mlev>
##$CPDPRG7= <mlev>
##$CPDPRG8= <mlev>
##$CPDPRGB= <>
##$CPDPRGT= <>
##$D= (0..31)
$$ [...]
##$SUBNAM4= <"">
##$SUBNAM5= <"">
##$SUBNAM6= <"">
##$SUBNAM7= <"">
##$SUBNAM8= <"">
##$SUBNAM9= <"">
##$SW= 239.972175391363
##$SWIBOX= (0..15)
0 1 3 0 0 0 0 0 0 0 0 0 0 0 0 0 
##$SW_h= 12077.2946859903
##$TD= 32768
##$TD0= 1
##$TE= 0
##$TE2= 300
##$TE3= 300
##$TEG= 300
##$TL= (0..7)
120 120 120 120 120 120 120 120 
##$TP= (0..7)
150 150 150 150 150 150 150 150 
##$TP07= 0
##$TPNAME0= <>
##$TPNAME1= <>
##$TPNAME2= <>
##$TPNAME3= <>
##$TPNAME4= <>
##$TPNAME5= <>
##$TPNAME6= <>
##$TPNAME7= <>
##$TPOAL= (0..7)
0.5 0.5 0.5 0.5 0.5 0.5 0.5 0.5 
##$TPOFFS= (0..7)
0 0 0 0 0 0 0 0 
##$TUNHIN= 0
##$TUNHOUT= 0
##$TUNXOUT= 0
##$USERA1= <user>
##$USERA2= <user>
##$USERA3= <user>
##$USERA4= <user>
##$USERA5= <user>
##$V9= 5
##$VALIST= <valist>
##$VCLIST= <CCCCCCCCCCCCCCC>
##$VD= 0
##$VDLIST= <DDDDDDDDDDDDDDD>
##$VPLIST= <PPPPPPPPPPPPPPP>
##$VTLIST= <TTTTTTTTTTTTTTT>
##$WBST= 1024
##$WBSW= 4
##$XGAIN= (0..3)
0 0 0 0 
##$XL= 0
##$YL= 0
##$YMAX_a= 88423641
##$YMIN_a= -134826387
##$ZGOPTNS= <>
##$ZL1= 120
##$ZL2= 120
##$ZL3= 120
##$ZL4= 120
##$ABSF1= 222.6606
##$ABSF2= -17.33621
##$ABSG= 5
##$ABSL= 3
##$ALPHA= 0
##$AQORDER= 0
##$ASSFAC= 0
##$ASSFACI= 0
##$ASSFACX= 0
##$ASSWID= 0
##$AUNMP= <proc_1d>
##$AZFE= 0.1
##$AZFW= 0.5
##$BCFW= 0
##$BC_mod= 2
##$BYTORDP= 0
##$COROFFS= 0
##$CY= -3
##$DATMOD= 1
##$DC= 0
##$DFILT= <>
##$DTYPP= 0
##$F1P= 0
##$F2P= 0
##$FCOR= 0.5
##$FTSIZE= 32768
##$FT_mod= 6
##$GAMMA= 0
##$GB= 0
##$INTBC= 1
##$INTSCL= 4.134877e-10
##$ISEN= 128
##$LB= 1
##$LEV0= 0
##$LPBIN= 0
##$MAXI= 10000
##$MC2= 0
##$MEAN= 0
##$ME_mod= 0
##$MI= 0.1934396
##$NCOEF= 0
##$NC_proc= 2
##$NLEV= 6
##$NOISF1= 120.0001
##$NOISF2= 80.00006
##$NSP= 0
##$NTH_PI= 0
##$NZP= 0
##$OFFSET= 222.6606
##$PC= 1.4
##$PHC0= -228.1267
##$PHC1= 26.56241
##$PH_mod= 1
##$PKNL= yes
##$PPARMOD= 0
##$PSCAL= 0
##$PSIGN= 0
##$REVERSE= no
##$SF= 50.322729756361
##$SI= 32768
##$SIGF1= 140
##$SIGF2= 120
##$SINO= 11.81781
##$SIOLD= 32768
##$SREGLST= <13C.CDCl3>
##$SSB= 0
##$STSI= 32768
##$STSR= 0
##$SW_p= 12077.2946859903
##$SYMM= 0
##$S_DEV= 0
##$TDeff= 32768
##$TDoff= 0
##$TI= <>
##$TILT= no
##$TM1= 0
##$TM2= 0
##$TOPLEV= 0
##$USERP1= <user>
##$USERP2= <user>
##$USERP3= <user>
##$USERP4= <user>
##$USERP5= <user>
##$WDW= 1
##$XDIM= 32768
##$YMAX_p= 519243316
##$YMIN_p= -2700835
$$ End of Bruker specific parameters
$$ ---------------------------------
##NTUPLES= NMR SPECTRUM
##VAR_NAME=  FREQUENCY,     SPECTRUM/REAL,   SPECTRUM/IMAG
##SYMBOL=    X,             R,               I
##VAR_TYPE=  INDEPENDENT,   DEPENDENT,       DEPENDENT
##VAR_FORM=  AFFN,          ASDF,            ASDF
##VAR_DIM=   32768,         32768,           32768
##UNITS=     HZ,            ARBITRARY UNITS, ARBITRARY UNITS
##FACTOR=    0.368581032318806, 1,           1
##FIRST=     11204.8891385315, 0,            0
##LAST=      -872.405547458802, 0,           0
##MIN=       -872.405547458802, -2700835,    0
##MAX=       11204.8891385315, 519243316,    0
$$ Real data points
##PAGE= N=1
##DATA TABLE= (X++(R..R)), XYDATA
$$ [...]
$$ plain form
22870 -1061061 -883109 -651417 -350401 -271734 -756289 -1151547 -1046853 -866216 -555263 -280066
22860 -280066 -349109 -395707 -242646 -183122 -251324 -364019 -191734 285130 419839 -46488
22850 -46488 -453702 -686409 -965146 -1142314 -839199 -661834 -518368 -40200 295328 -106647
22840 -106647 -577588 -524735 -120419 239223 247906 -137165 -364940 -533939 -254503 256550
22830 256550 418772 147960 -106123 -289729 -446943 -317747 -120238 -334612 -327935 -26090
22820 -26090 761690 1416188 1201548 756249 26300 -549135 -693425 -601161 -500714 -261295
22810 -261295 -199442 82529 -20353 -200375 230441 564435 400478 319744 487761 306379
22800 306379 -283960 -395431 3646 267442 701955 818331 876560 401411 -334059 -222425
$$ packed form
22870a061061J77952K31692L01016P8667m84555l95258J04694J80637L10953K75197
22860b80066o9043m6598J53061N9524o8202j12695J72285M76864J34709m66327
22850d6488m07214k32707k78737j77168L03115J77365J43466M78168L35528m01975
22840a06647m70941N2853M04316L59642Q683l85071k27775j68999K79436N11053
22830B56550J62222k70812k54083j83606j57214J29196J97509k14374O677L01845
22820b6090P87780O54498k14640m45299p29949n75435j44290R2264J00447K39419
22810b61295O1853K81971j02882j80022M30816L33994j63957q0734J68017j81382
22800C06379n90339j11471L99077K63796M34513J16376N8229m75149p35470J11634
$$ plain form
22790 -222425 93512 313362 140601 -120038 -181871 -460714 -915098 -1127048 -940788 -569662
22780 -569662 -12239 -27312 -171333 53472 202726 379671 384145 202750 26925 -76560
22770 -76560 -42774 24439 -80981 258590 775436 1134541 1252000 1012907 701361 -10551
22760 -10551 -287779 34575 356346 585209 564743 401434 306223 757899 831205 748760
22750 748760 811026 785802 683350 502360 405154 654002 1012497 1039547 816031 461208
22740 461208 671038 565677 -124878 -685438 -302112 27947 324971 350364 268466 646986
22730 646986 1220011 939559 244679 -62305 -328180 -294956 -54593 -52529 -34402 -89879
22720 -89879 -394954 -542021 -514481 -280141 -212171 -658393 -1029957 -724465 -440687 -533827
$$ packed form
22790b22425L15937K19850j72761k60639o1833k78843m54384k11950J86260L71126
22780e69662N57423j5073j44021K24805J49254J76945M474j81395j75825j03485
22770g6560L3786O7213j05420L39571N16846L59105J17459k39093l11546p11912
22760a0551k77228L22354L21771K28863k0466j63309r5211M51676P3306q2445
22750G48760O2266k5224j02452j80990r7206K48848L58495K7050k23516l54823
22740D61208K09830j05361o90555n60560L83326L30059K97024K5393q1898L78520
22730F46986N73025k80452o94880l06984k65875L3224K40363K064J8127n5477
22720h9879l05075j47067K7540K34340O7970m46222l71564L05492K83778r3140
$$ plain form
22710 -533827 -321437 73371 396740 644577 791375 60353 -321683 150106 443488 383916
22700 383916 165831 136923 293921 543019 688003 757035 879367 671826 388449 324857
22690 324857 169229 65761 155723 206478 49634 157207 492419 684283 275376 189496
22680 189496 173038 -258679 -870312 -974267 -478562 36977 344841 289762 74230 -286067
22670 -286067 -315068 -562777 -843213 -552803 -189904 105805 278579 180382 -262805 -670272
22660 -670272 -562542 -567435 -682044 -837354 -1195305 -1453517 -1231566 -776985 -627635 -582609
22650 -582609 -141409 596428 1175745 1349425 1213982 1202476 1239511 1125562 460282 -230663
22640 -230663 12616 511499 200569 -433321 -997381 -1091630 -800670 -242784 -221197 -407343
$$ packed form
22710e33827K12390L94808L23369K47837J46798p31022l82036M71789K93382n9572
22700C83916k18085k8908J56998K49098J44984O9032J22332k07541k83377o3592
22690C24857j55628j03468Q9962N0755j56844J07573L35212J91864m08907q5880
22680A89496j6458m31717o11633j03955M95705N15539L07864n5079k15532l60297
22670b86067k9001k47709k80436K90410L62899K95709J72774r8197m43187m07467
22660f70272J07730m893j14609j55310l57951k58212K21951M54581J49350M5026
22650e82609M41200P37837N79317J73680j35443j1506L7035j13949o65280o90945
22640b30663K43279M98883l10930o33890n64060r4249K90960N57886K1587j86146
$$ plain form
22630 -407343 -148949 -17646 369418 773780 851421 880975 1156075 1265973 1079965 842533
22620 842533 250083 -662843 -914300 -752453 -613591 -279588 119092 593629 733707 624911
22610 624911 417773 265882 -162511 -602107 -684197 -303279 17558 49060 542554 1139065
22600 1139065 1259975 1372242 1243134 906840 873821 773217 588679 563741 468847 262946
22590 262946 -60135 97970 -41221 -332389 -657506 -800042 -831090 -870400 -627684 -203073
22580 -203073 150198 243289 96690 169500 244554 232881 572164 873645 868329 891115 788011
22569 788011 708279 540241 44660 -140569 -84556 304966 782818 977435 1073040 852173
22559 852173 499232 140973 -439955 -670521 -578797 -332340 -40305 259823 284875 -20041
$$ packed form
22630d07343K58394J31303L87064M04362P7641K9554K75100J09898j86008k37432
22620H42533n92450r12926k51457J61847J38862L34003L98680M74537J40078j08796
22610F24911k07138j51891m28393m39596q2090L80918L20837L1502M93494N96511
22600A139065J20910J12267j29108l36294l3019j00604j84538k4938r4894k05901
22590B62946l23081J58105j39191k91168l25117j42536l1048l9310K42716M24611
22580b03073L53271R3091j46599P2810P5054j1673L39283L01481n316K2786j03104
22569G88011p9732j68038m95581j85229N6013L89522M77852J94617R5605k20867
22559H52173l52941l58259n80928k30566R1724K46457K92035L00128K5052l04916
$$ plain form
22549 -20041 268457 816093 971300 1070424 934865 688499 201918 -723496 -1139293 -658691
22539 -658691 -294789 -141368 292689 486772 110788 11947 147519 197810 -194328 -286659
22529 -286659 -141874 -115300 287476 556775 125045 -324324 -511267 -509083 -94690 375498
22519 375498 572733 803903 760927 416677 359543 264783 -60478 -801978 -1176964 -933348
22509 -933348 -645454 32155 406835 -24372 -572935 -849661 -667451 -339836 -315104 -331861
22499 -331861 -325695 -469475 -459838 -356036 -310982 169339 585756 657356 928360 1172352 988886
22488 988886 705835 557068 251227 -671372 -1334863 -1238660 -1009975 -805530 -999406 -964790
22478 -964790 -834163 -793132 -387078 166415 107420 -3173 -30472 -353959 -514222 -546021
$$ packed form
22549b0041K88498N47636J55207R9124j35559k46366m86581r25414m15797M80602
22539f58691L63902J53421M34057J94083l75984r8841J35572N0291l92138r2331
22529b86659J44785K6574M02776K69299m31730m49369j86943K184M14393M70188
22519C75498J97235K31170m2976l44250n7134r4760l25261p41500l74986K43616
22509i33348K87894O77609L74680m31207n48563k76726J82210L27615K4732j6757
22499c31861O166j43780R637J03802M5054M80321M16417P1600K71004K43992j83466
22488I88886k83051j48767l05841r22599o63491R6203K28685K04445j93876L4616
22478i64790J30627M1031M06054N53493n8995j10593k7299l23487j60263l1799
$$ plain form
22468 -546021 -473797 -346747 -258878 -52893 193393 456506 345612 476063 482034 94541
22458 94541 -106847 -217596 -254117 26476 367003 -383716 -1199955 -1293695 -1335600 -1284047
22448 -1284047 -1572365 -1604138 -906080 -302065 -93319 361482 665617 740041 976964 1105868
22438 1105868 1159793 927456 880188 677455 319198 197983 271195 465060 185192 -64841
22428 -64841 -18153 -40321 120110 366475 366856 92912 -223343 -421885 -440753 -243366 -219909
22417 -219909 -331118 -443130 -590715 -556618 -747328 -966499 -602059 -455641 -389747 168414
22407 168414 464487 308720 634172 896123 677888 636374 545678 794088 1341136 1501001
22397 1501001 1173790 763604 503804 473828 161130 -465742 -458826 159254 385997 229060
$$ packed form
22468e46021P2224J27050Q7869K05985K46286K63113j10894J30451N971l87493
22458I4541k01388j10749l6521K80593L40527p50719q16239r3740m1905N1553
22448a284047k88318l1773O98058O04015K08746M54801L04135P4424K36923J28904
22438A105868N3925k32337m7268k02733l58257j21215P3212J93865k79868k50033
22428f4841M6688k2168J60431K46365L81k73944l16255j98542j8868J97387K3457
22417b19909j11209j12012j47585L4097j90710k19171L64440J46418O5894N58161
22407A68414K96073j55767L25452K61951k18235m1514r0696K48410N47048J59865
22397A501001l27211m10186k59800k9976l12698o26872O916O18080K26743j56937
$$ plain form
22387 229060 71296 46121 107916 88761 317297 346819 -249748 -471219 -472651 -417988 -310705
22376 -310705 -152174 461021 691983 555571 288106 211743 355142 191155 236541 536121
22366 536121 479018 387659 531248 569899 202826 -135992 -336287 -603946 -1066447 -1358674
22356 -1358674 -1092145 -787964 -799356 -824465 -670323 -195291 -206278 -230539 362274 1043874
22346 1043874 1697615 1825039 1179252 574677 867037 1293356 1422071 1192988 536842
22337 536842 391419 560463 61155 -929166 -1261936 -1313002 -1330041 -1097352 -488713 120820
22327 120820 110983 -457347 -881932 -1147783 -1255815 -985244 -738108 -778710 -863244 -936384
22317 -936384 -1307406 -1748937 -1856400 -1656191 -1147751 -771418 -937233 -1387807 -2088254 -2058509
$$ packed form
22387B29060j57764k5175O1795j9155K28536K9522n96567k21471j432N4663J07283
22376c10705J58531O13195K30962j36412k67465p6363J43399j63987M5386K99580
22366E36121n7103r1359J43589L8651l67073l38818k00295k67659m62501k92227
22356a358674K66529L04181j1392k5109J54142M75032j0987k4261N92813O81600
22346A043874O53741J27424o45787o04575K92360M26319J28715k29083o56146
22337E36842j45423J69044m99308r90321l32770n1066j7039K32689O08639O09533
22327A20820r837n68330m24585k65851j08032K70571K47136m0602q4534p3140
22317i36384l71022m41531j07463K00209N08440L76333j65815m50574p00447K9745
$$ plain form
22307 -2058509 -1389535 -1201953 -921467 -124939 -252924 -545151 -1050988 -1235024 -971567
22298 -971567 -539048 -252467 -104639 -48716 29047 221264 400497 468946 496705 552832
22288 552832 780873 584897 -193159 -522674 -179822 45684 66034 487117 983495 915134
22278 915134 742625 589697 440161 -173367 -779518 -892175 -994419 -1051685 -1145923 -1404154
22268 -1404154 -1436258 -1245850 -1153529 -1139625 -687276 2389 -188125 -507630 -80074 18012
22258 18012 263002 933581 1160228 867366 436520 436790 46829 -41022 249736 615793
22248 615793 749481 721394 510906 108442 -358788 -644517 -844259 -991280 -740326 -338952
22238 -338952 -298812 -198915 -172650 -434597 -735260 -810781 -747236 -1123700 -1074754 -372123 195343
$$ packed form
22307b058509O68974J87582K80486P96528j27985k92227n05837j84036K63457
22298i71567M32519K86581J47828N5923P7763J92217J79233O8449K7759N6127
22288E52832K28041j95976p78056l29515L42852K25506K0350M21083M96378o8361
22278I15134j72509j52928j49536o13528o06151j12657j02244n7266r4238k58231
22268a404154l2104J90408R2321J3904M52349O89665j90514l19505M27556R8086
22258A8012K44990O70579K26647k92862m30846K70l89961q7851K90758L66057
22248F15793J33688k8087k10488m02464m67230k85729j99742j47021K50954M01374
22238c38952M0140R9897K6265k61947l00663p5521O3545l76464M8946P02631N67466
$$ plain form
22227 195343 532360 533341 710226 633617 -158434 -617915 -516169 -524430 -657159 -315235 560534
22216 560534 1010288 758831 452262 -108532 -387889 -445270 -325149 -216320 -219144 -115585
22206 -115585 410926 779007 501486 120717 -180634 -486758 -779690 -1167073 -1134561 -648910
22196 -648910 -414660 -388585 -217163 59237 -189865 -355463 -14187 61228 276394 698504
22186 698504 637456 3376 -396371 -475429 -140872 468871 715036 698927 572742 774431
22176 774431 1000559 1018001 1005574 926889 693181 498975 522785 622771 855197 866180 654596
22165 654596 595599 494210 52140 58971 392802 -16756 -563629 -681331 -240905 298802
22155 298802 670527 560208 100788 -265364 -590608 -881224 -833476 -372119 221576 253562
$$ packed form
22227A95343L37017R81J76885p6609p92051m59481J01746q261j32729L41924Q75769
22216E60534M49754k51457l06569n60794k79357n7381J20121J08829k824J03559
22206a15585N26511L68081k77521l80769l01351l06124k92932l87383L2512M85651
22196f48910K34250K6075J71422K76400k49102j65598L41276P5415K15166M22110
22186F98504o1048o34080l99747p9058L34557O09743K46165j6109j26185K01689
22176G74431K26128J7442j2427p8685k33708j94206K3810R9986K32426J0983k11584
22165F54596n8997j01389m42070O831L33831m09558n46873j17702M40426N39707
22155B98802L71725j10319m59420l66152l25244k90616M7748M61357N93695L1986
$$ plain form
22145 253562 -409456 -697484 -803962 -972079 -905854 -515730 -183550 -66071 199502 258051
22135 258051 -62339 -707683 -927152 -419512 -31791 -141531 -233186 -310131 -383805 -581563
22125 -581563 -1203801 -1703617 -1711258 -1287926 -891081 -534723 -388915 -755651 -1028453 -718374
22115 -718374 -380330 -461097 -514336 -341516 -255510 -408204 -457587 -493180 -802228 -647651
22105 -647651 -528989 -653508 -548822 -394766 -219038 126591 288770 -81831 -310334 -394035
22095 -394035 -508304 -573213 -626104 -477323 -461113 -378923 -341971 -223028 -138831 -522481 -483883
22084 -483883 -272668 -327207 -405617 -341953 -647507 -933713 -719417 -72137 430792 592865
22074 592865 615125 734192 903302 919950 757430 335141 389707 701249 588909 536108
$$ packed form
22145B53562o63018k88028j06478j68117O6225L90124L32180J17479K65573N8549
22135B58051l20390o45344k19469N07640L87721j09740r1655p6945p3674j97758
22125e81563o22238m99816p641M23332L96845L56358J45808l66736k72802L10079
22115g18374L38044q0767n3239J72820Q6006j52694m9383l5593l09048J54577
22105f47651J18662j24519J04686J54056J75728L45629J62179l70601k28503q3701
22095c94035j14269o4909n2891J48781J6210Q2190L6952J18943Q4197l83650L8598
22084d83883K11215n4539p8410O3664l05554k86206K14296O47280N02929J62073
22074E92865K2260J19067J69110J6648j62520m22289N4566L11542j12340n2801
$$ plain form
22064 536108 519700 133826 -352002 -528938 -355702 -567200 -1081818 -1501837 -1885178 -2069528
22054 -2069528 -1965577 -1296452 -769649 -734937 -670457 -588453 -611066 -751120 -1122095 -1184180
22044 -1184180 -894304 -586810 -588086 -726395 -571831 -577785 -798438 -761444 -17504 772244
22034 772244 903732 765161 438289 266291 264544 69297 208241 349802 -153835 -473211
22024 -473211 -495121 -582412 -574956 -601543 -629423 -600391 -453515 -706928 -900298 -432868 -28703
22013 -28703 20091 151097 503074 816737 491188 44133 -39981 296588 216823 -478025
22003 -478025 -895073 -1074814 -889688 -462937 -51694 231060 582632 486566 285751 313997
21993 313997 296235 82667 -78064 -523433 -1129513 -1099897 -593906 -90931 70481 -56531
$$ packed form
22064E36108j6408l85874m85828j76936J73236k11498n14618m20019l83341j84350
22054b069528J03951O69125N26803L4712O4480Q2004k2613j40054l70975o2085
22044a184180K89876L07494j276j38309J54564n954k20653L6994P43940P89748
22034G72244J31488j38571l26872j71998j747j95247J38944J41561n03637l19376
22024d73211k1910q7291P456k6587k7880K9032J46876k53413j93370M67430M04165
22013b8703M8794J31006L51977L13663l25549m47055q4114L36569p9765o94848
22003d78025m17048j79741J85126M26751M11243K82754L51572r6066k00815K8246
21993C13997j7762k13568j60731m45369o06080K9616N05991N02975J61412j27012
$$ plain form
21983 -56531 317441 465234 335665 367419 112713 -79377 -48767 173719 330852 2177
21973 2177 -630945 -414404 249927 560749 788368 539926 62832 88653 484315 444465
21963 444465 -133250 -584656 -535523 -423515 -521942 -564057 -699786 -606785 -433738 -555630
21953 -555630 -883004 -978175 -802177 -749434 -611611 -393210 -89748 200162 119146 160595
21943 160595 417830 76591 -358463 -602448 -665028 -674226 -665702 -392382 -261605 -451029
21933 -451029 -540232 -133152 -176226 -549327 -979970 -1198911 -690614 -97988 74603 -19320
21923 -19320 -201151 -180650 -89363 -28801 -1202 229268 224431 -57813 -34059 341832 298708
21912 298708 -3152 -49604 15074 411287 735226 702274 415000 435959 539532 529758 235423
$$ packed form
21983e6531L73972J47793j29569L1754k54706j92090L0610K22486J57133l28675
21973B177o33122K16541O64331L10822K27619k48442m77094K5821L95662l9850
21963D44465n77715m51406M9133J12008r8427m2115j35729R3001J73047j21892
21953e55630l27374r5171J75998N2743J37823K18401L03462K89910q1016M1449
21943A60595K57235l41239m35054k43985o2580r198Q524K73320J30777j89424
21933d51029q9203M07080m3074l73101m30643k18941N08297N92626J72591r3923
21923a9320j81831K0501R1287O0562K7599K30470m837k82244K3754L75891m3124
21912B98708l01860m6452O4678L96213L23939l2952k87274K0959J03573r774k94335
$$ plain form
21901 235423 -209818 -370472 -104387 -140359 -256491 -98794 -497642 -929090 -1126255 -1127414
21891 -1127414 -855841 -717216 -723089 -207661 375001 569303 355079 430953 495127 122935
21881 122935 317351 373628 -6153 -160452 -266808 -301317 184180 388583 137674 223878
21871 223878 430982 648289 427356 -23655 -329701 -573206 -685888 -602570 -362435 -244244
21861 -244244 -211021 -139755 -232662 -382321 273363 864806 826391 1011552 1167994 746351
21851 746351 311354 133394 360986 499232 308809 77468 -221222 -370999 -184191 133345
21841 133345 378964 627527 1105241 1265862 1201259 929488 508168 188064 122314 78758
21831 78758 -83320 21738 149566 31156 -169839 -153626 43708 89973 -168260 -446237
$$ packed form
21901B35423m45241j60654K66085l5972j16132J57697l98848m31448j97165j159
21891a127414K71573J38625n873N15428N82662J94302k14224P5874O4174l72192
21881A22935J94416N6277l79781j54299j06356l4509M85497K04403k50909Q6204
21871B23878K07104K17307k20933m51011l06046k43505j12682Q3318K40135J18191
21861b44244L3223P1266r2907j49659O55684N91443l8415J85161J56442m21643
21851G46351m34997j77960K27592J38246j90423k31341k98690j49777J86808L17536
21841A33345K45619K48563M77714J60621o4603k71771m21320l20104o5750m3556
21831G8758j62078J05058J27828j18410k00995J6213J97334M6265k58233k77977
$$ plain form
21821 -446237 -491263 -321639 -231962 275114 670268 706000 586123 769587 774303 157613
21811 157613 -315037 -595409 -649034 28360 722552 771363 654862 878013 626272 -45140
21801 -45140 -332477 -346349 196753 736384 727973 304133 -62527 10460 425342 206713
21791 206713 115630 275880 762506 939767 846258 627660 175674 -66845 219443 575276
21781 575276 598712 724435 798783 563742 499751 551847 396631 581671 789795 694546
21771 694546 626504 692530 375118 -29690 123184 544957 873389 1142577 1685633 2127973
21761 2127973 1713820 1081859 591491 244825 148370 -70088 -492104 -813966 -739664 -387942
21751 -387942 -394830 -594539 -531941 -413734 -530600 -721109 -1119594 -753328 -123140 -131499
$$ packed form
21821d46237m5026J69624Q9677N07076L95154L5732j19877J83464M716o16690
21811A57613m72650k80372n3625O77394O94192M8811j16501K23151k51741o71412
21801d5140k87337j3872N43102N39631q411m23840l66660P2987M14882k18629
21791B06713r1083J60250M86626J77261r3509k18598m51986k42519K86288L55833
21781E75276K3436J25723P4348k35041o3991N2096j55216J85040K08124r5249
21771F94546o8042O6026l17412m04808J52874M21773L28432K69188N43056M42340
21761B127973m14153o31961m90368l46666r6455k18458m22016l21862P4302L51722
21751c87942o888j99709O2598J18207j16866j90509l98485L66266O30188q359
$$ plain form
21741 -131499 -198864 -41657 36677 289815 610244 994257 819962 415351 222598 47315
21731 47315 -123449 -391198 -377138 139035 538900 316505 158452 -121440 -170523 6219
21721 6219 -145482 -380218 -194849 -333788 -648348 -429716 -146033 -69380 -62271 -141768 -442259
21710 -442259 -492210 -321186 -109767 218875 192093 -117768 -210152 -217379 -356034 -361227 -53774
21699 -53774 128536 80322 -84686 -14646 929396 1517746 1223875 631445 32589 -355678
21689 -355678 -756903 -742471 -675841 -278538 360648 691268 586004 396964 321856 95710
21679 95710 -430473 -720365 -635708 -338204 -341906 -685696 -882967 -420723 314429 462300
21669 462300 604724 775554 555958 76990 -249956 -155226 -34517 146058 347716 690230
$$ packed form
21741a31499o7365J57207P8334K53138L20429L84013j74295m04611j92753j75283
21731D7315j70764k67749J4060N16173L99865k22395j58053k79892m9083J76742
21721F219j51701k34736J85369j38939l14560K18632K83683P6653P109p9497l00491
21710d42259m9951J71024K11419L28642k6782l09861r2384p227j38655n193L07453
21699e3774J82310m8214j65008P0040R44042N88350k93871n92430n98856l88267
21689c55678m01225J4432O6630L97303O39186L30620j05264j89040p5108k26146
21679I5710n26183k89892Q4657K97504l702l43790j97271M62244P35152J47871
21669D62300J42424J70830k19596m78968l26946R4730J20709J80575K01658L42514
$$ plain form
21659 690230 728992 534073 478779 565579 326975 -36109 -48042 278194 506588 442424
21649 442424 -46008 -756689 -558954 71758 464547 554785 424202 454984 424133 279329
21639 279329 183017 -163905 -720087 -710358 -619204 -804199 -1054749 -1024097 -633040 -53215
21629 -53215 38955 -365894 -601109 -539546 -238168 -223336 -435312 -371965 -184826 -428643
21619 -428643 -645010 -402954 -56104 -234867 -323438 32134 253336 264759 -40003 -28641
21609 -28641 -116801 -248799 -442987 -484448 -231827 -482522 -645474 -417946 -175228 101080
21599 101080 488050 427541 625011 1294976 1406822 965629 884184 1222705 941761 84816
21589 84816 -86976 101878 265975 670772 806439 454972 194250 -28455 4149 -151169
$$ packed form
21659F90230L8762j94919n5294Q6800k38604l63084j1933L26236K28394o4164
21649D42424m88432p10681J97735O30712L92789R0238j30583L0782l0851j44804
21639B79329r6312l46922n56182R729R1154j84995k50550L0652L91057N79825
21629e3215R2170m04849k35215O1563L01378J4832k11976O3347J87139k43817
21619d28643k16367K42056L46850j78763q8571L55572K21202J1423l04762J1362
21609b8641q8160j31998j94188m1461K52621k50695j62952K27528K42718K76308
21599A01080L86970o0509J97470O69965J11846m41193q1445L38521k80944q56945
21589H4816j71792J88854J64097M04797J35667l51467k60722k22705L2604j55318
$$ plain form
21579 -151169 -541205 -653222 -196328 184155 313425 87869 -163816 -362811 -330237 160664
21569 160664 361522 614281 621501 195104 226243 713823 893617 981454 1085813 1144284
21559 1144284 1222883 848472 172444 -427774 -834607 -832182 -443424 135515 -49788 -380278
21549 -380278 -261100 -99073 30829 384683 700763 492122 107716 -570801 -704430 -514014
21539 -514014 -579627 -823855 -975293 -1016252 -913136 -853544 -771848 -72722 682312 667244
21529 667244 176009 57128 220124 233862 413958 538681 640180 792420 955741 1054771
21519 1054771 1025600 1055596 1101586 847077 680548 406614 -26686 -174116 -236128 -509401
21509 -509401 -551446 -433708 -290982 -203657 -85875 -192871 -355725 -209116 161932 528557
$$ packed form
21579a51169l90036j12017M56894L80483J29270k25556k51685j98995L2574M90901
21569A60664K00858K52759P220m26397L1139M87580J79794Q7837J04359N8471
21559A144284P8599l74411o76028o00218m06833K425L88758N78939j85303l30490
21549c80278J19178J62027J29902L53854L16080k08641l84406o78517j33629J90416
21539e14014o5613k44228j51438m0959J03116N9592Q1696O99126P55034j5068
21529F67244m91235j18881J62996J3738J80096J24723J01499J52240J63321R9030
21519A054771k9171K9996M5990k54509j66529k73934m33300j47430o2012k73273
21509e09401m2045J17738J42726Q7325J17782j06996j62854J46609L71048L66625
$$ plain form
21499 528557 103605 1065 53769 6751 25233 -79163 -246234 -107621 119169 -40956
21489 -40956 45468 269842 240300 252008 189699 -192620 -173988 -2093 -433356 -814068 -898503
21478 -898503 -815065 -842719 -835270 -862627 -718035 -677699 -720703 -507342 -419549 -310371 122531
21467 122531 223438 237279 242120 284305 514343 729870 742782 629643 339104 -63113
21457 -63113 -305145 -441414 -124091 272609 110801 -280999 -479087 -361569 -185745 -500643
21447 -500643 -992737 -871737 -495185 -491384 -380559 -224618 43655 -122823 -493021 -733036
21437 -733036 -375453 -9261 -141396 -333401 -400428 -461538 -370291 237831 366041 9398
21427 9398 -430462 -555125 -776775 -833197 -412197 -54992 141400 -155203 -223106 256059
$$ packed form
21499E28557m24952j02540N2704m7018J8482j04396j67071J38613K26790j60125
21489d0956Q6424K24374k9542J1708o2309l82319J8632J71895m31263l80712q4435
21478h98503Q3438k7654P449k7357J44592M0336m3004K13361Q7793J09178M32902
21467A22531J00907J3841M841M2185K30038K15527J2912j13139k90539m02217
21457f3113k42032j36269L17323L96700j61808l91800j98088J17518J75824l14898
21447e00643m92094J21000L76552L801J10825J55941K68273j66478l70198k40015
21437g33036L57583L66192j32135j92005o7027o1110R1247O08122J28210l56643
21427I398m39860j24663k21650n6422M21000L57205J96392k96603o7903M79165
$$ plain form
21417 256059 443900 154642 371874 628069 410101 89078 -251439 -88207 5845 66886
21407 66886 114358 -213713 -653744 -568170 -408515 -321834 -188695 -215729 26173 463010
21397 463010 191157 -320992 -166732 -255594 -433204 -442394 -533273 -906955 -1040194 -840065
21387 -840065 -447760 -117779 -72383 -290107 -474916 -205204 39001 -2092 -448806 -902591
21377 -902591 -510762 339140 831224 1063411 1189902 916514 235848 -166065 -184699 110474
21367 110474 284216 -198360 -600964 -1110096 -1392482 -1229231 -765510 -551045 -823005 -1070690
21357 -1070690 -665531 -298003 -138747 -112926 -328357 -785970 -1125246 -1269665 -1267099 -882025
21347 -882025 -558229 -312075 -281839 -217079 77077 -615 -159790 -449957 -534774 -333464
$$ packed form
21417B56059J87841k89258K17232K56195k17968l21023l40517J63232R4052O1041
21407F6886M7472l28071m40031Q5574J59655Q6681J33139k7034K41902M36837
21397D63010k71853n12149J54260q8862j77610r190r0879l73682j33239K00129
21387h40065L92305L29981M5396k17724j84809K69712K44205m1093m46714m53785
21377i02591L91829Q49902M92084K32187J26491k73388o80666m01913j8634K95173
21367A10474J73742m82576m02604n09132k82386J63251M63721K14465k71960k47685
21357a070690M05159L67528J59256K5821k15431m57613l39276j44419K566L85074
21347h82025L23796K46154L0236O4760K94156p7692j59175k90167q4817K01310
$$ plain form
21337 -333464 -388272 -235848 187280 272121 397231 407705 350140 -13190 -195022 -70372
21327 -70372 223389 84374 -119264 -1703 -350671 -403000 -3734 -145774 -616563 -858558
21317 -858558 -910152 -561320 -87241 342657 117402 -155100 -45748 354888 484655 266655
21307 266655 515659 737267 698021 499750 468200 454177 245526 -345757 -748346 -909525
21297 -909525 -591831 30391 125371 165918 240137 -186589 -841927 -652699 126115 662828
21287 662828 854971 1195799 988641 921536 882750 343751 -476343 -971807 -1012969 -924957
21277 -924957 -592378 -356673 -339097 -42724 224758 366175 280514 -81655 -321652 -211644
21267 -211644 228650 538886 141608 -272391 -291648 -178928 -122079 -293259 -559627 -483682
$$ packed form
21337c33464n4808J52424M23128Q4841J25110J0474n7565l63330j81832J24650
21327g0372K93761j39015k03638J17561l48968n2329L99266j42040m70789k41995
21317h58558n1594L48832M74079M29898k25255k72502J09352M00636J29767k18000
21307B66655K49004K21608l9246j98271l1550j4023k08651n91283m02589j61179
21297i09525L17694O22222R4980M0547P4219m26726o55338J89228P78814N36713
21287F62828J92143L40828k07158o7105l8786n38999q20094m95464m1162Q8012
21277i24957L32579K35705J7576K96373K67482J41417q5661l62169k39997J10008
21267b11644M40294L10236l97278m13999j9257J12720N6849j71180k66368P5945
$$ plain form
21257 -483682 -512475 -637250 -686584 -546371 -312961 -79158 -220065 -464555 -890415 -1076435
21247 -1076435 -671490 -308338 -119325 -136164 -231337 -558675 -783112 -1111664 -1099633 -619566
21237 -619566 -328221 -334580 -241168 -149060 -481072 -1033896 -1387092 -970559 -378125 -164332
21227 -164332 42029 84994 -194954 -548501 -605782 -769929 -834573 -770045 -865065 -1093196
21217 -1093196 -1610545 -1859569 -1736993 -1569133 -1395282 -1032027 -468493 -343246 -722777
21208 -722777 -927144 -737996 -488925 -378938 -488798 -1006857 -1132783 -610014 -561323 -661811
21198 -661811 -528741 -449725 -637997 -984686 -1335003 -1065236 -413494 215460 496125 345019
21188 345019 317317 452055 391118 234085 62771 15201 -33928 -211883 -114867 60420
$$ packed form
21257d83682k8793j24775m9334J40213K33410K33803j40907k44490m25860j86020
21247a076435M04945L63152J89013j6839r5173l27338k24437l28552J2031M80067
21237f19566K91345o359R3412R2108l32012n52824l53196M16533N92434K13793
21227a64332K06361M2965k79948l53547n7281j64147o4644O4528r5020k28131
21217a093196n17349k49024J22576J67860J73851L63255N63534J25247l79531
21208g22777k04367J89148K49071J09987j09860n18059j25926N22769M8691j00488
21198f61811J33070P9016j88272l46689l50317K69767O51742O28954K80665j51106
21188C45019k7702J34738o0937j57033j71314m7570m9129j77955R7016J75287
$$ plain form
21178 60420 221352 195579 309974 478665 564492 456931 514386 612348 702449 402000 243553
21167 243553 482542 547389 436960 397374 244478 169924 237728 316949 58185 -124280
21157 -124280 -247042 -125352 96853 -36332 -685683 -898271 -607938 -658206 -952124 -1110334
21147 -1110334 -1153833 -870964 -690585 -679941 -325140 -26029 81947 160192 179226 69722
21137 69722 249626 526111 450936 127370 320714 531279 554017 478687 467924 40780
21127 40780 -411322 -164569 238319 641036 677012 729520 1039204 908704 521326 251535
21117 251535 160570 137281 168796 298105 411158 123522 -574188 -975533 -1143702 -1246465
21107 -1246465 -715341 -161348 -313481 -393392 -558979 -769569 -1023037 -756149 -566934 -846391
$$ packed form
21178F0420J60932k5773J14395J68691Q5827j07561N7455R7962R0101l00449j58447
21167B43553K38989O4847j10429l9586j52896p4554O7804P9221k58764j82465
21157a24280j22762J21690K22205j33185o49351k12588K90333n0268k93918j58210
21147a110334m3499K82869J80379J0644L54801K99111J07976P8245J9034j09504
21137F9722J79904K76485p5175l23566J93344K10565K2738p5330j0763m27144
21127D0780m52102K46753M02888M02717L5976N2508L09684j30500l87378k69791
21117B51535r0965k3289L1515J29309J13053k87636o97710m01345j68169j02763
21107a246465N31124N53993j52133p9911j65587k10590k53468K66888J89215k79457
$$ plain form
21097 -846391 -850573 -206555 249382 300687 153543 244024 149712 -276416 -608665 -483912
21087 -483912 -182031 13344 80433 -387452 -712790 -793291 -394585 70512 559913 678961
21077 678961 604328 865078 484662 377259 1076607 1575740 1519807 1317618 1288072 1185416
21067 1185416 1395089 1317565 1076186 655647 288104 624054 586469 300448 392705 612397
21057 612397 861462 677169 400506 -52740 -208840 -103351 54426 442133 988088 1300629
21047 1300629 1073338 427375 -130510 -354886 -235383 -242680 -158766 -144971 -99183 83619
21037 83619 -243182 -691421 -701967 -536293 -99707 424037 424695 262511 676822 1213771
21027 1213771 1083170 728887 439267 258179 46602 -26628 88208 108665 135863 473343
$$ packed form
21097h46391m182O44018M55937N1305j47144R0481r4312m26128l32249J24753
21087d83912L01881J95375O7089m67885l25338q0501L98706M65097M89401J19048
21077F78961p4633K60750l80416j07403O99348M99133n5933k02189k9546j02656
21067A185416K09673p7524k41379m20539l67543L35950l7585k86021R2257K19692
21057F12397K49065j84293k76663m53246j56100J05489J57777L87707N45955L12541
21047A300629k27291o45963n57885k24376J19503p297Q3914J3795M5788J82802
21037H3619l26801m48239j0546J65674M36586N23744O58j62184M14311N36949
21027A213771j30601l54283k89620j81088k11577p3230J14836K0457K7198L37480
$$ plain form
21017 473343 490349 364720 456843 369904 269072 97394 -242489 -337256 -62902 -21142
21007 -21142 -365558 -710015 -739000 -580982 -393334 -440768 -1114955 -1515713 -1176358 -685230
20997 -685230 -427793 -326599 -28190 -57988 -458534 -477240 -284285 126041 472944 901879
20987 901879 1260646 1596476 1759677 1558772 1288157 800732 277843 191766 603128 921854
20977 921854 1031406 671357 144186 38296 323459 339496 383661 737218 1179290 1361317
20967 1361317 1406764 1054616 853226 882313 896913 1063742 812580 4369 -532496 -752953
20957 -752953 -490985 -203313 243663 489952 645873 633855 653575 755726 607315 533947
20947 533947 591773 486122 571260 650482 601652 547034 456486 306854 14436 -66945 12888
$$ packed form
21017D73343J7006j25629R2123q6939j00832j71678l39883r4767K74354M1760
21007b1142l44416l44457k8985J58018J87648m7434o74187m00758L39355M91128
20997f85230K57437J01194K98409k9798m00546j8706J92955M10326L46903M28935
20987I01879L58767L35830J63201k00905k70615m87425n22889q6077M11362L18726
20977I21854J09552l60049n27171j05890K85163J6037M4165L53557M42072J82027
20967A361317M5447l52148k01390K9087J4600J66829k51162q08211n36865k20457
20957g52953K61968K87672M46976K46289J55921j2018J9720J02151j48411p3368
20947E33947N7826j05651Q5138P9222m8830n4618r0548j49632k92418q1381P9833
$$ plain form
20936 12888 327440 793354 1432870 1358800 1154223 1439580 1831095 2463564 2788186 2708930
20926 2708930 2778073 2995253 3382799 3411871 3560258 4377205 5334242 6214014 6958752 8076637
20916 8076637 9334197 10723297 12030772 13896372 17057569 20714841 25207541 31757618
20908 31757618 40989987 53610670 70066163 88543742 103455609 108610915 102927450
20901 102927450 91179199 78366925 65727308 54099605 43812189 35258079 28671284
20894 28671284 24005968 20783190 17923708 15488233 13720017 12193548 10956608 9926440
20886 9926440 8898965 7650713 6551073 6102627 5697890 4605849 3825375 3964409 4091104
20877 4091104 3856528 3636499 2932943 2638134 3183411 3334436 3375051 3428344 3171271 2759431
$$ packed form
20936A2888L14552M65914O39516p4070k04577K85357L91515O32469L24622p9256
20926B708930O9143K17180L87546K9072J48387Q16947R57037Q79772P44738J117885
20916H076637J257560J389100J307475J865600L161197L657272M492700O550077
20908C1757618R232369J2620683J6455493J8477579J4911867N155306n683465
20901A02927450j1748251j2812274j2639617j1627703j0287416q554110o586795
20894B8671284m665316l222778k859482k435475j768216j526469j236940j030168
20886I926440j027475j248252j099640m48446m04737j092041p80474J39034J26695
20877D091104k34576k20029p03556k94809N45277J51025M0615N3293k57073m11840
$$ plain form
20867 2759431 2337285 2077482 2004083 1670244 1099182 1209511 1482354 1136047 795152 943903
20857 943903 1124028 1468648 2098458 2446814 2666290 2969141 3117330 3015834 2862860 2647190
20847 2647190 2237197 2050482 1906935 1588002 1238431 963186 900554 1107192 1244422 1374085
20837 1374085 1485180 1242603 1817020 2611914 2933160 2871401 2898205 2929726 3220471 3774638
20827 3774638 3925551 3481702 2928808 2653643 2431130 2420051 2718425 3264302 3912040 4071054
20817 4071054 3645502 3331720 3367970 3513470 3786691 4909368 6116819 7089226 8663281
20808 8663281 10293971 11248297 12021223 12397215 12394476 12064589 11791353 12127729 13275897
20799 13275897 14342466 15488117 16941809 18273226 18662439 17321216 15182008 12653793
$$ packed form
20867B759431m22146k59803p3399l33839n71062J10329K72843l46307l40895J48751
20857I43903J80125L44620O29810L48356K19476L02851J48189j01496j52974k15670
20847B647190m09993j86715j43547l18933l49571k75245o2632K06638J37230J29663
20837A374085J11095k42577N74417P94894L21246o1759K6804L1521K90745N54167
20827C774638J50913m43849n52894k75165k22513j1079K98374N45877O47738J59014
20817D071054m25552l13782L6250J45500K73221J122677J207451R72407J574055
20808H663281J630690R54326P72926L75992k739l29887k73236L36376J148168
20799A3275897J066569J145651J453692J331417L89213j341223k139208k528215
$$ plain form
20791 12653793 10516356 8426500 6627052 4961897 3799895 3246550 2924231 2451162
20783 2451162 2040470 1959628 2139776 2522206 2397429 2245641 2256038 1980384 1657634 1806521
20773 1806521 2192238 2355738 2191517 1953255 1498492 1088704 1287448 1516289 1678087
20764 1678087 1916895 1934095 1788576 1198886 666278 308916 -58690 -151702 -379745 -541980
20754 -541980 -114634 746474 1034151 778888 706652 432205 7146 -238175 -229905 -217239
20744 -217239 -177086 -15816 427868 667623 898614 1009290 637208 308170 256794 219876
20734 219876 75969 -83233 -370860 -334077 -360058 -489253 -531685 -195708 -104277 -485325
20724 -485325 -248031 537291 1037435 1249277 1149707 865101 327833 -343360 -552573 -918085
$$ packed form
20791A2653793k137437k089856j799448j665155j162002n53345l22319m73069
20783B451162m10692q0842J80148L82430j24777j51788J0397k75654l22750J48887
20773A806521L85717J63500j64221k38262m54763m09788J98744K28841J61798
20764A678087K38808J7200j45519n89690n32608l57362l67606r3012k28043j62235
20754e41980M27346Q61108K87677k55263p2236k74447m25059k45321Q270J2666
20744b17239M0153J61270M43684K39755K30991J10676l72082l29038n1376l6918
20734B19876j43907j59202k87627L6783k5981j29195m2432L35977R1431l81048
20724d85325K37294P85322N00144K11842r9570k84606n37268o71193k09213l65512
$$ plain form
20714 -918085 -1375352 -1105853 -253605 676535 674407 161640 -353029 -570326 -300797 -114118
20704 -114118 -45874 -184957 158581 535892 690078 374685 13999 104213 369871 419217
20694 419217 132816 -48826 -378763 -605272 -261689 206539 -196033 -708727 -908638 -829659
20684 -829659 -359439 -65810 -136917 -335251 -42518 681274 1220375 1072701 704649 447038
20674 447038 513826 432132 235361 76677 -33229 155957 423191 250489 250043 811299
20664 811299 918094 646985 511410 520219 173587 281996 636088 472427 -65838 -336605
20654 -336605 -206318 -36470 326952 874481 973141 899902 750056 55837 -360737 -560372
20644 -560372 -526373 -434664 -411420 -126209 45438 -28651 -149623 -246649 -103594 -216984
$$ packed form
20714i18085m57267K69499Q52248R30140k128n12767n14669k17297K69529J86679
20704a14118O8244j39083L43538L77311J54186l15393l60686R0214K65658M9346
20694D19217k86401j81642l29937k26509L43583M68228m02572n12694j99911P8979
20684h29659M70220K93629p1107j98334K92733P23792N39101j47674l68052k57611
20674D47038O6788q1694j96771j58684j09906J89186K67234j72702m46N61256
20664H11299J06795k71109j35575Q809l46632J08409L54092j63661n38265k70767
20654c36605J30287J69848L63422N47529R8660p3239j49846o94219m16574j99635
20644e60372L3999R1709K3244K85211J71647p4089j20972r7026J43055j13390
$$ plain form
20634 -216984 -520347 -492972 -145329 -182328 -515206 -839220 -531264 -295492 -54808 -15566
20624 -15566 -282427 -258063 25775 -8266 -72399 -365292 -650510 -976024 -1260403 -778259
20614 -778259 -107983 227630 406468 437750 741458 880166 811268 693053 264571 -129391
20604 -129391 -137523 -12099 5246 212457 421318 450530 347978 -317857 -1016363 -1472789
20594 -1472789 -1433976 -957401 -486521 -278548 -409967 -576478 -965099 -1402927 -1454353 -1093388
20584 -1093388 -890867 -774388 -684502 -730888 -892987 -627522 -47781 166239 -20604 -491155
20574 -491155 -541928 -586406 -1295716 -1823332 -1583932 -870897 -462207 -584919 -760842 -594747
20564 -594747 -16707 357354 530865 246424 -30409 20363 -54796 -439364 -953721 -1184567
$$ packed form
20634b16984l03363K7375L47643l6999l32878l24014L07956K35772K40684L9242
20624a5566k66861K4364K83838l4041o4133k92893k85218l25514k84379M82144
20614g78259O70276L35613J78838L1282L03708J38708o8898j18215m28482l93962
20604a29391q132J25424J7345K07211K08861K9212j02552o65835o98506m56426
20594a472789L8813M76575M70880K07973j31419j66511l88621m37828n1426L60965
20584a093388K02521J16479Q9886m6386j62099K65465N79741K14020j86843m70551
20574d91155n0773m4478p09310n27616K39400P13035M08690j22712j75923J66095
20564e94747N78040L74061J73511k84441k76833N0772p5159l84568n14357k30846
$$ plain form
20554 -1184567 -1338174 -1271333 -1213577 -963472 -661772 -293602 -123773 -188770 -274633 -185928
20544 -185928 -251139 -212528 -114245 5420 -141588 -339501 -469123 -517319 -609969 -638035 -104143
20533 -104143 426281 364465 -9200 -7335 -320057 -343114 19127 71256 -361697 -790004
20523 -790004 -627039 -19998 816608 1194303 1108639 921235 871702 1009484 1248036 1183049
20513 1183049 901937 651531 522808 454189 294837 -73136 -147437 87471 66655 27266
20503 27266 3838 -240640 -392763 -577861 -415735 -250062 -204328 -307559 -184802 -304185
20493 -304185 -684697 -453826 67758 286179 18108 83695 204316 89995 206103 483407
20483 483407 523701 104932 -431093 -499822 -158135 307125 330565 473402 445416 424252
$$ packed form
20554a184567j53607O6841N7756K50105L01700L68170J69829o4997q5863Q8705
20544a85928o5211L8611R8283J19665j47008j97913j29622m8196r2650k8066N33892
20533a04143N30424o1816l73665J865l12722k3057L62241N2129m32953m28307
20523g90004J62965O07041Q36606L77695q5664j87404m9533J37782K38552o4987
20513A183049k81112k50406j28723o8619j59352l67973p4301K34908k0816l9389
20503B7266k3428k44478j52123j85098J62126J65673M5734j03231J22757j19383
20493c04185l80512K30871N21584K18421k68071O5587J20621j14321J16108K77304
20483D83407M0294m18769n36025o8729L41687M65260K3440J42837k7986k1164
$$ plain form
20473 424252 453060 522702 505693 -183658 -516839 -598857 -416271 -343954 -455214 -594468
20463 -594468 -383979 -180045 -352796 -30332 403091 227135 229703 685367 935138 969057
20453 969057 895053 992454 1130280 1187354 1259743 1273699 1146352 765149 493503 454671 349453
20442 349453 229018 212687 469400 115234 -768270 -986947 -870640 -828628 -497940 -78705
20432 -78705 39489 93475 -231930 -271566 146837 644301 1086319 866656 555801 402596
20422 402596 490195 416868 325646 572836 767389 693457 358882 181517 -36340 -526019
20412 -526019 -798969 -1095316 -1379459 -1201197 -900526 -630287 -357443 -44833 224000 292730
20402 292730 213185 -129787 -505964 -534605 -257864 185954 315956 168347 504816 1125110
$$ packed form
20473D24252K8808O9642j7009o89351l33181q2018J82586P2317j11260j39254
20463e94468K10489K03934j72751L22464M33423j75956K568M55664K49771L3919
20453I69057p4004R7401J37826N7074P2389J3956j27347l81203k71646l8832j05218
20442C49453j20435j6331K56713l54166q83504k18677J16307M2012L30688M19235
20432g8705J18194N3986l25405l9636M18403M97464M42018k19663l10855j53205
20422D02596Q7599p3327r1222K47190J94553p3932l34575j77365k17857m89679
20412e26019k72950k96347k84143J78262L00671K70239K72844L12610K68833O8730
20402B92730p9545l42972l76177k8641K76741M43818J30002j47609L36469O20294
$$ plain form
20392 1125110 1338325 731606 -344776 -785358 -716527 -549269 -609778 -551777 -118279 -53248
20382 -53248 57920 526370 678474 463253 183331 163866 -154364 -549902 -632410 -583666
20372 -583666 -276563 449890 795053 1267043 1317410 771263 718394 669928 236086 5858
20362 5858 -106823 -223123 -291650 -455430 -408411 -57104 127743 -85515 -134424 343662
20352 343662 678769 330162 -124498 -348393 -568191 -319027 -73972 -224837 -334555 -539221
20342 -539221 -426648 -33237 155385 193788 42128 -85781 -235435 -229235 -251917 -327089
20332 -327089 -187370 -146113 -508751 -287078 239622 552435 997448 1111622 1026535 835523
20322 835523 699280 622721 569174 941648 1133106 937910 747691 643324 161226 -236874
$$ packed form
20392A125110K13215o06719j076382m40582O8831J67258o0509N8001M33498O5031
20382e3248J11168M68450J52104k15221k79922j9465l18230l95538q2508M8744
20372e83666L07103P26453L45163M71990N0367n46147n2869m8466m33842k30228
20362E858j12681j16300o8527j63780M7019L51307J84847k13258m8909M78086
20352C43662L35107l48607m54660k23895k19798K49164K45055j50865j09718k04666
20342e39221J12573L93411J88622L8403j51660j27909j49654O200k2682p5172
20332c27089J39719M1257l62638K21673N26700L12813M45013J14174q5087j91012
20322H35523j36243p6559n3547L72474J91458j95196j90219j04367m82098l98100
$$ plain form
20312 -236874 99309 821033 1234113 1238791 802072 339291 169974 168997 198623 443661 457130
20301 457130 344024 519352 592384 30377 -1047876 -1540294 -1056913 -656423 -536736 -516015
20291 -516015 -259208 -55364 -260570 -282260 -221579 -35706 38580 240330 420676 332662
20281 332662 366799 572553 798930 769440 38564 -379354 -286026 -206470 4760 207731
20271 207731 413529 370444 87241 -180560 -70694 104339 587321 1528260 2058189 1848901
20261 1848901 1507323 1129112 1080437 1418122 1372880 817734 575673 687603 692154 504542
20251 504542 103020 14665 285914 595684 816867 1109269 1237460 1375709 1340675 1242238
20241 1242238 1014991 460917 -246974 -532102 -281252 331036 162901 -359301 -445368 -114745
$$ packed form
20312b36874L36183P21724M13080M678m36719m62781j69317r77K9626K45038J3469
20301D57130j13106J75328P3032n62007j078253m92418M83381M00490J19687K0721
20291e16015K56807K03844k05206k1690O0681J85873P4286K01750J80346q8014
20281C32662L4137K05754K26377k9490p30876m17918R3328P9556K11230K02971
20271B07731K05798m3085k83203k67801J09866J75033M82982R40939N29929k09288
20261A848901l41578l78211m8675L37685m5242n55146k42061J11930M551j87612
20251E04542m01522q8355K71249L09770K21183K92402J28191J38249l5034r8437
20241A242238k27247n54074p07891k85128K50850O12288j68135n22202q6067L30623
$$ plain form
20231 -114745 540358 1111723 1058777 703071 388067 117050 -170807 -88994 69213 534945
20221 534945 785571 927049 795744 319395 395863 619783 369908 497580 680303 669720
20211 669720 593764 449039 605886 998879 1154109 1028260 1168510 1282452 1120178 737959
20201 737959 483500 508464 664053 699776 905324 968978 896164 706151 408514 111554
20191 111554 117694 252207 495210 768578 837284 989468 1317301 1439855 1055841 472285
20181 472285 401696 960489 1449672 1380388 968944 621209 206228 121099 625904 814488
20171 814488 875870 869460 806464 832976 850487 770637 831247 1160091 984205 716987 537688
20160 537688 678127 977946 1243607 1428134 980520 353039 13620 -91675 -68198 -335863
$$ packed form
20231a14745O55103N71365n2946l55706l15004k71017k87857Q1813J58207M65732
20221E34945K50626J41478j31305m76349P6468K23920k49875J27672J82723j0583
20211F69720p5956j44725J56847L92993J55230j25849J40250J13942j62274l82219
20201G37959k54459K4964J55589L5723K05548O3654p2814j90013k97637k96960
20191A11554O140J34513K43003K73368O8706J52184L27833J22554l84014n83556
20181D72285p0589N58793M89183o9284m11444l47735m14981q5129N04805J88584
20171H14488O1382o410o2996K6512J7511p9850O0610L28844j75886k67218j79299
20160E37688J40439K99819K65661J84527m47614o27481l39419j05295K3477k67665
$$ plain form
20150 -335863 -572030 -390910 1183 150426 -8227 1367 395426 1062508 1485900 1327173
20140 1327173 1217983 1474919 1579989 1562815 1666720 1711698 1731938 1535889 1368101 1247989
20130 1247989 1228233 1568094 1996379 1984369 1879271 1440867 956736 884442 1150244 1168290
20120 1168290 1300415 1543893 1511972 1330341 951865 608900 541988 359400 -184489 -445257
20110 -445257 -137022 307022 666423 502987 356412 638949 1305919 1540055 1197077 869220
20100 869220 987355 1162682 1156361 1019931 857208 902535 1238640 1599753 2118894 2285687
20090 2285687 2148124 1987976 1732251 1788666 1939243 1970316 1774301 1354350 1117205 1453144
20080 1453144 1427361 1006957 831843 889937 1157967 1271436 965678 1029194 1693505 1935795
$$ packed form
20150c35863k36167J81120L92093J49243j58653R594L94059O67082M23392j58727
20140A327173j09190K56936J05070j7174J03905M4978K0240j96049j67788j20112
20130A247989j9756L39861M28285j2010j05098m38404m84131p2294K65802J8046
20120A168290J32125K43478l1921j81631l78476l42965o6912j82588n43889k60768
20110d45257L08235M44044L59401j63436j46575K82537O66970K34136l42978l27857
20100H69220J18135J75327o321j36430j62723M5327L36105L61113N19141J66793
20090B285687j37563j60148k55725N6415J50577L1073j96015m19951k37145L35939
20080A453144k5783m20404j75114N8094K68030J13469l05758O3516O64311K42290
$$ plain form
20070 1935795 1640978 1379703 1386773 1329830 1172953 1029234 867320 988914 1359811 1344654
20060 1344654 765616 255872 262773 477333 539452 240704 126552 553379 766993 836244
20050 836244 952056 1182238 1233492 1455364 1557097 1658219 1617642 1490366 1281214 760011
20040 760011 432924 227255 243787 347664 712054 1061712 896034 802845 1171195 1371102
20030 1371102 1666271 1448612 924758 866349 1014164 1047923 1046900 884990 883697 1267635
20020 1267635 1494611 1482229 1450665 1475008 1516105 1420442 1368373 1732826 1826232 1375326 1050045
20009 1050045 980733 788461 711232 925695 1234945 1168605 1281393 1508369 1653416 1561767
19999 1561767 1693513 2194847 2454910 2339869 2174563 1865124 1467749 1327800 2127741
$$ packed form
20070A935795k94817k61275P070n6943j56877j43719j61914J21594L70897j5157
20060A344654n79038n09744O901K14560O2119k98748j14152M26827K13614O9251
20050H36244J15812K30182N1254K21872J01733J01122m0577j27276k09152n21203
20040G60011l27087k05669J6532J03877L64390L49658j65678r3189L68350J99907
20030A371102K95169k17659n23854n8409J47815L3759j023j61910j293L83938
20020A267635K26976j2382l1564K4343M1097r5663n2069L64453R3406m50906l25281
20009A050045o9312j92272p7229K14463L09250o6340J12788K26976J45047r1649
19999A561767J31746N01334K60063j15041j65306l09439l97375j39949P99941
$$ plain form
19990 2127741 2746789 2541933 2612083 3419790 4169908 4626049 4938175 4713809 4541412 4398598
19980 4398598 4270527 4459906 4870626 4643532 4535316 4585993 4588559 4562628 4943020 5210648
19970 5210648 5445860 5965792 6707860 7092236 7444075 8059578 8612348 9292444 10221525
19961 10221525 11078065 12206939 13559489 15198838 17157333 19909177 22544197 24681059
19953 24681059 27008735 30205857 33580819 37581475 42852003 49596654 57400290 65009029
19945 65009029 71295282 76574833 82759038 91937981 104677435 119847839 134353447 145095512
19937 145095512 147941686 141741086 132048696 125490394 123642467 127065458 136764773 152078204
19929 152078204 171510548 200080875 244148930 312097477 406855472 503882927 519243316
$$ packed form
19990B127741O19048k04856P0150Q07707P50118M56141L12126k24366j72397j42814
19980D398598j28071J89379M10720k27094j08216N0677K566k5931L80392K67628
19970E210648K35212N19932P42068L84376L51839O15503N52770O80096R29081
19961A0221525Q56540J128874J352550J639349J958495K751844K635020K136862
19953B4681059K327676L197122L374962M000656N270528O744651P803636P608739
19945F5009029O286253N279551O184205R178943J2739454J5170404J4505608J0742065
19937A45095512K846174o200600r692390o558302j847927L422991R699315J5313431
19929A52078204J9432344K8570327M4068055O7948547R4757995R7027455J5360389
$$ plain form
19922 519243316 426927458 319454469 242871077 193930099 162737540 140751697 124474229
19915 124474229 113583724 108255669 108106364 110410696 112080417 108568865 100683213 92708066
19907 92708066 86977668 83665023 82179060 81338879 81398190 82772205 86182485 92531073
19899 92531073 103380057 119086016 139209552 163093920 190497130 218084823 236112158
19892 236112158 225506015 186832470 145444246 114149868 91374958 74502310 61683186
19885 61683186 52098916 45002498 39847589 35953065 32724867 30244562 28789157 28317951
19877 28317951 27822354 25572329 22082770 19060257 17372840 16605732 16090653 15500687 15026220
19868 15026220 14876997 15278742 15703166 16003271 16079264 15197843 14188401 13480106 12971631
$$ packed form
19922E19243316r2315858j07472989p6583392m8940978l1192559k1985843j6277468
19915A24474229j0890505n328055j49305K304332J669721l511552p885652p975147
19907I2708066n730398l312645j485963q40181N9311J374015L410280O348588
19899I2531073J0848984J5705959K0123536K3884368K7403210K7587693J8027335
19892B36112158j0606143l8673545m1388224l1294378k2774910j6872648j2819124
19885F1683186r584270p096418n154909l894524l228198k480305j455405m71206
19877B8317951m95597k250025l489559l022513j687417p67108n15079n89966m74467
19868A5026220j49223M01745M24424L00105P5993q81421j009442p08295n08475
$$ plain form
19859 12971631 13160583 13455557 14005748 15029432 15715895 16792329 18981843 21169050 22985174
19850 22985174 25152515 28090196 31908056 36649119 42320725 48599104 55438024 63850428
19842 63850428 74186344 88996262 109708509 138575659 180010357 241835337 327308399
19835 327308399 416559454 441461821 386814634 313055395 241729418 181922406 138844242
19828 138844242 109499390 88548518 72726433 61013329 51910101 44454558 39048816
19821 39048816 34806795 30874528 27349541 24802485 22335800 19992610 17661033 15600127
19813 15600127 14104813 13298640 12355584 10894679 9560973 8738099 8362928 7978441 7263006
19804 7263006 6688125 6025925 5317617 4907404 4891009 4605948 4249779 4064422 4112075 3950427
$$ packed form
19859A2971631J88952K94974N50191J023684O86463J076434K189514K187207J816124
19850B2985174K167341K937681L817860M741063N671606O278379O838920Q412404
19842F3850428J0335916J4809918K0712247K8867150M1434698O1824980Q5473062
19835C27308399Q9251055K4902367n4647187p3759239p1325977n9807012m3078164
19828A38844242k9344852k0950872j5822085j1713104r103228p455543n405742
19821C9048816m242021l932267l524987k547056k466685k343190k331577k060906
19813A5600127j495314q06173r43056j460905j333706q22874l75171l84487p15435
19804G263006n74881o62200p08308m10213j6395k85061l56169j85357M7653j61648
$$ plain form
19794 3950427 3516092 2971681 2616669 2688428 3022812 3332409 3404482 2895759 2151074 1813098
19784 1813098 2072415 1850745 1118556 731517 1141815 1755315 1832688 1380772 976579 1007150
19774 1007150 1268118 1188990 803037 654313 1085298 1597687 2078763 2080366 1971860 1761390
19764 1761390 1357291 1301610 1750600 2068659 1985679 2107497 2116355 1916792 1632635 1423632
19754 1423632 1795957 2112688 2132648 2408425 2910120 3180257 3000434 3115358 3289033 3118738
19744 3118738 2956743 3063464 3007341 2130834 1165342 856406 865376 918424 883832 803948
19734 803948 945109 1366661 1729763 1622444 1468550 1338237 1082323 1038588 1368651 2078557
19724 2078557 2268511 1683666 1205615 1198751 1086288 820166 673819 337764 51179 126833
$$ packed form
19794C950427m34335n44411l55012P1759L34384L09597P2073n08723p44685l37976
19784A813098K59317k21670p32189l87039M10298O13500P7373m51916m04193L0571
19774A007150K60968p9128l85953j48724M30985N12389M81076J603j08506k10470
19764A761390m04099n5681M48990L18059q2980J21818Q858j99563k84157k09003
19754A423632L72325L16731J9960K75777N01695K70137j79823J14924J73675j70295
19744C118738j61995J06721n6123q76507r65492l08936Q970N3048l4592p9884
19734H03948J41161M21552L63102j07319j53894j30313k55914m3735L30063P09906
19724B078557J89954n84845m78051o864j12463k66122j46347l36055k86585P5654
$$ plain form
19714 126833 326823 309921 538895 1041554 1418167 1928591 2150497 2117498 1731979 989189
19704 989189 424855 483299 1081475 1741087 1684128 1025518 532926 405148 863535 1444342
19694 1444342 1255830 881693 933175 927233 889125 1002456 779263 649747 877243 1368765
19684 1368765 1402909 872418 451038 101166 -118207 -131047 11427 174705 83783 -42729
19674 -42729 2781 77196 131225 147611 310092 643309 823687 744811 747359 724080 719049
19663 719049 718145 494565 352961 344655 184529 298413 31713 -241226 -283627 -424599 -483029
19652 -483029 -334301 2076 303434 100829 -131947 -303979 -350476 -262483 -229211 -57801
19642 -57801 -211388 -732396 -931538 -1039730 -920675 -439908 261886 1055546 1246375 1091320
$$ packed form
19714A26833J99990j6902K28974N02659L76613N10424K21906l2999l85519p42790
19704I89189n64334N8444N98176O59612n6959o58610m92592j27778M58387N80807
19694A444342j88512l74137N1482n942l8108J13331k23193j29516K27496M91522
19684A368765L4144n30491m21380l49872k19373j2840J42474J63278r0922j26512
19674d2729M5510P4415N4029J6386J62481L33217J80378p8876K548k3279n031
19663G19049r04k23580j41604q306j60126J13884k66700k72939m2401j40972n8430
19652d83029J48728L36377L01358k02605k32776j72032m6497Q7993L3272J71410
19642e7801j53587n21008j99142j08192J19055M80767P01794P93660J90829j55055
$$ plain form
19632 1091320 654998 307220 116359 -24043 -215253 -349164 -292004 -233865 -279051 -354750
19622 -354750 -173531 106357 -71483 -120127 -120705 -469020 -1009751 -1230399 -904420 -739987
19612 -739987 -753323 -749313 -450704 -433911 -993014 -1396040 -1353378 -938475 -961186 -1084713 -800528
19601 -800528 -507148 -268359 -294210 -808838 -1072986 -946713 -330585 -344774 -476604 -538696
19591 -538696 -964191 -916650 -804608 -1009736 -1265782 -1065865 -535288 -204052 -354036 -519757
19581 -519757 -405396 -353468 -581421 -808790 -478063 -330858 -386398 -72937 179465 120603
19571 120603 183103 771608 977983 766348 702400 848590 1176486 1076803 869011 859551
19561 859551 920611 718955 628453 477022 56487 -38235 -61594 13255 366619 642883
$$ packed form
19632A091320m36322l47778j90861j40402j91210j33911N7160N8139m5186p5699
19622c54750J81219K79888j77840m8644n78l48315n40731k20648L25979J64433
19612g39987j3336M010K98609J6793n59103m03026M2662M14903k2711j23527K84185
19601h00528K93380K38789k5851n14628k64148J26273O16128j4189j31830o2092
19591e38696m25495M7541J12042k05128k56046J99917N30577L31236j49984j65721
19581e19757J14361N1928k27953k27369L30727J47205n5540L13461K52402n8862
19571A20603O2500N88505K06375k11635o3948J46190L27896r9683k07792r460
19561H59551O1060k01656r0502j51431m20535r4722k3359P4849L53364K76264
$$ plain form
19551 642883 685509 376229 158447 400542 549758 136401 -311518 -523179 -746856 -797182
19541 -797182 -712620 -676541 -579551 -563385 -557283 -467283 -296823 -281588 -337791 -51830 46084
19530 46084 264396 907633 1225536 946180 506991 708542 667149 506930 585384 396249
19520 396249 -285327 -790789 -721457 -656196 -703993 -583803 -847505 -1307027 -1060965 -522752
19510 -522752 -110989 45811 -159475 -376092 -454649 -506825 -663149 -317461 -50602 -97225
19500 -97225 -208376 -291604 -407142 -364694 -38283 144880 282791 312715 90633 -125725
19490 -125725 -271558 -90065 358175 252005 -1576 -149044 -331105 -425372 -434154 -416514
19480 -416514 -1006404 -1416905 -1311888 -1143956 -841785 -362427 -304128 -351473 -300929 -427654
$$ packed form
19551F42883M2626l09280k17782K42095J49216m13357m47919k11661k23677n0326
19541g97182Q4562L6079R6990J6166O102R0000J70460J5235n6203K85961R7914
19530D6084K18312O43237L17903k79356m39189K01551m1393j60219P8454j89135
19520C96249o81576n05462O9332O5261m7797J20190k63702m59522K46062N38213
19510e22752M11763J56800k05286k16617p8557n2176j56324L45688K66859m6623
19500i7225j11151q3228j15538M2448L26411J83163J37911K9924k22082k16358
19490a25725j45833J81493M48240j06170k53581j47468j82061r4267q782J7640
19480d16514n89890m10501J05017J67932L02171M79358N8299m7345N0544j26725
$$ plain form
19470 -427654 -207402 301339 856395 829605 439637 320127 421181 289832 222580 210753
19460 210753 22902 388953 635536 373408 -80702 53204 192862 190396 239056 16809
19450 16809 53193 237104 457860 673914 576761 454285 641132 446849 278758 241981
19440 241981 394151 409022 309819 224452 235858 113333 -147186 -285122 -392755 49527
19430 49527 251048 378067 593516 736144 596346 624701 494737 349136 295681 -125958
19420 -125958 -731142 -949554 -771197 -531269 -408789 -202651 21498 29059 363327 478814
19410 478814 329201 50593 -71437 -411680 -486097 -486520 -318424 -350753 -306834 -368599 -468246
19399 -468246 -354882 -472158 -375457 99108 312906 -45153 -556364 -585056 -183134 103999
$$ packed form
19470d27654K20252N08741N55056k6790l89968j19510J01054j31349o7252j1827
19460B10753j87851L66051K46583k62128m54110J33906J39658k466M8660k22247
19450A6809L6384J83911K20756K16054r7153j22476J86847j94283j68091l6777
19440B41981J52170J4871r9203q5367J1406j22525k60519j37936j07633M42282
19430D9527K01521J27019K15449J42628j39798K8355j29964j45601n3455m21639
19420a25958o05184k18412J78357K39928J22480K06138K24149P561L34268J15487
19410D78814j49613k78608j22030l40243p4417m23J68096l2329M3919o1765r9647
19399d68246J13364j17276R6701M74565K13798l58059n11211k8692M01922K87133
$$ plain form
19389 103999 141562 -274013 -733751 -503824 -184122 79783 443346 686829 257020 -281729
19379 -281729 -545798 -640260 -635050 -471689 18476 188380 76508 111633 484300 646751
19369 646751 464856 303528 278031 170978 166062 149112 -122430 -159646 -315003 -656336
19359 -656336 -640301 -324205 -581183 -721910 -471717 -350004 -512329 -1011512 -1329645 -1155930
19349 -1155930 -819398 -629841 -392384 -181437 -126919 -202921 -486799 -1066209 -1318881 -1226118
19339 -1226118 -1040589 -1336723 -1649047 -1703438 -1155129 -546080 -14663 180361 63231 119881
19329 119881 328028 534684 408940 -291646 -536263 -503629 -706866 -731355 -834986 -1280979
19319 -1280979 -1698630 -1655951 -1917547 -1982176 -1316912 -849958 -601419 -81746 146556 -125814
$$ packed form
19389A03999L7563m15575m59738K29927L19702K63905L63563K43483m29809n38749
19379b81729k64069r4462N210J63361M90165J69904j11872L5125L72667J62451
19369F46751j81895j61328k5497j07053m916j6950k71542l7216j55357l41333
19359f56336J6035L16096k56978j40727K50193J21713j62325m99183l18133J73715
19349a155930L36532J89557K37457K10947N4518p6002k83878n79410k52672R2763
19339a226118J85529k96134l12324n4391N48309O09049N31417J95024j17130N6650
19329A19881K08147K06656j25744p00586k44617L2634k03237k4489j03631m45993
19319a280979m17651M2679k61596o4629O65264M66954K48539N19673K28302k72370
$$ plain form
19309 -125814 -436602 -427566 -364221 -310623 -333227 -541816 -513630 -329505 -242433 -44378 -254572
19298 -254572 -736488 -1333957 -1876464 -2204672 -2044350 -1706274 -1591815 -1548516 -1390052 -1006201
19288 -1006201 -555861 -542929 -460864 47468 940997 1166162 1490531 1383710 599025 -86596
19278 -86596 -446960 -306456 -149195 -44593 252352 181462 -215432 -217056 -47961 165505
19268 165505 374075 633193 959958 997722 1117303 1029126 827697 965234 832626 518779
19258 518779 361856 225936 -391682 -752221 -627793 -515929 -398317 -623959 -1131002 -1201886
19248 -1201886 -813415 -574336 -765548 -706467 -359438 286979 257875 267201 442737 311694
19238 311694 302678 223889 244730 674573 1014483 1441201 1521104 962856 650601 313365
$$ packed form
19309a25814l10788R036O3345N3598k2604k08589K8186J84125Q7072J98055k10194
19298b54572m81916n97469n42507l28208J60322L38076J14459M3299J58464L83851
19288a006201M50340J2932Q2065N08332Q93529K25165L24369j06821p84685o85621
19278h6596l60364J40504J57261J04602K96945p0890l96894j624J69095K13466
19268A65505K08570K59118L26765L7764J19581q8177k01429J37537j32608l13847
19258E18779j56923j35920o17618l60539J24428J11864J17612k25642n07043p0884
19248a201886L88471K39079j91212N9081L47029O46417k9104R326J75536j31043
19238C11694r016p8789K0841M29843L39910M26718P9903n58248l12255l37236
$$ plain form
19228 313365 878 202377 322998 581168 1039731 1638456 1550886 1296269 1461607 1867992
19218 1867992 2756186 4002334 4765413 5384412 6429331 8283350 10693764 13147465 14795464
19209 14795464 14223624 11698528 8592358 6109072 4497184 3165678 2776647 2596289
19201 2596289 2044770 1540304 1242235 886146 388167 746875 1095063 757795 279411
19192 279411 -131073 -289432 -293810 -234324 -135975 -43771 -26047 108764 239763 556002 903291
19181 903291 797914 314025 -327868 -520792 -381387 -645428 -971237 -860822 -178602 610230
19171 610230 800596 1028681 1131928 1264270 1376508 951874 407308 20232 -168439 -356691
19161 -356691 -171114 -1518 202 343344 358323 197506 73212 353617 849146 1047633
$$ packed form
19228C13365l12487K01499J20621K58170M58563N98725q7570k54617J65338M06385
19218A867992Q88194J246148P63079O18999J044919J854019K410414K453701J647999
19209A4795464n71840k525096l106170k483286j611888j331506l89031j80358
19201B596289n51519n04466k98069l56089m97979L58708L48188l37268m78384
19192B79411m10484j58359m378N9486R8349R2204J7724J34811J30999L16239L47289
19181I03291j05377m83889o41893j92924J39405k64041l25809J10415O82220P88832
19171F10230J90366K28085J03247J32342J12238m24634n44566l87076j88671j88252
19161c56691J85577J69596J720L43142J4979j60817j24294K80405M95529J98487
$$ plain form
19151 1047633 1045014 862936 460870 -58927 -821594 -977013 -719237 -577671 -295725 -275525
19141 -275525 -276252 -182524 -482914 -599083 -122224 169994 181731 408832 341978 217914 84212
19130 84212 -218710 -670587 -671636 -388908 164447 157868 -148962 -19052 208758 142355 383808
19119 383808 731056 979955 710664 405429 394972 208282 134059 309813 507555 342430
19109 342430 20829 -255929 -723609 -793959 -865448 -866830 -744074 -672028 -762316 -646836 -513455
19098 -513455 -20815 330853 221249 289864 305164 -40708 -195281 -407082 -562642 -637449
19088 -637449 -762865 -764208 -693436 -275134 239962 420398 282313 5751 117500 445593
19078 445593 430356 300087 294282 191244 -200618 -60947 468494 761975 715631 508573
$$ packed form
19151A047633k619j82078m02066n19797p62667j55419K57776J41566K81946K0200
19141b75525p27R3728l00390j16169M76859K92218J1737K27101o6854j24064j33702
19130H4212l02922m51877j049K82728N53355o579l06830J29910K27810o6403K41453
19119C83808L47248K48899k69291l05235j0457j86690p4223J75754J97742j65125
19109C42430l21601k76758m67680p0350p1489j382J22756P2046r0288J15480J33381
19098e13455M92640L51668j09604O8615J5300l45872j54573k11801j55560p4807
19088f37449j25416j343P0772M18302N15096J80436j38085k76562J11749L28093
19078D45593j5237j30269n805j03038l91862J39671N29441K93481m6344k07058
$$ plain form
19068 508573 416743 305441 319085 357051 348340 383103 331217 213394 76574 176789 623309
19057 623309 945382 1219470 1332648 1060112 852168 1057615 916913 545705 464477 53588
19047 53588 -425377 -913376 -1272903 -708735 202355 399033 226019 218659 -132209 -806832
19037 -806832 -776802 -413882 270218 758557 567696 326507 152118 -49641 -288875 -440015
19027 -440015 -705717 -1039725 -968191 -796539 -449236 -122714 460730 1157855 1442356 1225197
19017 1225197 1014718 922497 1322529 1312027 808757 346693 433633 339275 253559 509035
19007 509035 1102223 1081915 752897 421831 184533 215533 -43883 -156695 -263727 -161495
18997 -161495 -166997 -380207 -535758 -905889 -865228 -512608 -609522 -443792 61540 351836
$$ packed form
19068E08573r1830j11302J3644L7966q711L4763n1886j17823j36820J00215M46520
19057F23309L22073K74088J13178k72536k07944K05447j40702l71208q1228m10889
19047E3588m78965m87999l59527N64168R11090J96678j73014p360l50868o74623
19037h06832L0030L62920O84100M88339j90861k41189j74389k01759k39234j51140
19027d40015k65702l34008P1534J71652L47303L26522N83444O97125K84501k17159
19017A225197k10479r2221M00032j0502n03270m62064Q6940r4358q5716K55476
19007E09035N93188k0308l29018l31066k37298L1000k59416j12812j07032J02232
18997a61495n502k13210j55551l70131M0661L52620r6914J65730N05332K90296
$$ plain form
18987 351836 302673 180249 -1118 -172689 -401630 -846543 -887670 -833087 -811283 -758669
18977 -758669 -651345 -1115065 -1099445 -587683 -331217 -493637 -641906 -812399 -1244275 -1559598
18967 -1559598 -1655273 -1543218 -1663755 -1556117 -1122213 -725765 -67649 441851 491732 493510
18957 493510 414854 754286 1209424 1697989 1377734 153485 -606409 -619519 -687754 -616587
18947 -616587 -280989 -423864 -625401 -822934 -723477 -183484 212826 401809 116135 -413554
18937 -413554 -254865 303677 289508 -91828 17785 305341 242869 35278 80292 553477
18927 553477 804938 638447 717469 1053307 1172160 1240578 1132093 659236 393619 793617
18917 793617 1065997 882117 607820 219485 -119688 -398995 -640097 -877045 -863020 -813715
$$ packed form
18987C51836m9163j22424j81367j71571k28941m44913m1127N4583K1804N2614
18977g58669J07324m63720J5620N11762K56466j62420j48269j70493m31876l15323
18967a559598r5675J12055j20537J07638M33904L96448O58116N09500M9881J778
18957D93510p8656L39432M55138M88565l20255j224249p59894j3110o8235P1167
18947f16587L35598j42875k01537j97533R9457N39993L96310J88983k85674n29689
18937d13554J58689N58542j4169l81336J09613K87556o2472k07591M5014M73185
18927E53477K51461j66491P9022L35838J18853O8418j08485m72857k65617L99998
18917G93617K72380j83880k74297l88335l39173k79307k41102k36948J4025M9305
$$ plain form
18907 -813715 -612207 -527629 -416829 -515317 -484924 -389905 -591504 -683727 -631272 -202745 154693
18896 154693 -213639 -361775 -132197 -119419 -462671 -574304 -471577 -232791 10566 190950
18886 190950 223488 319748 517968 473570 415264 225175 67621 -176227 -151684 78871
18876 78871 -96976 -287276 -158819 -277910 -261873 -342297 -65492 206476 32860 -301671
18866 -301671 -370831 -352175 -419632 -436992 -419441 -780623 -1125397 -805857 -505030 -452095 -380950
18855 -380950 -249541 -350086 -277892 -367967 -600948 -640062 -411892 -126927 -280016 -422286
18845 -422286 -191950 137507 -12728 143130 764157 1006478 1077840 1238453 684936 385160
18835 385160 483060 47671 -307645 -597624 -445323 30099 691047 1062989 720387 309826
$$ packed form
18907h13715K01508Q4578J10800r8488L0393R5019k01599r2223N2455M28527L57438
18896A54693l68332j48136K29578J2778l43252j11633J02727K38786K43357J80384
18886A90950L2538R6260J98220m4398n8306j90089j57554k43848K4543K30555
18876G8871j75847j90300J28457j19091J6037q0424K76805K71968j73616l34531
18866c01671o9160J8656o7457j7360J7551l61182l44774L19540L00827N2935P1145
18855c80950J31409j00545P2194r0075k32981l9114K28170K84965j53089j42270
18845d22286K30336L29457j50235J55858O21027K42321P1362J60613n53517k99776
18835C85160R7900m35389l55316k89979J52301M75422O60948L71942l42602m10561
$$ plain form
18825 309826 -30891 63968 412328 290804 357670 440682 110492 -148668 -392827 -614796
18815 -614796 -705276 -741009 -792192 -978696 -1283431 -1322114 -415756 355076 519472 386343
18805 386343 180841 -60293 -268868 -610330 -470224 -62720 -367657 -543622 -494971 -412010
18795 -412010 -215710 22420 261188 206412 192118 177345 31528 66837 -134876 -121795
18785 -121795 315359 713982 478814 -15216 58869 373914 307140 312131 251289 155308 455006
18774 455006 705304 773063 726350 1238912 1472040 1053101 509682 360238 252037 307099
18764 307099 908267 1195331 1132386 770381 498139 318839 255722 35826 74459 16516
18754 16516 44635 169668 -30812 -367055 -123682 244992 98168 -145539 -365106 -878571
$$ packed form
18825C09826l40717R4859L48360j21524O6866Q3012l30190k59160k44159k21969
18815f14796r0480l5733n1183j86504l04735l8683R06358P70832J64396j33129
18805C86343k05502k41134k08575l41462J40106M07504l04937j75965M8651Q2961
18795d12010J96300K38130K38768n4776j4294j4773j45817L5309k01713J3081
18785a21795M37154L98623k35168m94030P4085L15045o6774M991o0842r5981K99698
18774D55006K50298O7759m6713N12562K33128m18939n43419j49444j08201N5062
18764C07099O01168K87064o2945l62005k72242j79300o3117k19896L8633n7943
18754A6516K8119J25033k00480l36243K43373L68674j46824k43707k19567n13465
$$ plain form
18744 -878571 -1023372 -441697 -57617 -65069 -47024 -54956 -309872 -5518 506444 623255
18734 623255 520088 537542 354871 220711 383123 324331 15599 119704 214979 259481
18724 259481 544403 897237 737831 290289 47491 183667 12866 -404501 -386737 -522321
18714 -522321 -559911 -351244 -326721 -374761 111692 450425 557512 794378 895515 835453
18704 835453 707291 417913 -52205 -538421 -354433 -186506 -376317 -486725 -351759 -89981
18694 -89981 -17450 -213684 246521 710444 549377 395107 687478 825524 626351 246451
18684 246451 -205923 -298637 -201887 2729 300596 117383 -221650 -656072 -1038832 -1068039
18674 -1068039 -864160 -224598 69873 -290731 -350345 -513027 -866448 -1276553 -1335424 -972619
$$ packed form
18744h78571j44801N81675L84080p452J8045p932k54916L04354N11962J16811
18734F23255j03167J7454j82671j34160J62412n8792l08732J04105R5275M4502
18724B59481K84922L52834j59406m47542k42798J36176j70801m17367J7764j35584
18714e22321l7590K08667K4523m8040M86453L38733J07087K36866J01137o0062
18704H35453j28162k89378m70118m86216J83988J67927j89811j10408J34966K61778
18694h9981P2531j96234M60205M63923j61067j54270K92371J38046j99173l79900
18684B46451m52374r2714R6750K04616K97867j83213l39033m34422l82760k9207
18674a068039K03879O39562K94471l60604n9614j62682l53421m10105n8871L62805
$$ plain form
18664 -972619 -998607 -1184016 -1127617 -788287 -186450 76835 35692 -115563 -10649 161150
18654 161150 -182000 -581099 -632922 -531525 -577020 -595796 -385235 -165403 -18486 228540
18644 228540 560753 671218 435095 220429 -36123 -11834 22510 2196 181719 21840
18634 21840 -292439 -310530 5398 449801 690019 701106 659582 588868 472709 327071
18624 327071 61811 88238 180622 153259 -31600 -415909 -733795 -887260 -1138618 -998967
18614 -998967 -397789 -229913 -81846 79695 -246727 -523425 -323851 -46154 184514 131182
18604 131182 -131804 -199437 -187789 -291 -133184 -808441 -956491 -130450 738796 767501
18594 767501 134017 -201249 -64577 -45865 -182777 -497013 -421223 -132481 -272752 -335720
$$ packed form
18664i72619k5988j85409N6399L39330O01837K63285m1143j51255J04914J71799
18654A61150l43150l99099n1823J01397m5495j8776K10561K19832J46917K47026
18644B28540L32213J10465k36123k14666k56552K4289L4344k0314J79523j59879
18634B1840l14279j8091L15928M44403K40218J1087m1524p0714j16159j45638
18624C27071k65260K6427R2384k7363j84859l84309l17886j53465k51358J39651
18614i98967O01178J67876J48067J61541l26422k76698J99574K77697K30668n3332
18604A31182k62986o7633J1648J87498j32893o75257j48050Q26041Q69246K8705
18594G67501o33484l35266J36672J8712j36912l14236P5790K88742j40271o2968
$$ plain form
18584 -335720 -313985 -317706 12931 538098 1053715 936189 471364 319016 -22319 -425695
18574 -425695 -303758 -34920 285147 633773 558872 502164 432635 471858 184307 -437904
18564 -437904 -465425 -218078 11739 -67316 26327 109788 -197938 -114313 59417 383094
18554 383094 911666 889897 337498 -164166 -471366 -535901 -379270 61806 118191 -218253
18544 -218253 -783503 -967716 -563619 88592 527838 539562 752614 978684 991408 617438
18534 617438 230091 -111939 -556457 -639890 -1124717 -1496046 -1346719 -938391 -630780 -296689
18524 -296689 186821 400771 -190886 -823562 -902161 -820807 -567247 -387288 -317725 -582606
18514 -582606 -587680 -265541 -226807 -559174 -715825 -717334 -545769 -218199 -76067 177489
$$ packed form
18584c35720K1735l721L30637N25167N15617j17526m64825j52348l41335m03376
18574d25695J21937K68838L20067L48626p4901n6708o9529L9223k87551o22211
18564d37904k7521K47347K29817p9055R3643Q3461l07726Q3625J73730L23677
18554C83094N28572k1769n52399n01664l07200o4535J56631M41076N6385l36444
18544b18253n65250j84213M04097O52211M39246J1724K13052K26070J2724l73970
18534F17438l87347l42030m44518q3433m84827l71329J49327M08328L07611L34091
18524b96689M83510K13950n91657o32676p8599Q1354K53560J79959O9563k64881
18514e82606n074L22139L8734l32367j56651j509J71565L27570J42132K53556
$$ plain form
18504 177489 319031 164330 -144104 -275732 -208217 -234313 187394 986663 1407928 620942
18494 620942 319469 651955 157338 -574234 -597099 -36884 198620 341774 278516 108035
18484 108035 228346 790740 911768 909617 1060896 1001176 703658 332517 -13062 -29111
18474 -29111 241670 384360 310799 459876 1048016 1085329 482251 -73236 -436053 -521973
18464 -521973 -261411 37617 105011 146989 265663 328292 772566 917822 961909 949399
18454 949399 1276388 1782329 1965005 1961969 2139698 2660024 3161138 3955376 4637653 5382084
18444 5382084 6602297 7841624 9052191 11084050 13666315 16541629 20732670 27053218
18436 27053218 35298385 43914212 48062814 44142856 35633909 27303370 20734545 16081058
$$ packed form
18504A77489J41542j54701l08434j31628O7515k6096M21707P99269M21265p86986
18494F20942l01473L32486m94617p31572k2865N60215K35504J43154o3258j70481
18484A08035J20311N62394J21028k151J51279n9720k97518l71141l45579j6049
18474b9111K70781J42690p3561J49077N88140L7313o03078n55487l62817q5920
18464e21973K60562K99028O7394M1978J18674O2629M44274J45256M4087j2510
18454I49399L26989N05941J82676l036J77729N20326N01114P94238O82277P44431
18444E382084J220213J239327J210567K031859K582265K875314M191041O320548
18436B7053218Q245167Q615827M148602l919958q508947q330539o568825m653487
$$ plain form
18428 16081058 13055826 11217647 9930928 8709003 7823890 7076452 6348714 5607148 5167862
18419 5167862 4556419 3505692 2281143 1828925 1813938 1799995 2078316 1853772 1562329
18410 1562329 1104429 786331 422033 351352 604279 310176 -108856 12870 -44951 -238618
18400 -238618 -399308 -423155 -293428 177712 250226 73634 27394 288548 680082 789699
18390 789699 1005416 1409780 1081272 460167 85543 -37889 744502 1300614 1032985 599081
18380 599081 505353 710502 971739 948769 707279 332667 322767 621703 464248 320926
18370 320926 281749 207255 370351 94959 29062 213597 224456 -55313 -194150 -170985
18360 -170985 -339674 -471122 -452305 -296235 -280978 -184973 146013 -159979 -526885 -446003
$$ packed form
18428A6081058l025232j838179j286719j221925q85113p47438p27738p41566m39286
18419E167862o11443j050727j224549m52218j4987j3943K78321k24544k91443
18410A562329m57900l18098l64298p0681K52927k94103m19032J21726n7821j93667
18400b38618j60690k3847J29727M71140P2514j76592m6240K61154L91534J09617
18390G89699K15717M04364l28508o21105l74624j23432P82391N56112k67629m33904
18380E99081r3728K05149K61237k2970k41490l74612r900K98936j57455j43322
18370C20926l9177p4494J63096k75392o5897J84535J0859k79769j38837K3165
18360a70985j68689j31448J8817J56070J5257R6005L30986l05992l66906Q0882
$$ plain form
18350 -446003 -703867 -504791 -200327 40079 -15495 -189601 -388192 -104269 224492 241351
18340 241351 368893 599426 493625 141048 57955 169644 -87327 -369248 -379147 109270
18330 109270 590174 599458 432922 32539 -104670 215074 284855 -111539 -338001 -236878
18320 -236878 -113516 -258752 -315641 -565974 -860788 -875891 -826454 -499594 -124855 -95398
18310 -95398 -145659 -365171 -383706 -400602 -527481 -610530 -637827 -657065 -246232 -53855 -129973
18299 -129973 -205789 -82413 -96097 -365898 -304349 -265468 -43146 191732 494 -202708
18289 -202708 -264053 -78102 207335 417679 358326 -106924 -276786 -463933 -1064304 -1925523
18279 -1925523 -2294813 -2020259 -1773390 -1517233 -822186 -413921 -330110 -423444 -925083 -971986
$$ packed form
18350d46003k57864J99076L04464K40406n5574j74106j98591K83923L28761J6859
18340B41351J27542K30533j05801l52577q3093J11689k56971k81921r899M88417
18330A09270M80904R284j66536m00383j37209L19744O9781l96394k26462J01123
18320b36878J23362j45236n6889k50333k94814j5103M9437L26860L74739K9457
18310i5398n0261k19512j8535j6896j26879q3049k7297j9238M10833J92377p6118
18299a29973p5816J23376j3684k69801O1549L8881K22322K34878j91238k03202
18289b02708o1345J85951K85437K10344n9353m65250j69862j87147o00371q61219
18279a925523l69290K74554K46869K56157O95047M08265Q3811r3334n01639m6903
$$ plain form
18269 -971986 -628141 -271143 -162203 -451494 -1000438 -1134523 -648739 -683994 -878119 -641446
18259 -641446 -671825 -857700 -799957 -845600 -1237066 -1035971 -724631 -536092 -364000 98298
18249 98298 436465 337387 341420 824761 1150074 1049548 892995 649568 146512 -1503
18239 -1503 190271 -127608 -332038 -392868 -701593 -576593 -383126 -707468 -717229 -291427
18229 -291427 147002 393236 459646 246766 9845 -94306 87829 130164 73849 -63286
18219 -63286 -201946 -126431 47746 376847 514089 348558 -236646 -800066 -1192228 -1115122
18209 -1115122 -751375 -474566 -512198 -669948 -691303 -737099 -985219 -653380 -285724 -209218
18199 -209218 70446 384455 612532 627418 465725 189106 10402 -251322 -439998 -352530
$$ packed form
18269i71986L43845L56998J08940k89291n48944j34085M85784l5255j94125K36673
18259f41446l0379j85875N7743m5643l91466K01095L11340J88539J72092M62298
18249I8298L38167r9078M033M83341L25313j00526j56553k43427n03056j48015
18239a503J91774l17879k04430o0830l08725J25000J93467l24342r761M25802
18229b91427M38429K46234O6410k12880k36921j04151J82135M2335n6315j37135
18219f3286j38660P5515J74177L29101J37242j65531n85204n63420l92162P7106
18209a115122L63747K76809l7632j57750k1355m5796k48120L31839L67656P6506
18199b09218K79664L14009K28077J4886j61693k76619j78704k61724j88676Q7468
$$ plain form
18189 -352530 -15972 335551 351013 322055 79414 27119 400 60572 -56399 -208122
18179 -208122 -242601 -615403 -558355 -760771 -1395541 -1476396 -666466 83688 287975 224502
18169 224502 149738 206167 22247 -141569 -117705 98692 294642 134800 30784 -109856
18159 -109856 -312868 -288876 151138 539180 144937 60218 377357 592254 349870 -528240
18149 -528240 -1271941 -1302915 -994758 -683296 -302154 -339166 -448265 -285927 -54480 234434
18139 234434 477331 420979 -122046 -808971 -1210803 -798320 -226026 -95196 -108545 -263378
18129 -263378 -354204 -190956 -75291 11227 337991 384919 178368 261107 601442 423407
18119 423407 44813 283439 444769 -50903 -111877 197038 682017 796984 381016 -30392
$$ packed form
18189c52530L36558L51523J5462k8958k42641n2295k6719O0172j16971j51723
18179b08122l4479l72802N7048k02416o34770q0855Q09930P50154K04287o3473
18169B24502p4764N6429j83920j63816K3864K16397J95950j59842j04016j40640
18159a09856k03012K3992M40014L88042l94243q4719L17139K14897k42384q78110
18149e28240p43701l0974L08157L11462L81142l7012j09099J62338K31447K88914
18139B34434K42897n6352n43025o86925m01832M12483N72294J30830j3349j54833
18129b63378r0826J63248J15665Q6518L26764M6928k06551Q2739L40335j78035
18119D23407l78594K38626J61330m95672o0974L08915M84979J14967m15968m11408
$$ plain form
18109 -30392 59626 291419 3409 -429122 -757590 -899030 -478769 200712 681786 448702
18099 448702 388928 396548 160964 -319373 -932785 -942130 -549246 -221558 52221 103418 -157319
18088 -157319 -276241 -219799 -8189 237692 -230846 -308755 203590 320823 -24699 -474433
18078 -474433 -478628 -297643 -106300 101505 303892 418588 507129 229012 -677631 -1305223
18068 -1305223 -1342515 -860890 -541143 -90297 576982 781744 1051771 541435 -424943 -574970
18058 -574970 -25058 542278 413731 132786 -426612 -423499 -121074 -92361 -217668 -172686
18048 -172686 151688 278506 197393 115153 248534 -114468 -786532 -1058610 -1193123 -1250561
18038 -1250561 -675547 -395535 -318449 -354249 -291175 -2170 234634 178226 27059 -248769
$$ packed form
18109c0392R0018K31793k88010m32531l28468j41440M20261O79481M81074k33084
18099D48702n9774P620k35584m80337o13412r345L92884L27688K73779N1197k60737
18088a57319j18922N6442K11610K45881m68538p7909N12345J17233l45522m49734
18078d74433m195J80985J91343K07805K02387J14696Q8541k78117r06643o27592
18068a305223l7292M81625L19747M50846O67279K04762K70027n10336r66378j50027
18058e74970N49912N67336j28547k80945n59398L113L02425K8713j25307M4982
18048a72686L24374J26818q1113q2240J33381l63002o72064k72078j34513n7438
18038a250561N75014K80012P7086l5800O3074K89005K36804n6408j51167k75828
$$ plain form
18028 -248769 -246003 -302240 -212810 -220872 -120718 129760 213149 243682 534710 796668 668969
18017 668969 489318 630955 463522 -300355 -623876 -167454 367578 552879 469945 235670
18007 235670 418104 570770 253910 -211792 -530330 -661840 -336714 26277 136327 362647
17997 362647 355698 229005 544037 344298 -527792 -539816 11420 764012 1075032 1005658
17987 1005658 1428640 1661662 1239346 719687 282993 108390 -80114 -196863 -381
17978 -381 11198 -108599 -21591 58029 -242771 -169865 12552 -226578 -81368 95069 -77014
17967 -77014 -231773 -293795 -375555 -214973 -38539 252989 521024 26476 -436282 -582964
17957 -582964 -952673 -963217 -682478 -487975 -680035 -1175176 -1359100 -1170603 -1118887 -1505633
$$ packed form
18028b48769K766n6237Q9430q062J00154K50478Q3389L0533K91028K61958j27699
18017F68969j79651J41637j67433p63877l23521M56422N35032J85301q2934k34275
18007B35670J82434J52666l16860m65702l18538j31510L25126L62991J10050K26320
17997C62647o949j26693L15032j99739q72090j2024N51236P52592L11020o9374
17987A005658M22982K33022m22316n19659m36694j74603j88504j16749J96482
17978c81J1579j19797Q7008P9620l00800P2906J82417k39130J45210J76437j72083
17967g7014j54759o2022q1760J60582J76434K91528K68035m94548m62758j46682
17957e82964l69709j0544K80739J94503j92060m95141j83924J88497N1716l86746
$$ plain form
17947 -1505633 -1317609 -793520 -549054 -541670 -237254 291129 386860 394124 327204 58820
17937 58820 -23811 -205150 -242992 -106948 -81211 -222592 -144912 -149782 -140230 236302 415328
17926 415328 242838 91611 284002 163341 -121732 -275005 -357322 -288138 -194596 -201899
17916 -201899 -557001 -753719 -1065966 -1377950 -1326234 -1238963 -1092801 -507607 -284615 -782349
17906 -782349 -963509 -999552 -958608 -651776 -591219 -670069 -650122 -596845 -717226 -552790 -303173
17895 -303173 -468115 -499351 -369593 -691070 -1095458 -1325748 -1076296 -329735 -232032 -856008
17885 -856008 -1564276 -1785600 -1404426 -804991 -504346 -446402 -391240 -504360 -834904 -744337
17875 -744337 -337984 -315759 -628533 -694051 -157492 -21314 -18974 180523 96562 -107283
$$ packed form
17947a505633J88024N24089K44466P384L04416N28383R5731P264o6920k68384
17937E8820q2631j81339l7842J36044K5737j41381P7680m870R552L76532J79026
17926D15328j72490j51227J92391j20661k85073j53273q2317O9184R3542p303
17916b01899l55102j96718l12247l11984N1716Q7271J46162N85194K22992m97734
17906g82349j81160l6043M0944L06832O0557p8850J9947N3277j20381J64436K49617
17895c03173j64942l1236J29758l21477m04388k30290K49452P46561R7703o23976
17885h56008p08268k21324L81174N99435L00645N7944N5162j13120l30544R0567
17875g44337M06353K2225l12774o5518N36559J36178K340J99497q3961k03845
$$ plain form
17865 -107283 392577 1075700 904096 652223 792991 940130 741660 507245 135303 -149631
17855 -149631 -378704 -732984 -1033847 -849822 -356989 85031 240078 66104 -32202 322346
17845 322346 508802 94813 -214543 -352361 -197817 -31715 -406752 -517677 -317666 445
17835 445 325251 413430 482937 583760 361772 88305 -310755 -463388 76755 643319
17825 643319 648340 43036 -552720 -762302 -773448 -790551 -721660 -732061 -416250 180043 494803
17814 494803 -5948 -592341 -538405 -282919 -437241 -462883 -209105 113431 160654 -104796
17804 -104796 -316810 -389470 -168721 -241164 -306721 102626 762994 1052677 673495 336042
17794 336042 103408 -160461 -43542 236034 27383 48754 143237 270126 566241 768214
$$ packed form
17865a07283M99860O83123j71604k51873J40768J47139j98470k34415l71942k84934
17855a49631k29073l54280l00863J84025M92833M42020J55047j73974r8306L54548
17845C22346J86456m13989l09356j37818J54544J66102l75037j10925K00011L18111
17835D45L24806Q8179O9507J00823k21988k73467l99060j52633N40143N66564
17825F43319N021o05304n95756k09582j1146j7103O8891j0401L15811N96293L14760
17814D94803n00751n86393N3936K55486j54322k5642K53778L22536M7223k65450
17804a04796k12014p2660K20749p2443o5557M09347O60368K89683l79182l37453
17794C36042k32634k63869J16919K79576k08651K1371R4483J26889K96115K01973
$$ plain form
17784 768214 403153 -192476 -458931 -309053 -330325 -431505 -433171 -312359 -240162 -457371
17774 -457371 -698905 -599342 -493611 -457188 -53694 444610 362107 136388 221869 145611
17764 145611 -3511 -193108 -481697 -689350 -682625 -743214 -860292 -767712 -416372 -151946
17754 -151946 -231638 -322344 -357117 -193071 -48854 120848 404501 540912 57110 -163558
17744 -163558 40036 -126877 -480423 -449128 -302644 -103127 160194 53034 -395181 -821743
17734 -821743 -746308 -51382 478896 844217 544013 100620 -4392 -93065 102779 -18887
17724 -18887 -370251 -469394 -232845 65827 -32386 3430 441827 313246 -439642 -678623
17714 -678623 -284229 285354 422514 403062 796273 1109863 916996 139449 -418640 -221886
$$ packed form
17784G68214l65061n95629k66455J49878k1272j01180j666J20812P2197k17209
17774d57371k41534R9563J05731L6423M03494M98304q2503k25719Q5481p6258
17764A45611j49122j89597k88589k07653O725o0589j17078R2580L51340K64426
17754a51946p9692r0706l4773J64046J44217J69702K83653J36411m83802k20668
17744a63558K03594j66913l53546L1295J46484J99517K63321j07160m48215m26562
17734h21743P5435O94926N30278L65321l00204m43393j05012q8673J95844j21666
17724a8887l51364r9143K36549K98672r8213L5816M38397j28581p52888k38981
17714f78623L94394N69583J37160j9452L93211L13590j92867p77547n58089J96754
$$ plain form
17704 -221886 182754 200319 -4666 -178341 41707 357693 402565 550148 676996 754330
17694 754330 668535 333986 303382 411412 102139 338821 602994 125342 -36254 303941
17684 303941 680513 940996 937923 720525 984968 1027307 1075766 1118568 1340664 2095316
17674 2095316 2928341 3132899 3393555 4090679 4844370 5621849 6558259 7693642 8836464
17665 8836464 10633739 13828520 18124371 23239211 29460608 37190704 44376818 46157820
17657 46157820 40528424 31798604 24170301 18585776 14464954 11844962 9634055 7775704
17649 7775704 6771523 6204606 5280302 4100832 3264196 2841515 2494213 1948222 1758885
17640 1758885 2204776 2145928 1678312 1581618 1393599 1058097 1170196 1468784 1491338 1031843
$$ packed form
17704b21886M04640J7565k04985j73675K20048L15986M4872J47583J26848P7334
17694G54330q5795l34549l0604J08030l09273K36682K64173m77652j61596L40195
17684C03941L76572K60483l073k17398K64443M2339M8459M2802K22096P54652
17674B095316Q33025K04558K60656O97124P53691P77479R36410J135383J142822
17665H836464J797275L194781M295851N114840O221397P730096P186114J781002
17657D6157820n629396q729820p628303n584525m120822k619992k210907j858351
17649G775704j004181n66917r24304j179470q36636m22681l47302n45991j89337
17640A758885M45891n8848m67616r6694j88019l35502J12099K98588K2554m59495
$$ plain form
17630 1031843 343717 88492 378233 427061 444781 299300 82203 -66603 -324301 -270381
17620 -270381 -62756 -159887 -137547 164186 388374 770203 1505851 1949121 2286221 2735634
17610 2735634 2408972 1775142 1518951 946233 525318 427034 668291 1252057 1365765 791715
17600 791715 431105 154114 150297 526464 689849 410335 -40779 -110221 188163 449495
17590 449495 462356 340013 -23399 -328553 -448362 -502532 -302935 172864 214740 -43941
17580 -43941 -137151 -217826 -330537 -206642 126462 571463 1189471 1259190 1148471 930902
17570 930902 819788 385426 -89162 -433211 -716106 -492847 -670510 -1034079 -871557 -671261
17560 -671261 -555254 -610452 -596111 -453133 -133449 -28542 -195848 -52549 15260 -205825
$$ packed form
17630A031843o88126k55225K89741M8828J7720j45481k17097j48806k57698N3920
17620b70381K07625r7131K2340L01733K24188L81829P35648M43270L37100M49413
17610B735634l26662o33830k56191n72718m20915r8284K41257N83766J13708n74050
17600G91715l60610k76991l817L76167J63385k79514m51114o9442K98384K61332
17590D49495J2861j22343l63412l05154j19809n4170J99597M75799M1876k58681
17580d3941r3210q0675j12711J23895L33104M45001O18008O9719j10719k17569
17570I30902j11114m34362m74588l44049k82895K23259j77663l63569J62522K00296
17560f71261J16007n5198J4341J42978L19684J04907j67306J43299O7809k21085
$$ plain form
17550 -205825 -668120 -975049 -728084 -134997 76041 161797 165922 357702 404919 556650
17540 556650 458122 424199 632511 430415 348261 176196 368104 825976 790323 414051
17530 414051 -147140 -461633 -789575 -945466 -474975 103304 16028 -120282 -12172 -962
17520 -962 -299761 -314470 82039 410413 394892 5022 -694097 -936006 -377319 -49989
17510 -49989 194642 -73909 -361045 -406879 -12860 448092 356181 -41371 139699 455543
17500 455543 -51544 -282155 -279542 -134644 -100603 -259209 -253299 -111652 -93760 -57347 203416
17489 203416 673042 849847 1003922 834864 194685 -115812 74996 61692 -65490 -354340
17479 -354340 -530757 -452255 -172583 -170823 -259702 -176633 -165798 -62002 255904 418701 404088
$$ packed form
17550b05825m62295l06929K46965N93087K11038Q5756M125J91780M7217J51731
17540E56650r8528l3923K08312k02096q2154j72065J91908M57872l5653l76272
17530D14051n61191l14493l27942j55891M70491N78279q7276j36310J08110J1210
17520i62k98799j4709L96509L28374j5521l89870o99119k41909N58687L27330
17510d9989K44631k68551k87136m5834L94019M60952r1911l97552J81070L15844
17500D55543n07087k30611K613J44898L4041j58606N910J41647J7892L6413K60763
17489B03416M69626J76805J54075j69058o40179l10497J90808j3304j27182k88850
17479c54340j76417P8502K79672J760q8879Q3069J0835J03796L17906J62797j4613
$$ plain form
17468 404088 426783 187963 -136471 -33311 204277 347176 101343 -136556 -352557 -570489
17458 -570489 -719751 -821450 -631479 -686574 -781868 -487208 -177014 -166714 -560027 -874921
17448 -874921 -722992 -383103 -136915 88605 80914 -332998 -671752 -811435 -911725 -912323
17438 -912323 -1287683 -1583725 -1456200 -1510666 -1093433 -645719 -476571 -103540 243157 71320
17428 71320 -353499 -725077 -1096430 -922311 -602937 -189682 -13468 208121 673738 668374
17418 668374 475460 72094 255947 619862 43082 -329150 -612578 -851169 -822014 -480500
17408 -480500 76724 439513 620296 547948 162352 -297081 -203444 141450 309671 409924
17398 409924 592769 722764 460546 163352 266752 466804 425010 44694 -247564 119366
$$ packed form
17468D04088K2695k38820l24434J03160K37588J42899k45833k37899k16001k17932
17458e70489j49262j01699J89971n5095r5294K94660L10194J0300l93313l14894
17448h74921J51929L39889K46188K25520p691m13912l38754j39683j00290n98
17438i12323l75360k96042J27525n4466M17233M47714J69148L73031L46697j71837
17428G1320m24819l71578l71353J74119L19374M13255J76214K21589M65617n364
17418F68374j92914m03366J83853L63915n76780l72232k83428k38591K9155L41514
17408d80500N57224L62789J80783p2348l85596m59433R3637L44894J68221J00253
17398D09924J82845J29995k62218k97194J03400K00052m1794l80316k92258L66930
$$ plain form
17388 119366 161199 -40121 -16950 -206759 -359720 -280902 -196043 -289827 -359911 -152245 -204487
17377 -204487 -640484 -1037148 -1072797 -776475 -805909 -1248845 -1464140 -1449026 -1049038 -461295
17367 -461295 -349694 -371016 -548474 -796631 -789816 -947891 -738088 -320475 -147100 -927
17357 -927 248533 152241 -355252 -411833 -613214 -875878 -865303 -742418 -555671 -356098 -297010
17346 -297010 -508856 -725356 -854563 -564075 -129202 322710 832368 908026 395254 -55106
17336 -55106 -437936 -422335 -275506 -286797 -47405 276069 420929 260007 42825 -218338
17326 -218338 -520396 -511211 -300357 -47825 27384 402599 818973 816602 550580 296010
17316 296010 -105311 -622928 -1125402 -1465294 -1412780 -1083840 -967718 -766021 -540473 -633503
$$ packed form
17388A19366M1833k01320K3171j89809j52961P8818Q4859r3784p0084K07666n2242
17377b04487m35997l96664l5649K96322k9434m42936k15295J5114L99988N87743
17367d61295J11601k1322j77458k48157O815j58075K09803M17613J73375J46173
17357i27K49460r6292n07493n6581k01381k62664J0575J22885J86747J99573N9088
17346b97010k11846k16500j29207K90488M34873M51912N09658P5658n12772m50360
17336e5106l82830J5601J46829j1291K39392L23474J44860j60922k17182k61163
17326b18338l02058R185K10854K52532P5209L75215M16374k371k66022k54570
17316B96010m01321n17617n02474l39892N2514L28940J16122K01697K25548r3030
$$ plain form
17306 -633503 -759417 -648392 -475205 -312996 -239756 -506078 -470153 -405143 -494300 -398899
17296 -398899 -204937 61393 185099 -11426 -358837 -277700 -12764 -185596 -530667 -745302
17286 -745302 -758685 -487073 -103417 8223 160387 -130109 -352734 -274449 -474978 -604594
17276 -604594 -366497 -265493 -377353 -555834 -609882 -525327 -593279 -607739 -292917 -79634
17266 -79634 78076 193169 311552 566978 388175 -216831 -510654 -832048 -791365 -579452
17256 -579452 -317194 23075 -59997 44936 117800 55487 -169851 -258721 20610 509480
17246 509480 926432 834534 734319 777378 982243 801832 651008 783209 865224 777188
17236 777188 91260 -672216 -885397 -947082 -739486 -252264 155779 421297 439060 308436
$$ packed form
17306f33503j25914J11025J73187J62209P3240k66322L5925O5010q9157R5401
17296c98899J93962K66330J23706j96525l47411Q1137K64936j72832l45071k14635
17286g45302j3383K71612L83656J11640J52164k90496k22625P8285k00529j29616
17276f04594K38097J01004j11860j78481n4048Q4555o7952j4460L14822K13283
17266g9634J57710J15093J18383K55426j78803o05006k93823l21394M0683K11913
17256e79452K62258L40269q3072J04933P2864o2313k25338q8870K79331M88870
17246E09480M16952r1898j00215M3059K04865j80411j50824J32201Q2015q8036
17236G77188o85928p63476k13181o1685K07596M87222M08043K65518J7763j30624
$$ plain form
17226 308436 513066 324918 159588 58431 333010 388154 224807 66770 212612 434440
17216 434440 410180 -127916 -82813 722427 1247041 1228428 909685 921965 1311739 1375609
17206 1375609 796216 274144 -162982 -187076 -221183 -206517 -163234 -319859 -666963 -1068529
17196 -1068529 -1123381 -772947 -708507 -1047244 -1090273 -936436 -615843 -507492 -563070 -364352
17186 -364352 -276707 -377336 -398782 -548441 -576213 -571314 -403120 -144696 -294592 -597658
17176 -597658 -66830 381163 422730 611011 872641 832574 491416 62541 -352199 -414658
17166 -414658 -78838 191087 172787 488109 539954 93405 -183661 -184689 115657 -65566
17156 -65566 -600273 -553708 -275702 49428 69997 -136422 -146906 247571 433705 524627
$$ packed form
17226C08436K04630j88148j65330j01157K74579N5144j63347j58037J45842K21828
17216D34440k4260n38096M5103Q05240N24614j8613l18743J2280L89774O3870
17206A375609n79393n22072m37126k4094l4107J4666M3283j56625l47104m01566
17196a068529n4852L50434O4440l38737m3029J53837L20593J08351n5578J98718
17186c64352Q7645j00629k1446j49659k7772M899J68194K58424j49896l03066
17176e97658N30828M47993M1567J88281K61630m0067l41158m28875m14740o2459
17166d14658L35820K69925j8300L15322N1845m46549k77066j028L00346j81223
17156f5566n34707M6565K78006L25130K0569k06419j0484L94477J86134R0922
$$ plain form
17146 524627 808033 998925 794275 740896 779365 702574 431337 189925 192203 -64907
17136 -64907 -989839 -1479459 -1414177 -1166900 -549161 27156 427849 703789 1120605 1485481
17126 1485481 1085672 -83907 -796226 -441909 -121386 316262 297559 103370 323394
17117 323394 603772 1222360 1982953 2383631 2386427 1854207 1292950 690147 120134 54694
17107 54694 122792 206346 277989 323609 231808 194931 442750 442706 58723 -289623 -177032
17096 -177032 37842 -7353 203072 461394 547451 263587 -349811 -926468 -1199018 -885822
17086 -885822 -523018 -163533 -231310 -377828 -122677 -58494 47335 226025 472398 705276
17076 705276 1074766 1494329 1462937 1036902 614677 425591 269574 -37652 -447052 -722046
$$ packed form
17146E24627K83406J90892k04650n3379L8469p6791k71237k41412K278k57110
17136f4907r24932m89620O5282K47277O17739N76317M00693K75940M16816L64876
17126A485481l99809j169579p12319L54317L20523M37648j8703j94189K20024
17117C23394K80378O18588P60593M00678K796n32220n61257o02803n70013o5440
17107E4694O8098Q3554P1643M5620r1801l6877K47819m4l83983l48346J12591
17096a77032K14874m5195K10425K58322Q6057k83864o13398n76657k72550L13196
17086h85822L62804L59485o7777j46518K55151O4183J05829J78690K46373K32878
17076G05276L69490M19563l1392m26035m22225j89086j56017l07226m09400k74994
$$ plain form
17066 -722046 -496052 -499734 -430823 -151016 -297053 -439159 -645785 -900280 -684143 -351001
17056 -351001 217677 661938 727404 643220 483235 195546 91631 169243 -52129 -203475
17046 -203475 -482398 -776063 -733501 -754849 -602805 -682781 -827633 -903817 -810112 -533831
17036 -533831 -390320 -396295 -460571 -163159 -152647 -233763 35296 124257 -344470 -886260 -1085111
17025 -1085111 -1194691 -1186924 -1218544 -961669 -479299 -338999 -177907 6502 339240 500294
17015 500294 432516 -261329 -863957 -680115 -454673 -463267 -521463 -460726 -222420 134025
17005 134025 104010 -127317 -461036 -596603 -475327 -132781 133218 -262498 -624223 -575927
16995 -575927 -296416 -212902 77001 219793 585475 1291384 1387519 920738 369708 503864
$$ packed form
17066g22046K25994l682O8911K79807j46037j42106k06626k54495K16137L33142
17056c51001N68678M44261O5466q4184j59985k87689j03915P7612k21372j51346
17046b03475k78923k93665M2562k1348J52044p9976j44852p6184R3705K76281
17036e33831J43511n975o4276K97412J0512q1116K69059Q8961m68727n41790j98851
17025a085111j09580P767l1620K56875M82370J40300J61092J84409L32738J61054
17015E00294o7778o93845o02628J83842K25442q594n8196O0737K38306L56445
17005A34025l0015k31327l33719j35567J21276L42546K65999l95716l61725M8296
16995e75927K79511Q3514K89903J42792L65682P05909R6135m66781n51030J34156
$$ plain form
16985 503864 911264 984360 531848 96523 229218 374385 180244 67553 90198 62691
16975 62691 63191 -165192 -299107 -119276 90207 275648 295412 21592 -102521 303360
$$ packed form
16985E03864M07400P3096m52512m35325J32695J45167j94141j12691K2645k7507
16975F2691N00k28383j33915J79831K09483J85441J9764k73820j24113M05881
$$ [...]
##END NTUPLES=NMR SPECTRUM
##END=
