##TITLE=C13_SR8+TFA
 CDCl3, 19400 sc

 16.11.2020
##JCAMPDX= 6.0         $$ Bruker NMR JCAMP-DX V2.0
##DATA TYPE= NMR SPECTRUM
##DATA CLASS= NTUPLES
##ORIGIN= UXNMR, Bruker Analytische Messtechnik GmbH
##OWNER= root
$$ XWIN-NMR		Version 3.5
$$ Tue Nov 17 09:45:42 2020 Russian Standard Time (UT+4h)  she@DPX200
##.OBSERVE FREQUENCY= 50.327896
##.OBSERVE NUCLEUS= ^13C
##.ACQUISITION MODE= SIMULTANEOUS
##.ACQUISITION SCHEME= undefined
##.AVERAGES= 19402
##.DIGITISER RES= 17
##SPECTROMETER/DATA SYSTEM= spect
##.PULSE SEQUENCE= zgpg30
##.SOLVENT NAME= CDCl3
##.SHIFT REFERENCE= (INTERNAL, CDCl3, 0, 222.661)
##AUDIT TRAIL= $$ (NUMBER, WHEN, WHO, WHERE, WHAT)
$$ ##TITLE= Audit trail, XWIN-NMR		Version 3.5
$$ ##JCAMPDX= 5.01
$$ ##ORIGIN= Bruker BioSpin GmbH
$$ ##OWNER= she
$$ F:/spectra/data/she/nmr/c13/1/pdata/1/auditp.txt
$$ ##AUDIT TRAIL=  $$ (NUMBER, WHEN, WHO, WHERE, WHAT)
(   1,<2020-11-17 09:42:14.60 +0400>,<she>,<DPX200>,
      <created by zg, POWCHK disabled, PULCHK disabled
       terminated by command 'halt'
       configuration hash MD5:
       00 E9 B6 7A A2 85 ED C7 34 08 36 98 17 FE 4E 26
       data hash MD5: 32K
       4D 7A FA 39 1E D8 14 C3 08 06 40 D4 AE 48 A6 A1>)
(   2,<2020-11-17 09:43:13.35 +0400>,<she>,<DPX200>,
      <Start of raw data processing
       efp BC_mod = 2 LB = 1 FT_mod = 6 PKNL = 1 PHC0 = -228.1267 PHC1 = 26.56241 SI = 32K 
       data hash MD5: 32K
       B3 DF E2 46 87 62 5D 5A B8 6A 44 9E 29 72 73 3E>)
(   3,<2020-11-17 09:43:38.40 +0400>,<she>,<DPX200>,
      <abs ABSG = 5 
       data hash MD5: 32K
       2E A4 AF DF 9E 8F 49 8A 0D 22 C1 A2 43 A8 3B B8>)
(   4,<2020-11-17 09:43:46.26 +0400>,<she>,<DPX200>,
      <pk PHC0 = 5.358224 PHC1 = 0 
       data hash MD5: 32K
       66 5E AA 52 5F 59 63 FE F4 88 F6 D3 81 19 5B 65>)
(   5,<2020-11-17 09:44:13.43 +0400>,<she>,<DPX200>,
      <pk PHC0 = -2.592854 PHC1 = 3 
       data hash MD5: 32K
       BC EB FA 64 30 44 A8 E4 71 DD 34 3E 57 BF D5 20>)
(   6,<2020-11-17 09:44:17.56 +0400>,<she>,<DPX200>,
      <abs ABSG = 5 
       data hash MD5: 32K
       9D FF A3 06 55 F0 3C 12 4E 1E 5C 94 BA D9 9D AD>)
(   7,<2020-11-17 09:45:08.79 +0400>,<she>,<DPX200>,
      <pk PHC0 = -4.39148 PHC1 = 7.399999 
       data hash MD5: 32K
       CC 55 AE AF B9 ED 37 3E 4D 2C BC A1 87 65 2F D1>)
(   8,<2020-11-17 09:45:12.42 +0400>,<she>,<DPX200>,
      <abs ABSG = 5 
       data hash MD5: 32K
       4E E4 A1 20 80 7A 29 43 5F 10 D5 9D 70 CE 3C AC>)
$$ ##END=
$$ 
$$ hash MD5
$$ 34 2A AF 5A 59 FB F0 61 5E BA 3A 33 D4 D6 E5 FA
##$RELAX= 
##$RELAX= 
##$RELAX= 
##$RELAX= 
##$RELAX= 
##$RELAX= 
##$RELAX= 
##$RELAX= 
$$ Bruker specific parameters
$$ --------------------------
##$DU= <F:/spectra>
##$EXPNO= 1
##$NAME= <c13>
##$PROCNO= 1
##$TYPE= <nmr>
##$USER= <she>
##$AMP= (0..31)
100 100 100 100 100 100 100 100 100 100 100 100 100 100 100 100 100 100 
100 100 100 100 100 100 100 100 100 100 100 100 100 100 
##$AQSEQ= 0
##$AQ_mod= 1
##$AUNM= <au_zg>
##$AUTOPOS= <>
##$BF1= 50.322709
$$ [...]
##$SUBNAM4= <"">
##$SUBNAM5= <"">
##$SUBNAM6= <"">
##$SUBNAM7= <"">
##$SUBNAM8= <"">
##$SUBNAM9= <"">
##$SW= 239.972175391363
##$SWIBOX= (0..15)
0 1 3 0 0 0 0 0 0 0 0 0 0 0 0 0 
##$SW_h= 12077.2946859903
##$TD= 32768
##$TD0= 1
##$TE= 0
##$TE2= 300
##$TE3= 300
##$TEG= 300
##$TL= (0..7)
120 120 120 120 120 120 120 120 
##$TP= (0..7)
150 150 150 150 150 150 150 150 
##$TP07= 0
##$TPNAME0= <>
##$TPNAME1= <>
##$TPNAME2= <>
##$TPNAME3= <>
##$TPNAME4= <>
##$TPNAME5= <>
##$TPNAME6= <>
##$TPNAME7= <>
##$TPOAL= (0..7)
0.5 0.5 0.5 0.5 0.5 0.5 0.5 0.5 
##$TPOFFS= (0..7)
0 0 0 0 0 0 0 0 
##$TUNHIN= 0
##$TUNHOUT= 0
##$TUNXOUT= 0
##$USERA1= <user>
##$USERA2= <user>
##$USERA3= <user>
##$USERA4= <user>
##$USERA5= <user>
##$V9= 5
##$VALIST= <valist>
##$VCLIST= <CCCCCCCCCCCCCCC>
##$VD= 0
##$VDLIST= <DDDDDDDDDDDDDDD>
##$VPLIST= <PPPPPPPPPPPPPPP>
##$VTLIST= <TTTTTTTTTTTTTTT>
##$WBST= 1024
##$WBSW= 4
##$XGAIN= (0..3)
0 0 0 0 
##$XL= 0
##$YL= 0
##$YMAX_a= 85349446
##$YMIN_a= -129833150
##$ZGOPTNS= <>
##$ZL1= 120
##$ZL2= 120
##$ZL3= 120
##$ZL4= 120
##$ABSF1= 222.6606
##$ABSF2= -17.33621
##$ABSG= 5
##$ABSL= 3
##$ALPHA= 0
##$AQORDER= 0
##$ASSFAC= 0
##$ASSFACI= 0
##$ASSFACX= 0
##$ASSWID= 0
##$AUNMP= <proc_1d>
##$AZFE= 0.1
##$AZFW= 0.5
##$BCFW= 0
##$BC_mod= 2
##$BYTORDP= 0
##$COROFFS= 0
##$CY= -3
##$DATMOD= 1
##$DC= 0
##$DFILT= <>
##$DTYPP= 0
##$F1P= 0
##$F2P= 0
##$FCOR= 0.5
##$FTSIZE= 32768
##$FT_mod= 6
##$GAMMA= 0
##$GB= 0
##$INTBC= 1
##$INTSCL= 4.134877e-10
##$ISEN= 128
##$LB= 1
##$LEV0= 0
##$LPBIN= 0
##$MAXI= 10000
##$MC2= 0
##$MEAN= 0
##$ME_mod= 0
##$MI= 0.1934396
##$NCOEF= 0
##$NC_proc= 2
##$NLEV= 6
##$NOISF1= 120.0001
##$NOISF2= 80.00006
##$NSP= 0
##$NTH_PI= 0
##$NZP= 0
##$OFFSET= 222.6606
##$PC= 1.4
##$PHC0= -229.7528
##$PHC1= 36.96241
##$PH_mod= 1
##$PKNL= yes
##$PPARMOD= 0
##$PSCAL= 0
##$PSIGN= 0
##$REVERSE= no
##$SF= 50.322729756361
##$SI= 32768
##$SIGF1= 140
##$SIGF2= 120
##$SINO= 11.81781
##$SIOLD= 32768
##$SREGLST= <13C.CDCl3>
##$SSB= 0
##$STSI= 32768
##$STSR= 0
##$SW_p= 12077.2946859903
##$SYMM= 0
##$S_DEV= 0
##$TDeff= 32768
##$TDoff= 0
##$TI= <>
##$TILT= no
##$TM1= 0
##$TM2= 0
##$TOPLEV= 0
##$USERP1= <user>
##$USERP2= <user>
##$USERP3= <user>
##$USERP4= <user>
##$USERP5= <user>
##$WDW= 1
##$XDIM= 32768
##$YMAX_p= 433064885
##$YMIN_p= -2031712
$$ End of Bruker specific parameters
$$ ---------------------------------
##NTUPLES= NMR SPECTRUM
##VAR_NAME=  FREQUENCY,     SPECTRUM/REAL,   SPECTRUM/IMAG
##SYMBOL=    X,             R,               I
##VAR_TYPE=  INDEPENDENT,   DEPENDENT,       DEPENDENT
##VAR_FORM=  AFFN,          ASDF,            ASDF
##VAR_DIM=   32768,         32768,           32768
##UNITS=     HZ,            ARBITRARY UNITS, ARBITRARY UNITS
##FACTOR=    0.368581032318806, 1,           1
##FIRST=     11204.8891385315, 0,            0
##LAST=      -872.405547458802, 0,           0
##MIN=       -872.405547458802, -2031712,    0
##MAX=       11204.8891385315, 433064885,    0
$$ Real data points
##PAGE= N=1
##DATA TABLE= (X++(R..R)), XYDATA
$$ [...]
18054 -797783 -200223 183663 241012 442925 923813 1205969 1003802 555487 153163 -101483
18044 -101483 -386964 -312182 -174096 -349236 -782461 -1273799 -960851 -370359 -442849 -710266
18034 -710266 -756772 -427352 -182467 -211396 -356442 -525028 -277624 17807 -154636 -322003
18024 -322003 -378398 -700950 -626854 -340267 -954184 -1547499 -1116682 -192682 58891 -208945
18014 -208945 -484662 -593918 -302557 -172943 251944 684166 512325 170967 -27600 24008
18004 24008 93034 301967 362754 408998 249916 120362 498898 789809 405388 194573
17994 194573 102866 -331674 -389735 -285147 -485697 -394327 -67946 76307 -273576 -288111
17984 -288111 -212594 -233537 -100009 154473 452655 634541 339700 -333267 -788658 -624110
17974 -624110 -663247 -679041 -454829 -265193 264381 655372 563716 441196 561019 411831
17964 411831 265282 -27294 -139556 -183167 -173488 104515 223485 -20764 -373930 -744933
17954 -744933 -709491 -362321 274667 880256 960488 1277607 993526 457257 262070 269610
17944 269610 160105 49842 -222173 -665714 -604333 -126561 88936 -4878 -234754 -506172
17934 -506172 -183074 113377 100431 138935 156274 317736 682233 956054 862834 535804
17924 535804 357600 68115 -125906 -353794 -400769 -221132 -205720 -526648 -636295 -291980
17914 -291980 -339977 -515348 -392930 -398503 -624190 -973849 -1086177 -1279600 -1213408 -1254831
17904 -1254831 -1305862 -1023114 -712982 -409991 -27768 409318 795655 672815 307533 195731
17894 195731 91418 -41760 -202702 -129696 -57127 -213312 -296303 -180331 155946 -27180
17884 -27180 -71064 413311 967517 1382582 1221329 831994 766173 814862 238153 -312167
17874 -312167 -235132 -95375 -347293 -657320 -857843 -613455 -369637 -415907 -734835 -882814
17864 -882814 -548191 -164943 -186966 -286365 -166029 -189280 -424819 -230235 27237 165603
17854 165603 299738 355329 228133 -43791 -64908 176107 395105 81327 -364754 -686307
17844 -686307 -903600 -730872 -652241 -957855 -1288200 -1108479 -662682 -317171 -517554 -514684
17834 -514684 -24483 730852 1074886 493901 -202634 -457394 -519399 -391777 -34603 325782
17824 325782 302644 69149 174928 666943 733587 536281 196330 12620 529228 794748
17814 794748 835636 814334 398276 164512 324588 385687 214592 -173278 -500199 -442616
17804 -442616 -402752 -559034 -772405 -683079 -552569 -288724 139831 248812 49998 -200770
17794 -200770 -270052 121952 271926 239619 58997 -134713 -185363 -326162 -435964 -659372
17784 -659372 -443157 -236789 -256209 -568151 -683527 -556565 -488743 -619628 -654735 -692551
17774 -692551 -843447 -1049007 -731942 -481002 -159952 -255000 -884133 -936991 -494699 -387667
17764 -387667 -421208 -714055 -1157627 -1074850 -798357 -252902 -223522 -659997 -859930 -659172
17754 -659172 -234255 157572 343544 167756 -259585 -359949 -324732 -278959 -15689 122586
17744 122586 -255055 -364434 -371693 -292316 -231482 -502147 -658181 -342194 182834 541224
17734 541224 727283 744341 636140 313125 -91006 -229027 200687 828314 1132007 1134483
17724 1134483 1063088 518482 93522 273785 145968 -229328 -283010 -51983 -170187 -200766
17714 -200766 180350 184830 -119189 -221630 -147638 -18637 303108 272548 78209 -7405
17704 -7405 -393460 -483695 -24038 526896 1022511 984431 835203 557269 85235 -189983
17694 -189983 -343075 -417274 36335 318259 198539 -16205 -213523 -399440 -559210 -744201
17684 -744201 -462876 -168672 -82078 -493513 -592846 -139789 39866 132294 -86851 -285892
17674 -285892 -384756 -358753 -288502 -481403 -637145 -164637 128433 229957 471775 762914
17664 762914 733904 645443 913940 1354637 1644316 1317199 544673 210306 -112372 -460935
17654 -460935 77033 266585 -306986 -459689 -253949 -258048 -264331 31714 246551 292982
17644 292982 209224 612218 901943 568652 375691 186345 -9812 -212629 -79980 156169
17634 156169 241402 204234 282584 250990 109589 418194 630980 305620 145802 821238
17624 821238 1655065 2156715 2397857 2131123 1912809 1915642 2068836 2547602 2920176 3290306
17614 3290306 3924881 4327039 4605669 5393983 7119985 9165565 11349472 14154286 18228550
17605 18228550 23843552 31131223 41228464 54307531 66266892 72585049 71450915 62768851
17597 62768851 48810160 35268754 25818876 19536006 15082785 11866598 9927860 8460572
17589 8460572 7003183 5527065 4279177 3434338 2917317 2485953 2393970 2349904 1919361
17580 1919361 1335619 1038822 842550 771861 1008903 1023311 726762 523024 282644 373762
17570 373762 956229 1296364 931000 616049 760052 881682 679240 493661 539429 565229
17560 565229 597536 496744 314644 147947 48450 -164954 -142994 -52144 -232052 -612534
17550 -612534 -702142 -655534 -824529 -632449 -330107 -215425 240343 597547 900026 988420
17540 988420 936886 565221 256630 379642 327958 -223921 -656198 -715668 -702714 -649698
17530 -649698 -353312 222372 480363 665540 724904 375665 89796 -226245 -645308 -914679
17520 -914679 -863201 -584774 -612827 -533817 -204838 -228457 -743120 -913816 -736515 -712036
17510 -712036 -760237 -601844 -321246 -182129 -312890 -651739 -804155 -1033873 -982586 -811413
17500 -811413 -796921 -598150 8055 323308 356150 422064 460386 287851 373476 554776
17490 554776 412557 3565 -317160 -816361 -1045506 -965516 -980968 -772964 -478205 -91597
17480 -91597 88805 -155298 -235186 226542 468306 439414 584435 833896 661313 360763
17470 360763 9957 -219428 -74855 287038 418846 261748 -113207 -354077 -762369 -898611
17460 -898611 -577717 -132071 141516 -1108 -180893 -101517 102564 283505 146466 166035
17450 166035 370470 532023 303357 35159 19258 67112 -252023 -488823 -336139 -370247
17440 -370247 -561047 -652496 -660870 -370355 -143428 -325556 -660206 -764596 -766290 -361249
17430 -361249 -173059 -626955 -1002178 -1043134 -921894 -493490 230094 563762 485295 156217
17420 156217 86323 221274 52070 -158326 -385230 -589712 -789642 -812243 -836501 -831570
17410 -831570 -583485 -292125 -161679 -389503 -373594 -179454 -150136 -225457 59180 149388
17400 149388 -354728 -944179 -894736 -588922 -588851 -668297 -483573 -229282 -109999 -266065 -686734
17389 -686734 -553412 -154755 -50821 392890 849610 1192824 917887 289362 -238973 -68195
17379 -68195 359135 534331 718185 725334 755074 817786 993797 640411 -34138 -489904
17369 -489904 -789106 -713841 -338575 37701 109128 -98748 -541694 -888239 -667785 -602905
17359 -602905 -650812 -416058 151542 621242 639763 561518 498886 477280 491791 317609 274824
17348 274824 17899 -92628 -63950 -35730 -137335 -639897 -986949 -861404 -380869 232737
17338 232737 356428 188107 58674 122610 4749 -55720 -274127 -159560 84697 42623
17328 42623 155203 -56292 -246850 -242474 -307155 -507801 -574186 -364377 -226550 48760
17318 48760 331595 417928 217490 39097 -24507 -250167 -751470 -1023941 -590083 95394
17308 95394 543779 807862 399990 -488144 -1090750 -1167471 -885888 -566603 -223330 -268866
17298 -268866 -284487 -6605 -54430 -560972 -718909 -599142 -601002 -606071 -399827 -370226 -299500
17287 -299500 -250149 -101965 81059 352883 676310 255096 -165583 -108387 -220273 -431624
17277 -431624 -505690 -331657 -162339 -4084 232708 199567 -152132 -324731 -520155 -387865
17267 -387865 -85085 214084 364627 -85525 -165377 249130 443598 314684 610572 968755
17257 968755 1010435 898297 750607 1011362 993485 551575 25814 -216636 -164667 252432
17247 252432 667548 843240 694297 734848 904619 780875 142160 -412894 -301569 -421819
17237 -421819 -288460 -298891 -473684 -464036 -345138 -85119 527170 1134610 1267184 1260971
17227 1260971 764429 121190 -150884 -314642 -623826 -590295 -351465 -141637 132917 91910
17217 91910 410364 827105 765588 519246 231491 98301 211248 265744 162752 -97054
17207 -97054 -365638 -259618 12987 340583 576028 537823 474647 429973 241366 403735
17197 403735 1007433 1112702 1119851 1340826 1405429 866878 195310 -94013 -205787 -116066
17187 -116066 39615 545264 934012 1358074 1633327 1827851 2015207 1714551 1096812 571653
17177 571653 424192 455973 382779 -73747 -442727 -264539 -68446 -224896 -223737 -199644
17167 -199644 -245464 -491928 -776130 -684813 -477505 -542965 -650555 -457865 -464101 -617993
17157 -617993 -642534 -829578 -975885 -997419 -1174336 -910342 -281033 65346 27972 -492625
17147 -492625 -865787 -765327 -780728 -897629 -686683 -18930 526359 560898 210589 -401584
17137 -401584 -498872 -180574 -134188 -98552 -249151 -546660 -458083 -155559 119528 337101
17127 337101 279606 59807 -376670 -785557 -1173304 -1373608 -1287123 -1004865 -747822 -595199
17117 -595199 -597647 -465981 -390066 -277179 -45338 -38416 -590506 -1211060 -1478708 -1224579
17107 -1224579 -978939 -1160763 -1252431 -990407 -366641 209044 548819 433165 269688 16777
17097 16777 -321009 -373264 -491876 -550434 -384753 -202187 -135583 -176938 -592408 -911797
17087 -911797 -1145203 -1297356 -1054384 -614204 -313662 -128693 -333001 -455527 -674811 -777058
17077 -777058 -777277 -904542 -784038 -464732 -83727 -19612 8671 -204922 -94323 314828
17067 314828 298875 -47448 -284084 -505271 -692661 -478784 -397080 -560082 -910615 -1205640
17057 -1205640 -1163686 -1074474 -827789 -437945 127160 322912 24022 46734 -12576 -350191
17047 -350191 -326649 63738 420831 523308 502121 376953 -159514 -582496 -416085 41540
17037 41540 81670 -351079 -712774 -661892 -74371 226625 87448 -110116 -305979 -663001
17027 -663001 -867407 -806501 -881187 -965263 -514563 18352 310477 138270 -142542 -434221
17017 -434221 -532283 -615673 -501100 -236739 102169 261600 628708 1163880 1056466 756479
17007 756479 551539 377210 541816 565079 561531 458976 361554 381842 186409 103137 -90558
16996 -90558 -159644 -296224 -164795 61359 67922 -79967 60648 150768 187041 297108 494668
16985 494668 637026 480600 108780 -357941 -801599 -829176 -453769 -52999 266432 151812
16975 151812 -46253 139466 477460 443300 374344 389466 324191 617741 480098 107566
16965 107566 -211949 -449342 -494862 -523776 -685686 -912696 -815598 -701665 -696514 -559838
16955 -559838 -442825 -545315 -389147 -179009 73045 75420 132025 400633 301790 -51072
16945 -51072 180627 429358 684875 883974 745342 433433 163735 235593 228752 -455171
16935 -455171 -866017 -807814 -483642 27375 24963 124696 54722 -333997 -537863 -403644
16925 -403644 -210093 -115169 91266 305567 380558 139126 -263043 -877716 -1098650 -929332
16915 -929332 -774404 -685829 -577891 -408616 -370915 -340424 -306521 -715224 -1150930 -948697
16905 -948697 -409521 162859 307675 337162 282399 86939 315309 483206 464001 309487
16895 309487 212713 283417 299143 -284503 -881867 -805724 -513103 -209136 -114248 -223460
16885 -223460 -637002 -682947 -716589 -542916 -145629 -86854 -199585 -458998 -608051 -644374
16875 -644374 -962424 -973811 -1052603 -1177413 -1348417 -1265262 -715483 -399468 -336719 -488171
16865 -488171 -234557 84586 87177 287384 299743 112683 -69634 -287400 -413228 -167462
16855 -167462 467687 722712 534599 122069 -46317 -49750 -128150 -71307 246841 648424
16845 648424 793766 1021656 1315075 1557159 1627636 1758284 2274153 2887552 3215401 3390411
16835 3390411 3625369 3991475 5177869 7206405 10101881 13978548 17883439 21415115
16827 21415115 23868111 24219113 21879309 17118656 12492210 9238077 7102566 5707329
16819 5707329 4670133 3868559 2937134 2387235 2221362 1985780 1788905 1586863 1446708
16810 1446708 1359894 1138701 1189918 1492415 1049179 634535 976455 1219284 1340385 1244908
16800 1244908 816313 262506 -78534 57569 231445 482427 769411 1056466 1286610
16791 1286610 1098693 531586 52274 -181609 -348702 -191740 -143285 -494902 -841710 -590191
16781 -590191 117874 298305 183486 307570 457793 293433 73653 -177091 -498269 -277625
16771 -277625 238952 457136 629178 365477 -299299 -370874 -41521 350387 355810 580848
16761 580848 1097791 1203428 779177 112052 -167117 -290151 -372625 -602317 -959361 -1330960
16751 -1330960 -1339744 -1163078 -852517 -784996 -609908 -258699 35418 141090 -87227 -567907
16741 -567907 -749370 -627460 -619290 -293194 -57750 -507196 -905809 -683306 -156030 -37343
16731 -37343 -61457 2453 112630 60655 204286 363246 214713 80601 -60866 -391867
16721 -391867 -529946 -623939 -689261 -1041842 -1543785 -1658063 -1526805 -1302735 -1052072 -409360
16711 -409360 16830 213815 238437 99531 -170193 69857 146223 -141715 -152626 73835
16701 73835 417605 732744 954062 1003324 806551 597485 636235 743661 461386 93574
16691 93574 -228597 -480484 -291017 161823 340577 97031 -252934 -353670 -330071 -472683
16681 -472683 -224870 362348 345665 241232 127623 162481 333436 267456 204839 -39025
16671 -39025 -193524 -244526 -18413 432645 569439 356688 154885 -12965 -310688 -444681
16661 -444681 -293279 -67360 -103648 -407046 -168462 -171507 -353756 -524707 -926356 -859876
16651 -859876 -613204 -428613 -430671 -436816 -585179 -603226 -178856 -73579 -62863 -347917 -917289
16640 -917289 -697022 -90910 142536 -32330 -205197 -389855 -508099 -392902 -513836 -656705
16630 -656705 -533038 -519431 -399989 -127749 -60984 -322002 -802731 -1092725 -774699 -254911
16620 -254911 150603 -77300 -263530 59729 130869 -33081 -29729 -334247 -819369 -712066
16610 -712066 -337361 -250929 -192889 -8035 -6020 8363 386435 249146 -60257 91613
16600 91613 -96484 -705812 -1161256 -1296966 -904960 -325895 -231207 -633283 -689837 -555035
16590 -555035 -514554 -675872 -703539 -404209 -456939 -524319 -376989 -450075 -960926 -1411908
16580 -1411908 -1351562 -910133 -419774 -143905 125855 -187295 -505437 -643370 -543464 -46134
16570 -46134 109315 82419 314060 483094 112440 -519886 -896430 -678733 -365032 -281075
16560 -281075 175129 424482 328024 298939 168119 -197007 -253195 81034 334703 525205
16550 525205 561927 919713 1240529 1255251 1264576 1413938 1483522 1349180 989393 682867
16540 682867 804754 989039 657241 352674 268672 25753 -78957 -122353 77476 562183
16530 562183 758869 553547 -43765 -358414 -164264 -49256 -39998 -222298 -690236 -793467
16520 -793467 -797798 -870412 -928013 -736342 -266387 174321 387069 479185 380798 -56242 -197315
16509 -197315 55166 266124 219552 229709 625144 623049 418624 511949 311008 288888 403118
16498 403118 295718 81406 -310851 -282638 361459 741660 643355 653026 947655 1285136
16488 1285136 941476 581799 178969 -213260 -542217 -741783 -580961 -334159 -215428
16479 -215428 -328539 -326048 -536024 -935131 -803457 -501383 -213886 190042 897638 1156048
16469 1156048 685710 443578 210289 69551 196497 188284 -86941 -294494 -497319 -449906
16459 -449906 -56766 317922 416199 571240 317834 -134719 -658649 -882902 -693083 -250689
16449 -250689 195830 473816 645110 320223 -128812 -346272 -443617 -247240 80977 173684
16439 173684 -210289 -708300 -724809 -494855 -243550 31382 235157 183196 -5008 28103
16429 28103 509706 597064 363994 -16156 -204450 -95212 -355577 -440581 -456089 -355705
16419 -355705 -122655 76290 133536 393142 424178 -120577 -711364 -761377 -443492 379660
16409 379660 935037 853675 656139 394097 425116 163027 40049 -16661 -512745 -596157
16399 -596157 -511089 -520962 -410875 -204691 -189142 -422381 -741418 -892539 -637148 -351233
16389 -351233 -260251 -422021 -532990 -851370 -1127152 -776831 -39713 138671 -170925 -301555
16379 -301555 -362764 -446335 -388111 -480332 -628044 -414967 -146871 -764608 -1391760 -1397994 -1055437
16368 -1055437 -618050 -183475 -47632 -169115 -108609 204609 77 -668419 -929092 -741872
16358 -741872 -705935 -718005 -609559 -139521 307420 359895 299880 491895 783373 668640
16348 668640 131126 -201783 -113017 -252785 -433871 -690417 -906728 -948424 -785056 -252835
16338 -252835 415278 668275 489592 361154 177605 155902 545778 870648 564442 494211
16328 494211 766590 680199 505294 414607 -90507 -409888 -558694 -545302 -445713 -784126
16318 -784126 -956156 -675867 -400144 -244970 -432314 -394657 104451 567966 606005 142711
16308 142711 -159827 -437607 -497764 -186816 -31253 -513516 -1087355 -1233072 -705951 -11986
16298 -11986 283442 333718 163940 502828 963034 845634 437356 368128 449198 483642
16288 483642 282231 154672 238352 494334 846505 804799 561862 191017 90254 270450
16278 270450 560208 662923 463774 163506 138905 408570 181878 65208 156367 291987
16268 291987 472140 590886 717469 525905 262824 349713 662803 964692 1203273 1400256
16258 1400256 1398763 1045369 414198 -489666 -769908 -478633 -150535 62125 -122956 -393271
16248 -393271 -229962 -69422 76790 353486 483161 556311 497206 220776 -87729 -175373
16238 -175373 -152644 -135594 -123136 -215294 -402344 -317074 -33175 381449 885981 944968 1103361
16227 1103361 1238567 1184741 934845 397177 -206087 -778392 -881509 -553517 -495856 -361275
16217 -361275 60986 554724 627382 197526 -68968 -164573 32140 234843 213629 151838
16207 151838 -31917 -244 -57129 14752 -30 -57374 -101822 -287977 -380235 -593376 -665908
16196 -665908 -508429 -312208 -245264 -38862 -6519 -174224 -420567 -465975 -362912 -285320
16186 -285320 -345813 -146693 -7753 -197952 -42229 172533 452475 403281 417811 412150
16176 412150 247645 408577 522850 52559 -219186 52827 357936 542227 436284 592316
16166 592316 530723 143409 -202544 -445841 -657327 -571372 -51881 294363 202283 -249520
16156 -249520 -579164 -545762 154082 498399 146735 -125377 53686 189700 -23658 -189371
16146 -189371 -291767 -478801 -508845 -99972 316021 405101 14490 -461986 -581455 -673350
16136 -673350 -756425 -961855 -1377257 -1373210 -846990 -434816 -307046 -345947 -165367 -201826
16126 -201826 -533740 -698293 -449237 -71594 -135224 -118523 108542 202304 88018 178632
16116 178632 97534 -61289 -156208 -405961 -163031 214130 471297 337365 79047 -185359
16106 -185359 -55768 175474 612873 848346 808523 871556 855616 480058 111016 12617
16096 12617 499336 925212 672801 336820 645479 1291077 1485777 1437648 1117609 559054
16086 559054 39175 -55695 -29083 -35164 -126292 -403337 -558906 -386782 -316865 -387263 -446228
16075 -446228 -888754 -1204565 -1188655 -914266 -1023810 -1106447 -1039318 -986356 -660488 -410913
16065 -410913 -294932 -189376 153271 200960 14934 -32262 212268 355979 521188 473873
16055 473873 442305 474226 431928 202136 -213420 -566918 -360560 -286545 -454775 -346055
16045 -346055 35100 589107 627700 405513 461351 791900 371312 10327 175249 435610
16035 435610 631721 167913 14203 -52703 -299065 -547808 -883722 -774151 -168230 620222
16025 620222 705029 211567 155892 -139466 -440705 -627390 -783019 -757610 -390859 251112
16015 251112 546846 810033 1045053 671587 -83962 -190624 51486 241420 148270 -448559
16005 -448559 -971214 -789252 -713787 -766599 -461570 43321 427216 662363 780855 679556
15995 679556 217321 102318 55478 -819172 -1102660 -475935 494867 1214614 1364912 1178766
15985 1178766 862591 403338 -59324 -216016 -329642 -461630 -389599 -402751 -477156 -725828
15975 -725828 -680443 -110629 285764 21154 -25581 47989 105792 -207193 -597903 -792979
15965 -792979 -1099836 -1098040 -791626 -542481 -421320 -203621 5094 49419 37912 -133820
15955 -133820 -255138 -215898 31430 197861 72967 -118237 -298457 -286354 -78703 -72250
15945 -72250 -325529 -215234 -41851 -268417 -321573 -482269 -583822 -224301 97217 339252
15935 339252 683308 805702 686574 367872 252324 409823 612571 823289 939652 1189709
15925 1189709 1544868 1568676 1027685 386931 395268 398193 317715 277266 67125 -60085 -228540
15914 -228540 -360139 -359291 -359511 -253569 73687 746609 998892 675717 310844 473598 520840
15903 520840 125451 130790 494974 454373 -78610 -523942 -659481 -225925 -21218 -288508
15893 -288508 -449407 -669018 -719519 -567350 -223411 174791 235836 138134 223787 506606
15883 506606 772266 850224 978832 1038134 956044 658509 716875 495793 -90161 -111668
15873 -111668 333624 685494 637086 573661 329413 -152290 -422544 -254225 30565 284660
15863 284660 431973 516804 156492 84648 -151750 -568281 -861185 -752048 -536861 -316206
15853 -316206 -89524 76529 126421 165306 351916 233562 277826 268447 201554 458487 306239
15842 306239 476769 611477 483173 311884 80902 173345 309092 376389 363374 111055
15832 111055 -76401 -7603 226191 221575 220679 302437 280651 339974 509850 422153 523966
15821 523966 761154 357646 -242384 -279272 -18949 -103907 -522985 -491859 -426021 -494227
15811 -494227 -633557 -530985 -299029 -68761 64377 547971 916399 628503 35894 -151878
15801 -151878 354472 1054499 1327600 745485 9810 -579065 -673178 -359880 -242888 -350017
15791 -350017 -76902 69324 285230 703198 929210 956382 269703 -281154 -256241 -255873
15781 -255873 -279301 -238064 247584 356706 212984 234062 291897 82782 -178155 -423868
15771 -423868 -517714 -692103 -1018742 -718332 -182718 233417 529466 145123 -40553 208139
15761 208139 36836 -282623 -602930 -545719 -375140 -505150 -325760 -59255 -120960 -99690
15751 -99690 303518 552454 613291 800907 814183 499948 517391 636313 710273 768809 836832
15740 836832 693890 355534 31246 -141640 -10869 135513 214670 27141 -257985 -361174
15730 -361174 -327339 -320552 -706604 -611167 -354192 -446900 -252055 -22457 93088 92403 -10625
15719 -10625 -357047 -428946 -188122 -243781 -284089 -262085 -83270 305290 474378 475468 688432
15708 688432 659315 96097 -189984 -162221 -289634 -219661 -20338 -139916 -268665 -283314
15698 -283314 -257436 -192905 -139795 -63280 -207227 -435698 -196298 -130577 -197098 156544 367223
15687 367223 -120823 -542031 -897793 -1066929 -524048 24504 -53937 -353451 -456257 -561421
15677 -561421 -591340 -510642 -291758 -126375 -255308 -527191 -811550 -1242261 -1540219 -1300074
15667 -1300074 -897632 -974444 -1167068 -842665 -482621 -546277 -373997 -34738 -229931 -563766
15657 -563766 -777448 -1200528 -1595888 -1641856 -1402705 -1008601 -737685 -542322 -475917 -685835
15647 -685835 -700350 -773314 -1114473 -1187304 -1126627 -866621 -615372 -107192 437216 890093
15637 890093 1226768 1136981 646755 -35776 -574269 -984511 -1073691 -673868 -493913 -623908
15627 -623908 -430009 -102365 -125205 -9418 -62676 -23429 244520 -127278 -212407 169475
15617 169475 73426 -123272 107023 183673 212747 371980 428788 594128 493393 252178
15607 252178 344219 731060 1016243 924798 457615 -6554 26232 278852 165560 -33838
15597 -33838 -332926 -803790 -251444 502501 637976 445383 -42647 -258084 -116880 -291791
15587 -291791 -299501 -87411 447622 580190 353905 503801 569149 388089 99078 -217491
15577 -217491 -112313 101008 -32124 -103464 -227778 -292695 -289596 -391692 -581683 -659445
15567 -659445 -396183 17887 -69564 -260472 -525049 -390039 277499 428487 248134 368029
15557 368029 479966 651238 598592 532754 168310 -374761 -410840 -314923 -73699 119593
15547 119593 558404 910981 797628 663220 468452 638508 518524 -187686 -705677 -820798
15537 -820798 -758244 -775399 -555426 -784797 -1005764 -907676 -1037664 -886819 -720320 -651789
15527 -651789 -404058 -167238 -82688 -405879 -447378 -289988 -407713 -439538 -238532 -315486
15517 -315486 -603199 -600335 -481935 -530030 -910204 -1368824 -1725298 -1481725 -1263960 -1282957
15507 -1282957 -1050969 -733574 -562224 -690695 -654286 -962241 -1177403 -1509934 -1583553 -1307994
15497 -1307994 -979387 -497740 13736 109396 -84372 149978 762671 825040 653528 433363
15487 433363 211542 326813 579692 657063 506589 28819 -285057 18956 69842 -240792
15477 -240792 -558503 -219613 202070 61506 -222534 -293409 -363188 -329481 -213832 -461092
15467 -461092 -640827 -584667 -451563 26915 134655 87864 712581 1014679 520409 354474
15457 354474 377690 278337 434257 682659 456683 344750 197538 16946 122002 294087
15447 294087 75370 -414584 -509045 -314046 -245734 -823003 -1649883 -1765969 -1551974 -1553025
15437 -1553025 -1634788 -1469602 -1261816 -1170277 -837809 -242504 245098 338430 78580 -110821
15427 -110821 -371652 -415731 -260119 -457142 -578450 -354760 41281 198472 10013 181539
15417 181539 306093 209952 389760 391088 -11527 -288245 -166871 50120 298406 290580
15407 290580 116186 -113602 -184827 -278553 -562080 -476045 -393847 -411435 -239728 -126603
15397 -126603 295434 523479 245547 24593 -232521 -579368 -888049 -649573 -154847 -9715
15387 -9715 -144019 -272022 -129129 -292143 -400415 -342942 -373077 -478655 -562603 -887428
15377 -887428 -1337073 -1377234 -1408341 -1252192 -848261 -280730 271456 685325 798722 570903
15367 570903 314848 -8541 -53807 -65393 248728 718342 815016 738595 541302 101357
15357 101357 -240062 -63943 -204560 -638548 -587178 -142395 237840 149902 -312326 -762382
15347 -762382 -1120165 -1153238 -827406 -708737 -542474 -348042 -414367 -339725 -364047 -138413
15337 -138413 358468 558566 730022 703441 751999 838469 674679 383023 -123844 -830664
15327 -830664 -787895 -462109 -286989 -113831 -153785 -29558 410413 297964 -71872 -713266
15317 -713266 -779577 -383340 -170655 26874 472705 840189 504887 147231 -21344 -378780
15307 -378780 -461437 -315038 -533391 -883257 -1256428 -1062983 -888184 -1123208 -1394279 -1189995
15297 -1189995 -1081851 -1195659 -1127373 -871541 -731660 -500758 -203834 88724 50460 -387172
15287 -387172 -757419 -747838 -801031 -574538 -45055 131970 -77227 -428335 -472745 -380776
15277 -380776 -309283 -228128 -170513 -279796 -605024 -586017 -502688 -487561 -321552 -283615 -395436
15266 -395436 -624999 -765631 -649674 -379645 -505254 -635120 -817059 -972724 -445557 -150385
15256 -150385 -208416 -394304 -789045 -605751 -351177 -377761 -483326 -652879 -787182 -821852
15246 -821852 -510530 -77846 -363512 -528611 -469572 -292863 207355 455532 508488 279581
15236 279581 -235857 -440591 -333396 -578171 -711652 -428330 129926 625250 846840 577421
15226 577421 578626 685586 799580 841837 853518 489691 -411636 -856083 -763710 -751771 -687059
15215 -687059 -839674 -1130348 -1272606 -979160 -787763 -231083 240233 280110 295222 329402
15205 329402 165650 -232677 -420126 64225 511264 179956 250790 343310 321259 636577
15195 636577 762680 828366 727327 362210 -65997 -466393 -714736 -1150110 -1387891 -1458572
15185 -1458572 -1332266 -1076371 -1049400 -1048361 -1028273 -593151 -53844 227453 419008 689387
15175 689387 915897 563067 173512 440491 893421 1403597 1490242 1054090 1047815 933399
15165 933399 613764 208922 -33508 -144108 -109064 167806 406343 885975 1224910 945134
15155 945134 638997 721617 1244430 1355007 1089112 901525 999373 1010298 570038 612508
15145 612508 807415 727957 415466 82541 53943 133373 130062 -60804 -355499 -46128
15135 -46128 289696 207792 109610 59373 239897 306908 -44301 -371959 -290406 -268727 -449298
15124 -449298 -634827 -345465 189612 224645 52285 109784 328640 511711 605073 772660
15114 772660 986979 1080945 980808 947277 715538 623174 504688 416980 362449 92054
15104 92054 213515 486082 441224 240322 -387752 -960301 -1044029 -761030 -223103 315212
15094 315212 239429 63059 -213623 -615658 -1056748 -1431608 -1581236 -1154678 -532078 -365959
15084 -365959 -270801 -14842 127231 -287356 -707150 -453004 -358176 -516162 -422471 -476484
15074 -476484 -191659 10014 345661 582902 278665 18968 240356 459424 604758 505826
15064 505826 24113 -416813 -853206 -1181270 -1378613 -1365072 -991789 -692416 -359047 -396729
15054 -396729 -607781 -444629 114700 456164 150490 -51147 476637 775554 369097 41101
15044 41101 175395 -126091 -406514 -230461 -196983 -247654 -510329 -437228 -494097 -176035
15034 -176035 488012 977029 1014994 757179 408016 -207346 -762217 -1000412 -1091240 -1116334
15024 -1116334 -1005458 -917889 -735131 -737086 -566102 -206755 -494812 -648469 -225962 369078
15014 369078 680575 592073 454880 524975 497029 703247 299024 -135096 76364 188409
15004 188409 318448 655644 563693 279411 65475 -199082 -3692 200466 209748 516606
14994 516606 668093 716636 410971 -25212 -358772 -975937 -1185222 -517033 102112 475924
14984 475924 722605 661595 325970 144926 -84671 -385383 -630482 -734247 -550661 -414584
14974 -414584 -412091 -333946 -126597 148185 396104 439855 657265 539265 176820 287098
14964 287098 333589 91358 -125895 -169013 -3653 18695 138896 519099 880141 845814
14954 845814 662444 514054 368282 229728 236036 548269 759556 631197 229169 45225
14944 45225 -212049 -238763 -68249 276019 539965 649243 930790 1124007 1325730 1117510
14934 1117510 444073 -182866 -411732 -510214 -449185 -224594 -339540 -657098 -147078 312874
14924 312874 246940 191985 259179 333300 9802 -261747 213732 349318 41154 -135087
14914 -135087 -105480 -464648 -752843 -601753 -256375 173434 362456 26929 -155815 -181580
14904 -181580 -118902 -139455 92810 532559 563806 355374 57354 -60987 -325409 -762537
14894 -762537 -1256682 -1669127 -1438644 -717596 -265592 -315163 -307237 -135534 1816 -288147
14884 -288147 -466861 -352992 -275467 -368872 -382422 -289375 -485720 -956531 -896222 -755299
14874 -755299 -837387 -764194 -332315 338445 740891 984606 1127909 999575 622866 240035
14864 240035 -438034 -607816 -229121 354980 302732 -502404 -735553 -502831 -244353 332880
14854 332880 717834 598998 297741 -358713 -920033 -1151944 -1196677 -842755 -326448 -144874
14844 -144874 265961 298677 331324 494602 697491 1174553 1481706 1565301 1245076 558831
14834 558831 359411 685944 427139 350836 267281 362356 507655 400959 441352 776049
14824 776049 959383 556202 -318572 -399037 -249256 -388669 -165565 -309979 -605429 -632326
14814 -632326 -536948 -923703 -1141811 -601425 -275942 -305658 -257408 -447248 -758828 -878926
14804 -878926 -589775 -191300 -30458 92508 62340 156175 405213 371017 -55713 -866250
14794 -866250 -1325703 -1131789 -622791 17707 625609 610697 -47493 -685435 -872516 -612117
14784 -612117 -559624 -420543 -223960 -263004 -146965 -44296 52872 80177 141817 266324
14774 266324 283248 266410 302170 5903 -247427 -403833 -440399 -421232 -397304 -209133 -15994
14763 -15994 84687 56051 -182683 -639785 -724818 -428509 -394952 -722936 -586820 -301568
14753 -301568 -86276 111099 192983 27456 -241864 -617183 -883413 -853752 -491603 153982
14743 153982 261619 291120 486964 745846 708734 459443 122144 -91137 26638 403551
14733 403551 715611 631517 350538 -48733 -47805 342611 630117 255343 -235532 -383742
14723 -383742 -423116 -177825 133651 149718 350772 198743 -246095 -319971 -534819 -795614
14713 -795614 -667488 -420621 -268720 30585 240581 25457 52516 367633 348958 -91253
14703 -91253 -145339 -151077 -435457 -372672 -304603 -162368 -415627 -595543 -275940 -89498 -146989
14692 -146989 -198813 -132020 95733 689128 932720 481240 290472 192945 -161846 -223546
14682 -223546 -238872 -624075 -505189 -290034 -97477 84031 55369 -370189 -266650 125419
14672 125419 96036 -61947 -5959 199254 315754 28456 -169622 -7062 271215 1061070
14662 1061070 1371710 854831 2652 -291009 -410401 -435758 -245409 -223508 34644 470556
14652 470556 469867 196452 -256383 -283914 -413855 -464994 -430991 -369896 -87552 190992 -18010
14641 -18010 -131663 -320825 -600640 -750309 -559809 -301261 -370824 -454127 -424587 -379944
14631 -379944 -524047 -635299 -432412 -183776 -227093 -195958 -367395 -636928 -745720 -1000561
14621 -1000561 -1010343 -1085443 -1043183 -513316 119047 379338 -63681 -299213 -241448 -64696
14611 -64696 103398 46113 -244225 -569606 -737181 -864463 -758148 -503953 -710682 -764399
14601 -764399 -594376 -308457 391242 909809 726530 323241 -23883 -294729 -456393 -596155
14591 -596155 -646339 -398681 245577 320291 -123021 -249182 148667 551517 935513 861579
14581 861579 691515 767184 754154 127418 -669358 -785065 -791653 -618225 -540009 -684839
14571 -684839 -941587 -740668 -353680 -366037 -179246 -174972 -532048 -832952 -964494 -752314
14561 -752314 -502119 -47804 242025 -20644 -457525 -843392 -1378731 -1798580 -1383787 -728415
14551 -728415 -626168 -917079 -1043938 -905746 -731938 -477363 -315996 -520361 -752081 -1137186
14541 -1137186 -1339977 -1198861 -772772 -509350 -416341 -391240 -453632 -807630 -611521 -139354
14531 -139354 -133819 -252554 -287343 -418690 -662502 -973875 -740603 -1196 439726 677332
14521 677332 759950 423274 400029 716413 750354 409737 -49320 -23912 151085 123636
14511 123636 198035 495625 634252 574704 288121 66304 -69248 -147784 -346201 -388769
14501 -388769 -425018 -675935 -782363 -933785 -1093737 -1396541 -1050765 -733056 -594868 -636632
14491 -636632 -735861 -714445 -621188 -352406 84694 353359 552581 830375 663930 397573
14481 397573 192583 184039 154518 -95163 -58707 316996 69392 -339114 -567930 -854055
14471 -854055 -1082230 -872472 -630487 -634541 -699283 -366423 -88755 353688 650819 267547
14461 267547 -374158 -870603 -1279526 -1339231 -1389053 -1043993 -468412 -229666 -77854 -134602
14451 -134602 -317694 -314577 -24258 492499 1031279 1303409 1476916 1192471 620689 220413
14441 220413 -420859 -712326 -624312 -580408 -262625 -233051 -512798 -536523 -292079 -148576
14431 -148576 -328772 -268472 -143296 -46060 -164229 -333537 -320863 -316473 -397202 -244474 -258822
14420 -258822 -185250 -166926 -128744 104268 -58659 -658334 -743621 -358270 -175402 -14865
14410 -14865 -266269 -822998 -885776 -501187 -14727 108707 172381 401782 257903 208159
14400 208159 50633 114760 158382 184342 514529 766436 1141809 966417 296417 -188572
14390 -188572 -374685 -353449 -363961 -371042 -101035 20577 -89959 -196396 -650235 -873521
14380 -873521 -824092 -1027039 -1184906 -1096797 -988746 -929167 -1057792 -1093049 -753007 -388304
14370 -388304 -267736 -180382 172029 247435 -195556 -605582 -366310 -45276 -230172 -271195
14360 -271195 32043 -4307 -414282 -668827 -941629 -1079565 -917200 -829534 -971852 -716058
14350 -716058 -47015 130748 -36104 -249944 -283043 -240703 -134250 -157066 -197721 -272624
14340 -272624 -155765 -264888 -451160 -287797 -212772 -143783 -115716 -111987 -49363 425383 754473
14329 754473 615656 574011 662485 464451 269775 378596 429938 503731 632080 316135
14319 316135 -65897 -33476 -233298 -257274 -14375 230058 394288 119813 -294717 -288065
14309 -288065 -59790 203548 132780 46526 320792 365381 -358954 -864864 -1082997 -1140709
14299 -1140709 -915190 -845202 -839387 -857692 -810434 -988449 -1199173 -1146779 -983409 -1040608 -675527
14288 -675527 -134543 -123840 -216114 -281140 -142373 -16816 -74804 -174361 -5162 281593
14278 281593 175959 188490 98964 -299332 -391989 -341971 59349 672415 692442 528439
14268 528439 224717 -531417 -863178 -503497 -222936 -31054 113802 78956 -212572 -628487
14258 -628487 -1163626 -1622101 -1352316 -1343109 -1513459 -1048937 -333179 234116 496369 542683
14248 542683 134472 -436004 -390416 80096 267118 159966 75510 -53806 171185 238590
14238 238590 -355913 -528598 -388600 -222442 -189706 67072 103562 -162799 -518969 -299419
14228 -299419 179707 143875 13422 67590 532402 1089234 981173 498850 324755 523814
14218 523814 575946 641690 686681 815736 960337 1120463 1176650 1198443 911253 563056
14208 563056 192542 -751 113575 511896 618522 312683 40008 152093 246358 112328
14198 112328 78819 105900 301989 213862 -281283 -784016 -917217 -758316 -416574 -147622
14188 -147622 -685178 -829341 -430170 118175 -63912 -661416 -753313 -557932 -211710 45152
14178 45152 109507 -183785 -312167 -294767 -42637 434982 968258 1378972 1252712 640019
14168 640019 369154 338563 507055 467813 270087 -65227 -126703 163349 58392 -364708
14158 -364708 -400007 -177511 212453 485831 333906 -80728 -416469 -271026 -219956 -304426
14148 -304426 -332427 -394467 -542513 -536536 -470248 -399605 -103465 236826 452788 171561 -192130
14137 -192130 -323197 -277298 -55660 -212744 -272829 4520 214950 217381 -21879 -165101
14127 -165101 -246912 -532577 -224464 71682 86167 -113456 -506431 -469374 -515434 -868358
14117 -868358 -904097 -665022 -303288 -294580 -712027 -1249458 -1271961 -1066767 -1079817 -855026
14107 -855026 -592261 -421338 -236829 -157907 -213432 -412296 -533897 -493605 -353716 26268
14097 26268 101593 -227174 -315488 -253648 -155645 -20667 68672 21961 -43737 174278 38957
14086 38957 -71033 -172198 -394403 -215192 97663 158840 280903 352345 216673 124062
14076 124062 62523 -62172 -325369 -93574 471337 541351 37662 -263052 -253431 -180610
14066 -180610 -361270 -785519 -742689 -552663 -340775 -62562 -318141 -590863 -629451 -907059
14056 -907059 -1125980 -961486 -399085 102965 293612 77797 58841 -208553 -626174 -821970
14046 -821970 -967371 -765939 -442856 -577138 -259586 -24567 -53811 -201891 -417207 -613631
14036 -613631 -744713 -1257809 -1493948 -1307948 -1113302 -982435 -1084679 -982798 -594208 -302340
14026 -302340 -475574 -799961 -883557 -821618 -515872 103161 671114 680450 356628 428615
14016 428615 839815 1105841 719026 510340 892211 825328 330720 -69962 -297907 -318562
14006 -318562 -406257 -482553 -333615 -153450 -44535 -155815 -229791 167531 812557 954896
13996 954896 627091 121168 -276209 -81126 270597 170800 -112872 -341868 -440713 -216523
13986 -216523 -98870 -523190 -646065 -423623 -601477 -763562 -627811 -332356 -116565 179958
13976 179958 662746 822207 492277 331221 442979 708335 787092 382505 -121555 -461520
13966 -461520 -609785 -809961 -1212487 -1570115 -1590719 -1119230 -664273 -219146 141459 6023
13956 6023 -184025 -33528 182067 574 22251 -4108 90912 368870 376496 254224 53121
13945 53121 54302 -109993 -555674 -585832 -108346 29553 -146222 -518673 -249960 65344
13935 65344 -341991 -799053 -903348 -953526 -1095968 -1209006 -399080 387863 687981 592233
13925 592233 372708 21637 -536842 -1190708 -1214404 -1071661 -1221562 -990418 -580178 -249881
13915 -249881 -85557 -23379 -28730 -27146 251282 621613 708215 610257 416372 395189 648574
13904 648574 1094438 829626 216157 -291538 -132571 454286 532259 80433 -495579 -882206
13894 -882206 -1057407 -866638 -1101021 -1475178 -1370665 -1250109 -912394 -700208 -818076 -680652
13884 -680652 -279599 -198300 -620142 -1082186 -805816 -137176 343528 548787 806520 916899
13874 916899 573488 327525 411304 301727 53520 -316712 -681352 -774188 -640677 -282663
13864 -282663 88786 514102 834612 738777 451837 257237 -118057 -162450 -169300 -215461
13854 -215461 -142892 -294189 -504033 -501836 -110774 -82940 -173941 -153182 -128878 -226279 -246523
13843 -246523 -412505 -121947 255504 280581 235544 573620 1111091 924528 171997 -147816
13833 -147816 -246927 -311637 -100934 -122197 -425573 -563056 -263977 11181 145793 222809
13823 222809 116121 -22665 -167463 -240256 -193897 -361080 -196468 100214 138395 189281
13813 189281 285674 556283 624853 521223 247822 6298 -279453 -294907 -48084 328938
13803 328938 638924 693915 601652 60165 -672655 -1146321 -807430 -450874 -312166 -679444
13793 -679444 -1155944 -1237257 -977005 -847500 -471991 -731 187850 408619 626926 596860
13783 596860 211317 -349258 -468232 -293680 -155884 -267426 -516760 -743156 -1063142 -1036940
13773 -1036940 -866527 -927158 -1125581 -1062075 -685759 -355660 -446990 -583661 -415172 -181638
13763 -181638 40886 475347 655883 585886 424441 80916 -205156 -657423 -675200 -271851
13753 -271851 -386636 -812321 -1244866 -1176726 -756122 -491936 -481875 -326408 -244276 -377232
13743 -377232 -459756 -668968 -723407 -274768 54663 -48583 -71004 -87766 -171745 -310600
13733 -310600 -498675 -177245 21863 -91950 56662 63480 14859 203892 176319 225836
13723 225836 113353 -40959 52951 380642 497995 511736 666834 681657 350582 -254339
13713 -254339 -247767 218813 489785 620667 597361 707277 666475 375892 454852 678250
13703 678250 568095 -26759 -503355 -606030 -510197 -632459 -737758 -641149 -418834 -303796
13693 -303796 -248933 -299674 -120552 233987 294830 511638 1058221 1546387 1487401 847851
13683 847851 226474 116692 578236 813336 782179 621754 503001 468331 210510 -62846
13673 -62846 -11226 99900 244357 -155116 -469061 -452822 -677208 -1037737 -1252715 -688644
13663 -688644 -6737 136319 -198182 -25049 526906 444580 338025 362985 116383 -30859
13653 -30859 -104864 208475 441332 636722 1122056 1424456 1807681 1919672 1506373 890689
13643 890689 393530 -187771 -298400 100360 257838 379552 298518 -167763 -596852 -762487
13633 -762487 -772807 -590203 -271736 167394 346448 423803 304842 173284 565337 779365
13623 779365 633069 487519 587196 696258 667416 658992 722838 923951 1068923 813282
13613 813282 620565 820393 845194 773387 209717 -88548 94089 402721 538573 -255044
13603 -255044 -866903 -802596 -856311 -792339 -806426 -602388 -93219 446222 722827 792032
13593 792032 874824 722782 474452 24724 -589566 -1162184 -1127199 -784652 -642093 -670788
13583 -670788 -1164698 -1411615 -1131832 -717573 -609911 -796314 -939538 -781094 -684660 -537726
13573 -537726 -110179 131084 264454 360553 33411 -430815 -195201 430147 514203 664133
13563 664133 743864 255908 229387 369271 346387 460344 573146 257028 -128474 -194314
13553 -194314 240718 541105 820827 788608 832106 597294 335591 452921 531409 431890
13543 431890 368566 398797 407266 517915 622687 873484 849305 666155 376373 415145 357888
13532 357888 67035 -84607 -96594 -94974 -336870 -468065 -404801 -76168 284333 566281
13522 566281 473191 366459 113188 273723 322806 103128 52066 54933 -88445 -224788
13512 -224788 -2950 304852 465836 -15975 -690653 -692975 -412666 -192943 -41163 -124969
13502 -124969 -305431 -10647 300611 615674 550227 404923 251195 339294 645565 967992
13492 967992 1185214 1095770 592634 11772 -438243 -752155 -791477 -806885 -557053 -356361
13482 -356361 -632423 -815881 -580595 -424243 -418468 -399985 -480370 -522035 -417588 -172204
13472 -172204 -161362 -510371 -327111 -170392 -344199 -249078 58163 384418 436984 -51345
13462 -51345 -442166 -537206 -291850 -192404 -375339 -380282 -537059 -535476 -461624 -638079 -478546
13451 -478546 -170693 -133799 -128381 157528 308028 529523 860982 1126641 1151487 672463
13441 672463 282567 132699 -60185 274832 404929 197292 115435 165401 236365 -147486
13431 -147486 -418664 -606476 -556592 -671459 -944422 -994960 -616676 -332943 -289515 -229234
13421 -229234 -308401 -23404 120451 -217944 -690183 -819003 -824003 -876063 -878723 -576217 -571810
13410 -571810 -693574 -651242 -355404 -118203 -54795 -277485 -465559 -717633 -1253337 -1350974
13400 -1350974 -803713 -290997 42617 26240 -3303 -160292 -199687 19527 248390 56972
13390 56972 -229678 -108433 188403 -11546 -385753 -94866 391717 637883 1040569 1068193
13380 1068193 624234 220697 72625 -205332 -261236 89446 603202 741546 212692 -331370
13370 -331370 -587054 -915787 -887139 -931314 -1006634 -820036 -933166 -774151 -262394 1964
13360 1964 60190 -3307 -295659 -628755 -686249 -801263 -572273 -280167 130442 477155
13350 477155 450465 602309 923400 1123191 1100916 709167 391070 387978 152432 -108649
13340 -108649 -58335 179599 792292 1056685 863298 459277 54961 259670 540878 473355
13330 473355 -12688 -305759 136049 1173754 1543153 1469718 1267899 1547964 1652724 1087703
13320 1087703 547858 74007 -303024 -118477 440213 408921 347056 557821 560177 153485
13310 153485 276405 520558 427510 484221 478482 470406 587580 542858 327577 481919 684713
13299 684713 718128 1011741 988371 396971 267800 268312 449699 803781 778263 641110 516367
13288 516367 675031 810326 760922 507458 184549 212204 213101 -98595 -453490 -140894
13278 -140894 459611 815395 682238 280415 111803 51222 -343266 -756545 -837253 -544489
13268 -544489 -525340 -627604 -335993 -30 280677 743800 833331 330287 -181942 -101503
13258 -101503 108697 110228 249477 417741 497366 450488 209929 88773 227387 268639
13248 268639 248139 336670 580740 961279 1114727 884331 510590 345854 523453 1192104
13238 1192104 1702777 1560228 1147769 845209 474641 160635 96504 4123 -273726 -449004
13228 -449004 -214241 330520 554306 89100 -366333 -146314 467653 810082 554600 331267
13218 331267 717879 1221544 1250828 926321 808230 757732 698877 711500 516774 397760
13208 397760 807452 634772 116819 -90585 -86622 141213 536635 951856 1114067 1318580
13198 1318580 1392605 1452837 1756621 1497624 1123677 1222032 1119763 1165232 1044840 518559
13188 518559 351101 625985 676696 387731 444522 731333 621416 472999 354746 302112
13178 302112 515723 854419 769544 491116 340926 446269 704855 491859 279687 692543
13168 692543 1426440 1953734 1640929 1261818 1077400 1201042 1488470 1551435 1290603 1243442
13158 1243442 1203926 678145 507474 728639 837787 1131160 1189319 1141502 579032 438693
13148 438693 955321 1250695 1549150 1804248 1679305 1652558 1295916 293597 -136580 -185916
13138 -185916 -63587 250788 793940 1339484 1458390 1305671 1343498 1512669 1499648 1354389
13128 1354389 953245 611802 901822 1050594 1036389 1059058 1129215 895101 707412 507009
13118 507009 313917 243852 313151 498339 1073710 1818179 1785101 950983 215847 78338
13108 78338 120577 -141085 -283042 -202434 -70949 141109 491211 499635 521334 959505 1157489
13097 1157489 1106412 879404 702183 747321 662481 736598 1039756 1329107 1096788 373265
13087 373265 230566 458928 557000 259804 132107 521093 1072163 860290 627305 938232
13077 938232 1437748 1405524 1415740 1836226 2049915 2000583 1833761 1902057 1654577 1459865
13067 1459865 1440947 1695381 1483922 1413570 1768008 2165485 2690656 2952670 2953499 2777545
13057 2777545 2389614 1907036 1787099 2160523 2820108 2988815 2849995 2819796 2642365 2400995
13047 2400995 2163807 1834483 1893383 2203864 2210588 2293902 2782453 2838188 2472949 2142398
13037 2142398 1660500 1654762 2346943 2886536 2980693 3017847 3171651 2881034 2867321 2930221
13027 2930221 2950327 3052684 2895507 2803761 3220707 3672297 3840231 3826352 3587478 3533503
13017 3533503 3388072 3463769 3705792 3793081 4135311 4431053 4167288 4169144 4647678 5280293
13007 5280293 5759354 6171663 6497232 7205263 7829685 7937243 7678600 7439956 7373484 7720883
12997 7720883 8024697 7825137 8279413 8947737 9829461 10707697 11380805 11754098 12190581
12988 12190581 12881111 14120707 15852753 17648084 19403279 21107358 23308239 26157779
12980 26157779 29610051 34078584 39362637 45150066 52336485 62048516 75012940 91288368
12972 91288368 112304353 140288064 177075281 225310359 285333002 352578420 409829053
12965 409829053 430255127 401853452 340527856 273371788 216433138 172769024 139703728
12958 139703728 114553910 95329237 80789650 69545163 60398854 52791442 46600361
12951 46600361 41625276 37540381 33652783 30635257 28190671 26004085 23947129 22008074
12943 22008074 20490594 19035117 17738916 16878624 16101843 15378653 14423302 13407030 12573460
12934 12573460 11885996 11357434 11043082 10910114 10698795 10204511 9686499 9696379 9860881 10029386
12924 10029386 10313419 10200861 9913552 9842933 9831812 9693777 9737769 10104980 10533266 10835316
12914 10835316 10971171 11286795 11873804 12646433 13733126 15082837 16220536 17539929 18527479
12905 18527479 18586426 17613705 17228700 17664203 18081383 18747859 20125031 21828492 23160186
12896 23160186 24567538 26279089 28649261 32143910 36872724 42391404 49027848 57203399
12888 57203399 67490261 80791313 98200549 120988772 151011899 190359671 241881497
12881 241881497 306216468 375120309 426281694 433064885 391401039 324101197 257215110
12874 257215110 202904760 161741273 130563746 107234439 89238026 75743290 65385706
12867 65385706 56997995 50079324 44113053 39248004 35434459 31933446 28956461 26444321
12859 26444321 24186610 22439768 20854458 19423530 18246332 17127501 15927869 14843911
12851 14843911 13823556 13080159 12446474 12011792 11338838 10656301 10568752 11040757 10552016
12842 10552016 9950045 9419225 8931017 8856639 9072835 8978862 8678075 8253409 8252180 8796144
12832 8796144 8847216 8334013 8081213 8363798 8906092 8988567 9124481 9835363 10184094 10076796
12822 10076796 10193161 10629183 11240955 12081361 12597594 13073954 13850771 14698508 15608667
12813 15608667 16641168 17791240 18886601 20924319 23532853 26258486 29033134 32412639
12805 32412639 37130212 42804749 50004644 58676965 69709828 84038377 102810177 127815160
12797 127815160 160593538 203217600 258098058 323107434 387080915 426372377 419227955
12790 419227955 369248080 301846287 238979672 189128594 152034803 124172560 102708101
12783 102708101 85901753 72529511 61699921 53505840 46818818 41097922 36353315
12776 36353315 32583162 29272508 26353272 23678420 21510001 19818433 18091204 16623896
12768 16623896 15555644 14469624 13585988 12953568 12024999 11421638 11249137 10893051 10377747
12759 10377747 9868864 9169134 8655739 8422860 8302681 7688044 7199794 7065966 6516989
12750 6516989 5709454 5231680 5393031 5490709 4903690 4463569 4340208 4291579 4432563 4672090
12740 4672090 4465654 3976627 3620298 3394738 3371520 3799478 4268195 4050897 3707187 3470147
12730 3470147 2762233 1867975 1202614 1275852 1812604 2438715 2668992 2706053 2630444 2335322
12720 2335322 2123748 1761829 1401865 1499602 1599158 1612738 1709614 1493692 1337619 1269995
12710 1269995 1193008 1243606 1475324 1597228 1381174 1251216 1247516 1503877 1919093 2146747
12700 2146747 1982356 1469480 1189214 1135920 1300226 1416731 1579026 1246103 894303 686877
12690 686877 420041 215818 169397 279438 533695 970090 1247830 1483804 1768527 1742643
12680 1742643 1249686 1075257 918915 387044 238247 274898 423307 823792 1224020 1408589
12670 1408589 943591 353136 351213 314548 163887 363506 703660 1018101 1213748 1155498
12660 1155498 917350 866668 692558 655281 1147442 1425390 1269375 1370336 809182 76831
12650 76831 -65339 265146 593568 779078 558287 388417 398466 609529 287343 58652
12640 58652 96606 -118747 -300105 -194507 -21338 -64808 -148466 -183276 -258491 -468264 -577211
12629 -577211 -405210 -221059 -199032 37455 520791 652907 742192 1238173 1300741 1331909
12619 1331909 1268639 1268709 1385144 1073832 540702 3708 -181259 -220952 -139115 109783 219167
12608 219167 -36757 134546 543685 672656 764486 765995 794597 852127 633825 572505 988028
12597 988028 1227567 825052 704924 727752 217587 188292 189163 40962 176252 358643
12587 358643 150141 -146394 -397652 -461767 -309044 -332512 -529254 -446392 -169614 -139934
12577 -139934 -222688 91335 556786 425540 133327 117650 430667 562574 646849 485191
12567 485191 232225 155237 342922 464144 262853 89544 173229 244956 255121 483193
12557 483193 592708 500416 312223 459414 832731 1340794 1384812 877325 784144 696102
12547 696102 837283 1117645 913207 622948 140854 -62122 248172 231661 -128443 -455870
12537 -455870 -393537 -506081 -350506 622910 1073122 1033876 1009740 895244 650958 666685
12527 666685 304687 54819 315884 618274 738911 367034 -132635 -357093 -144384 344315
12517 344315 757325 302412 -569181 -960768 -497471 16273 229424 134253 -289612 -204317
12507 -204317 -10951 236810 381129 755768 926858 385829 -85715 52366 -68733 -248631
12497 -248631 285237 767816 937363 1252451 1456763 1333529 1073288 524284 491623 709371
12487 709371 911260 1366202 1185875 836164 725185 429653 -11427 157455 351063 59071
12477 59071 -372908 -564475 -830277 -1001796 -807774 -77322 345021 346912 550714 1042613
12467 1042613 1017221 699900 288836 24981 283956 802405 668683 158969 -241966 -344663
12457 -344663 -676297 -646559 182076 744405 780217 546317 192218 345910 753349 962194
12447 962194 943908 528094 231872 158709 334937 728533 1099001 1378374 1175186 805554
12437 805554 237589 -313992 -152340 -28878 -108561 -359168 -583760 -562860 -516631 -176662
12427 -176662 221070 313664 431074 280301 390961 557758 497806 284736 342186 391659
12417 391659 53393 -107997 -432637 -779255 -402069 -25949 -81862 -87735 134339 140498
12407 140498 188113 400868 217787 29731 9254 117393 295951 501574 737964 854095
12397 854095 826100 379460 -32947 -213950 -245968 161047 371257 136787 -153632 -31260
12387 -31260 536668 756873 833875 979293 816805 455581 98508 -71326 82931 17647
12377 17647 158014 400903 555544 798070 759107 530339 497879 377961 221642 19658
12367 19658 -277449 -600256 -723885 -594472 -490602 -295917 105049 475039 495951 78068
12357 78068 -340984 -115306 -3209 -305578 -341730 -253016 -207483 -211243 -304948 -211037 -118130
12346 -118130 -142083 -527786 -798502 -325727 272252 748378 904517 822324 320510 -37655
12336 -37655 -100551 -94500 -80685 -270613 -311644 -179472 -567 284807 624969 643015 48161
12325 48161 -388386 -273353 54218 288139 437997 586413 402699 336584 470141 722933
12315 722933 662155 584087 697877 261381 -124187 205929 375595 7466 -399168 -381352
12305 -381352 -187103 120462 626419 869536 833299 848205 370123 225169 15165 -379078
12295 -379078 -94589 282026 342135 -169302 -367255 -198019 -580352 -975528 -623779 -592311
12285 -592311 -764386 -732319 -662982 -722935 -677243 -415150 -132418 29103 161490 380434
12275 380434 563902 454389 300995 359413 107369 -98656 -401534 -689026 -241669 56454
12265 56454 -53947 166580 335610 327772 100372 154719 682446 830647 937205 1050307
12255 1050307 1063599 1062653 1080866 785652 311505 11245 -169478 -283060 -222436 107455
12245 107455 301272 -31303 -646148 -1127115 -928600 -12290 658716 675249 560988 603417
12235 603417 496152 174972 -35490 -113624 128481 -88587 -662082 -488741 198618 443087
12225 443087 237704 133799 -288764 -616569 -514940 -560458 -930094 -1193821 -1208714 -1045508
12215 -1045508 -959701 -743976 -696205 -684140 -623854 -265590 25215 -240030 -300312 -36735
12205 -36735 365076 523314 512481 530529 208289 -339188 -321702 -67117 492740 335666
12195 335666 -390295 -308943 -441290 -811201 -637673 -361804 -436292 -731691 -560611 62352
12185 62352 677062 894812 1010824 1090637 890348 455645 541582 536946 677017 990505
12175 990505 923364 830929 535268 307515 109159 -17325 -242188 260077 758034 658316
12165 658316 497885 339627 187485 65522 -91437 -206929 178408 721052 533405 325905
12155 325905 295239 -246796 -333306 -204573 -175475 212155 644201 645575 559034 474848 400847
12144 400847 -97660 -90366 194171 -173218 -409209 -601010 -462736 81767 51289 -297895
12134 -297895 -312207 -428429 -610335 -561211 -781558 -927818 -1205439 -1093679 -528388 -60205
12124 -60205 138257 154702 11532 2952 20634 18521 -197974 -333183 -160491 -529407 -899899
12113 -899899 -917308 -674903 -551230 -211908 -527545 -1308211 -1298703 -703189 -485534 -639301
12103 -639301 -429399 -386221 -484479 44300 199906 185090 134999 389170 480595 336273
12093 336273 380734 503758 356588 483464 603007 202233 -201058 -324927 -99403 119366
12083 119366 272736 505570 480321 300093 42105 -55355 -158540 -194361 -91202 -132893
12073 -132893 354253 696544 282269 108524 277838 -402792 -698050 -242004 216290 258844
12063 258844 100426 326816 605483 842968 1033129 811338 334480 104317 251391 426258
12053 426258 449392 453180 794010 1004567 697338 474757 326134 -406470 -1257318 -1045317
12043 -1045317 -646226 -302234 -179354 -133198 37109 156215 118990 -79435 -47996 15992
12033 15992 103050 349441 392870 323181 117959 -145916 -399474 -441478 -285255 -523424
12023 -523424 -786992 -687250 -368638 82612 230957 271444 175959 431873 633121 424470
12013 424470 571790 640707 642041 329440 269055 383264 132867 -304087 -441032 -660392
12003 -660392 -891337 -821155 -421894 61411 244701 509094 261502 -27385 -140015 -157292
11993 -157292 -85915 -74504 165765 48526 -150176 -517755 -798752 -706651 -717352 -649830
11983 -649830 -695478 -747453 -543865 -613970 -830455 -577501 -418746 -685508 -778379 -402879
11973 -402879 41091 -2936 -202837 67733 450196 284109 -227152 -803371 -877288 -489020
11963 -489020 -230346 -101392 66228 8011 -237941 -567266 -372619 204850 111399 -215366
11953 -215366 -2137 329706 265744 277559 236502 59325 40916 43424 332567 433217 249846
11942 249846 98862 3227 184316 404089 310348 177543 37393 273327 476354 584423
11932 584423 670706 529771 498656 777107 983469 1118202 1301701 1355609 1069358 637223
11922 637223 559505 403043 459968 524214 507640 682501 709721 418622 218298 294822 258810
11911 258810 54112 114770 621479 1249414 1325676 1116802 1011022 950020 740293 185320
11901 185320 120957 415969 715505 822463 717853 692534 326294 -33597 -443233 -546708
11891 -546708 -430352 -508968 -649625 -463020 -31305 158163 284010 575173 1020269 1463858
11881 1463858 1814612 2042536 2070169 1717910 1976361 2225407 2462220 3269956 4327541
11872 4327541 5271000 5650958 5877550 6382297 7153421 7777101 8039536 8580209 9519904
11863 9519904 11170532 13670577 16780539 19978010 21273552 19564947 16872654 14656327
11855 14656327 13043541 11441301 9924217 8624232 7583853 6687798 5421584 4400441
11847 4400441 3807579 3413693 2861055 1987167 1459084 1274823 907447 545458 282285
11838 282285 240996 163662 104054 -450236 -847887 -862678 -701403 -564477 -261246 170804
11828 170804 845946 1691155 1913981 1133729 475462 360496 376344 714161 1151646 1183893
11818 1183893 679331 345684 676788 956143 591319 -85003 -394758 -339121 320567 679002
11808 679002 698909 340508 -85276 -207293 -118091 -36620 13133 246630 233581 -22483
11798 -22483 -474647 -580513 -178495 336470 582985 865538 843396 1172473 1686705 1579976
11788 1579976 1566849 1534347 1445333 1415158 1500225 1917946 2501966 2692739 3378016 4488618
11778 4488618 5331306 6273071 8004019 9959530 11217905 11074724 9802340 8969296 8578630
11769 8578630 8725811 9516921 11069648 13471101 16719327 20643329 25907470 33263463
11761 33263463 40610071 43513837 39163578 31198727 23953908 18123695 14071808 11411161
11753 11411161 9326287 7756935 6864527 6103610 5364198 4761026 4483039 4183291 3643616
11744 3643616 2934995 2025020 1626965 1676041 1727508 1547891 1750614 1950189 1603003 374285
11734 374285 9658 456253 796261 897977 641411 304057 -15185 185151 847697 1523532
11724 1523532 1983134 2085771 1511875 670055 569059 706733 416386 297874 112701
11715 112701 403091 841134 921691 663491 142127 123494 406892 831524 1203216 1236506
11705 1236506 1277855 895910 371561 357072 313397 181585 457168 718453 943486 955241
11695 955241 887097 579558 602552 718922 702496 757771 838094 581005 853608 788516 202453
11684 202453 100433 30235 98551 314160 577785 686954 516502 457640 762175 918505
11674 918505 444773 158808 388410 475720 323783 265121 190486 316710 259783 308339
11664 308339 147468 76931 315264 456207 561603 546934 444262 445764 161349 -124973
11654 -124973 -182084 -121044 -331430 -739319 -849570 -603690 -355647 -173411 100482 339034
11644 339034 466128 424787 489714 400303 704607 867041 752451 500937 259015 -86284
11634 -86284 -142579 307249 452787 221401 145656 352381 244169 92848 289880 342084
11624 342084 185456 464270 1022285 1036439 669257 404431 666683 1336417 1241921 1219094
11614 1219094 1138595 683752 216632 -191074 -222010 -126718 -184892 -431175 -748142 -694785
11604 -694785 -428630 -472882 -443670 -295056 -189892 -167693 -186286 -59140 272676 672639
11594 672639 1059110 984118 214994 -54426 -17672 -205758 -377114 -822573 -1170135 -921108
11584 -921108 -837260 -745934 -437422 -358900 -143064 33836 -281618 -693880 -643473 -311412
11574 -311412 -23782 -130777 -167394 80448 433983 311104 206799 144697 -113433 -215571
11564 -215571 -132831 -438778 -1209566 -1501285 -1192477 -745160 -443029 -566358 -577188 -284978
11554 -284978 -811794 -1695989 -1520352 -824031 -689744 -602945 -546005 -718195 -475555 -583810
11544 -583810 -681239 -575093 -785453 -891713 -733933 -138414 280087 229942 366168 718280
11534 718280 905045 875451 485400 274393 313274 398979 213185 -59762 -237629 -274197
11524 -274197 -633936 -1176101 -1111653 -1101376 -1155417 -993697 -530241 -380630 -296675 -85288
11514 -85288 83440 -95853 -376784 -345882 210765 401378 148721 -295349 -796449 -1030006
11504 -1030006 -886689 -607209 -306210 -186406 -176238 -180055 -348999 -44809 384665 782215
11494 782215 561740 -48953 -197086 -257173 -295085 -294356 -340173 -201488 -127961 89356 44873
11483 44873 -168528 -18580 81443 229280 355584 247479 376874 503431 188970 -426118
11473 -426118 -962747 -865889 -588947 -340696 -157942 68816 515531 797515 829189 616879
11463 616879 314026 115078 127994 273422 39665 -273989 -412909 -469071 -493469 -290964
11453 -290964 -226554 -348195 -140443 -268212 -633075 -542201 -181794 161987 160077 -410405
11443 -410405 -101268 476853 312718 -84439 -161140 104897 223720 855593 1783132 1764558
11433 1764558 1389670 1233378 1201872 1185389 1124996 974963 632308 19413 -410410 -511254
11423 -511254 -298103 -366334 -801675 -554932 150344 256951 -40706 -66090 -181201 -185082
11413 -185082 -198608 -9639 166035 -46222 -642999 -1015466 -745840 -487508 -683294 -492702
11403 -492702 -68135 232109 416511 427176 201540 111262 211952 71746 -447545 -653385
11393 -653385 -503397 -457228 -642785 -696494 -178602 403791 333030 112400 -123963 -114450
11383 -114450 -64573 -27558 66668 98976 -180033 -489486 -347046 -228199 -210583 22855
11373 22855 501507 819177 1056968 1065195 571784 -118518 -476356 -591695 -637904 -644452 -289507
11362 -289507 586723 680546 373242 260564 396471 481943 98252 -82217 194802 574324
11352 574324 710986 529493 383583 268327 288985 518579 476280 356511 36938 -512007
11342 -512007 -982595 -1209939 -1122044 -888691 -840243 -772678 -899134 -895048 -450871 -85666
11332 -85666 105366 128412 -162495 -456466 -155950 85804 156338 475398 146635 -388906
11322 -388906 -434228 -284799 -173968 -125227 93458 203235 59031 154767 286290 372982
11312 372982 543249 648552 670407 574719 246792 176956 520438 769905 909457 832067
11302 832067 546133 357249 28765 -220877 -147266 -79588 16646 353284 366382 134838
11292 134838 -115361 -372809 -519713 -318024 -118869 -587539 -927507 -741948 -380993 -159432
11282 -159432 -18776 251800 268987 -87209 49654 272472 -40472 -500632 -899672 -918733
11272 -918733 -829777 -869286 -760943 -799049 -894803 -437861 -364747 -611908 -181370 463778
11262 463778 524403 287342 73398 -373007 -905467 -1351063 -1583222 -1431351 -1311549 -992987
11252 -992987 -406492 171381 627396 878351 979292 970290 679125 302035 195516 255668
11242 255668 336053 494450 313642 -24252 -349260 -544553 -574350 -758769 -667709 -267787
11232 -267787 -455301 -549356 -177683 177064 316055 137956 93674 343512 247705 327467
11222 327467 429296 179451 -60639 -325350 -242038 -249034 -412387 -460472 -516451 -514883 -657948
11211 -657948 -691609 -239309 272106 552970 543261 673367 826625 726514 149525 -443744
11201 -443744 -410982 -63890 137106 332705 496814 695259 523102 273173 305834 551464
11191 551464 671037 376248 -308637 -639707 -648010 -840222 -465555 -252204 -212933 -363782
11181 -363782 -442569 -595236 -695292 -581111 -95599 402839 919314 1049341 841250 796660
11171 796660 831241 904650 911022 797646 784532 747587 519736 19916 -127770 2641 -162364
11160 -162364 -205507 271651 571057 1017170 1149521 893429 820578 773817 737697 314264
11150 314264 -61632 -363733 -606370 -396929 -112587 -12057 368482 411496 303724 170692
11140 170692 -144571 -483709 -430739 -234427 -536362 -1065325 -1146493 -786228 -687677 -664836
11130 -664836 -219474 183332 120821 -418743 -244162 207024 508259 367565 -2903 -116849
11120 -116849 140889 462369 698406 730446 415802 -30509 -473775 -482670 -184303 -92237
11110 -92237 -31909 -234400 -496983 -600912 -279242 362296 659658 85470 -706039 -637969
11100 -637969 -156980 -12876 -245056 -513771 -722245 -273329 153518 157932 337989 506053
11090 506053 602142 567862 399934 278169 68275 2898 -333189 -707219 -721102 -490263
11080 -490263 -322202 -125038 149913 187438 27165 -178299 -581690 -908546 -959555 -1061478
11070 -1061478 -910627 -328214 312745 503403 262793 -164279 -482443 -842489 -758306 -679522
11060 -679522 -280225 477339 741173 854212 718041 618305 490724 168582 -60478 -192844
11050 -192844 -199790 -230923 -250917 -5233 371613 219508 47674 183322 235494 609837
11040 609837 1352726 1794248 1470886 957604 905778 1013075 1032671 1113096 1303641 1310550
11030 1310550 1250729 1080839 1058079 958468 691524 842573 991900 833278 486691 446465
11020 446465 407126 474887 487951 486657 478995 427052 562930 603883 635288 1033341 1542164
11009 1542164 1711754 1540769 1420499 1721207 2029124 2274900 2172730 2318744 2740334
11000 2740334 3351125 3861755 4310771 5428403 6635278 7993795 9960624 12273215 15981530
10991 15981530 21597378 29131312 38062353 45053826 44998959 37636153 29016662 23197604
10983 23197604 20351372 19556777 19798642 21253453 24177117 26735173 26726664 23279617 18342985
10974 18342985 14067629 11321547 8888664 6533408 4843894 3892253 3413240 3229539
10966 3229539 2922649 2514779 2250275 2000245 1684100 1544642 1537353 1471684 1383022 1182414
10956 1182414 842802 589763 636293 766371 666739 583177 694577 362735 -10151 -132350
10946 -132350 -397637 -623253 -474940 -102021 219759 247484 240740 296736 27663 -148297
10936 -148297 175376 398293 231593 -272303 -686972 -449920 -49010 36295 -250577 -221988
10926 -221988 -173554 -392246 -562615 -742712 -560806 -445259 -298122 1001 125570 416910
10916 416910 563134 423984 207504 82513 -479537 -952578 -897353 -815115 -853338 -751450
10906 -751450 -550073 -680370 -844582 -515123 -72245 358531 541447 191568 295986 288065
10896 288065 -117488 -746372 -778411 -881955 -861450 -333891 64220 172536 -82975 -65918
10886 -65918 275591 205358 -48190 -408202 -506489 -631379 -809872 -409973 -41605 -439751
10876 -439751 -708539 -773245 -931243 -797082 -838777 -1326069 -1170798 -453298 88455 662177
10866 662177 1193317 1096279 541731 235132 192968 156980 276722 403879 457300 579619
10856 579619 916652 734158 514977 501381 390377 182485 -11160 -14226 -56919 98593
10846 98593 425409 629031 678825 285983 -42503 -302494 -389860 -179546 -12613 -99808
10836 -99808 -158250 253262 517829 643084 834529 557742 -3235 -329772 -490384 -229635
10826 -229635 67626 -12839 -316901 68988 305770 312387 373282 467026 840251 1316980
10816 1316980 1257293 1174625 1205085 1272746 1128243 885558 1019814 1192830 927174 258303
10806 258303 3521 54493 156024 243127 287181 509794 788501 997944 985735 966558
10796 966558 840198 575065 514236 361565 312245 416209 461272 287720 374811 368317 408663
10785 408663 558591 401381 97856 87296 172283 197833 -52436 -208418 7867 124126
10775 124126 170927 67250 374712 967042 817729 225922 86419 146982 62989 -35946
10765 -35946 283100 607467 598410 505165 410947 356574 262707 237948 336943 -176802 -936418
10754 -936418 -1409155 -1326768 -1004947 -762977 -366227 -147412 -90241 -231703 -655989 -1155371
10744 -1155371 -1147422 -826887 -301402 327651 696612 878361 901419 1027689 1090626 1008476
10734 1008476 1038562 1074644 758971 883575 1291581 943092 149183 -357789 -442463 17568
10724 17568 526690 814474 926901 771632 871675 825920 376648 229181 274718 376346
10714 376346 167877 105487 306980 761705 1193774 1210075 1152154 841257 195188 -165102
10704 -165102 -327161 -490091 -520982 -547373 -587414 -365197 -341084 -470481 -831076 -1189149
10694 -1189149 -1109079 -1034876 -1039678 -983109 -888518 -802119 -845778 -551777 36279 208361 305457
10683 305457 425982 -95463 -496468 -635465 -513969 -738443 -845345 -744042 -689117 -558563
10673 -558563 -428649 -157061 -151684 -348840 -566583 -347256 79453 110312 -155118 -559179
10663 -559179 -844233 -821608 -911364 -904398 -576314 -428455 -404192 -128745 404131 862476
10653 862476 894495 240887 -396757 -636159 -346164 -464692 -742480 -581273 -426237 -270108
10643 -270108 -200696 -134987 -516077 -831372 -975995 -758030 -540246 -415579 -300999 -438808
10633 -438808 -469465 -292750 -192493 -135266 -237738 -425204 -330282 -30699 -209161 -194459
10623 -194459 201504 -159186 -454112 -456541 -817110 -1093812 -1108273 -1082203 -1152909 -1078139 -912191
10612 -912191 -657679 -419838 -9434 280298 462988 323682 264621 375566 270853 202210
10602 202210 227044 17764 -58487 -48216 45472 370162 533654 383953 450056 554020
10592 554020 561427 584827 671466 612437 499503 512881 394783 115571 37649 116863 222222
10581 222222 444319 433552 585077 533053 -66201 -223541 -130311 -123934 63747 229387
10571 229387 38334 -149477 -176972 -179368 267000 263272 -383716 -920874 -924841 -346899 -23677
10560 -23677 13342 20234 493827 903172 635336 907783 1204229 1445003 1674117 1400875
10550 1400875 860443 405122 -24913 -393158 -500087 13940 480907 708172 520192
10541 520192 235474 517057 858270 893927 403582 -91769 -88636 -188113 -276207 -92172
10531 -92172 61663 15265 37079 450456 632300 460033 362594 324349 458318 106059
10521 106059 -337047 -520635 -677787 -619879 -434179 -630249 -588166 -418633 -558019 -700718
10511 -700718 -921703 -1112730 -1253349 -1496078 -1718436 -1489627 -1064428 -609618 -324161 -129540
10501 -129540 -32912 -230341 -434497 -325831 -459406 -804938 -481347 52178 267762 202716
10491 202716 96513 314945 454102 352277 130302 48073 161308 48329 -109346 -78462
10481 -78462 -125020 6671 88030 178464 -215172 -545299 -248867 124550 -3076 -443682
10471 -443682 -648344 -623584 -296458 -43327 -404068 -1082609 -1464502 -1186716 -609711 -490608
10461 -490608 -373486 -113691 25946 -206579 -641695 -740136 -587985 -583434 -675852 -1244095
10451 -1244095 -1670874 -1388010 -1063121 -824277 -886333 -607394 -287002 -361719 -274070 -373991
10441 -373991 -670809 -737968 -611295 -593282 -824304 -627544 -420639 -76698 156919 -109150
10431 -109150 -443815 -429831 -225754 84953 109782 -165073 -440822 -509410 -459999 -87763
10421 -87763 101613 -203771 -793702 -801501 -457888 -516685 -563861 -363852 -264135 -85880 -10093
10410 -10093 223082 573885 561682 436176 212292 272693 417438 515376 472062 315221
10400 315221 186272 -162591 -220522 124067 283283 148374 -273021 -669400 -382609 -177222
10390 -177222 -648551 -702581 -121365 400082 560583 614264 642503 756655 599322 448578
10380 448578 384601 488861 664257 380369 30176 86223 67602 -202945 -246533 -158213
10370 -158213 12076 299371 429525 336784 411258 616199 990229 1194386 898087 405858
10360 405858 333315 223279 138395 125395 -210008 -171092 -117544 -250773 -211443 -202220 -134023
10349 -134023 17387 227840 268795 461656 986235 929811 249558 -34170 -185323 202777
10339 202777 728605 301888 -172432 -223244 -72570 -221070 -260346 -164345 -266295 -202496
10329 -202496 27841 -215021 -451854 -754521 -983373 -638125 -177598 109697 174916 74146
10319 74146 47934 -85376 41193 380939 607105 416976 70552 174466 409463 351736
10309 351736 573851 1104717 1013622 862533 1069025 961168 617249 157804 114045 145559
10299 145559 133858 209126 112615 -39710 -384707 -624084 -1149679 -1313215 -981276 -600494
10289 -600494 -44497 297139 109063 51678 94172 -430301 -639874 -387321 -561144 -811823
10279 -811823 -746523 -520898 -305770 -291677 -510661 -155995 289503 405162 367291 -12113
10269 -12113 -341291 -335356 -311472 -160611 279893 252603 145210 164496 -102581 -318875 -200108
10258 -200108 16824 585758 676816 682512 276054 812 324324 466710 700843 1060773
10248 1060773 737793 366064 288038 149040 198621 -12060 -300021 -311903 -293086 -17922
10238 -17922 174255 -203214 -628170 -978259 -815696 -243073 215195 251529 24663 -14619
10228 -14619 127697 -220939 -770208 -428732 205048 262735 -252406 -784715 -923683 -604524
10218 -604524 -246767 -14263 -171711 -412169 -432084 -58259 180628 -277847 -585276 -292579
10208 -292579 151653 350804 210262 123134 71046 -24531 -144745 -179658 -262319 -118742
10198 -118742 -103788 -419880 -538504 -266190 33751 364595 498293 492145 821251 1023295
10188 1023295 627931 83333 -349083 -833416 -1399563 -1501860 -1358454 -952818 -270862
10179 -270862 122479 77587 -212367 227824 934148 1030634 700871 488751 610348 520854
10169 520854 87503 -207328 -53109 56050 -66170 374839 1141782 1231300 999396 936425
10159 936425 918038 995836 1140022 1219604 1139143 848119 618420 362254 -21888 160753
10149 160753 668137 570083 351444 687116 875183 766720 326880 109868 552159 920050
10139 920050 991682 795822 308330 64116 226611 191428 85777 294510 385102 282993
10129 282993 64611 139758 276788 435429 635539 439972 72768 30957 223548 759381
10119 759381 1000490 1038666 1286339 1087569 927822 720807 619772 805425 970639 1096027
10109 1096027 1316041 1894696 2019859 1952923 2025687 1896930 1621016 1624917 2172871 2666273
10099 2666273 2275709 1542377 1182924 1143224 911947 623919 377011 301694 983021 1119380
10089 1119380 725180 493680 -146664 -494657 -182873 216628 246083 723831 1266469 1221130
10079 1221130 933691 703431 799911 846621 787008 546714 294350 -32392 -46916 -236927
10069 -236927 -378664 -364706 -510881 -407282 1638 308260 192958 26097 221350 282644
10059 282644 60396 150364 377799 661674 884784 1193199 1392264 1444126 1489854 1342789
10049 1342789 871923 370862 -202749 -723363 -1115353 -1255180 -1431284 -1546373 -1224686
10040 -1224686 -643757 206910 680514 573084 86501 -283743 -308907 -165922 155329 178904
10030 178904 310728 875227 1257504 818218 254518 34642 -29782 313923 736567 707685
10020 707685 479933 247698 49870 -123177 -227453 -55395 -18879 -63653 -85624 -218636
10010 -218636 -92705 -61019 -93210 2845 -179365 -529049 -728246 -786212 -535547 11523
10000 11523 569207 802472 955273 1253565 1595840 1602152 1080296 600585 756866 804866
9990 804866 579112 273827 71808 -12548 239933 582823 736627 1130101 1192878 1057247
9980 1057247 1936376 2634570 2661387 2593017 2849383 2962527 2572192 2491408 2691162 2587767
9970 2587767 2473604 2130481 1740180 1891124 2293114 2364461 2122025 2092112 2296803 2474575
9960 2474575 2561964 2319158 2045247 1931723 1719279 1407440 946701 900966 985234 1039455
9950 1039455 1260639 1623792 1970077 2208911 2029320 1620494 1177731 678837 346729 24308
9940 24308 138054 431332 648647 662108 422233 333366 94306 242643 378981 489231
9930 489231 549420 796043 881186 703042 365519 -136743 -182528 -126102 -375425 -795258
9920 -795258 -1009601 -572487 -67867 263753 187573 -108050 -105659 42463 -34492 -10998 185844
9909 185844 101656 -259732 -396519 -254118 -248530 -257803 -291715 -343490 -566235 -562069 -199445
9898 -199445 111319 246092 399824 481090 394871 177628 -36996 -189256 -236593 -265163
9888 -265163 -363642 -502723 -639017 -650668 -657581 -783808 -629375 -352009 -260814 -304878 -132067
9877 -132067 133435 -186844 -286230 27983 290122 354063 388999 843964 1013037 699064
9867 699064 255309 57841 6022 -309093 -742522 -814744 -537575 -351434 -149856 -92073
9857 -92073 31238 -69779 -175974 -208926 -319311 -448530 -39510 681177 691002 98320
9847 98320 -443610 -809552 -665722 -329536 107951 465736 336815 420869 670349 982753
9837 982753 1207762 1379363 1477325 1447676 1209539 1147381 1225837 1229105 1367711 1588030 1548436
9826 1548436 1107816 530937 377382 718752 1159057 1335166 1402077 1536311 1290195 1089712
9816 1089712 523711 135540 313392 760884 932346 791871 699086 785894 1256529 1457018
9806 1457018 1924728 2037760 1735929 1391425 1068709 1003369 1145665 1282941 1332404 1173143
9796 1173143 1000253 864905 1016291 1378832 1542419 1579367 1939098 2454052 2677598 2840891
9786 2840891 3009274 3305713 3386593 3512797 3820805 3829504 3468040 3453101 3753957 3741598
9776 3741598 3523297 2968553 2481612 1965084 1781993 1913665 1971090 2047993 1769055 1233101
9766 1233101 997549 1146601 1341497 1704074 2087825 1893469 1640411 1423247 1132865 855706
9756 855706 664800 752238 1027808 1021293 780867 864882 1165451 1282940 983111 701719
9746 701719 519496 481079 598935 230959 -141815 -249835 -152678 104993 295066 499754
9736 499754 440586 544911 582009 977003 1132917 989143 787135 522201 458895 350254
9726 350254 127408 93159 216388 565069 999489 1160849 1356149 1563062 1468297 1244039
9716 1244039 962672 952912 882977 633961 605283 322948 49336 338809 935172 1191360
9706 1191360 1252926 1598688 2240632 2967774 3035563 2704192 2420713 2537126 2902930 3139850
9696 3139850 3083897 3256301 3424137 3292820 3016840 2827875 2952924 3252989 3313411 3364690
9686 3364690 3463009 3850144 4426800 4960270 5231245 5509217 5701504 5680182 5576981 5781049
9676 5781049 6224408 6211437 6238361 6157358 6012641 5892701 5634122 5402041 5206432 5064727
9666 5064727 4591127 4047598 3283088 2565174 2528240 2620848 2868414 3121509 3281216 3159173
9656 3159173 2527121 2245629 2083608 1717186 1608950 1579141 1693862 1595915 1611614 1633976
9646 1633976 1432344 1270496 871902 789631 857552 499285 228917 75787 266616 460304
9636 460304 496021 701223 772270 1014067 1077234 499688 196017 153359 288092 359161 529579
9625 529579 1045504 934894 509225 474825 792430 975574 927962 885393 759673 404121
9615 404121 118075 -262639 -208706 -113134 -538070 -1058541 -1094777 -476824 196200 460465
9605 460465 83723 -82747 -174785 -456287 -336041 -117520 -309184 -397797 -623783 -937909
9595 -937909 -1146787 -1021636 -490251 -106920 -164114 -249960 -310962 -283819 -264952 -430310 -336075
9584 -336075 -227548 -638302 -734542 -541089 -766654 -862685 -598361 -439594 -600808 -802947
9574 -802947 -601095 -495034 -252892 -39835 -209236 -643332 -697956 -246515 25362 -62747
9564 -62747 117811 110742 -252877 -458434 -207492 118501 475773 599302 511154 208845
9554 208845 -347555 -127512 170673 89702 74300 -119968 -351722 -296227 249634 720012
9544 720012 638163 662823 890261 924942 691994 207577 -202726 -70906 181671 -146665
9534 -146665 -564758 -732121 -417273 -122358 -83392 67463 301531 507854 409325 -184939
9524 -184939 -557772 -682472 -572608 -103864 543188 979080 1244022 1594801 1490504 912669
9514 912669 622001 1076712 1883563 2279403 2274300 2126302 2074543 2346777 2570480 2759850
9504 2759850 2862658 2770048 2733472 2741765 2834694 3161101 3100291 3104597 3248945 3425109 3245287
9493 3245287 2966611 2771116 2200021 1631683 1364050 1002897 1064632 1352786 1187148 972472
9483 972472 893460 983797 888586 789132 799444 620413 452529 44399 79692 553468 885739
9472 885739 645789 843649 1170726 695067 424723 567418 804207 702666 305638 -148885
9462 -148885 -221430 39391 103555 350962 136544 -190483 85053 420087 671063 616403
9452 616403 263975 73697 105731 -50696 -363618 -345641 141993 501398 592501 1043899
9442 1043899 1556938 1812634 1760721 1358431 891317 837262 865347 1037856 1072296 635818
9432 635818 -129798 -510389 -243588 -141893 -16633 145936 66469 -19706 264618 298726
9422 298726 146603 20533 -24214 127371 239754 426492 502603 759191 1181572 1097196
9412 1097196 860304 1029200 971864 989085 1072926 1208579 1515268 1619214 1507472 848772
9402 848772 489838 1172756 2161311 2367200 2322384 2654271 3101066 3259974 3339622 3654809
9392 3654809 3762360 3551325 3534342 3655039 4304599 5296578 5726592 5816080 5677085 5437150
9382 5437150 5386845 5352162 5262299 4815334 4237421 3700615 3278873 2514112 1726197 1109212
9372 1109212 1020200 1206556 1320622 1233119 1220313 1483298 1236391 698904 584130 664309
9362 664309 618195 631127 409951 -278925 -766396 -866038 -549721 -327829 -178071 -270462
9352 -270462 -326317 -255668 -293013 -207281 -89431 -40924 -70938 -113976 -158480 -310988 -369387
9341 -369387 -478509 -633600 -276330 213193 211085 536923 812909 680489 317243 117687
9331 117687 271671 360188 740016 656940 180129 -115797 -141326 -115962 97330 304684
9321 304684 358694 754048 1029754 1038051 722847 524243 744156 795236 732912 637337 231052
9310 231052 -179518 -404188 -247669 114049 134635 79922 32267 124677 313814 433936
9300 433936 511116 411489 224250 454367 812106 862175 656326 365098 152516 -27141
9290 -27141 97170 111033 -101545 -257664 41585 193598 144901 267588 552958 603262
9280 603262 341560 256025 239001 20178 -271573 -138266 55427 254699 264889 230769
9270 230769 250621 245233 204473 112773 104629 296461 251231 138453 278765 528739 518953
9259 518953 338139 320950 423067 300312 -10745 -211447 -171746 24705 223770 447475
9249 447475 651069 716178 801703 722701 694315 551508 -67206 -408990 -125174 113106
9239 113106 70451 -326086 -613937 -568560 -367671 -43304 152964 -35366 -162835 -313681
9229 -313681 -625859 -624184 -389299 -73816 406572 445519 -20037 -456410 -594797 -801600
9219 -801600 -888132 -562419 -209942 125740 181166 -131 166158 539127 786482 728978
9209 728978 696222 361106 -88459 -153821 180379 153972 111557 385692 470033 177610 -199047
9198 -199047 -206584 169324 288363 178186 -25336 -141492 -291885 -570893 -989036 -1252071
9188 -1252071 -897897 -448359 -334540 -622786 -567403 -137336 408611 828368 640182 399173
9178 399173 406130 425305 432895 243932 374496 888455 744249 455273 617601 742797 593899
9167 593899 53527 -79170 151727 198530 512248 502139 671138 995575 834746 342386
9157 342386 75190 -363999 -469454 -463768 -164577 95663 -38316 22552 442279 654571
9147 654571 787712 453741 -90266 -282241 -415518 -576329 -638319 -839485 -676567 -332200
9137 -332200 -315625 -470266 -386357 -67716 70183 290363 324318 245217 268737 391302 508791
9126 508791 517422 -78994 -472834 -530215 -555652 -595111 -451906 -731917 -1097813 -1103697 -699950
9115 -699950 -258464 29873 151665 -13471 -347469 -520108 -339859 -194149 -193464 -308719
9105 -308719 -164392 243063 220877 225915 60539 -56559 -282590 -430145 -672925 -888538
9095 -888538 -828219 -866050 -1267740 -1506432 -1192556 -1010708 -1014400 -902890 -459914 -18563
9085 -18563 129357 -105597 -575437 -523214 -107130 -12745 -90109 270368 755654 1026454
9075 1026454 1093701 1285822 1257096 995287 585060 491140 467850 221109 310031 416841
9065 416841 301556 244269 107575 -91852 99810 282141 500620 500783 459884 172638 65791
9054 65791 772804 1071685 708457 299293 173328 100404 5026 286963 705482 585334
9044 585334 194435 -21825 -166431 -299920 18945 313966 298950 14465 -305123 -111475
9034 -111475 180789 -212 243088 564873 404081 -43894 -522150 -594618 -529372 -465167
9024 -465167 -568926 -538476 -438650 -231738 -8597 196099 1410 -526509 -787002 -771053
9014 -771053 -464723 -493538 -477557 -49134 297709 145867 -314873 -539487 -772322 -1029600
9004 -1029600 -903476 -627455 -259853 -194945 -131882 391031 454526 185997 -28350 -450301
8994 -450301 -263484 -127287 -276513 -329369 -613580 -955411 -990060 -915858 -568575 -389601
8984 -389601 -212627 -52355 301981 497123 580380 402544 -176258 -772306 -1057833 -1083131
8974 -1083131 -909782 -868850 -743151 -467965 102422 158827 115026 300209 367436 517954
8964 517954 359777 156133 46441 49316 254167 294179 28523 -360525 -656215 -404662
8954 -404662 -259238 -134335 -400661 -420898 -188177 107745 345111 397183 329387 571947
8944 571947 653731 428799 456530 840344 1140683 331251 -192512 -84398 282124 731067
8934 731067 556989 106800 -50667 -137227 -65660 45245 19624 29593 87003 -17573 327813
8923 327813 836122 992238 779758 401027 374098 301106 91310 -107740 120098 386281
8913 386281 -172577 -845510 -817505 -589504 -188974 113911 264043 116381 230602 211635
8903 211635 79377 37392 -81042 -328552 -56920 257516 387714 380514 301503 433886
8893 433886 280896 140047 61145 87168 280775 619238 471258 323625 427089 -75382
8883 -75382 -457622 -314214 -111564 -73955 -147949 -603993 -942213 -691905 -677230 -681344 -310667
8872 -310667 -163491 3715 -66327 -130538 -110758 -403542 -443424 -371106 -497133 -747846 -1162203
8861 -1162203 -1370420 -1306108 -997472 -891911 -792116 -506442 156539 586260 80416 -512199
8851 -512199 -672866 -617304 -247854 77363 -24859 -160492 -165486 277595 719519 596789
8841 596789 460963 467026 31022 -607881 -935807 -909717 -701488 -394946 -520888 -631086
8831 -631086 -778497 -673560 -31806 191218 77185 -146374 -369453 -605500 -987781 -1034927
8821 -1034927 -408967 -32324 -270846 -478151 -524080 -742580 -434543 52869 -269670 -197404
8811 -197404 303366 39686 -87578 460245 930457 778896 316227 272963 473407 147624
8801 147624 -444084 -1042390 -1117755 -912226 -435673 -134749 -268144 -267683 -74143 376719
8791 376719 798469 649108 112294 -392297 -633549 -828318 -721633 -725647 -532716 -460971
8781 -460971 -966293 -1417428 -1291228 -997540 -878860 -550080 -488073 -510660 -564589 -432134
8771 -432134 -359872 -241621 220525 432003 377257 619567 757226 422126 9795 242770
8761 242770 742345 1074460 1151338 971622 1057087 1035780 518861 60681 -44922 32500
8751 32500 -162406 -339274 -314457 -303226 -407126 -771111 -1010050 -856713 -569760 -255438
8741 -255438 -6106 114645 -34900 -454962 -403549 -280692 -560943 -1062646 -971134 -661592
8731 -661592 -515730 -267650 -334985 -587376 -850308 -1040681 -690653 -498299 -665599 -649936
8721 -649936 -230958 -125200 -732551 -1563700 -1986121 -1754362 -1687638 -1681108 -1157601 -400182
8711 -400182 -273618 -360290 -345858 -499286 -703501 -563599 -606725 -486932 -329351 -570929
8701 -570929 -371883 49442 311104 620192 716636 429263 29515 -32272 -32801 261925 287575
8690 287575 59044 -45661 -299319 -281948 -117119 -5813 222272 222418 -171902 -131093 -121163
8679 -121163 -204920 -61122 -219112 -367796 -612031 -561538 -16963 349207 433611 382097
8669 382097 412844 220042 -73878 -278042 -400423 -351235 -430464 -285698 -561642 -852941
8659 -852941 -513536 -230256 20204 99904 -158325 -559966 -719202 -643290 -467473 -243021
8649 -243021 -322165 -123714 12340 -331380 -776415 -1183557 -1164977 -875938 -555636 -213100
8639 -213100 -114180 -137695 -290542 -689450 -882540 -740916 6183 658220 536096 -36756
8629 -36756 -458976 -440867 -327057 -178013 -28655 -16492 57031 265180 326934 -49144 -671015
8618 -671015 -1047698 -1324820 -1404384 -1063390 -546426 -332822 -331994 -348517 -224152 -147327 -207183
8607 -207183 -154329 -272343 -669624 -1176168 -1331911 -767273 -154702 -9123 55613 180884
8597 180884 331786 345837 228005 -754 -325811 -706261 -834491 -809294 -751937 -702342
8587 -702342 -543530 -305799 158817 282455 7818 -157570 -58901 224560 804283 1409458
8577 1409458 1565964 1726482 1588593 1260619 432768 -96917 -381214 -598769 -560123 -478039
8567 -478039 -572896 -428851 -167643 202716 460829 816045 938259 509148 -158508 -364637
8557 -364637 -493858 -467128 -418571 -409884 -43176 510669 691184 336095 54337 -172576
8547 -172576 -428101 -634837 -544766 -636089 -919250 -970816 -667234 -529943 -479496 -247077
8537 -247077 309033 501165 436776 312566 -64390 -705523 -736618 -707922 -834371 -744931
8527 -744931 -880139 -888199 -516372 -543652 -615405 -474034 -323638 -46306 75655 -119801
8517 -119801 -410615 -618865 -890631 -1076650 -1205794 -1319508 -816301 -242507 -102983 -369876
8507 -369876 -815508 -867916 -510320 -303770 -272872 30021 130779 -34569 362783 1032164
8497 1032164 1006799 605009 364075 168706 108574 68030 61969 392395 1156341 1278142
8487 1278142 887279 592193 331017 -102108 -554730 -820090 -712342 -517307 -210585 -113880
8477 -113880 -201897 -2709 357147 499050 248167 -144665 -764776 -1184086 -985778 -776255
8467 -776255 -652049 -282927 -96150 23615 407001 815539 748183 218508 -361750 -299722
8457 -299722 -268440 -342606 -115511 -123932 -334328 -280499 -432960 -245722 -32715 53248 304978
8446 304978 613667 754463 549795 385038 122021 9941 -107549 -102124 -231578 187317
8436 187317 709048 809637 658887 272378 522535 842884 695877 573980 499822 405935
8426 405935 229454 -30712 -37763 -86609 -185656 -6436 246641 516399 379689 71906
8416 71906 129315 309078 22313 -307142 -131172 113558 254594 334219 145966 21415
8406 21415 319256 617147 526875 169670 219250 648940 786970 510419 177989 97339
8396 97339 -45212 -304014 53635 875782 969188 378553 926 -114546 -389609 -499806
8386 -499806 -409508 -400886 -273058 -313260 -306114 -470874 -539276 -577771 -424171 -346800 -635258
8375 -635258 -682988 -66700 281022 379759 470935 -2092 -496499 -695853 -587999 -275066
8365 -275066 135896 26256 -286732 -7898 279943 230011 -42472 -376919 -340422 -111820
8355 -111820 -236365 -343107 -152256 308333 377638 -37250 -260863 -171177 -71213 -41762
8345 -41762 -13268 295018 553319 306350 57192 1498 253368 665031 1077154 1178056
8335 1178056 875823 539455 261455 -156323 -109108 -78036 -303434 -88095 320291 187853
8325 187853 13211 -119965 162450 693275 779225 716224 688347 601781 150527 -104203
8315 -104203 123563 144734 246845 352718 -151718 -408039 -366896 -47816 255195 253706
8305 253706 -4668 -141543 -193320 -394003 -487300 -720886 -1029402 -827062 -727760 -558605
8295 -558605 -246516 295691 622985 602351 395386 133239 -380811 -1049254 -1302112 -1412163
8285 -1412163 -1327309 -1318911 -1453809 -1422012 -1294637 -1279820 -1274070 -1012088 -789616 -758623 -910430
8274 -910430 -1096859 -1144446 -935616 -863235 -758874 -256438 -40041 -221710 -336358 -75532
8264 -75532 177352 40706 -89549 24529 307142 586891 531557 116818 388656 907284
8254 907284 668914 477827 375518 -24226 -209047 -181321 99236 -60010 -399384 -205727
8244 -205727 -5334 6948 2754 -222007 -118013 86441 133268 29441 -363346 -652619
8234 -652619 -546880 -329334 -277748 41635 36230 9972 290669 458103 637496 833429
8224 833429 683105 346780 -198365 -503177 -271515 144812 5137 -236381 -69220 -100282
8214 -100282 77722 174075 139384 174343 144447 -57223 -270671 -161121 -33080 41449 -113770
8203 -113770 -47389 -56239 -508026 -1068208 -1231078 -1177592 -1183101 -1331794 -936086 -180351 300301
8192 300301 403397 -112062 -794622 -1306611 -1745462 -1562148 -1104473 -977332 -792674 -234378
8182 -234378 252654 336275 490830 677104 266008 -61663 -39927 306339 627537 589756
8172 589756 66878 -220791 -164540 -172523 -48098 31606 -394483 -828750 -793899 -586214 -333422
8161 -333422 -198273 -362255 -427812 148393 471847 312797 277206 558816 649357 370627
8151 370627 137648 46427 -10318 -19759 -304292 -626055 -675050 -911647 -1094803 -1045409 -661329
8140 -661329 -335726 -403993 -167266 73025 -155976 -410948 -153201 455904 747732 598316
8130 598316 468632 514241 442852 370030 267637 57553 -341601 -439834 -219624 21983
8120 21983 112480 83561 236003 240476 93439 -3832 59460 116132 51093 -306383 -485247
8109 -485247 -44758 86813 -242699 -593451 -947108 -1160673 -1253808 -1375724 -1301222 -1072857
8099 -1072857 -774799 -890259 -1294323 -1689571 -1845255 -1568096 -848402 -207694 -69836 -396743
8089 -396743 -599791 -828308 -1272499 -1501197 -1413962 -973030 -522189 -393933 -426248 -499035
8079 -499035 -718323 -783532 -581012 -322522 -206946 -289142 -447082 -408701 -510111 -500052
8069 -500052 -40566 163242 257136 474652 1008910 1633493 1184506 183488 -230061 -290016
8059 -290016 -112118 -236704 -764527 -1432376 -1610093 -1392256 -945573 -347550 133757 248185
8049 248185 176201 21671 -204171 -181028 -288870 -420916 -538699 -488103 -386515 -765387
8039 -765387 -1038456 -869114 -547984 -388710 -145278 -133077 -241536 -300272 -521115 -770699
8029 -770699 -1047776 -799523 -272603 -27055 -139047 -513278 -1097688 -1158590 -796153 -429873
8019 -429873 -493711 -730936 -751298 -681815 -804045 -947770 -837020 -818416 -693823 -553146
8009 -553146 -545768 -587137 -609394 -613843 -821175 -818983 -543852 -61598 362953 543515 498792
7998 498792 332828 90542 -77357 79461 661676 1254265 1716323 1410993 771312 214095
7988 214095 -72429 -194294 -181820 -214203 -84803 -287137 -801353 -1256924 -1321806 -734633
7978 -734633 -355255 31244 242753 237636 571173 723431 411458 42160 198487 421117
7968 421117 120674 -350599 -632987 -667935 -477392 56225 581089 508128 -50557 -470306
7958 -470306 -549250 -628998 -529835 -450021 -564132 -529680 -300762 -194329 -108394 92215 -35747
7947 -35747 -388527 -425144 -435712 -458814 -481821 -803107 -881597 -772582 -873666 -943350 -912833
7936 -912833 -529589 -316368 -1050941 -1664665 -1630663 -1190300 -1302709 -1554511 -1656899 -1255274
7926 -1255274 -488618 -278078 -35689 58498 -296077 -550124 -563356 -229895 112082 -10812
7916 -10812 -70299 -55111 -114072 -186446 65264 251854 187293 510 -529887 -874717 -929229
7905 -929229 -795732 -440730 -159809 81833 229311 -184009 -841212 -1292168 -1047164 -798388
7895 -798388 -1037046 -895471 -458668 -246639 -55456 99622 45457 43909 -97617 -51380
7885 -51380 154582 11900 -86168 -341636 -902618 -1173672 -1189292 -1006541 -801514 -670610
7875 -670610 -389385 34903 383865 497383 339156 143930 66817 -131255 -502200 -759811
7865 -759811 -725633 -684543 -1032143 -1165128 -1002603 -815374 -644148 -860571 -1260054 -1400095
7855 -1400095 -1087953 -486733 -273492 -106546 -179975 -569695 -594514 -336393 -132334 -302979
7845 -302979 -532942 -692301 -1271762 -1725597 -1828689 -1622990 -952389 -317335 -201194 -191085
7835 -191085 -462411 -377442 -384884 -723373 -731483 -679139 -746208 -1027973 -1403352 -1158969 -638557
7824 -638557 -198977 143422 30391 -185604 -519762 -457525 68909 333051 401878 408800
7814 408800 260657 353411 599556 491620 -82044 -571386 -642582 -690127 -886552 -993331
7804 -993331 -863661 -931839 -807227 -507793 -552575 -599427 -489639 -285080 -75773 273229
7794 273229 463640 554858 430611 489170 566262 661886 388848 61620 -192186 -225864 -249544
7783 -249544 -762377 -950311 -613426 -69919 -58565 -217860 -109494 -21917 82267 216742
7773 216742 397290 504921 438245 377741 343974 356040 64698 -93513 -125744 231747 841998
7762 841998 913141 707477 412327 44976 -67886 49879 -153923 -467009 -541967 -260934
7752 -260934 162024 371458 550848 780606 580256 201792 90438 117137 -123003 -494990
7742 -494990 -571080 -583296 -740554 -578180 -416284 -631331 -513674 -271514 -234657 32223
7732 32223 39201 72609 440071 568494 220602 -193849 -80202 129071 -37058 -165344
7722 -165344 -305258 43848 165097 -120239 -388268 -753057 -1182418 -1120917 -485423 24468
7712 24468 413401 648882 686313 633325 320972 366300 657853 500087 62844 -66781
7702 -66781 -210246 -545246 -978794 -1151630 -1011559 -797852 -626285 -658580 -658402 -245980 -32469
7691 -32469 -268653 -579144 -957406 -704696 -97815 87012 -418541 -863114 -1026077 -1024611
7681 -1024611 -653500 -286543 -494990 -644277 -696639 -550244 -301077 -90712 -339291 -397661
7671 -397661 -195016 -497831 -859398 -1093167 -997824 -799581 -762848 -1156848 -1767928 -1808974
7661 -1808974 -1415022 -1065487 -776968 -775174 -858730 -404370 48423 -75466 -292880 -589491
7651 -589491 -575717 -593372 -672660 -528260 -634905 -860249 -602269 -499417 -599309 -525709 -533327
7640 -533327 -608593 -517727 -531435 -801350 -1161571 -1016852 -823348 -968600 -1124208 -886797
7630 -886797 -516891 -198643 -487400 -821809 -693624 -776642 -988438 -918479 -984186 -970152
7620 -970152 -497483 -195158 367822 895238 778360 157273 -196697 -443708 -225995 60223
7610 60223 116939 -72699 -289060 -267741 -255223 137463 116993 271762 352199 -15411 -660093
7599 -660093 -1103582 -957527 -568495 -254797 -139449 23812 174047 27349 -550881 -699429
7589 -699429 -775328 -1054242 -1094587 -1061243 -624371 -332353 -156110 -242612 -594626 -939796
7579 -939796 -1112940 -543223 56780 431067 713743 681879 428069 261905 71159 -239532
7569 -239532 -503673 -649105 -689063 -808992 -858719 -676872 -361245 -201611 -273524 -652574
7559 -652574 -793026 -458438 -309251 -172562 -263807 -561662 -763490 -722415 -873478 -1051590
7549 -1051590 -593708 148413 486929 498942 -119429 -561926 -430082 -297716 -94954 -92267
7539 -92267 -444913 -595889 -362592 84285 248735 316361 367675 173279 260107 834739
7529 834739 1225367 1415799 1433518 1058668 172250 -439888 -629529 -380721 -392276 -599361
7519 -599361 -519870 -391575 -563536 -935221 -888810 -696969 -432065 -437681 -286474 -153491
7509 -153491 -50297 194922 149069 6946 -20369 230891 448912 458377 243373 -176862
7499 -176862 -458764 -596202 -729143 -770771 -653599 -321599 -592011 -999341 -1223122 -1449848
7489 -1449848 -1317255 -798612 -488731 -197533 125164 231659 -97226 -193058 128543 300193
7479 300193 365814 161620 49567 218848 697449 949785 819667 624394 692300 529048
7469 529048 32376 -234983 -411459 -259157 -138841 -322364 -343902 -300271 -164647 59083
$$ [...]
##END NTUPLES=NMR SPECTRUM
##END=
