##TITLE=C13_SR75+TFAA20
 DMSO-d6, 20700 sc

 7.6.2022
##JCAMPDX= 6.0         $$ Bruker NMR JCAMP-DX V2.0
##DATA TYPE= NMR SPECTRUM
##DATA CLASS= NTUPLES
##ORIGIN= UXNMR, Bruker Analytische Messtechnik GmbH
##OWNER= root
$$ XWIN-NMR		Version 3.5
$$ Wed Jun  8 12:13:21 2022 Russian Standard Time (UT+4h)  she@DPX200
##.OBSERVE FREQUENCY= 50.327896
##.OBSERVE NUCLEUS= ^13C
##.ACQUISITION MODE= SIMULTANEOUS
##.ACQUISITION SCHEME= undefined
##.AVERAGES= 20701
##.DIGITISER RES= 17
##SPECTROMETER/DATA SYSTEM= spect
##.PULSE SEQUENCE= zgpg30
##.SOLVENT NAME= CDCl3
##.SHIFT REFERENCE= (INTERNAL, CDCl3, 0, 222.089)
##AUDIT TRAIL= $$ (NUMBER, WHEN, WHO, WHERE, WHAT)
$$ ##TITLE= Audit trail, XWIN-NMR		Version 3.5
$$ ##JCAMPDX= 5.01
$$ ##ORIGIN= Bruker BioSpin GmbH
$$ ##OWNER= she
$$ F:/spectra/data/she/nmr/c13/1/pdata/1/auditp.txt
$$ ##AUDIT TRAIL=  $$ (NUMBER, WHEN, WHO, WHERE, WHAT)
(   1,<2022-06-08 12:11:54.81 +0400>,<she>,<DPX200>,
      <created by zg, POWCHK disabled, PULCHK disabled
       terminated by command 'halt'
       configuration hash MD5:
       00 E9 B6 7A A2 85 ED C7 34 08 36 98 17 FE 4E 26
       data hash MD5: 32K
       9C 8A 6F 93 60 B4 B4 4C 11 F6 90 89 12 17 A3 07>)
(   2,<2022-06-08 12:11:57.00 +0400>,<she>,<DPX200>,
      <Start of raw data processing
       efp BC_mod = 2 LB = 1 FT_mod = 6 PKNL = 1 PHC0 = -373.139 PHC1 = 25.88472 SI = 32K 
       data hash MD5: 32K
       9F CC C9 1E 65 4D 59 16 30 6F C8 0F 2F 65 A9 76>)
(   3,<2022-06-08 12:11:59.96 +0400>,<she>,<DPX200>,
      <abs ABSG = 5 
       data hash MD5: 32K
       DE F1 CD 90 FD 84 8B DE 32 5C 32 CB 70 F7 85 35>)
(   4,<2022-06-08 12:12:35.10 +0400>,<she>,<DPX200>,
      <pk PHC0 = -2.853659 PHC1 = 3.4 
       data hash MD5: 32K
       BC 35 F8 47 4F 15 70 9D B6 AB BF D6 83 FD 83 7B>)
$$ ##END=
$$ 
$$ hash MD5
$$ C9 38 DF 46 7C CA 3B 50 E4 E6 17 86 63 91 EA BF
##$RELAX= 
##$RELAX= 
##$RELAX= 
##$RELAX= 
##$RELAX= 
##$RELAX= 
##$RELAX= 
##$RELAX= 
$$ Bruker specific parameters
$$ --------------------------
##$DU= <F:/spectra>
##$EXPNO= 1
##$NAME= <c13>
##$PROCNO= 1
##$TYPE= <nmr>
##$USER= <she>
##$AMP= (0..31)
100 100 100 100 100 100 100 100 100 100 100 100 100 100 100 100 100 100 
100 100 100 100 100 100 100 100 100 100 100 100 100 100 
##$AQSEQ= 0
##$AQ_mod= 1
##$AUNM= <au_zg>
##$AUTOPOS= <>
##$BF1= 50.322709
##$BF2= 200.13
##$BF3= 50.322709
##$BF4= 500.13
##$BF5= 500.13
##$BF6= 500.13
##$BF7= 500.13
##$BF8= 500.13
##$BYTORDA= 1
##$CFDGTYP= 0
##$CFRGTYP= 5
##$CHEMSTR= <none>
##$CNST= (0..31)
1 1 145 1 1 1 1 1 1 1 1 1 1 1 1 1 1 1 1 1 1 1 1 1 1 1 1 1 1 1 1 1 
##$CPDPRG= <waltz16>
##$CPDPRG1= <>
##$CPDPRG2= <waltz16>
##$CPDPRG3= <>
##$CPDPRG4= <mlev>
##$CPDPRG5= <mlev>
##$CPDPRG6= <mlev>
##$CPDPRG7= <mlev>
##$CPDPRG8= <mlev>
##$CPDPRGB= <>
##$CPDPRGT= <>
##$D= (0..31)
0 2 0.00345 0 0 0 0 0 0 0 0 0.03 2e-05 3e-06 0 0 0 0 0 0 0 0 0 0 0 0 0 
0 0 0 0 0 
##$DATE= 1654605212
##$DBL= (0..7)
120 120 120 120 120 120 120 120 
##$DBP= (0..7)
150 150 150 150 150 150 150 150 
$$ [...]
##$SUBNAM4= <"">
##$SUBNAM5= <"">
##$SUBNAM6= <"">
##$SUBNAM7= <"">
##$SUBNAM8= <"">
##$SUBNAM9= <"">
##$SW= 239.972175391363
##$SWIBOX= (0..15)
0 1 3 0 0 0 0 0 0 0 0 0 0 0 0 0 
##$SW_h= 12077.2946859903
##$TD= 32768
##$TD0= 1
##$TE= 0
##$TE2= 300
##$TE3= 300
##$TEG= 300
##$TL= (0..7)
120 120 120 120 120 120 120 120 
##$TP= (0..7)
150 150 150 150 150 150 150 150 
##$TP07= 0
##$TPNAME0= <>
##$TPNAME1= <>
##$TPNAME2= <>
##$TPNAME3= <>
##$TPNAME4= <>
##$TPNAME5= <>
##$TPNAME6= <>
##$TPNAME7= <>
##$TPOAL= (0..7)
0.5 0.5 0.5 0.5 0.5 0.5 0.5 0.5 
##$TPOFFS= (0..7)
0 0 0 0 0 0 0 0 
##$TUNHIN= 0
##$TUNHOUT= 0
##$TUNXOUT= 0
##$USERA1= <user>
##$USERA2= <user>
##$USERA3= <user>
##$USERA4= <user>
##$USERA5= <user>
##$V9= 5
##$VALIST= <valist>
##$VCLIST= <CCCCCCCCCCCCCCC>
##$VD= 0
##$VDLIST= <DDDDDDDDDDDDDDD>
##$VPLIST= <PPPPPPPPPPPPPPP>
##$VTLIST= <TTTTTTTTTTTTTTT>
##$WBST= 1024
##$WBSW= 4
##$XGAIN= (0..3)
0 0 0 0 
##$XL= 0
##$YL= 0
##$YMAX_a= 119864029
##$YMIN_a= -110875394
##$ZGOPTNS= <>
##$ZL1= 120
##$ZL2= 120
##$ZL3= 120
##$ZL4= 120
##$ABSF1= 222.0892
##$ABSF2= -17.90747
##$ABSG= 5
##$ABSL= 3
##$ALPHA= 0
##$AQORDER= 0
##$ASSFAC= 0
##$ASSFACI= 0
##$ASSFACX= 0
##$ASSWID= 0
##$AUNMP= <proc_1d>
##$AZFE= 0.1
##$AZFW= 0.5
##$BCFW= 0
##$BC_mod= 2
##$BYTORDP= 0
##$COROFFS= 0
##$CY= -3
##$DATMOD= 1
##$DC= 0
##$DFILT= <>
##$DTYPP= 0
##$F1P= 0
##$F2P= 0
##$FCOR= 0.5
##$FTSIZE= 32768
##$FT_mod= 6
##$GAMMA= 0
##$GB= 0
##$INTBC= 1
##$INTSCL= 4.134877e-10
##$ISEN= 128
##$LB= 1
##$LEV0= 0
##$LPBIN= 0
##$MAXI= 10000
##$MC2= 0
##$MEAN= 0
##$ME_mod= 0
##$MI= 0.1934396
##$NCOEF= 0
##$NC_proc= 2
##$NLEV= 6
##$NOISF1= 120.0001
##$NOISF2= 80.00006
##$NSP= 0
##$NTH_PI= 0
##$NZP= 0
##$OFFSET= 222.0892
##$PC= 1.4
##$PHC0= -375.9927
##$PHC1= 29.28472
##$PH_mod= 1
##$PKNL= yes
##$PPARMOD= 0
##$PSCAL= 0
##$PSIGN= 0
##$REVERSE= no
##$SF= 50.3227585034004
##$SI= 32768
##$SIGF1= 140
##$SIGF2= 120
##$SINO= 11.81781
##$SIOLD= 32768
##$SREGLST= <13C.CDCl3>
##$SSB= 0
##$STSI= 32768
##$STSR= 0
##$SW_p= 12077.2946859903
##$SYMM= 0
##$S_DEV= 0
##$TDeff= 32768
##$TDoff= 0
##$TI= <>
##$TILT= no
##$TM1= 0
##$TM2= 0
##$TOPLEV= 0
##$USERP1= <user>
##$USERP2= <user>
##$USERP3= <user>
##$USERP4= <user>
##$USERP5= <user>
##$WDW= 1
##$XDIM= 32768
##$YMAX_p= 466182049
##$YMIN_p= -2445356
$$ End of Bruker specific parameters
$$ ---------------------------------
##NTUPLES= NMR SPECTRUM
##VAR_NAME=  FREQUENCY,     SPECTRUM/REAL,   SPECTRUM/IMAG
##SYMBOL=    X,             R,               I
##VAR_TYPE=  INDEPENDENT,   DEPENDENT,       DEPENDENT
##VAR_FORM=  AFFN,          ASDF,            ASDF
##VAR_DIM=   32768,         32768,           32768
##UNITS=     HZ,            ARBITRARY UNITS, ARBITRARY UNITS
##FACTOR=    0.368581032318806, 1,           1
##FIRST=     11176.1413227862, 0,            0
##LAST=      -901.153363204117, 0,           0
##MIN=       -901.153363204117, -2445356,    0
##MAX=       11176.1413227862, 466182049,    0
$$ Real data points
##PAGE= N=1
##DATA TABLE= (X++(R..R)), XYDATA
$$ [...]
10626A096065J32931J35789P889j57287l88655m17887l80284o5087k01741k19295
10616d57562P3631L62477K29157l8960P1564L84310L34111n85363l85298K03500
10606A91567J10499j83863l19458J66934K6768n11054j92345L87314J91238j67667
10596c00067o9683M47089L90428J02604M9798N3077l11914k22749j28862j96542
10586a86821L87303M43099j73791j35223L56886J1939j54341L09978K14667l48902
10576G24794n84797j55969J55861j26273k65432o0085L7331K38732J5394k45018
10566b65462J08844J1527J01355o3013n18471j09391J81933j0135M43027O03494
10556D83708J54655L1495J396k63948l97630j42585P9760J78076r3407J63000
$$ y = [1096065, 1228996, 1364785, 1372674, 1215387, 826732, 408845, 28561, -36526, -238267, -457562, -383931, -21454, 207703, 168743, 240307, 624617, 958728, 373365, -11933, 191567, 302066, 118203, -201255, -34321, -7553, -518607, -710952, -323638, -132400, -300067, -369750, 77339, 467767, 570371, 620169, 673246, 361332, 138583, 9721, -186821, 200482, 643581, 469790, 334567, 691453, 703392, 549051, 859029, 1073696, 724794, 139997, -15972, 139889, 13616, -251816, -311901, -274570, -35838, -20444, -265462, -156618, -145091, -43736, -106749, -625220, -734611, -552678, -562813, -119786, 483708, 638363, 669858, 671254, 407306, 9676, -132909, -53149, 124927, 31520, 194520]
10546A94520M66467L19579J15262N46263M03550n31758o52166m87595l01631Q0140
10536A52631N59724K86622k51325p6723k3092L14443Q1227k49659j62167j44725
10526D86956l10750n06539l55797J94431K34490k49412k2516M49149J28143l36188
10516b88033k69569j09639L60789L19831J11233k3097l33514k58845j11138j55973
10506g57955p613j26857Q1140J6166p7849L13431M83284N97195J41651l95094
10496B67499j71878k4847K7290l488k37259O6416K43390n4340l34631j72417J86230
10485b08035J68252j14641L3139K72915M06096J62459m6833k20599m01215J55452
10475B06990J77860j85559m36355m38493p3575m4548k18297j71225L72603M29330
$$ y = [194520, 660987, 980566, 1095828, 1642091, 2045641, 1513883, 861717, 374122, 72491, 152631, 712355, 998977, 747652, 670929, 647837, 962280, 1043507, 793848, 631681, 486956, 176206, -330333, -686130, -491699, -257209, -506621, -529137, -79988, 48155, -288033, -557602, -667241, -306452, 13379, 124612, 101515, -231999, -490844, -601982, -757955, -765568, -892425, -811285, -795119, -872968, -559537, -76253, 520942, 662593, 267499, 95621, 70774, 98064, 94576, -142683, -76267, 167123, 112783, -221848, -394265, -208035, -39783, -154424, -121285, 151630, 557726, 720185, 673352, 452753, 51538, 206990, 384850, 199291, -237064, -675557, -749132, -793680, -1011977, -1183202, -810599, -381269]
10465c81269K90880j337n51989o43451k99745K14610M32674K38728M3116J35313
10455e22470M28677R5238q1380k10620m11818N3436L76257K61293m17211j69829
10445e98427j43459m94254o9305O05882N12638N8574J63142K40283R2459M25617
10435G93150O07342j38514j08647Q7388k6125J03934K9301l34155n52362j29301
10425C32011K19794l01863j09925K28044k60787l74904j30019K99734J68754K50344
10415C21183M69387M44534J76748j03933k14425l27171J1491N40909M2045o32263
10405G28505o21972m14831J55811N59738P7373m94412q04502l60152L24757J12611
10395g37074o6490n5899K43495K26919J0535N8876m7664k86030j77534R8659L4002
$$ y = [-381269, -90389, -91726, -643715, -1287166, -1586911, -1372301, -939627, -700899, -657783, -522470, -93793, 1445, -79935, -290555, -702373, -648937, -272680, -11387, -428598, -598427, -741886, -1236140, -1305445, -699563, -186925, -128351, 34791, 275074, 367533, 793150, 1400492, 1261978, 1153331, 1240719, 1214594, 1318528, 1347829, 1013674, 461312, 332011, 551805, 249942, 140017, 368061, 107274, -267630, -397649, -97915, 70839, 321183, 790570, 1235104, 1411852, 1307919, 1093494, 766323, 777814, 1318723, 1360768, 728505, 106533, -308298, -152487, 407251, 484624, -9788, -814290, -1174442, -849685, -737074, -803564, -859463, -615968, -389049, -378514, -319638, -367302, -653332, -830866, -732207, -698205]
10384f98205K47434N82002N4119j9378L02030L21420l82370l68504O0704Q8645
10374A87897k40078j80677L94962M47159N19810J12140j34772J34574J11213l74270
10364I77958n26855l02659K61479j56173l79386r7425j81853m60428k19387J86921
10354h97808q5641J51862Q9178Q8619J45838K60957P04546N38286k29535m02573
10344C63729m88070k51602l78693r6782M55548K97991K3247m85540q0719J48085
10334d92806j13065j48300L73703N20224R7117l49064k88023j87941M4549L4004
10324e09602j41546k3367L62654m6867K1555L83524l8636L48543O20580j66282
10314H10556n43004N6926K94140N6044K51313N116m44723l07439m31369l76566
$$ y = [-698205, -450771, 131231, 185350, 165972, 468002, 789422, 407052, 38548, 99252, 187897, -52181, -232858, 162104, 609263, 1129073, 1241213, 1106441, 1241015, 1352228, 977958, 451103, 148444, 409923, 253750, -125636, -223061, -404914, -865342, -1084729, -897808, -983449, -831587, -742409, -653790, -507952, -246995, 457551, 995837, 766302, 363729, -124341, -375943, -754636, -851418, -395870, -97879, -74632, -560172, -640891, -492806, -605871, -754171, -380468, 139756, 236873, -112191, -400214, -588155, -543606, -509602, -651148, -674515, -311861, -358728, -337173, 46351, 7715, 356258, 976838, 810556, 267552, 324478, 618618, 674662, 925975, 931091, 486368, 178929, -252440, -629006]
10304f29006j41585j8694j97337p2055p0742k84993N51944J90881r2623j3037
10294g77247l2006K44451R2877L30080L86143M69542K06024l7014j57059k36773
10284D89018L00546L59058j5574l21410j04634J36316O7430j90333j73056m07658
10274A39703r3087K86118L38457j01068l31513m95250q6406L22802M5028k48183
10264b23399k00483J94170J97943K25309J50818j42745l24771P1926L35670r1668
10254A92770j52010l26308m83534k43195K16807L33415k37619J81672K08772L72243
10244F3013N42747m1889p12695n33697l04406R4147K68005P4896J03553J78717
10234b67609P0347N05854K29621m53466m30866j78401J38341J68052j14392R4178
$$ y = [-629006, -770591, -789285, -986622, -1058677, -1129419, -1414412, -862468, -671587, -764210, -777247, -809253, -564802, -471925, -141845, 244298, 713840, 919864, 882850, 725791, 489018, 789564, 1148622, 1133048, 811638, 707004, 843320, 910750, 720417, 547361, 139703, 46616, 332734, 671191, 570123, 238610, -256640, -343046, -20244, 24784, -223399, -423882, -229712, -31769, 193540, 344358, 201613, -123158, -51232, 284438, 192770, 40760, -285548, -769082, -1012277, -795470, -462055, -699674, -518002, -309230, 63013, 605760, 563871, -148824, -682521, -986927, -892780, -624775, -549879, -446326, -267609, -197262, 308592, 538213, 84747, -346119, -524520, -386179, -218127, -332519, -238341]
10224b38341K40750M93194K45761l70382L718M2686K40287m9500k56257k8690
10214C23226k09968l10672j09300O13241N20007Q310k01326j98196j30474Q0350
10204C85198Q2955j2494L08848M14330L03321J27983M7032J23664K27980j91369
10194A817448n06861l79580o9835n7928k8723j52569m6832j7566L42504J33622
10184A033680J6456J13863k08359q8654J32428j51955l23253j11521k89297j56462
10174c3074K46520J77081L0585k06402j08543k87273r3344l2340J57150K87575
10164A37935k16396n71119k54665K65713N32623N93409K94841K68583j49386n41875
10154C59663K0691K19980m42961m62519k33420n0718K86634j35697j59021J4125
$$ y = [-238341, 2409, 495603, 741364, 370982, 374700, 417386, 657673, 608173, 351916, 323226, 113258, -197414, -306714, 306527, 826534, 834844, 633518, 435322, 304848, 385198, 468153, 455659, 764507, 1178837, 1482158, 1610141, 1657173, 1780837, 2008817, 1817448, 1310587, 931007, 861172, 803244, 774521, 621952, 575120, 557554, 900058, 1033680, 1050136, 1163999, 955640, 866986, 999414, 847459, 524206, 412685, 123388, -33074, 213446, 390527, 421112, 214710, 106167, -181106, -274450, -306790, -149640, 137935, -78461, -649580, -904245, -638532, -105909, 487500, 782341, 1050924, 901538, 359663, 380354, 600334, 157373, -305146, -538566, -589284, -302650, -438347, -597368, -583243]
10144e83243J99167K88071k99303k26455J65540L48683M22243L6066q1712l28207
10134e9150m94423M3563K68199J67215J35100l3154l35574R3424M25570j3779
10124A96991m92759k13741m06513O5338O04527J485l47463n42285l97761Q4809
10114a447372q0652j66325K93909M32490K04398M82992Q7068j36088K88499K34542
10104A93461l21953n11778j32229N35607K26726k46429k83262k65160m16180r5433
10094a316630N95710R19311N24347K02408K01720j62295o37634k97045q0868K24665
10084A73689M9663l18810n9409k76835j06452k37876k73677K26075M25493K07349
10074a90790J33560J73992L91882K52863K5434j44693k82970j76997j49267o0515
$$ y = [-583243, -384076, -96005, -395308, -621763, -456223, -107540, 314703, 350769, 269057, -59150, -553573, -510010, -241811, -74596, 60504, 27350, -308224, -214800, 210770, 196991, -295768, -509509, -916022, -850684, -246157, -244672, -592135, -1134420, -1532181, -1447372, -1528024, -1694349, -1400440, -967950, -763552, -280560, -193492, -329580, -41081, 193461, -128492, -640270, -772499, -236892, -10166, -256595, -539857, -805017, -1221197, -1316630, -720920, 198391, 722738, 925146, 1126866, 964571, 326937, 29892, -50976, 173689, 223352, -95458, -154867, -431702, -538154, -776030, -1049707, -823632, -398139, -190790, -57230, 116762, 508644, 761507, 786941, 642248, 359278, 182281, 33014, -27501]
10064b7501j52909m7613j97875O1377K59639J63241M9568m1997k84191J38565
10054g9696J31419R7438J6598p0556N3639K89299J65199l03427p0036J17360L8347
10043C85584K04504L84988L49550j60335m49179n40631p21360k94578M7927J83862
10033f09668k11689o00869l21195J8577L63226L59029K23073M15991K54445k69286
10023c78366p4660M44595j6234n15392J93287K55543j09926j0041m6608r4575
10013c52377o1730O0984N89655L08031m49017o03559k06098L98745j96568n1380
10003e63314K61195L85347K71957n0826k40820j25703k8625l40200k7416L00138
9993a58267K11736K17232q1875j3084j82840j00473J87811j62708j66935K0603
$$ y = [-27501, -180410, -228023, -425898, -364521, -104882, 58359, 107927, 65930, -218261, -79696, 51723, 149161, 165759, 95203, 148842, 438141, 603340, 299913, 229877, 347237, 385584, 590088, 975076, 1324626, 1164291, 715112, 174481, -546879, -841457, -793530, -609668, -821357, -1422226, -1743421, -1724844, -1361618, -1002589, -779516, -363525, -109080, -378366, -453026, -8431, -24665, -540057, -346770, -91227, -201153, -211194, -257802, -352377, -414107, -353123, 236532, 544563, 95546, -508013, -714111, -315366, -511934, -563314, -302119, 83228, 355185, 304359, 63539, -62164, -90789, -430989, -458405, -158267, 53469, 270701, 188826, 175742, -7098, -107571, 80240, -82468, -249403, -228800]
9983b28800l29648p3112j4279k45175j44666J22164Q8816J76900J02923l04549
9973h49426l5437L98059M27189J39350j29407j7761j19551O5999K58891K00428
9963C38334j19269L687J2681k89365o1409L1693K06417l1442l93799l70855K49301
9952d24026L42698J40854k1137J9577K8408o45802k85665J08717l13174k54550
9942a304100m7622M54715Q07931N74027k2281m76001q8629K22276L0936l44007
9932a92755m01159n4762J61146J33162K91028K52431J5621J77451J13302j76432
9922C19033o24741m62010j73129n9048L7990L66350L68068L12848N41320K13043
9912H39724m95219k40069K98517M20126Q6504j42492m36271p15802l64164M987
$$ y = [-228800, -558448, -631560, -645839, -891014, -1035680, -913516, -824700, -647800, -544877, -849426, -884863, -486804, -59615, 79735, -49672, -67433, -186984, -120985, 137906, 338334, 219065, 222752, 235433, -53932, -115341, -83648, 122769, 91327, -302472, -673327, -424026, -81328, 59526, 38389, 57966, 86374, -559428, -845093, -736376, -1049550, -1304100, -1351722, -897007, -89076, 484951, 462670, -13331, -101960, 120316, 151252, -192755, -593914, -648676, -487530, -354368, -63340, 189091, 204712, 382163, 495465, 319033, -305708, -767718, -940847, -999895, -961905, -595555, -227487, 85361, 626681, 839724, 344505, 104436, 402953, 823079, 909583, 767091, 330820, -384982, -749146, -744159]
9902g44159L26481L99956K74415J17213j65027l22902j17180L26906K24824m27226
9892a06699m35670m29279m01283j06982J29342j34243m8954J70524N40728M71830
9882c50686j58656J89624N82217L17469N6979k64078n40108l04504M5270N7701
9872c68772M4967L49829L03497p3849K43451J48385l32836j22126Q7751j44130
9862A36167j97138l65247j30329q9436l55675j90046O12075J07948n46774l37498
9852a355953J42776M18976K96877K17867K86845r300l58738R7552k28482m44952
9842i36532M56065N84237P5042J32472k38866m07944m45032n32878j73795M63892
9832a023339L47166J07441J99555N0886o59089m29715J85067N00698K42283j63111
$$ y = [-744159, -417678, -17722, 256693, 373906, 208879, -114023, -231203, 95703, 320527, -106699, -542369, -971648, -1372931, -1479913, -1350571, -1484814, -1533768, -1363244, -822516, -350686, -509342, -319718, 262499, 579968, 636947, 372869, -167239, -471743, -426473, -368772, -323805, 26024, 329521, 255672, 499123, 647508, 314672, 192546, 280297, 136167, -60971, -426218, -556547, -645983, -1001658, -1191704, -579629, -471681, -1018455, -1355953, -1213177, -794201, -497324, -279457, 7388, -1912, -360650, -263098, -491580, -936532, -480467, 103770, 178812, 311284, 72418, -335526, -780558, -1313436, -1487231, -1023339, -676173, -568732, -369177, -318291, -977380, -1407095, -1222028, -721330, -479047, -642158]
9822f42158K53259O55799M35879L486j16100j39576j57208j27152j13524M8734
9812A01439L34045L52101J9707j02617J46386L6787l7380J14776k7959k33886
9802G03399l5330N5588o12901o67961m4606L32974J42671k44473J84552N88582
9792D02495q4723o68030K02794L60283J13116j72832m72547n02321Q5616O03789
9782a32360O85519J4681l65637j44792O4116N3567Q0399K43424Q275m2562k48382
9771B16248n20135m55563j03242J1274k28934J70360j13999k97278K1151K60627
9761a039491Q4963R4662K945R4004K06668J25157K98961m5770J9421J67826n0295
9750d0949m57289o10357k34353n3747R3923Q6420M84128L56105j41102j45990
$$ y = [-642158, -388899, 266900, 702779, 706265, 590165, 450589, 293381, 166229, 52705, 101439, 435484, 787585, 807292, 704675, 851061, 887848, 850468, 965244, 937285, 703399, 668069, 723657, 110756, -557205, -601811, -268837, -126166, -370639, -186087, 402495, 317772, -350258, -147464, 212819, 325935, 153103, -319444, -821765, -736149, -132360, 553159, 567840, 202203, 57411, 121527, 175094, 255493, 498917, 507192, 464630, 216248, -303887, -759450, -862692, -851418, -1080352, -909992, -1023991, -1321269, -1300118, -1039491, -954528, -859866, -856921, -762917, -556249, -431092, -132131, -177901, -158480, 9346, -40949, -498238, -1108595, -1342948, -1396695, -1302772, -1216352, -732224, -376119, -517221, -663211]
9740f63211M9031j42293k35609l0311J23498J60765K50348K82853L90490L84957
9730E70518k30712l73496Q5174K56640o8611m67985l48187M16226M66242M16505
9720G22314L1938o20730m26776J08803M14248N44321k19394n04745j7219K67209
9710B99969j55974n7144M32042J93881m64536l67496J26488Q8910k40419l32878
9700d77157j81959r2397K50645k5684m6857m9262j45642j7361J42998K47103J68265
9689b27308L61764J46280J98424o0837K7996M09015K36956p8257l76652o49858
9679a2477l53014j08891M4242J71926j52344J88647K70748l10515l92646P5157
9669e79167j60775o316O17664L76670J52017J27925Q4882m16805n95273k76174
$$ y = [-663211, -614180, -756473, -992082, -1022393, -898895, -738130, -487782, -204929, 185561, 570518, 339806, -33690, 51484, 308124, 239513, -228472, -576659, -160433, 305809, 722314, 754252, 133522, -293254, -184451, 229797, 774118, 554724, 49979, 32760, 299969, 143995, 86851, 518893, 712774, 248238, -119258, 7230, 96140, -144279, -477157, -659116, -751513, -500868, -526552, -573409, -622671, -768313, -785674, -642676, -395573, -227308, 134456, 280736, 479160, 418323, 446319, 855334, 1092290, 1014033, 637381, -12477, -365491, -474382, -430140, -258214, -410558, -221911, 48837, -261678, -654324, -579167, -739942, -746258, -128594, 248076, 400093, 528018, 612900, 196095, -399178, -675352]
9659f75352j07626M20090M80165k59721l88285Q8086K62405J90675j80283P7134
9649i2712K4800M1210m7666K83766L67958l22416q09892q74575l55311k01549
9639a986387K49586N04351K29347J38639K80694K49639J90068J89729j15011n72833
9629f42178k35607M1006j9734J44319O74428K34788n07572k69308J45235O3468
9619c71155k17889J86739M43409N46390M53718O5862k22903n11440l25635m47035
9609c99939k94426L39392N11399J1920j55722l63085J6366J42626k78395l01292
9599g71156k99342j27146m0236M6077Q1945J77923M3632K36341J12117l29898
9589h69743Q1248j07134k61620j58718J21523M38071M97735K09118n7576K37583
$$ y = [-675352, -782978, -362888, 117277, -142444, -530729, -442643, -180238, 10437, -169846, -92712, -67912, -26702, -74368, 209398, 577356, 254940, -554952, -1429527, -1784838, -1986387, -1736801, -1232450, -1003103, -864464, -583770, -334131, -144063, 45666, -69345, -642178, -877785, -836779, -856513, -712194, -37766, 197022, -310550, -579858, -434623, -371155, -589044, -402305, 41104, 587494, 1041212, 1107074, 884171, 372731, 47096, -399939, -694365, -354973, 156426, 168346, 12624, -350461, -334095, -191469, -469864, -771156, -1070498, -1197644, -1237880, -1191803, -1109858, -931935, -888303, -651962, -539845, -869743, -788495, -895629, -1157249, -1315967, -1194444, -756373, -258638, -49520, -107096, 130487]
9579A30487M98337o5701o74444l69858m2010J38957K53253k89546m26290l75267
9569a222082m08137j51310j11401K5689P90122Q31647j37574j96814J57733K59865
9559a62262l7809o26558r9932K98314J60497l44106L6187L89030k09476j47579
9549g43694N74352J82332m42668l63669j57248N3115j78268l05668O7728P12646
9539f01042M30174j89819j82593K16455J00711k77564J12644l23373n50493J03098
9529a161802Q31203P89660J37401n1502J97683R0123n88538o29896J5929J11022
9519b58717m0600p2497j44114j21451K97520N09550k4626l38771n245n400K2094
9508a82257K61049N33923L01308j20526k53122k68068m93015n49752K4394J18751
$$ y = [130487, 628824, 563123, -111321, -481179, -523189, -384232, -130979, -420525, -846815, -1222082, -1630219, -1781529, -1892930, -1867241, -1077119, -245472, -383046, -579860, -422127, -162262, -200071, -826629, -926561, -628247, -467750, -811856, -775669, -386639, -596115, -743694, -169342, 12990, -429678, -793347, -950595, -897480, -1075748, -1381416, -1313688, -601042, -170868, -360687, -543280, -326825, -226114, -503678, -391034, -714407, -1264900, -1161802, -330599, 459061, 596462, 544960, 742643, 832766, 244228, -385668, -369739, -258717, -299317, -371814, -515928, -637379, -339859, 169691, 145065, -193706, -198951, -204351, -182257, 78792, 612715, 914023, 793497, 540375, 272307, -220708, -770460, -746066, -627315]
9498f27315n9213L06886N84935k52765j81282O68238Q10356N8063p6831k82718
9488I48354m90738m53428k11441k8514k139K69692K5157L00284J13956q6073Q3663
9477D68773j8520q7400k32105l88245k20753k70857m822J80124j51943n0250J22206
9466f53792R8433o5459p0531K98526N96574o0013k55664j93924j20031N9542l13819
9455f80158l74031j50062L79042M82407k46771j67155K03921J58658P338J34206
9445b52605M17058k0433j07777L19168J52743O9949k20179k09683j89848K82004
9435B40397M85424Q4926n14294O0024K35681k18082l36199j42138p6315l68931
9425e49507l06582j26339r7532p5672L59954O34024J18938J3066K46094J44585
$$ y = [-627315, -686528, -379642, 205293, -47472, -228754, 439484, 1249840, 1307903, 1231072, 948354, 457616, 4188, -207253, -235767, -237906, 31786, 56943, 357227, 471183, 385110, 468773, 450253, 362853, 130748, -257497, -478250, -749107, -753929, -573805, -725748, -775998, -653792, -555359, -620818, -691349, -392823, 203751, 143738, -111926, -305850, -425881, -366339, -680158, -1054189, -1204251, -825209, -342802, -589573, -756728, -552807, -394149, -386811, -252605, 164453, 144020, 36243, 355411, 508154, 578103, 357924, 148241, -41607, 240397, 725821, 810747, 296453, 356477, 592158, 374076, 37877, -104261, -180576, -549507, -856089, -982428, -1079960, -1155632, -795678, -161654, -42716, -29650, 216444, 361029]
9415C61029j37098n00374l72674j66265l67238Q2248J88973k20914L8959L68723
9405g24631K99197p4908k64923j61354k62526P3340L63963L76609J79822l73346
9395e68757n43293J36721o7296k53222J52714N06779K01455n30543o97096k60187
9385a922725L49514K61816L87877O16611P1996j80947J30422j51478l07251l23397
9375a067562R885M10946J42447J07070K26865J36324K79384L6511r6242j15094
9365G0534k54857j95089j27620j21683p6925J06502J96309N3396j02967N7622
9355c94778J02985K7909K24550K77795O1364o07185m17337l0740M652L41903J08420
9344c00462l32916j58912l09176m38321K07174J43665l47727j42190j5804m2707
$$ y = [361029, 223931, -276443, -649117, -815382, -1182620, -1100372, -911399, -1132313, -1093354, -724631, -425434, -500342, -765265, -926619, -1189145, -1115805, -751842, -375233, -195411, -568757, -1112050, -975329, -1042625, -1295847, -1143133, -636354, -434899, -965442, -1662538, -1922725, -1573211, -1311395, -923518, -306907, -234911, -415858, -285436, -436914, -744165, -1067562, -1057677, -646731, -504284, -397214, -170349, -34025, 245359, 281870, 185628, 70534, -184323, -379412, -507032, -628715, -705640, -599138, -402829, -349433, -452400, -394778, -291793, -263884, -39334, 238461, 299825, -307360, -724697, -755437, -750785, -408882, -300462, -633378, -792290, -1101466, -1539787, -1332613, -1188948, -1536675, -1678865, -1694669, -1737376]
9334a737376R9593L34899J15566K80344O32295N32199M84671M3087p54323n30945
9324d99990m9375R0024m6365L5594J75691K15428m941L1425j92228m49279K31115
9313d62901R2450n5330K56866N54853M14099M335j69566m1463j09318j39899k19639
9302A24487l23284l97133j28540K36718O74075N70378M06582k3409k30790j66609
9292G42475j79220j83925l7467J26008Q893q4728j44796j02391j46436L8563j95049
9281a58073o04472P6756N42312M25587L96716j00005r7563j09705K49300M64973
9271A085826L19119l16442m66888k44255m91924l01813j10511J70309P61766N05212
9261I10399r8888j77284p1838J34996R4237l24507k11814n3996l95984Q159K32335
$$ y = [-1737376, -1637783, -1302884, -1187318, -906974, -274679, 257520, 742191, 785278, 30955, -499990, -549365, -459341, -505706, -470112, -294421, -78993, -83934, -52509, -244737, -694016, -462901, -370451, -425781, -168915, 385938, 800037, 804372, 634806, 593343, 484025, 344126, 124487, -198797, -595930, -724470, -487752, 186323, 756701, 1163283, 1139874, 909084, 742475, 563255, 379330, 341863, 467871, 476764, 392036, 247240, 144849, -1587, 36976, -158073, -762545, -685789, -143477, 282110, 678826, 578821, 481258, 371553, 620853, 1085826, 1404945, 1088503, 621615, 377360, -114564, -416377, -526888, -356579, 405187, 910399, 811511, 634227, 562389, 697385, 791622, 467115, 255301, 201305, -194679, -186520, 45815]
9250D5815l3254j57979l08773k66838N8828R2652R3026j73025j10300j33793m11119
9239a304760k13472K08164N88064J39137J68381J52617J33991L47659K49636j39876
9229C29541j66424R5625m08128j77449j67032k91986J1306j17402j38985j17682
9219a148616J58889N80867P31940J90170l74633l76174l09042m7113K73996N90535
9209B70819L12802l46160m11290k61316K12202r912j66636L9262J23698L03255
9199F6724k27757j39942K77773M14588J3079L87894j2223m98029l59418l74578
9189d51889j548J69324L13142O4726j52865o03625l09269M56390K92527J26464
9179i6623n5813k0074J41438Q11r4952j48415l27460q7374J83288J06634K34901
$$ y = [45815, 12561, -145418, -454191, -721029, -662201, -569549, -476523, -649548, -759848, -893641, -1304760, -1518232, -1310068, -722004, -582867, -414486, -261869, -127878, 219781, 469417, 329541, 163117, 258742, -149386, -326835, -493867, -785853, -774547, -891949, -1030934, -1148616, -989727, -408860, 323080, 513250, 138617, -237557, -546599, -593712, -319716, 270819, 583621, 237461, -173829, -435145, -222943, -232855, -399491, -360229, -236531, 66724, -161033, -300975, -23202, 391386, 404465, 792359, 780136, 282107, -77311, -451889, -453437, -284113, 29029, 93755, -59110, -662735, -972004, -515614, -223087, -96623, -152436, -172510, -31072, -30261, -125213, -273628, -601088, -688462, -505174, -398540, -163639]
9168a63639J5529o83371m5710K55006N142q7116J56581J2903q2071L80565K41583
9157E402J64302n21706l70163K31135N1278j35917J3243K28030K05880k78882
9147d07398k50460J69015J64664l19603J8668L99653M77062K11820l19937l45840
9137b02356K4017J93021J59694K7575r9530K15040L69288r6592l40524J73061
9127D22694J72669k9115l05113K9761M45106K73305n4391p5128j66101p1517k75910
9116C66260l7376L89176L54056L58400K26315j82406m67965k83534l78889k53123
9106I0914o57581m62369j5277K6335J37817K54771P9071l97210k36912M08632
9096g71809K12626j29420J79847J49025l96639p5603J79744L68257R14860K62154
$$ y = [-163639, -148110, -831481, -877191, -622185, -617043, -704159, -547578, -534675, -616746, -236181, 5402, 169704, -352002, -722165, -491030, -439752, -575669, -562426, -334396, -128516, -407398, -657858, -488843, -324179, -643782, -625114, -225461, 251601, 463421, 143484, -202356, -178339, 14682, 174376, 201951, 102421, 317461, 686749, 590157, 249633, 422694, 595363, 566248, 261135, 290896, 736002, 1009307, 954916, 879788, 713687, 642170, 366260, 328884, 718060, 1072116, 1430516, 1656831, 1474425, 1006460, 722926, 344037, 90914, -566667, -1029036, -1044313, -1017978, -880161, -625390, -546319, -943529, -1180441, -771809, -559183, -688603, -508756, -359731, -756370, -831973, -652229, -283972, 630888, 893042]
9086H93042m03077l24420J9334J97930J96666K63818p2231j77332K0903L56246
9076I70879l365o33309n44928r4818J28074O7774m7564L63438M30387L88990J99565
9065A225123J37043K73938j76788k51189n9030J6671Q5925J53892L36840o4257
9055A678168o25990k22029J53332q0557K92896M20101K49053M2110l82117m8241
9045A476726k4930k72005n8036L24600P37319M0776j49660j37222m36992k76387
9035A224189J8570O5977J89522O8537O7456l07460j84942k8734r1042j74635j48108
9024F99330k9407p4013l2022k35446j48968J637m97370l63455m7692K97249M93775
9013F3618L85662K46932K11830K2014L562K9448L5019M9312J1808n81323r07748
$$ y = [893042, 489965, 165545, 184879, 382809, 579475, 843293, 771062, 593730, 614633, 970879, 967514, 334205, -210723, -305541, -177467, -109693, -157257, 206181, 636568, 1025558, 1225123, 1362166, 1636104, 1459316, 1208127, 1149097, 1165768, 1251693, 1405585, 1742425, 1678168, 1052178, 830149, 983481, 902924, 1195820, 1615921, 1864974, 1907084, 1524967, 1476726, 1451796, 1179791, 1121755, 1446355, 2183674, 2224450, 2074790, 1937568, 1500576, 1224189, 1242759, 1308736, 1498258, 1566795, 1634251, 1326791, 1141849, 1113115, 1022073, 847438, 699330, 669923, 595910, 563888, 328442, 179474, 181111, -316259, -679714, -727406, -430157, 63618, 449280, 696212, 908042, 930056, 933618, 963066, 998085, 1047397, 1059205, 477882, -429866]
9002d29866j86175L75518O30892N54863L8894j67390L36128P75959N04943J3908
8992B447674j30705j6854J49482j96592r7774j59904L27607P02237M41111k0434
8982C445848r5991l15248j45316O39919O20217k61258n55656k92087r8776j06784
8972B834868J09194n4484o1118P7897j56236k68635j34976L28891L26967k3296
8962B979072o1563k9834k66247m37257j98829k06205Q1155L58667J31834k16846
8952B133947o83639j48664J68178j02914K310q2314j32630J07218M0436p6764
8942A225164L07216J94831J40399m53654j030980k78808J0284l1411J5650N97558
8932F96249Q22936L25417K60633N25674M66940l2571j60493M55405P60321M51571
$$ y = [-429866, -616041, -240523, 390369, 945232, 984126, 816736, 1152864, 1928823, 2433766, 2447674, 2316969, 2300115, 2449597, 2253005, 2155231, 1995327, 2322934, 3025171, 3466282, 3445848, 3349857, 3034609, 2889293, 3529212, 4149429, 3888171, 3332515, 3040428, 2941652, 2834868, 2944062, 2889578, 2828460, 2906357, 2750121, 2481486, 2346510, 2675401, 3002368, 2979072, 2917509, 2887675, 2621428, 2184171, 1985342, 1779137, 1860292, 2218959, 2350793, 2133947, 1450308, 1301644, 1469822, 1366908, 1369218, 1286904, 1154274, 1261492, 1301928, 1225164, 1532380, 1727211, 1867610, 1413956, 382976, 104168, 114452, 83041, 98691, 696249, 1519185, 1844602, 2105235, 2630909, 3097849, 3065278, 2904785, 3360190, 4120511, 4572082]
8922D572082J94936k69564m4864N68771L31873J58855J23230l4733K48176J63754
8912F012516M3212n65814m63933k6080M7397M4970k02683k21936j58854k53761
8902D255034m08475k65922j14243j44560K75432L46045j72689p48110o05177m4731
8892B372604p7402k28763k44236r4962m088m3895k2919j04153m12716O6366N95310
8881A801146O53855L66944K16146J17699k21998j49726j06294k36700k9880K51799
8871B662991j52763m8937J31409m04908o08409j08743J75424N88232O47455m8855
8861B832896l45940k16860r8746J89224O64562N83960K20377L54204O15662J30038
8851D929377O0591L76593K05367J30389L51799K77101j66170k33440j81869j4777
$$ y = [4572082, 4767018, 4497454, 4452590, 5021361, 5353234, 5512089, 5635319, 5600586, 5848762, 6012516, 6055728, 5489914, 5025981, 4999901, 5047298, 5092268, 4889585, 4667649, 4508795, 4255034, 3846559, 3580637, 3466394, 3321834, 3597266, 3943311, 3770622, 3022512, 2417335, 2372604, 2295202, 2066439, 1822203, 1727241, 1723153, 1679258, 1656339, 1552186, 1139470, 1205836, 1801146, 2455001, 2821945, 3038091, 3155790, 2933792, 2784066, 2677772, 2441072, 2411192, 2662991, 2510228, 2461291, 2592700, 2187792, 1579383, 1470640, 1646064, 2234296, 2881751, 2832896, 2486956, 2270096, 2171350, 2360574, 3025136, 3609096, 3829473, 4183677, 4799339, 4929377, 4989968, 5366561, 5571928, 5702317, 6054116, 6331217, 6165047, 5931607, 5749738, 5734961]
8841E734961P5499n04215k60092J90216j91300K95905j30924l77963k6251k61363
8831D544473o64571n72562l87591O1738J51789k29251o54925n28848K04525l6232
8821A888545j27165O68134N02629r3455j81505n58960o88147m71740n1106K05129
8811A092359L8041L280J96550K41043N3473M2607K21010l1617n39175k63017O3957
8800A118511J88674K51530m64662k80657N10685K38831K19164j68178j11121K62318
8790A765095M30946N95951O27968P1203m56659l87608k22881k88533l67680j07195
8780A660607J14932J41953l40432l80561O657L23380L89632k2025n3206j04197
8770A736740k56784n52218o48689j64154M20631N25466K17058J34576J06523j65326
$$ y = [5734961, 5810460, 5306245, 5046153, 5236369, 5045069, 5340974, 5210050, 4832087, 4805836, 4544473, 3879902, 3307340, 2919749, 2981487, 3133276, 2904025, 2249100, 1720252, 1924777, 1888545, 1761380, 2429514, 2932143, 2838688, 2657183, 2098223, 1410076, 938336, 887230, 1092359, 1130400, 1133680, 1330230, 1571273, 1624746, 1667353, 1888363, 1856746, 1317571, 1054554, 1118511, 1307185, 1558715, 1094053, 813396, 1324081, 1562912, 1782076, 1613898, 1502777, 1765095, 2196041, 2791992, 3419960, 3491163, 3034504, 2646896, 2424015, 2135482, 1767802, 1660607, 1775539, 1917492, 1577060, 1196499, 1203156, 1526536, 1916168, 1894143, 1840937, 1736740, 1479956, 927738, 279049, 114895, 535526, 1060992, 1278050, 1412626, 1519149, 1353823]
8760A353823l23184k15087J71073M80022N93242L52732j16957n30978k79863r2094
8750A392729l2354J31231j94598J1943J85656l13489k41326J08714L73810L98435
8740A820751k64251q3513J13085j72858k22416r8286j14041m4914J47757L17726
8730A399040M36390L03364l67164p18409k45722j32073p6494J56535P31297O98688
8720B185452L09795J8202l49450j15453J74022K93586J75917J93185O6714m12865
8710B539105l71720M82041K92047m96461J66997L88945j8477j4284k49109k74213
8700B444871m5448j17547j0662O5537n19254l35955m0719J30488O6302n34880
8690A102733r40136k64247j11168l94753j7036L81019J88063J52837L61064R7675
$$ y = [1353823, 1030639, 815552, 986625, 1466647, 2059889, 2412621, 2295664, 1764686, 1484823, 1392729, 1360375, 1491606, 1297008, 1308951, 1494607, 1181118, 939792, 1048506, 1422316, 1820751, 1556500, 1472987, 1586072, 1413214, 1190798, 1092512, 978471, 933557, 1081314, 1399040, 1835430, 2138794, 1771630, 1053221, 807499, 675426, 598932, 755467, 1486764, 2185452, 2495247, 2513449, 2163999, 2048546, 2222568, 2516154, 2692071, 2885256, 2951970, 2539105, 2167385, 2649426, 2941473, 2445012, 2612009, 3000954, 2982477, 2968193, 2719084, 2444871, 2399423, 2281876, 2271214, 2336751, 1817497, 1481542, 1440823, 1571311, 1637613, 1102733, 162597, -101650, -212818, -607571, -624607, -243588, -55525, 97312, 458376, 556051]
8680E56051l77662k20558N8480L59080J71654l8735J90300L75876L50389Q2910
8670A507785j79567l49307j72571r6382j30906j22566k45409J53830K07345J42767
8660G15019J50671p1806k5101r8493j12052N2802l30521q4657M7038k49419J12340
8649A05821N59170J98348q1329Q9173m4603k97356J0932j16464o2071n30j04092
8638B56999k28848r5311L73857L43078m39899n41978o7803M48247L98270O7682
8628E14294k70357l89898J7082p706j20964J49933J91721m5627m30817k70306
8618f62645K67160L86670j15354n8491O9422L14564L90764k91936m98166j4256
8608b12268q5661M7580M53784N32683M06588j23946m32976j35180Q53236M79934
$$ y = [556051, 178389, -42169, 16311, 375391, 547045, 508310, 698610, 1074486, 1424875, 1507785, 1328218, 978911, 806340, 709958, 579052, 456486, 211077, 364907, 572252, 715019, 865690, 793884, 768783, 670290, 558238, 611040, 280519, 195862, 242900, -6519, 105821, 664991, 863339, 782010, 871183, 826580, 529224, 540156, 423692, 361621, 361091, 256999, 28151, -67160, 306697, 649775, 209876, -332102, -399905, 48342, 446612, 514294, 243937, -145961, -128879, -136585, -257549, -107616, 84105, 38478, -392339, -662645, -395485, -8815, -124169, -182660, -113238, 201326, 592090, 300154, -198012, -212268, -297929, -250349, 203435, 736118, 1142706, 1018760, 585784, 450604, 1303840, 1783774]
8598A783774j66814k93956l77016k41242Q3434k98838j58887J43854k9828L03520
8588G48001N20039K55516O6391J84259K35837o9623k06728m3157K66585K13616
8578B170736K99940J90944j56265K794k6449q2483m0589l97893k92640K77737
8568A945832R1848n9569M021k04465l10953j38033J60258P05212P90936M3710
8558C028797m18852j98578K62551K31264M4314j54162l95370m56426k83209k6081
8548A634248M08514J88638R835M6826k05183l50101k97117J53307p2162m93120
8538A023685k2330M36476k9946j29776L51029j04388j62415l8552l9313K9159
8528A313629K79098R5027n67855o76227k40052l4957M4514J98878Q889j29280
$$ y = [1783774, 1616960, 1323004, 945988, 704746, 788180, 489342, 330455, 474309, 444481, 748001, 1268040, 1523556, 1589947, 1774206, 2010043, 1940420, 1733692, 1690535, 1957120, 2170736, 2470676, 2661620, 2505355, 2508149, 2481700, 2399217, 2358628, 1960735, 1668095, 1945832, 2037680, 1978111, 1982132, 1777667, 1466714, 1328681, 1488939, 2194151, 2985087, 3028797, 2609945, 2411367, 2673918, 2905182, 2949496, 2795334, 2399964, 1943538, 1660329, 1634248, 2042762, 2231400, 2241235, 2288061, 2082878, 1732777, 1435660, 1588967, 1516805, 1023685, 1001355, 1437831, 1407885, 1278109, 1629138, 1524750, 1362335, 1323783, 1284470, 1313629, 1592727, 1687754, 1119899, 443672, 203620, 168663, 213177, 412055, 420944, 291664]
8518B91664m70997m51461M49089Q98976J18773l99919j86597j71657m90983k33159
8508f46271M33065N51652J22023R0619K82956J20582k28058K26179J40813o6619
8498A026941j15463l50906m8061O17782J57131n73729j35231L71826M10499k5149
8488A335640k38137k61756N6894N76017K11642m48212q4550P9941r3946m42262
8478F91271k39974N1232K53003Q7747j90458k14436r7698k68689J98458L12775
8468E83231j49642m09578k4470M54615M62685n7273r1269k71712l24191r9119
8458G3277J63503J22731j37000j36497o10877k3057K38740K52703K72995M605
8448B21123l0838J06805J17092J53567Q6031J9143o1522m2450j97931J62328M03768
$$ y = [291664, -179333, -630794, -181705, 717271, 836044, 436125, 249528, 77871, -413112, -646271, -213206, 338446, 460469, 551088, 834044, 954626, 726568, 952747, 1093560, 1026941, 911478, 560572, 512511, 1130293, 1287424, 713695, 578464, 950290, 1360789, 1335640, 1097503, 835747, 892641, 1468658, 1680300, 1232088, 1147538, 1227479, 1133533, 691271, 451297, 502529, 755532, 843279, 652821, 438385, 340687, 71998, 270456, 583231, 433589, 24011, -459, 454156, 916841, 859568, 768299, 496587, 172396, 73277, 236780, 359511, 222511, 86014, -524863, -547920, -309180, -56477, 216518, 221123, 190285, 297090, 414182, 567749, 653780, 672923, 611401, 568951, 371020, 533348, 937116]
8437I37116j02182J35600N08835J10355m24438k52109K02599N9092K6022J31428
8427A332318J59956p27k65187k76018l47024r8958M2700k93704k34492J68429
8417A87293J76987j4507L84663L81564p5761O7031J11396o2610l52162l50952
8407D52942k47905K2868L8016P7521K01035P3858j34329l15578o19117o15515
8397a066204j31958J50829K34968P30440M91403J68897L10604J59639J2797j68514
8387H92901r1662J8323j23850k27842n0259k93031n22098M7901l07n23989k70527
8376a144440r3846Q6292J18506N32522K37564m65972j67635M33229N50870L52406
8366D39496L4796k10994k81601j73893j35852k15963j08047K26363K07772O1638
$$ y = [937116, 834934, 970534, 1479369, 1589724, 1165286, 913177, 1115776, 1174868, 1200890, 1332318, 1492274, 1491547, 1226360, 950342, 603318, 504360, 547060, 253356, 18864, 187293, 364280, 349773, 734436, 1116000, 1040239, 1107270, 1218666, 1156056, 803894, 452942, 205037, 227905, 265921, 343442, 544477, 618335, 484006, 168428, -450689, -1066204, -1198162, -1047333, -812365, -81925, 409478, 578375, 888979, 1048618, 1061415, 892901, 801239, 819562, 695712, 467870, 417611, 124580, -397518, -349617, -349924, -873913, -1144440, -1238286, -1151994, -1033488, -500966, -263402, -729374, -897009, -463780, 87090, 439496, 474292, 263298, -18303, -192196, -328048, -544011, -652058, -425695, -217923, -156285]
8356a56285j98593O3334p7120k51087J24631K40085O05696M94623p4562m81316
8346B89406n7159O889M6147J87145j763K00174J38773k27655j78679j51815J38461
8335C89924L23063J60974q7794p4707K41242K80619J56935j87140p17796k90581
8325A94739o493m59968l70430J14951Q1466j87235j32301K65960M71992J73361
8315A46042k90438l31865j46332K7927M40094K59239k14439j78388K56210L45406
8305C13456k02321m25551k91453Q6622L60588L2056L8077m2280j91788j22865
8295d45459m75049k96426n446K59306M15029L57373K96429k06019j19807K72949
8285E2880L30214K4946K77024J28799n38616n79069m37716K64871J13792r6961
$$ y = [-156285, -354878, -291544, -368664, -619751, -495120, -255035, 350661, 845284, 770722, 289406, 232247, 239136, 285283, 472428, 470665, 670839, 809612, 581957, 403278, 251463, 389924, 712987, 873961, 786167, 711460, 952702, 1233321, 1390256, 1203116, 485320, 194739, 188246, -271722, -642152, -527201, -445735, -632970, -765271, -499311, -27319, 146042, -144396, -476261, -622593, -594666, -154572, 104667, -109772, -288160, -31950, 313456, 111135, -314416, -605869, -519247, -158659, -126603, -88526, -130806, -322594, -445459, -920508, -1216934, -1222380, -963074, -548045, -190672, 105757, -100262, -220069, 52880, 383094, 408040, 685064, 813863, 275247, -303822, -741538, -476667, -362875, -459836]
8275d59836L33466L69478K26286L46316L32040J38943j08682K13124M52800J77540
8265B021475n53256m82632j45939m13467K87826L95692p2706k04242M5284K14969
8255A093004l44613m63937l20956j24264j82591n0913J9093J66093K41855K76104
8245C08875K24330k20235l69729k36629M02385L62020j83714n24599M5951O07055
8235D15710M55351L08343j26359l26062L8720o0733K11821M34464k29744l32761
8225G88750J25229j75403l57627L53287L52282j95488k97119J09076R0063k81335
8215E11715n04878n12091O1813L31745N6339K33025M80423q4056l86303l07240
8205a19508l0708J42094k90028n2092L01217k94639o10796j06462M96924M98749
$$ y = [-459836, -126370, 243108, 469394, 815710, 1147750, 1286693, 1178011, 1391135, 1843935, 2021475, 1468219, 985587, 839648, 426181, 714007, 1109699, 1036993, 832751, 878035, 1093004, 748391, 284454, -36502, -160766, -343357, -394270, -375177, -209084, 32771, 308875, 533205, 312970, -56759, -293388, 108997, 471017, 287303, -237296, -191345, 415710, 871061, 1179404, 1053045, 726983, 765703, 704970, 916791, 1351255, 1121511, 788750, 913979, 738576, 380949, 734236, 1086518, 891030, 593911, 702987, 793050, 511715, 6837, -505254, -443441, -111696, -55357, 177668, 658091, 574035, 187732, -119508, -150216, -8122, -298150, -350242, -49025, -343664, -954460, -1060922, -563998, -65249]
8195f5249r4798j65320J90369J63030k32036k29948n01317m41185P05K20132L62730
8184g92887J25397K30271N03552M28333Q7194p1854m01586j46713M8324M28118
8174D38149K34482j44293j02425Q2840L85264K74620k10010m80508o06248m21974
8164e50103P9309m4583k2530K47368k2258l74649m74777o349M88076N1789L2358
8153e96349N34036K21094k72449r3613K59300J39646J15533k8028n04663n53197
8143g78690J70243P70469J94452R9719k68975m89855N7020K93436M78458M89997
8133A016274P3539j00300p3122q6969k72572j95440q431q1522m44371n01636l79130
8122a053680l76576l37926N9413L35410O03676Q24546L76485K03037L21073J64398
$$ y = [-65249, -160047, -325367, -134998, 28032, -204004, -433952, -935269, -1376454, -1375749, -1155617, -792887, -667490, -437219, 66333, 494666, 581860, 510006, 108420, -38293, 10031, 438149, 672631, 528338, 425913, 508753, 894017, 1168637, 958627, 478119, -128129, -550103, -470794, -515377, -537907, -290539, -312797, -687446, -1162223, -1168572, -680496, -628707, -596349, -62313, 158781, -113668, -207281, 52019, 191665, 307198, 279170, -225493, -778690, -608447, 162022, 356474, 456193, 187218, -302637, -245617, 47819, 526277, 1016274, 1089813, 989513, 916391, 829422, 556850, 361410, 352979, 271457, -172914, -674550, -1053680, -1430256, -1768182, -1708769, -1373359, -769683, 54863, 431348, 634385, 955458, 1119856]
8112A119856m45877j66702K92400K33642j73206o87430n86595l1372N10190K82579
8102C47485l3224J11714j28957J0629q4042j95256K69684P69573K98631k03337
8092A162900n79314m52476K3645L85050N86441L96398J07851K2889K45379K01143
8082B099906J35314j47123p24633o95622m99312j62702J74705J74853J13985O09572
8072A078943M23600K27866P4082m88800k72894n1061j19298o4775l86056l19069
8062A02538J87331J89771J58911J37619k90259J61727L15771k15817k73863j7135
8052D56594j71454j538K8677l50867k65194N105R3571M30193N29626N38151K59309
8041A552173k82472j68960k72879j82215M52804L28818j2361l66073k35118P7155
$$ y = [1119856, 673979, 507277, 799677, 1033319, 860113, 172683, -413912, -445284, 64906, 347485, 314261, 425975, 297018, 307647, 223605, 28349, 298033, 1067606, 1366237, 1162900, 583586, 131110, 154755, 539805, 1126246, 1522644, 1630495, 1653384, 1898763, 2099906, 2235220, 2088097, 1363464, 667842, 168530, 5828, 180533, 355386, 469371, 1078943, 1502543, 1730409, 1804491, 1315691, 1042797, 991736, 872438, 807663, 421607, 102538, 289869, 479640, 638551, 776170, 485911, 647638, 963409, 747592, 473729, 456594, 285140, 283602, 312279, -38588, -303782, -298677, -205106, 225087, 754713, 1292864, 1552173, 1269701, 1100741, 827862, 645647, 1098451, 1427269, 1414908, 1048835, 813717, 890872]
8031H90872j00194K78761K37529j42189l3436L9734k20384l4240M3597k39572
8021G20478j53961M69748O40855M28786J87481j70592r0577r7898k02067l4015
8011A698238N814m11662P5256K80395K74288M27398J26323j34871l55023l43646
8001A642510j56808M915K10037J34446l21080j14665J43426j00546j43298K79656
7991A578593M05452O8927m24509J34856L73593L43423p8347n48245k43663O1122
7981A671202j97908j06473J01255P0689L6073j29269j6911K95202j38447j79233
7971A406180l12542r2359J66165K42079J3670Q3693K87977K13308l42773l86289
7961A279109j7289J11993J13128M04847N86788Q349j77335l6157k12547l66875
$$ y = [890872, 790678, 1069439, 1306968, 1164779, 1131343, 1171077, 950693, 916453, 960050, 720478, 566517, 1036265, 1677120, 2105906, 2293387, 2122795, 2032218, 1934320, 1732253, 1698238, 1704052, 1292390, 1367646, 1648041, 1922329, 2349727, 2476050, 2341179, 1986156, 1642510, 1485702, 1490617, 1700654, 1835100, 1514020, 1399355, 1542781, 1442235, 1298937, 1578593, 1984045, 2052972, 1628463, 1763319, 2136912, 2480335, 2401988, 1853743, 1610080, 1671202, 1473294, 1366821, 1468076, 1538765, 1574838, 1445569, 1428658, 1723860, 1585413, 1406180, 1093638, 1001279, 1167444, 1409523, 1423193, 1506886, 1794863, 2008171, 1665398, 1279109, 1261820, 1373813, 1486941, 1891788, 2478576, 2486925, 2309590, 2273433, 2060886, 1694011]
7951A694011l23675l60333J50527L82113j65213l52674J712K87853Q7108O6015
7941A467444P9890k6319J72268K3172K46540K08393K62079O4788p9089l38583
7931B080583l41393O4419K46899J97479j63235l37145J46762M62514L71993J36594
7921B865470j41557K41344L76409J52113m65177m41429L0573M1603p9368j22041
7911B457940k00052N2014L62407N27547P6294l43052m401O46780Q27829M87469
7901D890775N32770N31222K27901j68066j88107k77078K48327N16138R90570J175039
7891H479491J115936J388506P22399N35563J256436J957947K622099L275466L984321
7882B5338164M493308N316136N902034N884463N836390N033877M027287K947484
$$ y = [1694011, 1370336, 1010003, 1160530, 1542643, 1377430, 1024756, 1026468, 1314321, 1401429, 1467444, 1547334, 1521015, 1693283, 1716455, 1962995, 2171388, 2433467, 2498255, 2419166, 2080583, 1739190, 1803609, 2050508, 2247987, 2084752, 1747607, 1894369, 2356883, 2728876, 2865470, 2723913, 2965257, 3341666, 3493779, 3028602, 2587173, 2617746, 2659349, 2579981, 2457940, 2257888, 2309902, 2672309, 3199856, 3276150, 2933098, 2928697, 3575477, 4403306, 4890775, 5423545, 5954767, 6182668, 6014602, 5826495, 5549417, 5797744, 6313882, 7304452, 8479491, 9595427, 10983933, 11706332, 12241895, 13498331, 15456278, 18078377, 21353843, 25338164, 29831472, 35147608, 41049642, 46934105, 52770495, 57804372, 61831659, 64779143]
7874F4779143J196394j156143l191288m282616m822252n395854n594247m993485
7866C6539652m289554l459202k637840k225085k136769k146718j368402j32913
7858A8143169o6396m33341r47532p63884J01168r1980k04242l52624L5214L59335
7848A5778887l83639n32790n78764r6057L77619K28051L54270J46383K05502N55076
7838A6054538R32478J230418J705785K222135K531568K824510L453187M257624
7830C5212243N149667O036653P000171Q751950J0781411J2730763J4567968J6409802
7822A16640628J8042857J8837309J7862629J5061431J0169767M103651k313132
7815A98405140q594918j3938422j7957477j9232321j8204002j5668280j3594015
$$ y = [64779143, 65975537, 64819394, 61628106, 57345490, 52523238, 47127384, 41533137, 36539652, 32250098, 28790896, 26153056, 23927971, 21791202, 19644484, 18276082, 18143169, 18076773, 17643432, 16695900, 15932016, 16033184, 15941204, 15736962, 15384338, 15419552, 15778887, 15395248, 14862458, 14283694, 14187637, 14565256, 14793307, 15147577, 15293960, 15499462, 16054538, 16987016, 18217434, 19923219, 22145354, 24676922, 27501432, 30954619, 35212243, 40361910, 46398563, 53398734, 62150684, 72932095, 85662858, 100230826, 116640628, 134683485, 153520794, 171383423, 186444854, 196614621, 200718272, 198405140, 189810222, 175871800, 157914323, 138682002, 120478000, 104809720, 91215705]
7808I1215705j1474248r348949p503774o309179n361927m137847l031749k393567
7800D1654465j667281j090051j273985j378185o22759o32092r59905j027224p86538
7791C2216445q54041p64613o34131m43218L9965J48784K82430O66121J075871
7782C1733613J149228J654211K553794L207715L782683M437982N096232O463849
7774F0079307P775608R311513J1688769J3839858J6583332K0074452K4405010
7767A63757849K9420950L3135033L5271671L6540427L4974974L0021953K1830715
7760C84953572J0588249k696213j5748607k6831347l4564074l7596870l6437944
7753B41666766l2887736k8858108k4700991j9950164j6107764j3528400j0986387
$$ y = [91215705, 79741457, 70392508, 62888734, 56579555, 51217628, 47079781, 44048032, 41654465, 39987184, 38897133, 37623148, 36244963, 35622204, 34990112, 34030207, 33002983, 32216445, 31362404, 30597791, 29963660, 29520442, 29560407, 29709191, 29991621, 30657742, 31733613, 32882841, 34537052, 37090846, 40298561, 44081244, 48519226, 53615458, 60079307, 67854915, 77166428, 88855197, 102695055, 119278387, 139352839, 163757849, 193178799, 226313832, 261585503, 298125930, 333100904, 363122857, 384953572, 395541821, 392845608, 377097001, 350265654, 315701580, 278104710, 241666766, 208779030, 179920922, 155219931, 135269767, 119162003, 105633603, 94647216]
7746I4647216q971686p575062o374070m559639k962472k213154k085210k197701
7738E7708222k572874k824077k527471j727192j402804j352347j594803j399992
7730D2306662j227086p85909j28895L99797J111224J579330J812607K202231L000000
7721E0269961M068761N069169N645179O729593Q061748J0490252J3184278J5911100
7713A19430041J9124419K3216548K8166420L2968643L7538546M0717096M2592999
7706C43754712M2061102L7558234K8227332J4580669j459890j7775198l1725406
7699D15221555m1281401m5089377m3962541m0337418l5144131k9255846k3815054
7692A56335787j9783970j6341735j3571634j1401359r303270p335654o079877
$$ y = [94647216, 85675530, 78100468, 71726398, 67166759, 64204287, 61991133, 59905923, 57708222, 55135348, 52311271, 49783800, 48056608, 46653804, 45301457, 43706654, 42306662, 41079576, 40293667, 40164772, 40564569, 41675793, 43255123, 45067730, 47269961, 50269961, 54338722, 59407891, 65053070, 71782663, 79844411, 90334663, 103518941, 119430041, 138554460, 161771008, 189937428, 222906071, 260444617, 301161713, 343754712, 385815814, 423374048, 451601380, 466182049, 464722159, 446946961, 415221555, 373940154, 328850777, 284888236, 244550818, 209406687, 180150841, 156335787, 136551817, 120210082, 106638448, 95237089, 85933819, 78598165, 72518288]
7685G2518288m733250l912463l596672k835747j999393j874166k410532k726824
7677D8429241k516446k413078j808944j482950j158301m97580R0452Q5614K61656
7668C8989664J210308J999956K242139K448222L112119L819022M716134N762700
7660F4300264O753791Q497874J0884961J2901679J5452996J8935938K3123064
7653A60850567K7230570L1054745L4212997L5772064L5275414L1738956K4270361
7646C80405674J3554923M66516j3099651k5028658l3224612l7375030l8196366
7639B47502796l5687026l0903061k6062877k2143104j8386439j4845560j2087581
7632H7387148r899167p901745o238222n211865m690561m289827l499704k658175
$$ y = [72518288, 67785038, 63872575, 60275903, 57440156, 55440763, 53566597, 51156065, 48429241, 45912795, 43499717, 41690773, 40207823, 39049522, 38551942, 38642394, 38728008, 38989664, 40199972, 42199928, 44442067, 46890289, 50002408, 53821430, 58537564, 64300264, 71054055, 79551929, 90436890, 103338569, 118791565, 137727503, 160850567, 188081137, 219135882, 253348879, 289120943, 324396357, 356135313, 380405674, 393960597, 394427113, 381327462, 356298804, 323074192, 285699162, 247502796, 211815770, 180912709, 154849832, 132706728, 114320289, 99474729, 87387148, 77487981, 69586236, 63348014, 58136149, 53445588, 49155761, 45656057, 42997882]
7624D2997882k803358k917576k600870j970966j652696j513969j252656p76532
7616B7509259p39865n03078m23984o1122k27771k26306N07781P39486R69465J716097
7606B9259962J687827K186990K877437L117446L894800N108288O392924P817700
7598F2343374R193362J0822091J2411419J4613619J6858647J7782780J7280352
7591A61305644J5627817J3006563P616058P25192n887216j1441048j5977537j8905593
7583A46069880j9248454j7931244j6187886j3796556j1053778r015357p632369
7576E1204236o744697n434797l787554l402928l362126k855348k283545j828255
7568B1504986j707032j709660j396710j172008o39121m26210m03923n74911p28601
$$ y = [42997882, 40194524, 37276948, 34676078, 32705112, 31052416, 29538447, 28285791, 27509259, 26769394, 26266316, 25842332, 25781210, 25553439, 25327133, 25834914, 26574400, 27543865, 29259962, 30947789, 33134779, 36012216, 39129662, 43024462, 48132750, 54525674, 62343374, 71536736, 82358827, 94770246, 109383865, 126242512, 144025292, 161305644, 176933461, 189940024, 197556082, 198281274, 192394058, 180953010, 164975473, 146069880, 126821426, 108890182, 92702296, 78905740, 67851962, 58836605, 51204236, 44459539, 39024742, 35237188, 31834260, 28472134, 25616786, 23333241, 21504986, 19797954, 18088294, 16691584, 15519576, 14880455, 14454245, 14050322, 13475411, 12746810]
7559A2746810l07755m15646n18513p0109k76908m87764q1865Q2115M41611P25421
7549A1837397N49498O47375J176303J398032J137545R34014J538659K252316L042983
7540B4514122L646863M409499N245136N849399N615287N016352M575676L643176
7532F2515510K065199J52645k127419l683164m608253n528374o030933n993862
7524C6761349n616612m912904l675410k915081k812447k190253j582134j737303
7516A1319205j531101j119696o33371o97848o42056n70416l22853n68973o22997
7507D609894m51222l12319j46388l88184k62193J87576J75189p98818q95631j72769
7497A545135p5097q7022r7589o5290k80550k17208M73978L87785l06852j66387
$$ y = [12746810, 12439055, 12023409, 11504896, 11434787, 11157879, 10670115, 10588250, 10670365, 11111976, 11837397, 12386895, 13034270, 14210573, 15608605, 16746150, 17680164, 19218823, 21471139, 24514122, 28160985, 32570484, 37815620, 43665019, 49280306, 54296658, 58872334, 62515510, 64580709, 64733354, 62605935, 58922771, 54314518, 48786144, 42755211, 36761349, 31144737, 26231833, 22556423, 19641342, 16828895, 14638642, 13056508, 11319205, 9788104, 8668408, 8035037, 7337189, 6695133, 6124717, 5801864, 5232891, 4609894, 4158672, 3846353, 3699965, 3311781, 3049588, 3237164, 3412353, 2613535, 1717904, 1545135, 1470038, 1383016, 1285427, 1220137, 939587, 722379, 1196357, 1584142, 1277290, 1110903]
7487A110903J94004K64740J75918k8774j35217J55387J51714k72943n37802l15879
7477G62051J00605P532L1734Q022j79052L50148P41613J96612l88147k55348k14268
7466A161502k83945j42927k17882L2114j09872r78009l69409P26040Q44428N63583
7456A225623K67491q2168o3856j7016m2347l05908m32390l39479r7356J75375
7446B87969r2138l35442j83195J40909J21857p3090J19213N3422j88479J37048
7436a1926N55606N38766j48909k05928K97141J61362J65362o37923p89400l74303
7426d50152j32144j2928j86049l4497j73218m97492K91728Q29052P84521L90625
7416H09446K12901O2768l21871J10647n7871k82833j03052M7753j86748m42317
$$ y = [1110903, 1304907, 1569647, 1745565, 1716791, 1581574, 1736961, 1888675, 1615732, 1077930, 762051, 862656, 870188, 901922, 909944, 730892, 1081040, 1822653, 2019265, 1631118, 1375770, 1161502, 877557, 734630, 516748, 548862, 438990, -539019, -908428, -182388, 662040, 1225623, 1493114, 1410946, 1347090, 1330074, 1287727, 981819, 549429, 209950, 112594, 287969, 195831, -139611, -322806, -181897, -60040, -133130, -13917, 39505, -148974, -11926, 543680, 1082446, 933537, 727609, 1024750, 1186112, 1351474, 713551, -75849, -450152, -582296, -595224, -781273, -815770, -988988, -1486480, -1194752, -365700, 418821, 809446, 1022347, 1085115, 763244, 873891, 816020, 533187, 430135, 477888, 291140, -151177]
7406a51177k31125J58143Q38871L56331l16656m03680j50200J19017p021P7194
7396B89697k7330m75456J96542M83673J22515K48369N32184l9752j76262l91636
7386G62544k67361M64146L40403r0159O8533n53420k78311q354k27330j90335
7376B0356j06k48932j88551K87905K39030j62106l85280k18185m3299K77148L23749
7365i8271J56301M12947K78200l14671p9538M1092l0055J11725J66190J42839
7355G86759N7606J68301o682o68458n30258k03552K01803K91477L7611L53049
7345D87656N74620K26091q6024k04122m08540p68031o6733M35330M082m34259
7335b39930l94740J15557N39990L47573O9322j0265r0117k48671J0278K81517
$$ y = [-151177, -382302, -224159, 614712, 971043, 654387, 250707, 100507, 219524, 212503, 289697, 262367, -213089, -16547, 467126, 589641, 838010, 1370194, 1330442, 1154180, 762544, 495183, 959329, 1299732, 1209573, 1278106, 724686, 446375, 438021, 210691, 20356, 20250, -228682, -417233, -129328, 109702, -52404, -437684, -655869, -699168, -422020, -98271, 58030, 470977, 749177, 434506, 354968, 396060, 366005, 477730, 643920, 786759, 844365, 1012666, 1005984, 337526, -192732, -396284, -194481, 96996, 134607, 487656, 1062276, 1288367, 1202343, 998221, 589681, -178350, -245083, 190247, 194329, -239930, -634670, -519113, 20877, 368450, 437772, 427507, 337390, 88719, 98997, 380514]
7325C80514q6373m95860k36714m6008n5103K6569J58842L80379j96006o06744
7315g76504l56591K72384J73322J47261O90314M06457L46757N17735r1550o23329
7305G06256q00306n77539j16303j36163L26927M84026J55254J86067O05937K21662
7295A055818Q7058J22847O7601l25187m99920l75292l89587j41586L27098m1262
7285a12412n21329k85355j08263L6882P7548L28584K06197n63549p55819o3299
7275a760815P42153Q58687K54026j21152k04347q5699l0367l43602j76892r7576
7265i65584L524K93450M54388j67432k25155k34616j92303k13042k55179J38643
7255a363306N85598N62275J38924K5973m1353k02560k7043l1677R6906j01100
$$ y = [380514, 294141, -201719, -438433, -484441, -539544, -512975, -354133, 26246, -169760, -776504, -1133095, -860711, -687389, -540128, 150186, 556643, 903400, 1421135, 1329585, 706256, -94050, -671589, -787892, -924055, -597128, -113102, 42152, 228219, 834156, 1055818, 1142876, 1265723, 1333324, 1008137, 508217, 132925, -256662, -398248, -71150, -112412, -633741, -919096, -1027359, -990477, -912929, -584345, -378148, -941697, -1697516, -1760815, -1018662, -159975, 94051, -27101, -231448, -317147, -347514, -691116, -868008, -965584, -962060, -668610, -214222, -381654, -606809, -841425, -1033728, -1246770, -1501949, -1363306, -777708, -215433, -76509, -50536, -91889, -294449, -321492, -353169, -256263, -357363]
7245c57363l44330r5260K75560K36887L01415N52392N29517J32028k8030m64903
7235G37913l81097k83013p6199J74028Q2777j53681r8318k27794k6438L8665m71392
7224f84549j80633J495l33166j91374K94504L60996L29271R3064q7941l31109
7214g29442l56645J76821M47485L73799K77313N1774l8823l55805k43020L306
7204c93237j2622J49084L00629k09870j47678J02081J66402L56926j58213p59886
7194f06384m48779k2925Q2621M57169L32249P4229p4227Q7991j27033N2352j95825
7183c88562m41094L43429Q18116N13723J3826K15084M60492k424j85353m87805
7173H59432l54408K75098o9189m26111q1435N547J2874n1302j90317k37938p4590
$$ y = [-357363, -701693, -796953, -521393, -284506, 16909, 569301, 1098818, 1230846, 1202816, 737913, 356816, 73803, -2396, 171632, 254409, 100728, 2410, -225384, -251822, -213157, -684549, -865182, -863687, -1196853, -1388227, -1093723, -732727, -403456, -310392, -398333, -729442, -1086087, -909266, -461781, -87982, 189331, 241105, 202282, -153523, -396543, -393237, -405859, -256775, 43854, -166016, -313694, -211613, -45211, 311715, 153502, -606384, -1055163, -1078088, -995467, -538298, -206049, -131820, -206047, -118056, -245089, -192737, -388562, -829656, -486227, 331889, 845612, 859438, 1074522, 1535014, 1532590, 1347237, 859432, 505024, 780122, 710933, 284822, 203387, 208934, 221808, 170506, -19811, -257749, -332339]
7162c32339J47587l40577l9558O5625J32533M74963R1938k02711O5328K09864
7152B72653j1205k73656K2962k48347k77394N0330J62763j55165m6406K25997
7142b77468M54321K85874l0504l50871k11637l77837j58680M60581L92914J99918
7132C86611K8356K25596K28793l15650o00669j97092K18647k66444m76439l54223
7122a122514O0364Q00410N74932M77999q4146m49217j81569q034k9416k05224
7112a66415p38246k93735R5748J30906m6072l9436K14501J88319M87878K95345
7102A28793m68827n48928m75841K4073K20805K6724k9491K8116n1228J82448M38258
7091e25098J52667n8554l07302j64273L27476M86752O3300k08614j20899j4467
$$ y = [-332339, -184752, -525329, -564887, -499262, -366729, 108234, 200172, -2539, 62789, 272653, 261448, -12208, 10754, -237593, -514987, -464657, -301894, -457059, -503465, -277468, 176853, 462727, 432223, 81352, -130285, -508122, -666802, -206221, 186693, 386611, 414967, 640563, 869356, 553706, -46963, -244055, -25408, -291852, -768291, -1122514, -1062150, -261740, 313192, 791191, 707045, 257828, 76259, 68225, 38809, -166415, -904661, -1198396, -1102648, -971742, -1017814, -1057250, -842749, -654430, -166552, 128793, -340034, -888962, -1364803, -1340730, -1119925, -1093201, -1122692, -1094576, -1145804, -963356, -525098, -372431, -430985, -738287, -902560, -575084, -88332, -25032, -233646, -354545, -369012]
7081c69012j30440l97605l36635k01968K95930L45942J48398K15204j138j3430
7071d44754p9391j51447L42938K06803j73995r2560P9862K94586J43259j92752
7061f7451j57009K57606N12232O38712j12181n53971k64507k93735o26448o4531
7051g31283J28628K79695n0854j33444j85220k18285J45379J84315J7766R5815
7041d67488M30625J10785n01214Q9493L66637m8870o22631j76082K28332J47034
7031d43379k47249j21182O2920K12289K94240j77147k67802R155P6253J16249
7021d85653J50486J86004O3289M78516N38654K50933J36951J71678R4947k61949
7011A323856n32679j01374M7888K10279q4748m31325j65140j7182j93819j43854
$$ y = [-369012, -499452, -897057, -1233692, -1435660, -1139730, -793788, -645390, -430186, -431324, -444754, -524145, -675592, -332654, -125851, -299846, -392406, -312544, -17958, 125301, -67451, -224460, 33146, 545378, 1184090, 1071909, 517938, 253431, -40304, -666752, -731283, -602655, -322960, -373814, -507258, -692478, -910763, -765384, -581069, -563303, -467488, -36863, 73922, -427292, -337799, 28838, -20032, -642663, -818745, -590413, -443379, -690628, -811810, -748890, -536601, -242361, -419508, -687310, -678155, -601902, -485653, -335167, -149163, -85874, 392642, 931296, 1182229, 1319180, 1490858, 1585805, 1323856, 791177, 689803, 737691, 947970, 863222, 431897, 266757, 249575, 55756, -88098]
7001h8098J35204J65061J28329J41194j69487p20428n44215M5366Q9467J56825
6991f60782L70990k64831k63369l90883j12590M19998N53126j35109q5004K72885
6981b95569Q5448J88049M73764j50525j99765j43527n50262p1975N2948l33080
6971i44494j58630J32157L38131L44462l4271j12063j27769o31392l78919L63673
6961a209115O77275N20335j42734j7653K42892O4483n32223k66944K85569L10570
6951f7545m818l4732K51580K8079j64210m47778J27840Q4946l55368j66466Q8161
6940f60311J42077L16046M0256L28828O27885j09399l03744j89331l13056k83408
6930d04157k00029J49918N16807j88622m55800M8295L62679R8743j26016O2783
$$ y = [-88098, 47106, 212167, 340496, 481690, 312203, -408225, -952440, -907074, -817607, -660782, -289792, -554623, -817992, -1208875, -1321465, -901467, -348341, -483450, -568454, -295569, -210121, -22072, 451692, 301167, 101402, -42125, -592387, -664362, -611414, -944494, -1103124, -970967, -632836, -288374, -322645, -434708, -562477, -1193869, -1572788, -1209115, -531840, -11505, -154239, -171892, 71000, 135483, -396740, -663684, -378115, -67545, -72363, -107095, 144485, 172564, 8354, -439424, -311584, -226638, -582006, -748472, -660311, -518234, -202188, -161932, 166896, 794781, 685382, 381638, 192307, -120749, -404157, -604186, -454268, 62539, -126083, -581883, -533588, -170909, -72166, -198182, -135399]
6920a35399n7613k34033J7874O3042R7257K41335M2320k81289o57225r4119L30914
6909f66936M15395N8074j72548Q968q6089j6476M06267L71902J11935l68126l42583
6898b80217j71694j74249M4209J8594J55238M89639M69966K76833K85141l5832
6888A077628r09041n10046K06121K03696J90736K64296K14202k22619j70179k7495
6878C17299K44762j29091N0527Q1113k63776l54023j32752N4793R2072l67674
6868d06750m60665l18326m01830J59346R29457P48205J31925j40588l05290k70027
6858c34543k771L42134N10699K04642j38025m088M36238K76859k55395n81894
6848D53856o23331j4182K391K78156j170l81862m10548l76638K57896N28674J38236
$$ y = [-135399, -193012, -427045, -409171, -346129, -248872, -7537, 34783, -246506, -903731, -997850, -666936, -251541, -193467, -366015, -357047, -443136, -459612, -53345, 318557, 430492, 62366, -280217, -451911, -626160, -581951, -563357, -408119, 81520, 551486, 828319, 1113460, 1077628, 168587, -341459, -135338, 68358, 259094, 523390, 737592, 514973, 344794, 317299, 562061, 432970, 483497, 564610, 300834, -53189, -185941, -131148, -39076, -406750, -867415, -1185741, -1587571, -1428225, -498768, 249437, 381362, 240774, -64516, -334543, -337314, 4820, 515519, 720161, 582136, 578048, 1014286, 1291145, 1035750, 453856, -169475, -183657, -181266, 96890, 95720, -286142, -696690, -1073328, -815432, -286758, -148522]
6837a48522j27449j46041q9587R2451J68820p8658j84562k59426k43740K1087
6827i95627K20641J27943P161j84659l54571K99465O28323R2786j85377j78846
6817e22761J58732J32514j94398r9883K01048J07926k18795k82669M42145L78908
6807A02767Q28m1259L32126K63075j01203J18379K84771K424l75975m48152j80845
6796d3064J75378K21494j67444o48602q6758K89568M67994O18370N19483O5496
6786A411915k18631m53975l02843k32393l53384k22498Q7917K19924k87091m08608
6776g59667L1962P2232R681L54983J43399n3263R6936l50341o6775M40539M15834
6765C35520L19004M3212r3936k53446k27546j75872P3706L14631J72574k7583
$$ y = [-148522, -275971, -422012, -511599, -419148, -250328, -328986, -513548, -772974, -1016714, -995627, -774986, -647043, -639882, -824541, -1179112, -879647, -251324, -158538, -343915, -522761, -364029, -231515, -425913, -525796, -324748, -216822, -435617, -718286, -276141, 102767, 103595, 62336, 394462, 657537, 556334, 674713, 959484, 961908, 585933, 137781, -43064, 132314, 353808, 186364, -462238, -548996, -259428, 208566, 826936, 1346419, 1411915, 1193284, 739309, 436466, 204073, -149311, -371809, -283892, -63968, -351059, -759667, -727705, -655473, -645792, -290809, -147410, -200673, -103737, -454078, -520853, -80314, 335520, 654524, 697736, 603800, 350354, 122808, -53064, 20642, 335273, 507847, 480264]
6755D80264J0095n5581L335k84048o14664p1129J90788J32425k30845k22717L99777
6744b62300O21460L99635l14864l31308J2548J15239l15731m37197M4547K14398
6734b53573L48527J93324j63937n98227q98314n42489L75962P44596K26720K73639
6724b93772j1404n581K86402K84080O4730o14560m72720J37257J39546K2089k7165
6713d91098j26249j94291M2811J15895J09754O17410N60514l07643q57K89278
6703F15524o1011j17511k19996L3875N4993J26840J02749r5444j1546M3399J41381
6692F13253n2554k38376l49908l9941K00521O3715L14989J50634j68860j18105
6682C75368j19515l93117j31013J15732L89253m0396j04605k27730j05116N4374
$$ y = [480264, 490359, 434778, 438113, 154065, -460599, -531728, -340940, -208515, -439360, -662077, -262300, 359160, 758795, 443931, 112623, 125171, 240410, -75321, -512518, -467971, -253573, 94954, 288278, 124341, -473886, -1372200, -1914689, -1538727, -794131, -567411, -293772, -305176, -310757, -24355, 259725, 324455, -290105, -762825, -625568, -486022, -463933, -491098, -617347, -811638, -768827, -652932, -543178, 74232, 634746, 327103, 326246, 615524, 554513, 437002, 217006, 250881, 305874, 432714, 535463, 440019, 428473, 471872, 613253, 560699, 322323, -27585, -67526, 132995, 196710, 511699, 662333, 493473, 375368, 255853, -137264, -268277, -152545, 236708, 196312, 91707, -136023, -241139, -186765]
6672a86765l6825J85770J95610J4161l7423o0838K09451Q6463J80366P8084j95531
6661D32523l15721o24384k04234K55589M34109J72422j37489J69645M04354j98705
6651C88109k44046m04249o07518l70451K54503K79214j8761p2898K51300K00475
6641c44322j30268N221J92567l65482l51845J35597K59425j4176k59751l64658
6631a237692k2678O26674M68227P6341R1608m4234J76640L66536k12989k22950
6621F5483j78746n1629j33198k9024O1593j87404l89551k57922K33963O54184
6611b12251O06943L64599K81701p1679k51619j72674l11046k14225n5756k12944
6601b48951o14660l95399P4300L04734N14357K91624k74685N3138J91709L5386
$$ y = [-186765, -223590, -37820, 157790, 171951, 134528, 73690, 283141, 369604, 549970, 628054, 432523, 116802, -507582, -711816, -456227, -22118, 150304, 12815, 182460, 586814, 388109, 144063, -260186, -867704, -1238155, -983652, -704438, -723199, -796097, -544797, -344322, -474590, -469369, -276802, -642284, -994129, -858532, -599107, -613283, -873034, -1237692, -1260370, -633696, -165469, -89128, 2480, -41754, 134886, 501422, 288433, 65483, -113263, -164892, -298090, -327114, -265521, -452925, -842476, -1100398, -866435, -212251, 394692, 759291, 1040992, 969313, 717694, 545020, 233974, 19749, -36007, -248951, -863611, -1259010, -1184710, -879976, -365619, -73995, -348680, -295542, -103833, -68447]
6591f8447l20575k40560J05200j2176m6072K24284J17235l96882k79445L30308
6581e87130K62446j82085J13385L97537K18344J44426j4228j10191Q7338j18292
6571B11550J83591j59180l52286j99890q5013J80960J85330J90357K15176J53122
6561E23717j11538j53603m35215l68650J90178J59287j8313J31001j29739o20624
6551h33499n42871K94352N05415O7038j40879L13252K95449M41502j31054n09903
6541b41198n3795J3083m5506m673m12665l60659q4691j00134J01502Q834O22807
6530e57095N74926J66707K09611K20755M7993j84937k18204l12447j17010n00142
6520f69843o56798l08476k88502l93557K03506Q28222M50704j0201j60173M3559
$$ y = [-68447, -389022, -629582, -524382, -536558, -582630, -358346, -241111, -637993, -917438, -587130, -324684, -506769, -393384, 4153, 222497, 366923, 352695, 242504, 329842, 211550, 395141, 235961, -116325, -316215, -401228, -220268, -34938, 155419, 370595, 523717, 412179, 258576, -176639, -545289, -355111, -195824, -214137, -83136, -212875, -833499, -1376370, -1082018, -576603, -509565, -650444, -337192, -41743, 399759, 268705, -241198, -294993, -281910, -327416, -332089, -744754, -1105413, -1190104, -1290238, -1188736, -1179902, -557095, 17831, 184538, 394149, 614904, 662897, 477960, 259756, -52691, -169701, -669843, -1326641, -1635117, -1923619, -2317176, -2113670, -1285448, -834744, -844945, -1005118, -961559]
6510i61559N24016L83705M7605Q7055L60429Q19231J17150m40985l22499k2643
6500E91505N4231j88167N5292K20174J58271R2695n33867l99037n06848k90659
6490g46410K3737J57273L74582p2774k21953J29863K65082K68289M1933k148J02719
6479C20193K34712R7326m4518J24554k1825k58324m52549q017L51366L04289l47262
6468B99945m90302k76137J80489N16062Q916o0777K19598n7490j98564j36069
6458E671k92996k17318j20470J30860m2459J70874M58309J54093j96974k48498
6448a98908Q4840O48798M78434J23051j94509k75046k47054k48974K13415m71003
6438h6956q84653k78440p7529J40903M87886P06270K17784j44086L12109K67298
$$ y = [-961559, -437543, -53838, -6233, 80822, 441251, 1260482, 1377632, 936647, 614148, 591505, 645736, 457569, 512861, 733035, 891306, 984001, 450134, 51097, -455751, -746410, -722673, -565400, -190818, -263592, -485545, -355682, -90600, 177689, 219622, 217474, 320193, 554905, 652231, 607713, 732267, 710442, 452118, -431, -8448, 342918, 647207, 299945, -190357, -466494, -286005, 230057, 238973, 178196, 397794, 340304, 141740, 5671, -287325, -504643, -625113, -494253, -536712, -365838, 92471, 246564, 49590, -198908, -114068, 534730, 1013164, 1136215, 941706, 666660, 419606, 170632, 384047, -86956, -971609, -1250049, -1327578, -1186675, -698789, 7481, 225265, 81179, 393288, 660586]
6428F60586l50048o95242m06499J51184L03567J8778k11553k45139N37642K18294
6418a8430l56640q8837k5136J16931L76225K46833L59817J73309r2402K0167L7320
6407G49157j66982L982K24428K72398N5900k01153l76482m74061j64425j42090
6397b19328j37550M00756P19228J67803k57766k58470j39855l25833M915N23923
6387D77823M86234m0480l62935K7886j31303n60869l61695n8665K82363L80049
6377A38408r2409j00214J0018M34250P47680J71766j79265k75113L6243O95334
6367A586698O55085N51497Q86919P86177M04790m30407m11906p1041J37312L3971
6357D129095K83226Q04116J196076J309246J179813J292501Q74184O27770P12114
$$ y = [660586, 310538, -384704, -791203, -640019, -336452, -317674, -529227, -774366, -236724, -18430, -375070, -463907, -489043, -372112, 4113, 250946, 610763, 784072, 691670, 711837, 749157, 582175, 586157, 810585, 1082983, 1138883, 937730, 561248, 87187, -77238, -219328, -356878, 43878, 763106, 930909, 673143, 414673, 274818, -51015, -46100, 477823, 964057, 923577, 560642, 588528, 457225, -103644, -465339, -524004, -241641, 138408, 45999, -54215, -44197, 390053, 1137733, 1309499, 1130234, 855121, 891364, 1586698, 2241783, 2793280, 3680199, 4466376, 4871166, 4440759, 4028853, 3957812, 4095124, 4129095, 4412321, 5216437, 6412513, 7721759, 8901572, 10194073, 11068257, 11696027, 12408141]
6348A2408141J015968P58266l70022r12483r18733j63241q5001k95129k37428
6339A1200338o3303J35576P87868P90058M65833N06264O7746j18455j38451n20757
6329A3112717p76205q23970j331902j346762r69970j238852j338278o37217l66376
6320D283185o09200m24169p7165j32913m39825m55241k69957k17760J24026J77322
6310A958303m31703n4256J50308R1407K0525j70909K0569l55348l62085o4028
6300H02783j20422k57494m61562n46955j71025J86625J92552J21044K2474l29997
6290e61977j30746k51710l79259m6362L20443L98400L64980l2611L51711M45430
6280D78299J55488L3684j24423o9386j13155K77072q0158k53583j45067k81571
$$ y = [12408141, 13424109, 14182375, 13812353, 12899870, 11981137, 11817896, 11732895, 11437766, 11200338, 11137035, 11272611, 12060479, 12850537, 13316370, 13822634, 13890380, 13771925, 13633474, 13112717, 12336512, 11512542, 10180640, 8833878, 7863908, 6625056, 5286778, 4649561, 4283185, 3673985, 3249816, 3172651, 3039738, 2599913, 2144672, 1874715, 1656955, 1780981, 1958303, 1526600, 1472344, 1622652, 1714059, 1734584, 1563675, 1584244, 1228896, 866811, 802783, 682361, 424867, -36695, -583650, -754675, -568050, -375498, -254454, -231980, -561977, -692723, -944433, -1323692, -1370054, -1049611, -651211, -286231, -318842, 32869, 478299, 633787, 667471, 543048, 473662, 360507, 637579, 557421, 303838, 158771, -122800]
6270a22800k06655J13630K01468l82250m11671L33410Q37102J087066N31086k39072
6260A741314m9061l50661o51265m86064k44634o0761k59864k16374j77258q5434
6250h40062L6961K81178K89407K22573m9194K046k04721M6415k33586o37252m80889
6239a567124j96925L57825M28523J07959P4488K78120P4661P3511K27995j03594
6229b44561J41454K82641k88868m6671M90026K94578j49831m01119j43138Q0589
6219A5100k36066l21151J74522O19390J67885p1499q2036m14805n20698k19005
6209h88363J74601J83038L46189K11481k29542l4153p1297j12659m8738p734j87387
6198f64564l6595j37281l55174MM82466J88254P6556j40990j76149P7297L47450
$$ y = [-122800, -329455, -215825, -14357, -396607, -808278, -474868, 362234, 1449300, 1980386, 1741314, 1692253, 1341592, 690327, 204263, -40371, -101132, -360996, -577370, -754628, -840062, -803101, -521923, -232516, -9943, -59137, -57091, -261812, -215397, -448983, -1086235, -1567124, -1764049, -1406224, -977701, -869742, -795254, -517134, -442473, -368962, -140967, -244561, -103107, 179534, -109334, -156005, 334021, 628599, 478768, 77649, -65489, 15100, -220966, -542117, -367595, 251795, 419680, 348181, 266145, -148660, -669358, -888363, -713762, -530724, -184535, 26946, -202596, -236749, -308046, -420705, -469443, -477177, -664564, -701159, -838440, -1193614, -1193610, -711144, -522890, -446334, -587324, -763473, -686176, -338726]
6187c38726K40685m4867j10455r3456j25108j35869j82137m3429j25000k42279
6177a200641k51588K5435K12282L25838L82653l91140n30346r7859J64810N72620
6167g87936M22817J88820J13890R8304J36032K22861j8044l74821Q9443L77554
6157D68920L9452J5357m2206J40927l2265K21434j7713j49822K61112j39157q7997
6146F78042R1025k92906k35837M6408Q7975j32890m85338j48135K54356j68973
6136c06273k9291L79261J44570k10307J37236M43588J17826q7564n79821n58962
6126e49737k80339p49j27769j4803J85899J55766L11503M90125K85382R6231j74125
6115C77384k86122r4838K06598J00907K8229K47727L01809R3183j69789k95341
$$ y = [-338726, -98041, -142908, -253363, -346819, -471927, -607796, -789933, -833362, -958362, -1200641, -1452229, -1426794, -1214512, -888674, -506021, -897161, -1427507, -1525366, -1360556, -787936, -365119, -176299, -62409, 35895, 171927, 394788, 376744, 1923, 91366, 468920, 508372, 523729, 481523, 622450, 590185, 811619, 793906, 644084, 905196, 766039, 678042, 769067, 476161, 240324, 286732, 374707, 241817, -243521, -391656, -137300, -306273, -335564, 43697, 188267, -22040, 115196, 558784, 676610, 589046, 9225, -549737, -830076, -830825, -958594, -973397, -787498, -631732, -320229, 169896, 455278, 551509, 377384, 91262, -3576, 203022, 303929, 332158, 579885, 881694, 974877, 805088, 509747]
6105E09747j4377j77015j39717J34584n03299l88766q454J03944K21330J33023
6095a29000J4176j96338O9011O41435K38119k00097N0932K18543l2411o0535p0270
6084E43565p17687p01380M1032N68519M85758J60284j18320R609j88793l55619
6074b73032m0989L35265J26117r9414J56109j02780m35621k11001J79160K21920
6064a44266K86764N86527L08121l43864k43902L62186J58806l76493o8810k02825
6054C22244k52425L12352K58254K97431K56402J19790q4960p81671o63494m08503
6044f24580j97790K89418M95979N61539M57735J7049m07726j85655m3488k03116
6034A59365k24290O63326J94251p41255m11443R6635K36418K49615l2379k92277
$$ y = [509747, 495370, 318355, 178638, 313222, -190077, -578843, -587297, -483353, -262023, -129000, -114824, -311162, -242151, 399284, 637403, 437306, 488238, 706781, 674370, 613835, 543565, -174122, -875502, -834470, -265951, 219807, 380091, 261771, 271380, 82587, -273032, -314021, 21244, 147361, 47947, 204056, 101276, -334345, -545346, -366186, -144266, 142498, 729025, 1037146, 693282, 449380, 811566, 970372, 593879, 525069, 322244, 69819, 382171, 640425, 937856, 1194258, 1314048, 1229088, 447417, -216077, -624580, -822370, -532952, -36973, 524566, 982301, 999350, 591624, 405969, 362481, 159365, -64925, 598401, 792652, 51397, -360046, -263411, -26993, 222622, 190243, -102034]
6024a02034q3260M47852J70016Q749J79298J67819j89443l39051k73569J20219
6014A06596M62452K9193Q3561q5012j99289M59566O19333R0156O0968K77056J55897
6003B060477M9197K57785N21971L58656K97302j67465k85816J16614j54734k95764
5993B758223j9740Q3282L15922N55650j93032l78782l27266m79131n8312M29693
5983B686507k5470l75418l41015k08973q9562r718r8052P9383K77176j0952n1096
5972A832810K66815K87742M42112k1831j27896L90998M84613K31232m12592l88686
5962B985317k0111j0146j6546J62608K58772M97785K43337l91322q64219l17174
5952B528301N1729r8655k29372M6085K71683L7652l9843k90345l79003P131K60987
$$ y = [-102034, -185294, 262558, 432574, 441323, 620621, 788440, 598997, 259946, -13623, 106596, 569048, 598241, 681802, 596790, 397501, 857067, 1476400, 1566556, 1627524, 1904580, 2060477, 2109674, 2367459, 2889430, 3248086, 3545388, 3377923, 3092107, 3208721, 3053987, 2758223, 2738483, 2821765, 3137687, 3693337, 3500305, 3121523, 2794257, 2315126, 2256814, 2686507, 2661037, 2285619, 1944604, 1735631, 1646069, 1636351, 1538299, 1617682, 1894858, 1883906, 1832810, 2099625, 2387367, 2829479, 2807648, 2679752, 3070750, 3555363, 3786595, 3374003, 2985317, 2965206, 2955060, 2938514, 3101122, 3359894, 3857679, 4101016, 3709694, 2845475, 2528301, 2580030, 2481375, 2252003, 2298088, 2569771, 2607423, 2567580, 2277235, 1898232, 1905363, 2166350]
5941B166350M42783j56115n68888l4455K87183K77898J41445p5784m33954k45952
5931A800511q458K18612k2899k38312j37381l00285p4990j19407j17154L19881
5921A320118K45164N9245m899k23395J22028L16510N8442k7011O7550L20856N43751
5910B798359k9235n35486j07639r1409n6100O02307M12806l19797j74840j89803
5900B309163k44929k26717j45496l03791l90102k68880r6403K5861j60779K80681
5890G78608L94733k04573n0125J40563M02276L69391K54611K17610J88353K63907
5880B755354r4322n49472n69009k0891K31266O6801L6820m9186K32092M85871
5870B525324k61042l64392L7184k27230p18660m63267K60626P74878K35129m74727
$$ y = [2166350, 2609133, 2453018, 1884130, 1849675, 2136858, 2414756, 2556201, 2480417, 2046463, 1800511, 1792053, 2010665, 1987766, 1749454, 1612073, 1311788, 1236798, 1117391, 1000237, 1320118, 1565282, 1624527, 1619628, 1396233, 1518261, 1834771, 1893213, 1866202, 1933752, 2254608, 2798359, 2769124, 2233638, 2125999, 2034590, 1978490, 2580797, 2993603, 2673806, 2498966, 2309163, 2064234, 1837517, 1692021, 1388230, 998128, 729248, 632845, 658706, 497927, 778608, 1173341, 968768, 918643, 1059206, 1461482, 1830873, 2085484, 2303094, 2491447, 2755354, 2661032, 2111560, 1542551, 1521660, 1752926, 1819727, 1856547, 1807361, 2039453, 2525324, 2264282, 1899890, 1937074, 1709844, 991184, 527917, 788543, 1563421, 1798550, 1323823]
5860A323823n65921j37315L32641p5706O6014K52548j65394k26191K51571J98192
5850A254262k10391l09149q9922M28464K22234m37040o05005k92737k18046k90731
5840e48061k88391m08721k56215J19894O57593O76507J29094N61913L45349L83389
5830A372351P7749j86797J00820k09854n73425l23191J76294O7867k67067L0113
5820B64860M25910L06351J67276r5551k52554k79255n49N5032q7651n3418J19921
5809E70372L28762K32937O27882J044249M65803k32371l19975m43398j1448J9442
5799B282255j67346l12235j61519L27989K95394M53405N82257J54490J9995K21394
5789C696079K35128k4255P3438M79259P6518j54218L7659L11321J2779K12480
$$ y = [1323823, 757902, 620587, 953228, 877522, 943536, 1196084, 1030690, 804499, 1056070, 1254262, 1043871, 734722, 644800, 1073264, 1295498, 858458, 253453, -39284, -257330, -548061, -836452, -1245173, -1501388, -1381494, -723901, -47394, 81700, 643613, 988962, 1372351, 1450100, 1263303, 1364123, 1154269, 580844, 257653, 433947, 501814, 234747, 264860, 690770, 997121, 1164397, 1068846, 816292, 537037, 536488, 591520, 503869, 450451, 570372, 899134, 1132071, 1759953, 2804202, 3270005, 3037634, 2717659, 2274261, 2262813, 2282255, 2114909, 1802674, 1641155, 1969144, 2264538, 2717943, 3300200, 3454690, 3474685, 3696079, 3931207, 3906952, 3980390, 4459649, 4536167, 4381949, 4419608, 4730929, 4743708, 4956188]
5779D956188o0010o31282k41413L07516k21865k23229l75126m18189k57217J64406
5769B999779O1787k22306P9671l7843j38432l44298n32007n59184k04237J88032
5759A290962j42707m29462j03769N92202K47496l44898l3517L29896J42411q971
5749A539643L01040K66401j51582m2601q4113l48020m04782l27897k21197q2790
5739D44102J1603K01653J89233L38473M76190j9179j95790J44749J5746m4348
5729A562432J9437p0072l79758l60356r7567Q8922j00362L7877M28033q8128k20157
5718H20301J39639L22698L93519N1162l08386k58730K1219l26656r0444M04170
5708A168492N34358J90991m8610l5850m52261n61290m11179K67048P97791P09606
$$ y = [4956188, 4896178, 4264896, 4023483, 4330999, 4109134, 3885905, 3510779, 3092590, 2835373, 2999779, 3061566, 2839260, 2918931, 2881088, 2742656, 2398358, 1866351, 1307167, 1102930, 1290962, 1148255, 718793, 615024, 1207226, 1454722, 1109824, 1076307, 1406203, 1548614, 1539643, 1840683, 2107084, 1955502, 1912901, 1828788, 1480768, 1075986, 748089, 526892, 444102, 455705, 657358, 846591, 1185064, 1661254, 1642075, 1446285, 1591034, 1606780, 1562432, 1581869, 1511797, 1132039, 771683, 674116, 763038, 662676, 700553, 1128586, 1040458, 820301, 959940, 1282638, 1676157, 1727319, 1418933, 1160203, 1181422, 854766, 764322, 1168492, 1702850, 1893841, 1845231, 1809381, 1357120, 795830, 384651, 651699, 1449490, 2159096]
5698B159096j27589l10391n70999m98396o2632J10209j4181j41661k20013L32236
5688F55679P08246J12676n22506p9226L93794P23977K50675j77248J61766K47419
5678B475252j12804l17018J08475L08131j0044p489M95553L04677K93570P3482
5668C611785l11707j65724j5357J37627J56275j58544J2750J6144K7743L15598
5658C626590K73372P1678k26737K39293P57126O76596L23832N21685N50739j4737
5648F799437m078j52419k74236j80499l53353m34664m7191k96957l91202r1491
5638D573347o41627r22143l17851L0684J17649P8388Q2849j14639l79325l57070
5628B150262k60705J29044M20629J7198l27531K75430M01368r2892k39159L48168
$$ y = [2159096, 2031507, 1721116, 1150117, 651721, 589089, 699298, 685117, 543456, 323443, 655679, 1363925, 1476601, 954095, 874869, 1268663, 1992640, 2243315, 2066067, 2227833, 2475252, 2362448, 2045430, 2153905, 2462036, 2451992, 2444503, 2940056, 3244733, 3538303, 3611785, 3300078, 3134354, 3118997, 3256624, 3412899, 3254355, 3267105, 3283249, 3310992, 3626590, 3899962, 3971640, 3744903, 3984196, 4741322, 5417918, 5741750, 6263435, 6814174, 6799437, 6795359, 6642940, 6368704, 6188205, 5834852, 5400188, 5352997, 5056040, 4664838, 4573347, 3931720, 3009577, 2691726, 2722410, 2840059, 2918447, 3001296, 2886657, 2507332, 2150262, 1889557, 2018601, 2439230, 2456428, 2128897, 2404327, 2805695, 2712803, 2473644, 2821812]
5618B821812L7209j34233N07204M24105L73876M46746j16601m6110J09262N63202
5608D986472M35099k08516O9629N31454N67459k06259p01370m70494K21815R24575
5598F149864J274506Q02892N04194Q45697P88710N38967O93508J230239J060311
5589A3888888P11986K14026j36918l72989l80647q63224j470595j287113j043751
5580I259663j030881r43347q05595q42307o19990j7765n33165o94063l92818k85589
5570C094143k06091j73433k80151n8309N5255k3829J87899K81387q8915n33541
5560B254415l39688J16361L94651M65911o6214m24801m59495K8958J40169M93838
5550B604105L62462p0768l93934j89094L56622J90055K07447L06541J86196j31035
$$ y = [2821812, 2859021, 2724788, 3231992, 3656097, 4029973, 4476719, 4360118, 4314008, 4423270, 4986472, 5421571, 5213055, 5282684, 5814138, 6381597, 6175338, 5473968, 5003474, 5225289, 6149864, 7424370, 8227262, 8731456, 9577153, 10365863, 10904830, 11598338, 12828577, 13888888, 14600874, 14814900, 14677982, 14304993, 13924346, 13061122, 11590527, 10303414, 9259663, 8228782, 7285435, 6479840, 5637533, 5017543, 4999778, 4466613, 3772550, 3379732, 3094143, 2888052, 2714619, 2434468, 2376159, 2431414, 2407585, 2595484, 2876871, 2787956, 2254415, 1914727, 2031088, 2425739, 2891650, 2825436, 2400635, 1941140, 1970098, 2110267, 2604105, 2966567, 2895799, 2501865, 2312771, 2669393, 2859448, 3066895, 3373436, 3559632, 3428597]
5540C428597r8887K34076N07000O00334P90388Q34653J174206J167059J152129
5531I789555J007879Q88030M21255J10126q3950m29687q02930q47971m40590k91765
5521I319952r41135r34281m42793n93604p95451q35506n54296m32702l52593j74168
5511C263423m96323n47531j09140L70595P5756l00961k13717j31241R8613N10290
5501B519764J2731k51490J8733k16064m2288M978N0609L87027L59228l27995k76648
5490B238585K83520J11096R3101k27020P0782J18376j98679N3130L45174L51389
5480C239454K76642M10465J72493J12355M80738Q55224J090165Q03427Q62669
5471H303632O09284N81937M90972P88009O36567m74255q49386o19073n44054p91475
$$ y = [3428597, 3329710, 3563786, 4070786, 4671120, 5461508, 6296161, 7470367, 8637426, 9789555, 10797434, 11685464, 12106719, 12216845, 12132895, 11703208, 10900278, 10052307, 9611717, 9319952, 8378817, 7444536, 7001743, 6408139, 5612688, 4777182, 4222886, 3790184, 3437591, 3263423, 2767100, 2219569, 2110429, 2481024, 2556780, 2255819, 2042102, 1910861, 2009474, 2519764, 2532495, 2281005, 2299738, 2083674, 2041386, 2046364, 2096973, 2484000, 2843228, 2515233, 2238585, 2522105, 2633201, 2726302, 2499282, 2570064, 2688440, 2489761, 2542891, 2888065, 3239454, 3516096, 3926561, 4099054, 4211409, 4692147, 5547371, 6637536, 7440963, 8303632, 8912916, 9494853, 9985825, 10773834, 11410401, 10936146, 10086760, 9467687, 8923633, 8132158]
5461H132158j038465p22098o02579m24447p18772p10260m45035k61750J46955
5452C355707P0905P2617J84942J17207k51698k48466j19016L092K4534M2459n8495
5441C193788k32119k43254L83009J79475k61235P1879P55472O03175k76501m06096
5431C767593j88519J76001N70587L90038j1112j99877m38052j64762J93593K44057
5421D339547P68j42453N0998M24294L73312N27378L72649N90022R3755l18108
5411F312162J59251L79463L21799j23407j59211j51601m19167o94406m29550j83919
5401E011414l89083m91941k99275o48029n91888j13332q1799L9454J29154k04732
5391B359943j62967k76009l68304j14325l93738l41081J90611K6101k8160K40642
$$ y = [8132158, 7093693, 6371595, 5769016, 5344569, 4625797, 3915537, 3470502, 3208752, 3355707, 3426612, 3499229, 3684171, 3801378, 3549680, 3301214, 3182198, 3185290, 3209824, 3252283, 3193788, 2961669, 2718415, 3101424, 3280899, 3019664, 3091543, 3847015, 4450190, 4173689, 3767593, 3579074, 3755075, 4325662, 4715700, 4704588, 4504711, 4066659, 3901897, 4095490, 4339547, 4340315, 4197862, 4248860, 4673154, 5046466, 5573844, 5946493, 6536515, 6630270, 6312162, 6471413, 6850876, 7172675, 7049268, 6890057, 6738456, 6319289, 5624883, 5195333, 5011414, 4622331, 4130390, 3831115, 3183086, 2591198, 2477866, 2396067, 2435521, 2564675, 2359943, 2196976, 1920967, 1552663, 1438338, 1044600, 703519, 894130, 920231, 892071, 1132713]
5381A132713K12450J30245J12760M10299K59232k87156j67920j63489k26465k82961
5371A129708l93556n04513m1743K34949K34554K29088K57401Q5569Q3493J08420
5361A423370o3948m77280j2897L81335L74336N61583K85743l14031k6525M68788
5351B600474K22353M14120K36885j60436n03650o75393j61521j9284n7899j93452
5341A702197r1120j83410k94580O7829J86500j16055l96715k47329R7507J62256
5331H87080l04701n79147k66391M7531K25515K7400k65583j905K12761N8781p1319
5320b9978l84897j93352K12279N62233O14878K70267K69469k50442l49376l27967
5310C93114l22400K3913J50358L26182L17805J20019R9611L1875J3008K13083
$$ y = [1132713, 1345163, 1475408, 1588168, 1998467, 2257699, 1970543, 1802623, 1639134, 1412669, 1129708, 736152, 231639, 189896, 424845, 659399, 888487, 1145888, 1231457, 1314950, 1423370, 1359422, 882142, 869245, 1250580, 1624916, 2186499, 2472242, 2158211, 2131686, 2600474, 2822827, 3236947, 3473832, 3313396, 2809746, 2134353, 1972832, 1953548, 1895649, 1702197, 1611077, 1427667, 1133087, 1200916, 1387416, 1271361, 874646, 627317, 724824, 887080, 582379, 3232, -263159, -215628, 9887, 37287, -228296, -230201, -17440, 41341, -29978, -414875, -608227, -395948, 166285, 781163, 1051430, 1320899, 1070457, 721081, 393114, 70714, 94627, 244985, 571167, 888972, 1008991, 1108602, 1140477, 1153485, 1366568]
5300A366568J07973J64148J32829K02328N29231O16119L14843l46273n60512q64215
5290A663039p48197j76546o1258j74203q2214J14409j00753l1276K28225j41385
5280D89841l46184j77812L38069N09226M57832p6649q80718o11411p8299l714
5270c79819k9761K33239L61935N8697l10834j94584p2683L75026N63711J84500
5260G89427m57951n82650L5372R8792J78431j02948k33849N20632J7808J74814
5250D37878Q70741M08492M9186l99113k95864L26735P01317M98412l1478J11202
5240B677508R14071P66214J077597J340716R63645m91503j495770j408158j060530
5231C283790m14361k11821n01445p51256p34905m26854M26359P24427M21891Q9785
$$ y = [1366568, 1474541, 1638689, 1771518, 1973846, 2503077, 3119196, 3434039, 3087766, 2527254, 1663039, 914842, 738296, 677038, 502835, 420621, 535030, 434277, 403001, 631226, 489841, 143657, -34155, 303914, 813140, 1270972, 1194323, 313605, -297806, -376105, -379819, -409580, -176341, 185594, 244291, -66543, -261127, -333810, 41216, 604927, 789427, 331476, -251174, -215802, -117010, 61421, -41527, -275376, 245256, 263064, 437878, 1308619, 1717111, 1766297, 1367184, 1071320, 1398055, 2099372, 2597784, 2566306, 2677508, 3591579, 4357793, 5435390, 6776106, 7739751, 7248248, 5752478, 4344320, 3283790, 2869429, 2657608, 2156163, 1404907, 670002, 243148, 669507, 1393934, 1815825, 1905610]
5221A905610k16400l17646m00956m06390k95074J41482o5358J37707j4384K7254
5211D95845J59629k97774o27618p5040N90632L79384l33814m11357l0012M66787
5201C16662L37797r1331Q0721J78238K07879o5557k64679J78828K59709O1094
5191A199361l43036l26509o0037L7182K43859K91803K99131N45618J020624J412422
5181D320418J268601J413449J756753N95197n79161j818001k012703j286273r37241
5172B721039p69123o80741Q3239L87568J43651k11123m11107j74026m74442o10406
5162D529k4358L15645K20761K22856j21919n97635o75994k69348J81348K33755
5152e10360p7084M823O9747q3383L08477K23725j88749j68586k26339K3316L15786
$$ y = [1905610, 1689210, 1371564, 970608, 564218, 269144, 410626, 345268, 482975, 468591, 495845, 655474, 357700, -269918, -344958, 245674, 625058, 291244, -120113, -150125, 316662, 654459, 563128, 643849, 822087, 1029966, 964409, 699730, 878558, 1138267, 1199361, 856325, 529816, 469779, 506961, 750820, 1042623, 1341754, 1887372, 2907996, 4320418, 5589019, 7002468, 8759221, 9354418, 8775257, 6957256, 4944553, 3658280, 2721039, 1951916, 1271175, 1354414, 1741982, 1885633, 1674510, 1263403, 1089377, 614935, 4529, -19829, 295816, 516577, 739433, 617514, 19879, -656115, -925463, -744115, -510360, -587444, -582621, -512874, -596257, -287780, -64055, -252804, -421390, -647729, -624413, -308627]
5141c08627L41929K76132J82849l7362l60434k58740J86138L0992J38131K27165
5131D18173j51992l87330j19173O0340N75874P31601P03395Q29222Q27537J250470
5121D738117J651929N54644q21774j502981r76205o26259o47953l17216k81592
5112A770710l38706P6323L32310K7649l05514j31595k60757m14833j22579j84555
5102D48453j80151n01091n63280n0209j71758j41950l07466k53764O10772M87125
5092f23319K38131k52636o36194L83867P37187L79701M85862n9950p73730k77429
5082c98510K27760K65336R7246K6288q5236l36576p927L42296N48231o855q39930
5071a67877l31782Q1799L1051K05292M99926M18751P59299J065536P00081L24046
$$ y = [-308627, 33302, 309434, 492283, 454921, 94487, -164253, 21885, 52877, 191008, 418173, 266181, -121149, -240322, -179982, 395892, 1127493, 1830888, 2660110, 3487647, 4738117, 6390046, 6944690, 6122916, 4619935, 3643730, 3017471, 2369518, 2052302, 1770710, 1432004, 1508327, 1840637, 1868286, 1562772, 1431177, 1170420, 755587, 633008, 448453, 268302, -232789, -796069, -846278, -1018036, -1159986, -1467452, -1721216, -1110444, -623319, -385188, -637824, -1274018, -890151, -152964, 226737, 712599, 652649, -121081, -398510, -170750, 94586, 191832, 218120, 132884, -203692, -211619, 130677, 678908, 672053, -167877, -499659, -417860, -386809, -181517, 318409, 737160, 1496459, 2561995, 3262076, 3586122]
5061C586122k08669m86393o20345o17413k36797L4289j4185l22318L406J59444
5051A277141k42854l13788j85543n5867L7433j34631j7886J76910k14810j71238
5041A54867J15349L45236M5484k45344k65187J01847J85712l0824J56758k38106
5031C25792l39986m5628K07689J03965m61458m59529n6652L24995J29676k13722
5021d84858l01219J60714J75100O9097K53360L24764j84818l62604J08995J73216
5011f8253M48007N30969M12885K95124N06379L31194j07428j12220j7110m63952
5001A755595j122248n66857k38268j31361j62825m81069j62981l73558k96998
4992a780570M21539M07804P1362l6959q5175J11299N99231J25451j57689j75025
$$ y = [3586122, 3377453, 2891060, 2270715, 1653302, 1416505, 1450794, 1436609, 1114291, 1117697, 1277141, 1034287, 720499, 534956, 479089, 516522, 381891, 364005, 540915, 326105, 154867, 270216, 615452, 660936, 415592, 150405, 252252, 437964, 407140, 563898, 325792, -14194, -59822, 147867, 251832, -209626, -669155, -725807, -400812, -271136, -484858, -786077, -625363, -450263, -381166, -127806, 196958, 12140, -350464, -241469, -68253, 379754, 910723, 1323608, 1618732, 2125111, 2456305, 2348877, 2236657, 2219547, 1755595, 633347, 66490, -171778, -303139, -465964, -947033, -1110014, -1483572, -1780570, -1359031, -951227, -879865, -916824, -1001999, -890700, -291469, -166018, -323707, -498732]
4982d98732l89011m94295k10951K35878M12169K61941Q3772j14024p1756o381
4972g91390n6662J99704M1805j46823j17502k2387k54502l48177k22437n1454
4962a769825L5327J52496M51459N10604L82559j16036J43460q97j891K44817k0636
4951A1437n34672k23695L55384j0250l12427n34471j61280N50912K73720J05227
4941d80115L11235J75586k67275k90011k0817K80442N03252k26710l56962k14079
4931e85454k46346k70048K55272N92108M36325M2423l24116j87654L2690K25462
4921b9338J59320m47663m24996J37532P8674k33299l48029O4884k467J35616L10956
4910e98810J76864J90758l6290J22507R2145j57155o1318R7394k72525j08764
$$ y = [-498732, -887743, -1382038, -1592989, -1357111, -944942, -683001, -599229, -713253, -785009, -791390, -848052, -648348, -606543, -753366, -870868, -893255, -1147757, -1495934, -1718371, -1769825, -1734498, -1582002, -1130543, -619939, -237380, -353416, -209956, -210853, -212744, 32073, 11437, -523235, -746930, -391546, -401796, -714223, -1248694, -1409974, -859062, -585342, -480115, -168880, 6706, -260569, -550580, -571397, -290955, 212297, -14413, -371375, -585454, -831800, -1101848, -846576, -254468, 181857, 224280, -99836, -287490, -254800, -29338, 129982, -317681, -742677, -605145, -526471, -759770, -1107799, -1042915, -1045382, -909766, -598810, -421946, -231188, -267478, -144971, -52826, -209981, -271299, -173905, -446430, -555194]
4900e55194L02113N0258K9939K96221n46969n18627l10759J5740L25385K18818
4890f93075Q5435N21685J083681O59078l05909p26248p9944K10278K2752l34024
4880D43709m09642l25061J29517O0633Q7126M66943k35042m62232k20637k21002
4870f85688p140j0859n1618K56996K95086M12278J59050l95921n73603P594L33204
4859b60621L31920K32700o6955j8686M2691J5696p2680J49710j0810j96000J77089
4848C24054J83957L4464M32192K85069l7660j03832J16466K9734J7010j29717
4838A151737j45981l19182k6829Q28966O46126k15302k95259j15009j56950m13309
4828I39008j66932n02504o54943l9877L32366M79734K44023n8774j05919O4979
$$ y = [-555194, -253081, -202823, -172884, 123337, -423632, -942259, -1253018, -1237278, -911893, -693075, -607640, -85955, 997726, 1656804, 1350895, 624647, 544703, 754981, 777733, 443709, 34067, -290994, -161477, -100844, -13718, 453225, 218183, -244049, -464686, -685688, -692828, -703687, -755305, -498309, -203223, 209055, 368105, -27816, -601419, -593825, -260621, 71299, 303999, 237044, 218358, 261049, 276745, 204065, 353775, 342965, 146965, 324054, 508011, 542475, 974667, 1259736, 1222076, 1118244, 1234710, 1264444, 1281454, 1151737, 1005756, 686574, 659745, 1488711, 2134837, 1919535, 1624276, 1509267, 1352317, 939008, 772076, 269572, -385371, -425248, -92882, 386852, 630875, 572101, 466182, 531161]
4818E31161j11493J05077Q2153r1387K08384J15324p5872j89128n17368k99254
4808b42403P8683r8967k25331p5969j61529j79198N4373k08710K54101J97383
4798f07567K9787Q4255K07123N99546J72479k20717n97418k52828J93019k2821
4788d15142R0334K26411L11912J41827p8981J96340J09139K9244o4959o11866
4778f5741m14282J464j01590j02293K32993P6670M6883K43191J70051K08428L11148
4767F06922J08541k2017m9706M27450K41033k15725J83407o4410n99515k36592
$$ y = [531161, 419668, 524745, 606898, 515511, 723895, 839219, 763347, 574219, 56851, -242403, -163720, -262687, -488018, -563987, -725516, -904714, -850341, -1059051, -804950, -607567, -577780, -493525, -286402, 313144, 485623, 264906, -332512, -585340, -392321, -415142, -324808, -98397, 213515, 355342, 276361, 472701, 581840, 611084, 546125, -65741, -480023, -478559, -580149, -682442, -449449, -372779, -325896, -82705, 87346, 295774, 606922, 715463, 693446, 643740, 1071190, 1312223, 1096498, 1279905, 1215495, 615980, 379388]
$$ [...]
##END NTUPLES=NMR SPECTRUM
##END=
