##TITLE=C13_SR7-2C
 CDCl3, 22002 sc

 29.1.2020
##JCAMPDX= 6.0         $$ Bruker NMR JCAMP-DX V2.0
##DATA TYPE= NMR SPECTRUM
##DATA CLASS= NTUPLES
##ORIGIN= UXNMR, Bruker Analytische Messtechnik GmbH
##OWNER= root
$$ XWIN-NMR		Version 3.5
$$ Thu Jan 30 13:39:59 2020 Russian Standard Time (UT+4h)  she@DPX200
##.OBSERVE FREQUENCY= 50.327896
##.OBSERVE NUCLEUS= ^13C
##.ACQUISITION MODE= SIMULTANEOUS
##.ACQUISITION SCHEME= undefined
##.AVERAGES= 22002
##.DIGITISER RES= 17
##SPECTROMETER/DATA SYSTEM= spect
##.PULSE SEQUENCE= zgpg30
##.SOLVENT NAME= CDCl3
##.SHIFT REFERENCE= (INTERNAL, CDCl3, 0, 222.624)
##AUDIT TRAIL= $$ (NUMBER, WHEN, WHO, WHERE, WHAT)
$$ ##TITLE= Audit trail, XWIN-NMR		Version 3.5
$$ ##JCAMPDX= 5.01
$$ ##ORIGIN= Bruker BioSpin GmbH
$$ ##OWNER= she
$$ F:/spectra/data/she/nmr/c13/1/pdata/1/auditp.txt
$$ ##AUDIT TRAIL=  $$ (NUMBER, WHEN, WHO, WHERE, WHAT)
(   1,<2020-01-30 13:37:36.01 +0400>,<she>,<DPX200>,
      <created by zg, POWCHK disabled, PULCHK disabled
       terminated by command 'halt'
       configuration hash MD5:
       00 E9 B6 7A A2 85 ED C7 34 08 36 98 17 FE 4E 26
       data hash MD5: 32K
       F5 A7 E3 B7 4D C7 82 8B 07 E1 F7 73 81 71 9F 4A>)
(   2,<2020-01-30 13:38:07.81 +0400>,<she>,<DPX200>,
      <Start of raw data processing
       efp BC_mod = 2 LB = 1 FT_mod = 6 PKNL = 1 PHC0 = -214.8823 PHC1 = 22.40638 SI = 32K 
       data hash MD5: 32K
       8E B6 CE D3 09 0D 92 F4 98 09 48 08 DC A7 FC 4A>)
(   3,<2020-01-30 13:38:10.64 +0400>,<she>,<DPX200>,
      <abs ABSG = 5 
       data hash MD5: 32K
       37 83 FC D1 E0 05 78 B0 D0 C8 00 BF C4 55 5C 95>)
(   4,<2020-01-30 13:38:44.50 +0400>,<she>,<DPX200>,
      <pk PHC0 = -1.869226 PHC1 = 7.400002 
       data hash MD5: 32K
       68 C7 4E 20 97 1E C6 D0 AA 36 02 1F 62 17 10 89>)
(   5,<2020-01-30 13:38:47.84 +0400>,<she>,<DPX200>,
      <abs ABSG = 5 
       data hash MD5: 32K
       5C 77 52 A8 15 1A 85 E6 12 95 6D 8F 68 D4 BB 44>)
(   6,<2020-01-30 13:39:10.95 +0400>,<she>,<DPX200>,
      <pk PHC0 = -1.799206 PHC1 = 2.000001 
       data hash MD5: 32K
       90 9D 01 43 3C 4D B3 AC 5B 6E 27 45 57 F9 69 77>)
(   7,<2020-01-30 13:39:19.06 +0400>,<she>,<DPX200>,
      <abs ABSG = 5 
       data hash MD5: 32K
       5E 3A E5 A9 71 1A EB 50 7D D3 20 BD 4E AE 6D F6>)
$$ ##END=
$$ 
$$ hash MD5
$$ 07 6B 91 1F 72 5B 41 03 AB 4C DD F8 07 2D 9A BE
##$RELAX= 
##$RELAX= 
##$RELAX= 
##$RELAX= 
##$RELAX= 
##$RELAX= 
##$RELAX= 
##$RELAX= 
$$ Bruker specific parameters
$$ --------------------------
##$DU= <F:/spectra>
##$EXPNO= 1
##$NAME= <c13>
##$PROCNO= 1
##$TYPE= <nmr>
##$USER= <she>
##$AMP= (0..31)
100 100 100 100 100 100 100 100 100 100 100 100 100 100 100 100 100 100 
100 100 100 100 100 100 100 100 100 100 100 100 100 100 
##$AQSEQ= 0
##$AQ_mod= 1
##$AUNM= <au_zg>
##$AUTOPOS= <>
##$BF1= 50.322709
##$BF2= 200.13
##$BF3= 50.322709
##$BF4= 500.13
##$BF5= 500.13
##$BF6= 500.13
##$BF7= 500.13
##$BF8= 500.13
##$BYTORDA= 1
##$CFDGTYP= 0
##$CFRGTYP= 5
##$CHEMSTR= <none>
$$ [...]
##$SUBNAM4= <"">
##$SUBNAM5= <"">
##$SUBNAM6= <"">
##$SUBNAM7= <"">
##$SUBNAM8= <"">
##$SUBNAM9= <"">
##$SW= 239.972175391363
##$SWIBOX= (0..15)
0 1 3 0 0 0 0 0 0 0 0 0 0 0 0 0 
##$SW_h= 12077.2946859903
##$TD= 32768
##$TD0= 1
##$TE= 0
##$TE2= 300
##$TE3= 300
##$TEG= 300
##$TL= (0..7)
120 120 120 120 120 120 120 120 
##$TP= (0..7)
150 150 150 150 150 150 150 150 
##$TP07= 0
##$TPNAME0= <>
##$TPNAME1= <>
##$TPNAME2= <>
##$TPNAME3= <>
##$TPNAME4= <>
##$TPNAME5= <>
##$TPNAME6= <>
##$TPNAME7= <>
##$TPOAL= (0..7)
0.5 0.5 0.5 0.5 0.5 0.5 0.5 0.5 
##$TPOFFS= (0..7)
0 0 0 0 0 0 0 0 
##$TUNHIN= 0
##$TUNHOUT= 0
##$TUNXOUT= 0
##$USERA1= <user>
##$USERA2= <user>
##$USERA3= <user>
##$USERA4= <user>
##$USERA5= <user>
##$V9= 5
##$VALIST= <valist>
##$VCLIST= <CCCCCCCCCCCCCCC>
##$VD= 0
##$VDLIST= <DDDDDDDDDDDDDDD>
##$VPLIST= <PPPPPPPPPPPPPPP>
##$VTLIST= <TTTTTTTTTTTTTTT>
##$WBST= 1024
##$WBSW= 4
##$XGAIN= (0..3)
0 0 0 0 
##$XL= 0
##$YL= 0
##$YMAX_a= 39889613
##$YMIN_a= -157399137
##$ZGOPTNS= <>
##$ZL1= 120
##$ZL2= 120
##$ZL3= 120
##$ZL4= 120
##$ABSF1= 222.624
##$ABSF2= -17.3728
##$ABSG= 5
##$ABSL= 3
##$ALPHA= 0
##$AQORDER= 0
##$ASSFAC= 0
##$ASSFACI= 0
##$ASSFACX= 0
##$ASSWID= 0
##$AUNMP= <proc_1d>
##$AZFE= 0.1
##$AZFW= 0.5
##$BCFW= 0
##$BC_mod= 2
##$BYTORDP= 0
##$COROFFS= 0
##$CY= -3
##$DATMOD= 1
##$DC= 0
##$DFILT= <>
##$DTYPP= 0
##$F1P= 0
##$F2P= 0
##$FCOR= 0.5
##$FTSIZE= 32768
##$FT_mod= 6
##$GAMMA= 0
##$GB= 0
##$INTBC= 1
##$INTSCL= 4.134877e-10
##$ISEN= 128
##$LB= 1
##$LEV0= 0
##$LPBIN= 0
##$MAXI= 10000
##$MC2= 0
##$MEAN= 0
##$ME_mod= 0
##$MI= 0.1934396
##$NCOEF= 0
##$NC_proc= 2
##$NLEV= 6
##$NOISF1= 120.0001
##$NOISF2= 80.00006
##$NSP= 0
##$NTH_PI= 0
##$NZP= 0
##$OFFSET= 222.624
##$PC= 1.4
##$PHC0= -218.5507
##$PHC1= 31.80638
##$PH_mod= 1
##$PKNL= yes
##$PPARMOD= 0
##$PSCAL= 0
##$PSIGN= 0
##$REVERSE= no
##$SF= 50.3227315989248
##$SI= 32768
##$SIGF1= 140
##$SIGF2= 120
##$SINO= 11.81781
##$SIOLD= 32768
##$SREGLST= <13C.CDCl3>
##$SSB= 0
##$STSI= 32768
##$STSR= 0
##$SW_p= 12077.2946859903
##$SYMM= 0
##$S_DEV= 0
##$TDeff= 32768
##$TDoff= 0
##$TI= <>
##$TILT= no
##$TM1= 0
##$TM2= 0
##$TOPLEV= 0
##$USERP1= <user>
##$USERP2= <user>
##$USERP3= <user>
##$USERP4= <user>
##$USERP5= <user>
##$WDW= 1
##$XDIM= 32768
##$YMAX_p= 455122311
##$YMIN_p= -3201197
$$ End of Bruker specific parameters
$$ ---------------------------------
##NTUPLES= NMR SPECTRUM
##VAR_NAME=  FREQUENCY,     SPECTRUM/REAL,   SPECTRUM/IMAG
##SYMBOL=    X,             R,               I
##VAR_TYPE=  INDEPENDENT,   DEPENDENT,       DEPENDENT
##VAR_FORM=  AFFN,          ASDF,            ASDF
##VAR_DIM=   32768,         32768,           32768
##UNITS=     HZ,            ARBITRARY UNITS, ARBITRARY UNITS
##FACTOR=    0.368581032318806, 1,           1
##FIRST=     11203.0474431902, 0,            0
##LAST=      -874.247242800138, 0,           0
##MIN=       -874.247242800138, -3201197,    0
##MAX=       11203.0474431902, 455122311,    0
$$ Real data points
##PAGE= N=1
##DATA TABLE= (X++(R..R)), XYDATA
$$ [...]
$$ plain form
15861 -203654 -226625 -343720 -308797 -382216 -511873 -282075 -153208 -434821 -374780 -330684
15851 -330684 -378598 -30594 320341 332023 31627 16050 238621 334326 46434 85120
15841 85120 235971 123411 28083 399755 755387 586852 182605 119277 -62560 -200228
15831 -200228 -13925 312854 62766 130052 535858 465976 502039 254093 57057 -75126
15821 -75126 -142582 29853 141177 119905 -33201 194046 703388 960966 981235 826567
15811 826567 420963 221605 79128 -210226 -334128 -354408 -172033 64427 47777 264348
15801 264348 207390 -225155 -378610 -304717 -226827 -260555 -357370 -771576 -888193 -632993
15791 -632993 78510 859092 909689 358595 -172150 -490050 -758306 -1174594 -1068224 -943221
$$ packed form
15861b03654k2971j17095L4923p3419j29657K29798J28867k81613O0041M4096
15851c30684m7914L48004L50935J1682l00396j5577K22571R5705k87892L8686
15841H5120J50851j12560r5328L71672L55632j68535m04247o3328j81837j37668
15831b00228J86303L26779k50088O7286M05806o9882L6063k47946j97036j32183
15821g5126o7456J72435J11324k1272j53106K27247N09342K57578K0269j54668
15811H26567m05604j99358j42477k89354j23902k0280J82375K36460j6650K16571
15801B64348n6958m32545j53455P3893P7890l3728r6815m14206j16617K55200
15791f32993P11503P80582N0597n51094n30745l17900k68256m16288J06370J25003
$$ plain form
15781 -943221 -668023 -377137 -522861 -1016015 -1899468 -2157037 -1990633 -1578224 -970508 -767574
15771 -767574 -827858 -862051 -889943 -771276 -632721 -335252 -460689 -697693 -569272 -895601
15761 -895601 -1116762 -1049230 -751468 -678942 -390005 -288307 -258338 -144529 193457 437577
15751 437577 -35742 -449596 -619122 -476232 -440871 -467922 -323063 -173174 -91577 -305340
15741 -305340 -486452 -438868 -271387 -147160 234058 229772 -125223 -507774 -494716 163122
15731 163122 358837 147659 -130711 -125308 186475 19025 -425247 -859856 -919456 -390156
15721 -390156 313985 821549 924584 494799 225248 63790 -238836 -349925 36694 84237
15711 84237 -293929 -787363 -824036 -54806 577589 591829 646610 422253 -88804 -125294
$$ packed form
15781i43221K75198K90886j45724m93154q83453k57569J66404M12409O07716K02934
15771g67574o0284l4193k7892J18667J38555K97469j25437k37004J28421l26329
15761h95601k21161O7532K97762P2526K88937J01698K9969J13809L37986K44120
15751D37577m73319m13854j69526J42890L5361k7051J44859J49889Q1597k13763
15741c05340j81112M7584J67481J24227L81218m286l54995l82551J3058O57838
15731A63122J95715k11178k78370N403L11783j67450m44272m34609n9600N29300
15721c90156P04141N07564J03035m29785k69551j61458l02626j11089L86619M7543
15711H4237l78166m93434l6673P69230O32395J4240N4781k24357n11057l6490
$$ plain form
15701 -125294 -94118 48757 155097 -246225 26526 433211 282621 17175 17201 37980 -80512
15690 -80512 -82931 51458 72280 -179854 -614311 -1131929 -1561416 -1523782 -1006281 -727106
15680 -727106 -658677 -738766 -500761 143752 336374 -221096 -901834 -1235546 -1236982 -875654
15670 -875654 -496443 -148013 -15894 -29228 -2229 -279261 -340109 -248950 -270988 -522968
15660 -522968 -644288 -549030 -213153 44894 523824 689617 507032 455214 380882 168551
15650 168551 -86654 -261573 -329645 -483137 -613138 -565618 -301664 -33255 433180 251483
15640 251483 39893 164577 227628 -109954 -233544 -271654 -414711 -678028 -974042 -1030769
15630 -1030769 -1072056 -983334 -726479 -613997 -797906 -929756 -653740 -410562 -511043 -366335
$$ packed form
15701a25294L1176J42875J06340m01322K72751M06685j50590k65446K6K0779j18492
15690h0512k419J34389K0822k52134m34457n17618m29487L7634N17501K79175
15680g27106O8429q0089K38005O44513J92622n57470o80738l33712j436L61328
15670h75654L79211L48430J32119j3334K6999k77032o0848R1159k2038k51980
15660e22968j21320R5258L35877K58047M78930J65793j82585n1818p4332k12331
15650A68551k55205j74919o8072j53492j30001M7520K63954K68409M66435j81697
15640B51483k11590J24684O3051l37582j23590l8110j43057k63317k96014n6727
15630a030769m1287Q8722K56855J12482j83909j31850K76016K43178j00481J44708
$$ plain form
15620 -366335 -514719 -1012334 -1118364 -830684 -433724 -130815 55103 54832 192669 292697
15610 292697 218132 -378878 -1388447 -1889954 -1958871 -1846995 -1591037 -1334697 -1103739 -951644
15600 -951644 -1029577 -1017220 -692373 -333365 -244552 -379305 70787 208507 289783 597790
15590 597790 602510 377656 405931 476610 268563 118640 -76004 -66552 -257094 -247694 111048
15579 111048 230877 -416564 -1021653 -1120367 -1002052 -524398 -168229 -61732 -54026 133465
15569 133465 476201 461042 187884 -435246 -436971 114705 376507 192753 -332874 -637912
15559 -637912 -863487 -882373 -581932 -24714 395183 105750 -158302 -229271 -257020 -105789
15549 -105789 -55135 -237369 -147684 -258217 -554480 -936074 -1168372 -784029 -370136 -83420
$$ packed form
15620c66335j48384m97615j06030K87680L96960L02909J85918k71J37837J00028
15610B92697p4565n97010j009569n01507o8917J11876K55958K56340K30958J52095
15600i51644p7933J2357L24847L59008Q8813j34753M50092J37720Q1276L08007
15590E97790M720k24854K8275P0679k08047j49923j94644R452j90542R400L58742
15579A11048J19829o47441o05089r8714J18315M77654L56169J06497P706J87491
15569A33465L42736j5159k73158o23130j725N51676K61802j83754n25627l05038
15559f37912k25575j8886L00441N57218M19897k89433k64052p0969k7749J51231
15549a05789N0654j82234Q9685j10533k96263l81594k32298L84343M13893K86716
$$ plain form
15539 -83420 120047 234348 398013 687352 451679 -14332 -277965 -453090 -570688 -287041
15529 -287041 219236 618719 540905 321672 25381 -474225 -799257 -914734 -1100213 -872950
15519 -872950 -266212 -11573 -287667 -639063 -578178 -136982 13449 -4634 -128008 -104543
15509 -104543 -114903 -219713 -443841 -423026 -88818 49164 376774 780418 648849 395225
15499 395225 106966 -85870 17106 -183248 -515552 -732737 -470620 -302783 -323496 -502614
15489 -502614 -431228 -285653 304956 814536 925276 840337 767819 844896 610626 46972
15479 46972 -58997 -207341 -590577 -1184175 -1318149 -1073188 -778896 -485090 -233712 231867
15469 231867 616112 698366 260634 -592212 -945262 -471225 -416776 -933343 -930993 -670525
$$ packed form
15539h3420K03467J14301J63665K89339k35673m66011k63633j75125j17598K83647
15529b87041N06277L99483p7814k19233k96291m99606l25032j15477j85479K27263
15519h72950O06738K54639k76094l51396O0885M41196J50431j8083j23374K3465
15509a04543j0360j04810k24128K0815L34208J37982L27610M03644j31569k53624
15499C95225k88259j92836J02976k00354l32304k17185K62117J67837k0713j79118
15489e02614P1386J45575N90609N09580J10740q4939p2518P7077k34270n63654
15479D6972j05969j48344l83236n93598j33974K44961K94292K93806K51378M65579
15469B31867L84245Q2254m37732q52846l53050M74037N4449n16567K350K60468
$$ plain form
15459 -670525 -608759 -509942 -258474 -31541 -25893 -453775 -344339 3018 -224107 -475405
15449 -475405 -604595 -494029 60522 666658 1161781 1237069 419829 102663 398666 436482
15439 436482 464700 314978 -21559 51038 114852 -11955 93990 556578 845890 864062
15429 864062 855190 603014 -86957 -813790 -751369 -298910 97397 33454 -200254 -372969
15419 -372969 -369162 -684410 -890893 -547974 -235594 -350876 -553553 -391796 -113833 40464
15409 40464 11247 -281621 -665452 -778267 -626724 -614251 -721875 -891912 -883032 -654770
15399 -654770 -914276 -1194716 -965475 -607783 -711660 -683833 -784556 -1232657 -1562046 -1504190
15389 -1504190 -1053675 -553089 -207034 220072 126416 -385384 -669130 -524708 -289763 -221292
$$ packed form
15459f70525O1766R8817K51468K26933N648m27882J09436L47357k27125k51298
15449d75405j29190J10566N54551O06136M95123P5288q17240l17166K96003L7816
15439D36482K8218j49722l36537P2597O3814j26807J05945M62588K89312J8172
15429H64062q872k52176o89971p26833O2421M52459L96307o3943k33708j72715
15419c72969L807l15248k06483L42919L12380j15282k02677J61757K77963J54297
15409D0464k9217k92868l83831j12815J51543J2473j07624j70037Q880K28262
15399f54770k59506k80440K29241L57692j03877K7827j00723m48101l29389N7856
15389a504190M50515N00586L46055M27106r3656n11800k83746J44422K34945O8471
$$ plain form
15379 -221292 -586782 -718580 -285981 -184081 -541324 -623528 -443981 -294618 -41972 9286
15369 9286 -377794 -422844 -288515 -412167 -705262 -773129 -131630 485207 841510 653725
15359 653725 -37330 -462766 -536920 -424207 -122940 101956 146757 13418 -47676 -108449
15349 -108449 -317372 -237563 -267752 -363187 -2614 359232 131155 -405410 -512414 -420100
15339 -420100 -485633 -728174 -855649 -660391 -750528 -846906 -979378 -752839 -107485 513953
15329 513953 891651 795269 467368 369886 22643 -456310 -970287 -837472 -285188 -229458
15319 -229458 -522340 -466206 299781 642299 63471 -261393 -298037 -278180 -269034 -259352 -152934
15308 -152934 -133006 -112491 -25984 146805 131161 158996 -12112 116443 145278 109453 -540699
$$ packed form
15379b21292l65490j31798M32599J01900l57243q2204J79547J49363K52646N1258
15369I286l87080m5050J34329j23652k93095o7867O41499O16837L56303j87785
15359F53725o91055m25436p4154J12713L01267K24896M4801j33339o1094o0773
15349a08449k08923P9809l0189r5435L60573L61846k28077n36565j07004R2314
15339d20100o5533k42541j27475J95258r0137r6378j32472K26539O45354O21438
15329E13953L77698r6382l27901r7482l47243m78953n13977J32815N52284N5730
15319b29458k92882N6134P65987L42518n78828l24864l6644J9857R146R682J06418
15308a52934J9928K0515Q6507J72789j5644K7835j71108J28555K8835l5825o50152
$$ plain form
15297 -540699 -1174235 -1256189 -1264302 -1034769 -777208 -405825 -407997 -360113 -744810 -1029041 -883729
15286 -883729 -1069781 -1028517 -1286633 -1664291 -1696965 -1301346 -756108 -227817 -224743 -704576
15276 -704576 -773551 -231022 269886 365132 184291 -232729 -223092 173401 -85937 -241745
15266 -241745 -294883 -330552 -145518 229359 432977 107993 -337020 -579239 -630236 -787426
15256 -787426 -1013008 -851275 -457220 -333517 -385162 -19473 203091 91192 247486 363067
15246 363067 228892 141792 404347 936847 1213731 857811 434831 382962 503099 699303
15236 699303 776694 843157 426298 -138314 -246243 68609 300827 418012 260470 80974
15226 80974 910 -183810 -229384 -274398 -196848 -184606 -246922 -154551 159867 141812 40212
$$ packed form
15297e40699o33536q1954q113K29533K57561L71383k172M7884l84697k84231J45312
15286h83729j86052M1264k58116l77658l2674L95619N45238N28291L074m79833
15276g04576o8975N42529N00908R5246j80841m17020R637L96493k59338j55808
15266b41745n3138l5669J85034L74877K03618l24984m45013k42219n0997j57190
15256g87426k25582J61733L94055J23703n1645L65689K22564j11899J56294J15581
15246C63067j34175q7100K62555N32500K76884l55920m22980n1869J20137J96204
15236F99303P7391O6463m16859n64612j07929L14852K32218J17185j57542j79496
15226H0974q0064j84720m5574m5014P7550J2242o2316R2371L14418j8055j01600
$$ plain form
15215 40212 77279 -55647 -581502 -1019999 -1070051 -889056 -699214 -754675 -148025 788370
15205 788370 1001559 798213 740538 870811 791845 502597 274353 474447 744973 799526
15195 799526 409513 350801 595349 407205 -9009 207357 556710 166457 94463 556764
15185 556764 522783 93470 -198700 -541739 -672373 -511814 -366981 -280476 -15123 500489
15175 500489 504515 545387 449864 91614 -161057 -458520 -518992 -429494 -298081 -93152 15246
15164 15246 -74859 -384732 -695505 -691625 -434985 -340625 -282340 163488 750788 868079 243422
15153 243422 -133903 118376 232093 -1137 -109995 -6374 60423 -146463 12169 297476
15143 297476 266981 44172 -286429 -218822 99747 48937 -433711 -891215 -761997 -951314
$$ packed form
15215D0212L7067j32926n25855m38497n0052J80995J89842n5461O06650R36395
15205G88370K13189k03346n7675J30273p8966k89248k28244K00094K70526N4553
15195G99526l90013n8712K44548j88144m16214K16366L49353l90253p1994M62301
15185E56764l3981m29313k92170l43039j30634J60559J44833Q6505K65353N15612
15175E00489M026M0872r5523l58250k52671k97463o0472Q9498J31413K04929J08398
15164A5246r0105l09873l10773L880K56640R4360N8285M45828N87300J17291o24657
15153B43422l77325K52279J13717k33230j08858J03621O6797k06886J58632K85307
15143B97476l0495k22809l30601O7607L18569n0810m82648m57504J29218j89317
$$ plain form
15133 -951314 -1167772 -847301 -683201 -348532 56600 389592 557207 416053 72326 -19808
15123 -19808 214421 487368 700097 687452 558415 380650 166261 64768 -139583 117200
15113 117200 237761 -44348 -263667 -145158 -32675 76513 71857 440721 551799 385149
15103 385149 340217 398882 158904 -189888 -266586 -173075 -304802 -595440 -732247 -950360
15093 -950360 -687547 184841 687000 504139 711241 843226 481729 105703 41274 188932
15083 188932 280590 224228 115611 45374 110376 316662 475000 404200 408868 136665 -15538
15072 -15538 273665 577448 491556 299168 223651 -244043 -802174 -851297 -446115 -349383
15062 -349383 -676242 -923734 -974343 -878864 -860781 -903037 -864760 -416464 -194010 -296362
$$ packed form
15133i51314k16458L20471J64100L34669M05132L32992J67615j41154l43727r2134
15123a9808K34229K72947K12729j2645j29037j77765k14389j01493k04351K56783
15113A17200J20561k82109k19319J18509J12483J09188m656L68864J11078j66650
15103C85149m4932N8665k39978l48792p6698R3511j31727k90638j36807k18113
15093i50360K62813Q72388N02159j82861K07102J31985l61497l76026o4429J47658
15083A88932R1658n6362j08617p0237O5002K06286J58338p0800M668k72203j52203
15072a5538K89203L03783q5892j92388p5517m67694n58131m9123M05182R6732
15062c49383l26859k47492n0609R5479J8083m2256L8277M48296K22454j02352
$$ plain form
15052 -296362 246684 270305 5654 -113195 -269487 -292612 -518776 -702803 -568690 -50731
15042 -50731 361947 599094 745487 832687 545698 171062 44144 -86501 -186870 76790
15032 76790 304086 236331 182713 -163144 -508944 -309283 93484 454044 203004 -80511
15022 -80511 -71194 82306 338889 576834 643030 621866 544860 223944 -269517 -470094 -684161
15011 -684161 -926867 -1048698 -1459000 -1570882 -1348436 -1191808 -954083 -805415 -1061188 -1263390
15001 -1263390 -789555 551 250991 -45912 -339969 -311304 -593096 -857136 -830331 -679213
14991 -679213 -550360 -653775 -581491 -416339 -348866 -367927 -420628 -667627 -1111694 -1431502
14981 -1431502 -1485827 -1184578 -785294 -615092 -528403 -511093 -513505 -243675 -78469 -426572
$$ packed form
15052b96362N43046K3621k64651j18849j56292k3125k26164j84027J34113N17959
15042e0731M12678K37147J46393Q7200k86989l74636j26918j30645j00369K63660
15032G6790K27296o7755n3618l45857l45800J99661M02767L60560k51040k83515
15022h0511R317J53500K56583K37945O6196k1164p7006l20916m93461k00577k14067
15011f84161k42706j21831m10302j11882K22446J56628K37725J48668k55773k02202
15001a263390M73835P90106K50440k96903k94057K8665k81792k64040K6805J51118
14991f79213J28853j03415P2284J65152O7473j9061n2701k46999m44067l19808
14981a431502n4325L01249L99284J70202Q6689J7310k412K69830J65206l48103
$$ plain form
14971 -426572 -1173186 -1254052 -974864 -826772 -288253 464299 564320 210131 -163789 -231514
14961 -231514 -54394 131630 378597 -218388 -749784 -699123 -544307 -1252 446991 475851
14951 475851 136059 -83520 -192630 -378713 -476748 -569859 -660609 -433194 137701 212021
14941 212021 276412 805696 801390 536651 270153 87101 55549 359096 422452 -164482
14931 -164482 -155603 208751 883149 1125725 909466 1198416 1382087 1174940 1122006 1085638
14921 1085638 869235 373233 80442 277761 588199 457867 67041 -646793 -902529
14912 -902529 -310887 -132991 -438294 -467919 -367126 -251619 -844168 -1366565 -1659920 -1730783
14902 -1730783 -1524255 -1189030 -666424 -21670 486801 407527 242098 -11825 -420079 -862475
$$ packed form
14971d26572p46614q0866K79188J48092N38519P52552J00021l54189l73920o7725
14961b31514J77120J86024K46967n96985n31396N0661J54816N43055M48243K8860
14951D75851l39792k19579j09110j86083r8035r3111r0750K27415N70895P4320
14941B12021O4391N29284m306k64739k66498j83052l1552L03547O3356n86934
14931a64482Q879L64354O74398K42576k16259K88950J83671k07147n2934l6368
14921A085638k16403m96002k92791J97319L10438j30332l90826p13834k55736
14912i02529N91642J77896l05303k9625J00793J15507n92549n22397k93355p0863
14902a730783K06528L35225N22606O44754N08471p9274j65429k53923m08254m42396
$$ plain form
14892 -862475 -973487 -958275 -853314 -998573 -1340298 -1202977 -617717 -429660 -544711 -385493
14882 -385493 -124655 219144 833625 648244 296618 45011 -253365 -240340 70579 155174
14872 155174 163923 -268962 -502739 -234417 6539 -44441 -381763 -381793 -115026 44283 -59274
14861 -59274 87887 470149 397970 357562 738164 926751 1317982 1553344 1193670 651064
14851 651064 694262 762536 536077 359271 222600 263236 195517 -29361 -367648 -331492
14841 -331492 68621 537783 831125 843692 664008 593350 592839 408802 374443 196126 -32906
14830 -32906 58530 264786 64920 55418 142617 263633 370840 512974 511493 236962 -36056
14819 -36056 -333032 -706878 -567731 -413358 -295797 -388800 -620205 -588046 -421007 -519852
$$ packed form
14892h62475j11012J5212J04961j45259l41725J37321N85260J88057j15051J59218
14882c85493K60838L43799O14481j85381l51626k51607k98376J3025L10919Q4595
14872A55174Q749m32885k33777K68322K40956n0980l37322l0K66767J59309j03557
14861e9274J47161L82262p2179m0408L80602J88587L91231K35362l59674n42606
14851F51064M3198O8274k26459j76806j36671M0636o7719k24878l38287L6156
14841c31492M00113M69162K93342J2567j79684p0658n11j84037l4359j78317k29032
14830c2906R1436K06256j99866r502Q7199J21016J07207J42134j481k74531k73018
14819c6056k96976l73846J39147J54373J17561r3003k31405L2159J67039r8845
$$ plain form
14809 -519852 -543529 -665470 -1093265 -1063830 -795815 -732693 -646073 -482740 -576991 -595261 -642539
14798 -642539 -411983 -282272 -344829 -730267 -1143195 -823722 -239452 127260 229850 -96034
14788 -96034 -389013 -187110 41380 -33624 -50296 -116492 -241362 -172258 69826 18857 -204635
14777 -204635 -420903 -722478 -730071 -686137 -411233 -419257 -268767 76888 35440 214795 822910
14766 822910 1128236 1327093 1357360 1330038 1190187 757532 298111 165711 99637 -135930
14756 -135930 -95845 -74828 -253857 -789207 -1285119 -1390576 -1201632 -1131157 -1405604 -1556239
14746 -1556239 -1356130 -925877 -305511 347177 860026 1005297 768809 496184 656631
14737 656631 736837 540491 203390 117311 452949 665292 250652 -70206 -134544 8824
$$ packed form
14809e19852k3677j21941m27795K9435K68015O3122Q6620J63333r4251j8270m7278
14798f42539K30556J29711o2557l85438m12928L19473N84270L66712J02590l25884
14788i6034k92979K01903K28490p5004j6672o6196j24870O9104K42084n0969k23492
14777b04635k16268l01575p593M3934K74904q024J50490L45655m1448J79355O08115
14766H22910L05326J98857L0267k7322j39851m32655m59421j32400o6074k35567
14756a35930M0085K1017j79029n35350m95912j05457J88944P0475k74447j50635
14746a556239K00109M30253O20366O52688N12849J45271k36488k72625J60447
14737F56631Q0206j96346l37101q6079L35638K12343m14640l20858o4338J43368
$$ plain form
14727 8824 240710 337454 188764 -177084 -161888 -331922 -867105 -1268224 -898979 -319738
14717 -319738 -421162 -605816 -453645 -339190 -161502 213321 474509 246944 171 118548
14707 118548 323978 538298 568845 136826 -102314 121939 -42203 -250129 -655822 -1120440
14697 -1120440 -985487 -681793 -565200 -585944 -211269 -63026 -266240 25113 232277 177287
14687 177287 389771 925980 868700 564488 194462 -279186 -458469 -382265 -250801 -18376
14677 -18376 124508 186016 -78464 -575596 -547391 -114013 85632 245012 380489 413599
14667 413599 194727 -398658 -293068 80657 151615 216845 505910 458607 381265 386784 341574
14656 341574 357049 -54454 -575891 -884125 -774623 -707680 -412065 60980 271225 466956
$$ packed form
14727H824K31886R6744j48690l65848J5196j70034n35183m01119L69245N79241
14717c19738j01424j84654J52171J14455J77688L74823K61188k27565k46773J18377
14707A18548K05430K14320L0547m32019k39140K24253j64142k07926m05693m64618
14697a120440J34953L03694J16593k0744L74675J48243k03214K91353K07164n4990
14687A77287K12484N36209n7280l04212l70026m73648j79283P6204J31464K32425
14677a8376J42884O1508k64480m97132K8205M33378J99645J59380J35477L3110
14667D13599k18872n93385J05590L73725P0958O5230K89065m7303p7342N519m5210
14656C41574J5475m11503n21437l08234J09502O6943K95615M73045K10245J95731
$$ plain form
14646 466956 307059 348937 475419 617967 780830 178384 -134518 -151792 -236335 -52267
14636 -52267 33887 162167 345116 377352 483323 671778 833212 558465 228977 81146
14626 81146 2416 134789 246038 -111311 -356643 -300624 -304368 -528102 -529387 -366880 -340804
14615 -340804 -546914 -498623 -376488 -413726 -288941 -192795 -120668 -332872 -417198 -134498
14605 -134498 -106337 -445280 -436139 -470391 -830560 -732650 -431525 -71690 -102010 -568419 -825112
14594 -825112 -1018599 -1023523 -413214 -41828 85456 137153 297374 484627 283997 -222948
14584 -222948 -403058 -599499 -780547 -193685 474086 364681 -24596 -291351 -227480 -94997
14574 -94997 -63278 -295084 -694225 -892694 -689556 -366104 -12207 85621 128606 400840
$$ packed form
14646D66956j59897M1878J26482J42548J62863o02446l12902j7274q4543J84068
14636e2267Q6154J28280J82949L2236J05971J88455J61434k74747l29488j47831
14626H1146p8730J32373J11249l57349k45332N6019l744k23734j285J62507K6076
14615c40804k06110M8291J22135l7238J24785R6146P2127k12204q4326K82700
14605a34498K8161l38943R141l4252l60169R7910L01125L59835l0320m66409k56693
14594h25112j93487m924O10309L71386J27284N1697J60221J87253k00630n06945
14584b22948j80110j96441j81048N86862O67771j09405l89277k66755O3871J32483
14574i4997L1719k31806l99141j98469K03138L23452L53897R7828M2985K72234
$$ plain form
14564 400840 488980 216399 -116225 -380570 -600733 -473581 -434018 -491568 -470574 -333673
14554 -333673 -207626 265638 615239 489813 158619 -244609 -849096 -1078318 -681989 -389111
14544 -389111 -359147 -293761 196797 564983 598659 188473 33954 43868 -309244 -508270
14534 -508270 -597145 -385298 96611 318211 243054 -44592 -453473 -661986 -548048 -378762
14524 -378762 -506847 -537853 -594294 -899255 -1103039 -966640 -447283 -20898 258337 320500
14514 320500 266278 206677 -93242 -380665 -700079 -539072 -174797 44940 64476 11920
14504 11920 -154335 -244199 -65800 101869 175426 112829 -236204 -549176 -484667 -419686 -484320
14493 -484320 -458285 -359818 -215987 -581644 -750585 -330486 397958 695962 564943 483430
$$ packed form
14564D00840Q8140k72581l32624k64345k20163J27152L9563n7550K0994J36901
14554c33673J26047M73264L49601j25426l31194m03228o04487k29222L96329K92878
14544c89111K9964O5386M90558L68186L3676m10186j54519R914l53112j99026
14534e08270q8875K11847M81909K21600p5157k87646m08881k08513J13938J69286
14524c78762j28085l1006n6441l04961k03784J36399N19357M26385K79235O2163
14514C20500n4222n9601k99919k87423l19414J61007L64275K19737J9536n2556
14504A1920j66255q9864J78399J67669P3557o2597l49033l12972O4509O4981o4634
14493d84320K6035R8467J43831l65657j68941M20099P28444K98004j31019q1513
$$ plain form
14483 483430 609454 174318 -358261 -495950 -133316 -82935 -629971 -996979 -804539 -453649
14473 -453649 -365784 -675079 -567465 -405457 -296444 -249169 -287772 -287047 -395955 -529791 -412750
14462 -412750 -238142 -167619 -249440 -399840 -251086 180538 514226 660176 454532 441249
14452 441249 584422 608265 513043 356362 641584 677211 698495 870023 683506 318887
14442 318887 -175933 -807567 -815202 -649471 -740830 -365521 202270 385540 251184 -8240
14432 -8240 -298046 -507518 -321368 -135499 196080 15168 -440240 -377613 -143091 20194
14422 20194 372270 725103 881920 906051 609757 695237 1046858 768624 654125 902090
14412 902090 653123 182846 -215625 -445495 -87539 256734 61805 -310007 -399117 -312211
$$ packed form
14483D83430J26024m35136n32579j37689L62634N0381n47036l67008J92440L50890
14473d53649Q7865l09295J07614J62008J09013M7275l8603P25j08908j33836J17041
14462d12750J74608P0523q1821j50400J48754M31624L33688J45950k05644j3283
14452D41249J43173K3843r5222j56681K85222L5627K1284J71528j86517l64619
14442C18887m94820o31634p635J65731r1359L75309N67791J83270j34356k59424
14432h240k89806k09472J86150J85869L31579j80912m55408O2627K34522J63285
14422B0194L52076L52833J56817K4131k96294Q5480L51621k78234j14499K47965
14412I02090k48967m70277l98471k29870L57956L44273j94929l71812q9110Q6906
$$ plain form
14402 -312211 -266397 -328842 -97782 97428 148223 381052 876132 1491842 1713249 1464033
14392 1464033 1207748 1209809 926564 793162 752660 704355 900846 1270690 976978 574762
14382 574762 155689 -363318 -522181 -517883 -185391 -47223 -3866 205371 244789 51821
14372 51821 -219175 -438994 -589488 -393136 -167163 -176010 124218 618126 891951 754567
14362 754567 532465 455855 494082 268065 -298896 -382362 -154828 138939 570653 460887
14352 460887 -104170 -295203 -58496 136821 -81011 -488846 -575426 -335531 -478225 -695362
14342 -695362 -527386 -379327 -612760 -493968 -327498 -408001 -677419 -464608 67012 102830
14332 102830 -70862 56735 467639 377790 3253 -153848 159247 525290 373216 52140
$$ packed form
14402c12211M5814o2445K31060J95210N0795K32829M95080O15710K21407k49216
14392A464033k56285K061k83245j33402m0502m8305J96491L69844k93712m02216
14382E74762m19073n19007j58863M298L32492J38168M3357K09237L9418j92968
14372E1821k70996k19819j50494J96352K25973q847L00228M93908K73825j37384
14362G54567k22102p6610L8227k26017n66961q3466K27534K93767M31714j09766
14352D60887n65057j91033K36707J95317k17832m07835q6580K39895j42694k17137
14342f95362J67976J48059k33433J18792J66470q0503k69418K12811N31620L5818
14332A02830j73692J27597M10904q9849l74537j57101L13095L66043j52074l21076
$$ plain form
14322 52140 239754 592035 445378 -104707 -130148 280248 374284 396590 416658 -92306
14312 -92306 -409875 -214271 109393 357578 611899 855704 647924 379567 235492 452104
14302 452104 864748 872898 393993 75746 -334595 -608675 -647021 -1011882 -944593 -353882
14292 -353882 -75775 -545112 -798462 -501167 -257236 -31595 338534 483816 610852 478593
14282 478593 318819 352921 179468 84764 397595 560642 290161 -544558 -1013082 -1189700
14272 -1189700 -1061323 -969507 -884074 -781149 -720606 -241088 213782 181770 -56377 -73950
14262 -73950 -206921 -195184 318610 721377 512938 -110299 -196323 1576 -35101 74258
14252 74258 -50892 -332585 -591025 -968551 -967061 -930082 -929071 -823321 -591869 -427959 -218122
$$ packed form
14322E2140J87614L52281j46657n50085k5441M10396R4036K2306K0068n08964
14312i2306l17569J95604L23664K48185K54321K43805k07780k68357j44075K16612
14302D52104M12644Q150m78905l18247m10341k74080l8346l64861O7289N90711
14292c53882K78107m69337k53350K97295K43931K25641L70129J45282J27036j32259
14282D78593j59774L4102j73453r4704L12831J63047k70481q34719m68524j76618
14272a189700J28377R1816Q5433J02925O0543M79518M54870l2012k38147j7573
14262g3950j32971J1737N13794M02767k08439o23237q6024J97899l6677J09359
14252G4258j25150k81693k58440l77526J490L6979J011J05750K31452J63910K09837
$$ plain form
14241 -218122 -131391 -54919 -138999 -478212 -481068 -389404 -554900 -812509 -599903 -225106 -59909
14230 -59909 -215843 -464217 -347958 -439320 -690154 -758745 -495007 -114772 -79666 -78999 208410
14219 208410 342920 468702 589900 834568 897853 543937 -79927 -176413 -189766 -296597
14209 -296597 -678353 -764799 -681461 -741711 -839669 -699677 -540430 -7965 341933 217864
14199 217864 139012 -78315 -371569 -168981 85303 182874 228801 153723 193957 72843
14189 72843 -144912 -396862 -246052 152757 527689 649451 216572 -292839 -602169 -716262
14179 -716262 -574724 -640317 -471758 -177840 250486 437526 106754 -689490 -1244624 -1322068
14169 -1322068 -929583 -320719 -74577 -395016 -613375 -412858 -393226 -319944 -265533 -462128
$$ packed form
14241b18122Q6731P6472q4080l39213k856R1664j65496k57609K12606L74797J65197
14230e9909j55934k48374J16259r1362k50834o8591K63738L80235L5106O67K87409
14219B08410J34510J25782J21198K44668O3285l53916o23864r6486j3353j06831
14209b96597l81756q6446Q3338o0250r7958J39992J59247N32465L49898j24069
14199B17864p8852k17327k93254K02588K54284R7571M5927p5078M0234j21114
14189G2843k17755k51950J50810L98809L74932J21762m32879n09411l09330j14093
14179g16262J41538o5593J68559K93918M28326J87040l30772p96244n55134p7444
14169a322068L92485O08864K46142l20439k18359K00517J9632P3282N4411j96595
$$ plain form
14159 -462128 -185472 -7962 22431 -17877 -10140 45676 421303 424584 123270 145316 462250
14148 462250 586925 347096 240102 47926 16288 280788 315664 110583 47956 109211
14138 109211 130355 260218 91298 -315174 -413451 -96195 89224 261782 406890 472911
14128 472911 582155 505904 757221 1287322 1266994 585137 -90402 -400890 -678826 -457087
14118 -457087 -175341 66776 320799 216194 -84626 -204856 261849 940992 1119268 1021869
14108 1021869 731316 322143 137919 124238 43182 -140453 -169317 -425257 -698263 -1073894
14098 -1073894 -1477567 -1509857 -1402012 -1128132 -611827 -362716 -252617 -163039 35417 179517
14088 179517 8730 -40979 74769 114676 130818 -55807 -315050 -35291 98156 49324
$$ packed form
14159d62128K76656J77510L0393m0308P737N5816L75627L281l01314K2046L16934
14148D62250J24675k39829j06994j92176l1638K64500L4876k05081o2627O1255
14138A09211K1144J29863j68920m06472r8277L17256J85419J72558J45108O6021
14128D72911J09244p6251K51317N30101k0328o81857o75539l10488k77936K21739
14118d57087K81746K42117K54023j04605l00820j20230M66705O79143J78276r7399
14108A021869k90553m09173j84224j3681q1056j83635k8864k55940k73006l75631
14098a073894m03673l2290J07845K73880N16305K49111J10099Q9578J98456J44100
14088A79517j70787m9709J15748L9907J6142j86625k59243K79759J33447m8832
$$ plain form
14078 49324 196132 -88456 -525587 -626154 -454455 -611090 -979687 -1125750 -814781 -382102
14068 -382102 -477705 -828507 -984096 -1086830 -983073 -808859 -550652 -59021 132582 95302
14058 95302 103102 -57006 -250815 -15188 -110413 -580442 -921164 -1030302 -616422 -134150
14048 -134150 -54571 -537014 -1177693 -1444331 -1684666 -1382220 -855670 -719265 -795428 -811457
14038 -811457 -755195 -393587 -134455 -354632 -621914 -765778 -368685 126201 93547 -369185
14028 -369185 -718751 -997236 -1361095 -1092932 -538712 -368269 -319857 -238125 -183175 31653
14018 31653 97339 -513194 -863964 -758836 -298986 -555264 -964230 -334086 396546 264744
14008 264744 -579164 -1058218 -1178741 -1120536 -1124348 -1262531 -1055384 -732234 -695923 -993070
$$ packed form
14078D9324J46808k84588m37131j00567J71699j56635l68597j46063L10969M32679
14068c82102r5603l50802j55589j02734J03757J74214K58207M91631J91603l7280
14058I5302P800j60108j93809K35627r5225m70029l40722j09138M13880M82272
14048a34150P9579m82443o40679k66638k40335L02446N26550J36405p6163j6029
14038h11457N6262L61608K59132k20177k67282j43864L97093M94886l2654m62732
14028c69185l49566k78485l63859K68163N54220J70443M8412Q1732N4950K14828
14018C1653O5686o10533l50770J05128M59850k56278m08966O30144P30632j31802
14008B64744q43908m79054j20523N8205l812j38183K07147L23150L6311k97147
$$ plain form
13998 -993070 -1132272 -935927 -1030513 -1001721 -1062600 -921018 -926682 -1220782 -1519148 -1735908
13988 -1735908 -1613216 -1023218 -504328 -449387 -606408 -1114353 -1267702 -872380 -843268 -910346
13978 -910346 -871207 -156542 561912 700992 581611 92692 -415583 -584098 -467064 -430727
13968 -430727 -448218 -268742 62674 620819 896877 1005170 1093811 953046 435130 57095
13958 57095 -203604 -318539 -187726 -246223 -401462 -421108 -656160 -620751 -445361 113749
13948 113749 618968 629836 736094 632865 291255 178720 -197915 -680489 -939151 -811638
13938 -811638 -399461 -376698 -424704 -520174 -781634 -820187 -818174 -715566 -534147 -651262 -881183
13927 -881183 -606667 -98412 141103 62715 124062 421730 103948 -387599 31701 221138
$$ packed form
13998i93070j39202J96345r4586K8792o0879J41582n664k94100k98366k16760
13988a735908J22692N89998N18890N4941j57021n07945j53349L95322K9112o7078
13978i10346L9139P14665P18454J39080j19381m88919n08275j68515J17034L6337
13968d30727j7491J79476L31416N58145K76058J08293Q8641j40765n17916l78035
13958E7095k60699j14935J30813n8497j55239j9646k35052L5409J75390N59110
13948A13749N05219J0868J06258j03229l41610j12535l76635m82574k58662J27513
13938h11638M12177K2763m8006r5470k61460l8553K013J02608J81419j17115k29921
13927h81183K74516N08255K39515p8388O1347K97668l17782m91547M19300J89437
$$ plain form
13917 221138 -169145 -448182 -554962 -276255 -291649 -322623 -226629 -262452 -290106 36912
13907 36912 -15008 -319368 -279527 -24236 134463 -94750 -647601 -1103932 -918362 -146860
13897 -146860 258884 275173 252721 567471 767902 836116 611075 -142002 -974675 -1350653
13887 -1350653 -1142128 -1114137 -1231061 -1172177 -1384897 -1411675 -1070383 -729688 -254487 60523
13877 60523 -215218 -662022 -876470 -808691 -936867 -952704 -829367 -499821 -101739 -26916
13867 -26916 -92751 -108799 -238721 -35590 275272 235050 95791 -97505 -351524 -895323
13857 -895323 -837727 -414579 -615832 -850398 -812419 -420506 -42361 -84375 19564 101057
13847 101057 -440222 -853527 -916376 -870583 -1245882 -1525547 -1583572 -1330534 -834763 -663195
$$ packed form
13917B21138l90283k79037j06780K78707j5394l0974R5994l5823k7654L27018
13907C6912n1920l04360L9841K55291J58699k29213n52851m56331J85570P71502
13897a46860M05744J6289k2452L14750K00431O8214k25041p53077q32673l75978
13887a350653K08525K7991j16924N8884k12720k6778L41292L40695M75201L15010
13877F0523k75741m46804k14448O7779j28176j5837J23337L29546L98082P4823
13867b6916o5835j6048j29922K03131L10862m0222j39259j93296k54019n43799
13857h95323N7596M23148k01253k34566L7979L91913L78145m2014J03939Q1493
13847A01057n41279m13305o2849M5793l75299k79665n8025K53038M95771J71568
$$ plain form
13837 -663195 -161308 595569 964613 1197029 1145908 886204 531807 154404 -158817 -281915
13827 -281915 -189206 -41785 -153034 -252407 -195572 -448053 -562250 -155891 274752 349660
13817 349660 221675 129602 110224 209045 214618 18121 -501771 -745017 -606932 -83276
13807 -83276 60595 -29045 -57925 -43011 392318 797347 1052546 1052998 1030793 1091466 751820
13796 751820 496754 847302 1245987 865229 199883 -148715 -305183 -438595 -120415 242898
13786 242898 552446 441622 344700 547643 692154 467009 -303819 -683928 -487487 -162995
13776 -162995 -112995 -227484 -171008 -130298 -64615 -122911 -419388 -549579 -292154 -106924
13766 -106924 -260103 -499921 -656011 -833618 -788642 -668846 -686875 -616070 -509991 -367865
$$ packed form
13837f63195N01887P56877L69044K32416n1121k59704l54397l77403l13221j23098
13827b81915R2709J47421j11249r9373N6835k52481j14197M06359M30643P4908
13817C49660j27985r2073j9378R8821N573j96497n19892k43246J38085N23656
13807h3276J43871q9640k8880J4914M35329M05029K55199M52k2205O0673l39646
13796G51820k55066L50548L98685l80758o65346l48598j56468j33412L18180L63313
13786B42898L09548j10824r6922K02943J44511k25145p70828l80109J96441L24492
13776a62995N0000j14489N6476M0710O5683n8296k96477j30191K57425J85230
13766a06924j53179k39818j56090j77607M4976J19796j8029P0805J06079J42126
$$ plain form
13756 -367865 -340944 -384170 -535795 -748585 -617708 -273159 101112 534432 573984 721167
13746 721167 715058 308451 207864 403376 443250 -27776 -188184 -11379 -539731 -1272166
13736 -1272166 -1712642 -1832734 -1468797 -969753 -827245 -711036 -605639 -502844 -172921
13727 -172921 338265 252819 -89017 -166683 -6675 -99110 -247141 -240135 -343859 -387379 -164330
13716 -164330 350624 561915 172700 -488764 -802529 -944944 -871702 -518398 -569985 -669912
13706 -669912 -551627 -221801 73612 -139067 -900900 -1301956 -1139238 -855791 -893730 -683936
13696 -683936 -446810 -334518 -310046 -245210 -435436 -788113 -960555 -929517 -873532 -1038569
13686 -1038569 -1323518 -1122556 -767031 -453694 -438878 -610936 -564551 -231299 -107051 -189097
$$ packed form
13756c67865K6921m3226j51625k12790J30877L44549L74271M33320L9552J47183
13746G21167o109m06607j00587J95512L9874m71026j60408J76805n28352p32435
13736a272166m40476j20092L63937M99044J42508J16209J05397J02795L29923
13727a72921N11186q5446l41836p7666J60008r2435j48031P006j03724m3520K23049
13716a64330N14954K11291l89215o61464l13765j42415P3242L53304n1587r9927
13706f69912J18285L29826K95413k12679p61833m01056J62718K83447l7939K09794
13696f83936K37126J12292K4472O4836j90226l52677j72442L1038N5985j65037
13686a038569k84949K00962L55525L13337J4816j72058M6385L33252J24248q2046
$$ plain form
13676 -189097 -521332 -667282 -561503 -628220 -598686 -647865 -875841 -933631 -1075389 -1197339
13666 -1197339 -1133338 -1093265 -1153923 -1083226 -750243 -455910 -475514 -529795 -485669 -528958 -663242
13655 -663242 -602170 -135746 146468 189740 255302 422022 523743 733915 655792 559925
13645 559925 967588 1112982 729073 330172 -203148 -362352 85247 632626 885707 656126
13635 656126 596157 655823 384478 352348 424526 256517 264785 -81162 -343490 -53002 218755
13624 218755 283671 -120918 -550815 -708493 -667142 -523372 -376247 -120563 81662 20849
13614 20849 -522382 -935105 -470039 -39040 119927 483656 751828 640766 332730 -7719
13604 -7719 -369520 -39457 436439 696318 829223 862806 1015870 1207884 1075513 790079
$$ packed form
13676a89097l32235j45950J05779o6717K9534m9179k27976n7790j41758j21950
13666a197339O4001M0073o0658P0697L32983K94333j9604n4281M4126m3289j34284
13655f63242O1072M66424K82214M3272O5562J66720J01721K10172p8123r5867
13645E59925M07663J45394l83909l98901n33320j59204M47599N47379K53081k29581
13635F56126n9969N9666k71345l2130P2178j68009Q268l45947k62328K90488K71757
13624B18755O4916m04589m29897j57678M1351J43770J47125K55684K02225o0813
13614B0849n43231m12723M65066M30999J58967L63729K68172j11062l08036l40449
13604g719l61801L30063M75896K59879J32905L3583J53064J92014j32371k85434
$$ plain form
13594 790079 419704 432138 646672 447714 326037 453571 282526 266848 277041 103352
13584 103352 123068 16306 -385106 -694869 -637040 -715703 -957114 -855581 -614779 -749427
13574 -749427 -941025 -627191 -151022 -63162 165825 335292 107516 -217545 -354538 -94795
13564 -94795 160665 292561 863806 1048988 877488 627834 223369 -193518 -425863 -582293
13554 -582293 -765292 -645118 -202761 265447 587518 626222 125305 51473 379464 473179
13544 473179 -49980 -793751 -1038455 -679416 33041 147358 -364874 -599384 -101360 316392
13534 316392 730359 827684 410305 46942 -239759 -428926 -512143 -640428 -445213 -523647
13524 -523647 -340446 -127756 -176405 -196265 251387 721288 606335 164690 159209 582213
$$ packed form
13594G90079l70375J2434K14534j98958j21677J27534j71045j5678J0193j73689
13584A03352J9716j06762m01412l09763N7829p8663k41411J01533K40802j34648
13574g49427j91598L13834M76169Q7860K28987J69467k27776l25061j36993K59743
13564i4795K55460J31896N71245J85182j71500k49654m04465m16887k32345j56430
13554e82293j82999J20174M42357M68208L22071L8704n00917p3832L27991R3715
13544D73179n23159p43771k44704L59039P12457J14317n12232k34510M98024M17752
13534C16392M13967R7325m17379l63363k86701j89167q3217j28285J95215p8434
13524e23647J83201K12690m8649j9860M47652M69901j14953m41645n481M23004
$$ plain form
13514 582213 660031 520477 345578 -22035 -263863 -179267 -235920 -142432 13534 167100
13504 167100 518401 815510 1103966 1299732 1275852 1035863 888135 320499 270762 665818
13494 665818 448663 39369 -230410 -135748 361641 550869 853221 945451 847173 620979
13484 620979 327887 170472 117872 557095 983556 758755 491561 321271 328538 680800
13474 680800 879269 615134 -36539 -490343 -603420 -567464 -385457 -142132 -136141 -76482
13464 -76482 130897 428498 400421 594240 987610 1079522 672307 21701 -350252 -336960
13454 -336960 -202491 195342 322092 -87037 -149193 111867 -34250 -270105 -432636 -7503
13444 -7503 649950 1067217 1011728 774641 565647 557335 845833 784084 340809 327441 335524
$$ packed form
13514E82213P7818j39554j74899l67613k41828Q4596n6653R3488J55966J53566
13504A67100L51301K97109K88456J95766k3880k39989j47728n67636m9737L95056
13494F65818k17155m09294k69779R4662M97389J89228L02352R2230r8278k26194
13484F20979k93092j57415n2600M39223M26461k24801k67194j70290P267L52262
13474F80800J98469k64135o51673m53804j13077L5956J82007K43325N991N9659
13464g6482K07379K97601k8077J93819L93370R1912m07215o50606l71953J3292
13454c36960J34469L97833J26750m09129o2156K61060j46117k35855j62531M25133
13444g503O57453M17267n5489k37087k08994q312K88498o1749m43275j3368Q083
$$ plain form
13433 335524 321249 454555 492573 449102 478990 490151 383336 -78951 -464342 -574695
13423 -574695 -258997 -348396 -749308 -805583 -901928 -638016 -369584 -229845 -54855 94211
13413 94211 458694 568536 228809 -55115 -146511 32406 287368 156390 -370920 -271630
13403 -271630 370892 949095 1241369 964354 660653 413978 264367 354221 554782 357137
13393 357137 60842 383224 497153 -96592 -464651 -396303 -86343 351991 518856 520306
13383 520306 474509 434859 789562 1155471 615383 -82386 -32033 205651 208924 191730 -2834
13372 -2834 -213585 -115592 68142 467094 694030 479520 263915 240236 590372 615857
13362 615857 223731 18873 -269841 -440499 -450560 -444207 -224901 -111148 12580 32893
$$ packed form
13433C35524j4275J33306L8018m3471K9888J1161j06815m62287l85391j10353
13423e74695L15698q9399m00912n6275r6345K63912K68432J39739J74990J49066
13413I4211L64483J09842l39727k83924r1396J78917K54962j30978n27310R9290
13403b71630O42522N78203K92274k77015l03701k46675j49611Q9854K00561j97645
13393C57137k96295L22382J13929n93745l68059O8348L09960M38334J66865J450
13383E20306m5797l9650L54703L65909n40088o97769N0353K37684L273j7194j94564
13372b834k10751R7993J83734L98952K26936k14510k15605k3679L50136K5485
13362F15857l92126k04858k88714j70658j0061O353K19306J13753J23728K0313
$$ plain form
13352 32893 40338 -237981 -362616 -139294 32864 131615 683894 1127469 1579127 1938591
13342 1938591 1755793 1768600 1844099 1600455 1183746 736685 784776 1126120 703567 49709
13332 49709 -114039 -113853 16173 418220 423228 365271 533456 628271 975570 1016092 819665
13321 819665 319906 -115219 23925 288766 512440 823656 1230892 1331001 1200728 1150903
13311 1150903 1682239 1978003 1978200 2003960 1471026 736311 815573 1064274 908795 712863
13301 712863 653511 707861 682744 814637 696491 343853 290592 502625 613796 463841
13291 463841 294458 593191 852419 762622 792869 772105 731456 412415 -172055 -174509 157419
13280 157419 505512 960983 1393042 1172542 781825 433897 -145154 -137671 48988 319597
$$ packed form
13352C2893P445k78319j24635K23322J72158R8751N52279M43575M51658L59464
13342A938591j82798J2807P5499k43644m16709m47061M8091L41344m22553o53858
13332D9709j63748J86J30026M02047N008n7957J68185R4815L47299M0522j96427
13321H19665m99759m35125J39144K64841K23674L11216M07236J00109j30273m9825
13311A150903N31336K95764J97K5760n32934p34715P9262K48701j55479j95932
13301G12863n9352N4350k5117J31893j18146l52638n3261K12033J11171j49955
13291D63841j69383K98733K59228q9797L0247k0764m0649l19041n84470k454L31928
13280A57419L48093M55471M32059k20500l90717l47928n79051P483J86659K70609
$$ plain form
13270 319597 447175 515879 816336 989915 555909 583030 933789 956377 965747 772184
13260 772184 725876 662072 133085 30088 365420 919733 1248252 876556 678690 572109
13250 572109 406843 410069 211984 128597 219289 394404 431088 358094 399613 514837 467836
13239 467836 236762 141268 64936 235519 413238 420802 223658 287748 524780 764639
13229 764639 627389 454693 322157 249051 569323 954623 1299763 1340692 1138480 916456
13219 916456 658626 821400 934431 487229 265895 259991 86478 -155611 -294034 218182
13209 218182 796058 1246950 1704668 1827833 1475509 1000268 618929 526432 569620 713068
13199 713068 891334 838030 914530 1118193 804905 519488 240173 189256 566401 929897
$$ packed form
13270C19597J27578O8704L00457J73579m34006K7121L50759K2588R370j93563
13260G72184m6308o3804n28987j02997L35332N54313L28519l71696j97866j06581
13250E72109j65266L226j98085q3387R0692J75115L6684p2994M1519J15224m7001
13239D67836k31074r5494p6332J70583J77719P564j97144O4090K37032K39859
13229G64639j37250j72696j32536p3106L20272L85300L45140M0929k02212k22024
13219I16456k57830J62774J13031m47202k21334n904j73513k42089j38423N12216
13209B18182N77876M50892M57718J23165l52324m75241l81339r2497M3188J43448
13199G13068J78266n3304P6500K03663l13288k85417k79315n0917L77145L63496
$$ plain form
13189 929897 1197474 1266306 1134144 1006978 730160 763612 865796 1002077 1155568 1240816
13179 1240816 1005262 744809 851347 625180 659170 1032751 1296162 1356373 1117188 918106
13169 918106 786537 598877 719634 932290 1040759 1138491 1154250 1221010 1429503 1474467
13159 1474467 1418272 1709945 1929028 1754660 1795864 1496462 1406598 1232422 690831 505054
13149 505054 637078 892498 1221847 1296850 1513044 1778989 1981119 1941938 1526331 1332835
13139 1332835 1429752 1341124 1360555 1000732 954535 1243251 1294662 1273667 1382319 1401468 876430
13128 876430 448833 657450 733539 521657 502220 359738 335529 719539 1262591 1216119
13118 1216119 929223 981195 1299072 1710808 1637461 1467192 1550706 1294076 1048118 1155175
$$ packed form
13189I29897K67577O8832j32162j27166k76818L3452J02184J36281J53491Q5248
13179A240816k35554k60453J06538k26167L3990L73581K63411O0211k39185j99082
13169I18106j31569j87660J20757K12656J08469R7732J5759O6760K08493M4964
13159A474467n6195K91673K19083j74368M1204k99402q9864j74176n41591j85777
13149E05054J32024K55420L29349P5003K16194K65945K02130l9181m15607j93496
13139A332835R6917q8628J9431l59823m6197K88716N1411k0995J08652J9149n25038
13128H76430m27597K08617P6089k11882j9437j42482k4209L84010N43052m6472
13118A216119k86896N1972L17877M11736p3347j70269Q3514k56630k45958J07057
$$ plain form
13108 1155175 1510494 1876903 1748265 1678240 1754194 1733240 1582597 1535202 1459055 1421175
13098 1421175 1341225 1613896 2132678 2219028 1868338 1536282 1845628 1967148 2112732 2064809
13088 2064809 1848728 2068546 2455922 2432587 1909634 1950943 2352785 2449316 2238705 1838698
13078 1838698 2004059 2279367 2657135 2955248 2959986 3145945 3413353 3274099 2880594 2480996
13068 2480996 2544025 2638337 2853934 2864764 2694192 2860204 3029110 3020457 2821414 2657019
13058 2657019 2545558 2323280 2178310 2366131 2814272 3213870 3184032 2703819 2239685 2460918
13048 2460918 2761206 2726762 2917082 3830693 4514875 4741505 5015316 5119232 4982203 4803822
13038 4803822 4668528 4796001 4565537 3928891 3441323 3616148 4089508 4588710 5159042
$$ packed form
13108A155175L55319L66409j28638p0025P5954k0954j50643m7395p6147l7880
13098A421175p9950K72671N18782Q6350l50690l32056L09346J21520J45584m7923
13088B064809k16081K19818L87376k3335n22953M1309M01842R6531k10611m00007
13078A838698J65361K75308L77768K98113M738J85959K67408j39254l93505l99598
13068B480996O3029R4312K15597J0830j70572J66012J68906q653j99043j64395
13058B657019j11461k22278j44970J87821M48141L99598k9838m80213m64134K21233
13048B460918L00288l4444J90320R13611O84182K26630K73811J03916j37029j78381
13038D803822j35294J27473k30464o36646m87568J74825M73360M99202N70332
$$ plain form
13029 5159042 5314878 5449461 5698889 6207125 6472325 6311532 6268002 6274743 6609590 7096203
13019 7096203 7338563 7439270 7550026 7954613 8700506 9370856 10025582 10233076 10173886 10106516
13009 10106516 10306357 10912873 11442002 11816693 12334236 13496302 15500527 17671043 19555136
13000 19555136 21488708 23791680 26725073 30625530 35503060 41524114 49364822 59376924
12992 59376924 72310994 89616068 113121389 144804599 187894033 246078234 320032252
12985 320032252 396134525 440456364 425842285 366144020 295757096 234270978 186206590
12978 186206590 150246646 123331197 103013888 87500690 75547745 65840429 57818985
12971 57818985 51130692 45305927 40566674 36323145 32082869 28248394 25387896 23429502
$$ packed form
13029E159042J55836J34583K49428N08236K65200j60793m3530O741L34847M86613
13019G096203K42360J00707J10756M04587P45893O70350O54726K07494n9190o7370
13009A0106516J99841O06516N29129L74691N17543J162066K004225K170516J884093
13000A9555136J933572K302972K933393L900457M877530O021054P840708J0012102
12992E9376924J2934070J7305074K3505321L1683210M3089434N8184201P3954018
12985C20032252P6102273M4321839j4614079n9698265p0386924o1486118m8064388
12978A86206590l5959944k6915449k0317309j5513198j1952945r707316q021444
12971E7818985o688293n824765m739253m243529m240276l834475k860498j958394
$$ plain form
12963 23429502 21836197 20307654 18765892 17305038 16310575 15616499 15213401 14700593 14377815
12954 14377815 13866107 13081478 12294747 11731741 11288794 11131674 10698738 10275737 10013885
12945 10013885 9569845 9354608 9013033 8883595 8721141 8584133 8676792 8532978 8352299
12936 8352299 8800823 9287899 9679384 10570173 11866448 12710911 13917667 15770155 17854108
12927 17854108 20480541 23213069 25625209 26661714 25883892 23908384 21687124 20207349
12919 20207349 19774995 19850231 19550041 19467043 20080946 21218162 23167134 25973512 29316245
12910 29316245 32765730 37270169 43007401 50401438 60055236 73329923 91577957 115745031
12902 115745031 148461626 193682962 255337989 333320504 412595195 455122311 433614108
$$ packed form
12963B3429502j593305j528543j541762j460854r94463o94076m03098n12808l22778
12954A4377815n11708p84629p86731n63006m42947j57120m32936m23001k61852
12945A0013885m44040k15237l41575j29438j62454j37008R2659j43814j80679
12936H352299M48524M87076L91485Q90789J296275Q44463J206756J852488K083953
12927A7854108K626433K732528K412140J036505p77822j975508k221260j479775
12919B0207349m32354P5236l00190q2998O13903J137216J948972K806378L342733
12910B9316245L449485M504439N737232P394037R653798J3274687J8248034K4167074
12902A15745031L2716595M5221336O1655027P7982515P9274691M2527116k1508203
$$ plain form
12895 433614108 367088880 292694933 229472025 181627989 146579882 120517296 100789591
12888 100789591 86096305 74901172 65691050 58126331 51680882 45832189 40760053 36251796
12880 36251796 32167363 28758880 26393871 24699913 22863936 20822134 19040079 17726059
12872 17726059 16522686 15258994 14317828 13880982 13067296 12574634 12388255 11586327 11078631
12863 11078631 10845852 10628138 10290812 9473351 8725996 8344665 8269155 8577713 8857985
12854 8857985 8676741 8383235 8062757 7803728 7883869 8076846 8201714 8640360 9192390 9439640
12844 9439640 9778147 10063192 10151718 10625307 10851851 10866141 11157152 11219900 11219885 11208149 11656686
12833 11656686 12499385 13240497 14109634 15519630 16945636 18168695 19652880 21827785
$$ packed form
12895D33614108o6525228p4393947o3222908m7844036l5048107k6062586j9727705
12888A00789591j4693286j1195133r210122p564719o445449n848693n072136m508257
12880C6251796m084433l408483k365009j693958j835977k041802j782055j314020
12872A7726059j203373j263692r41166m36846q13686m92662j86379q01928n07696
12863A1078631k32779k17714l37326q17461p47355l81331p5510L08558K80272
12854H857985j81244k93506l20478k59029Q0141J92977J24868M38646N52030K47250
12844I439640L38507K85045Q8526M73589K26544J4290K91011O2748j5j1736M48537
12833A1656686Q42699P41112Q69137J409996J426006J223059J484185K174905
$$ plain form
12825 21827785 24242329 27454368 31836911 36893791 42964854 51029770 61762302 75608899
12817 75608899 94128391 118971265 152648721 198555144 260385266 336531072 409177608
12810 409177608 442888965 416671564 351191245 280219321 220782441 175476773 141695812
12803 141695812 116547944 97877303 83514890 71830974 62425192 54996737 48631847
12796 48631847 42967384 38266234 33806329 29461122 25816706 23164818 21078657 19209371
12788 19209371 17878134 16827091 15671547 14280335 12597389 11253119 10356331 9345365
12780 9345365 8594718 7917327 7364502 6968280 6832207 7066015 6886477 6238113 5570369
12771 5570369 5020883 4823031 4983648 5138909 5128012 5179380 5468932 5588012 5188259 4192622
$$ packed form
12825B1827785K414544L212039M382543N056880O071063Q064916J0732532J3846597
12817G5608899J8519492K4842874L3677456M5906423O1830122P6145806P2646536
12810D09177608L3711357k6217401o5480319p0971924n9436880m5305668l3780961
12803A41695812k5147868j8670641j4362413j1683916r405782p428455o364890
12796D8631847n664463m701150m459905m345207l644416k651888k086161j869286
12788A9209371j331237j051043j155544j391212j682946j344270q96788j010966
12780I345365p50647o77391n52825l96222j36073K33808j79538o48364o67744
12771E570369n49486j97852J60617J55261j0897N1368K89552J19080l99753r95637
$$ plain form
12761 4192622 3426239 3397105 3831019 4110039 3980168 3834929 3618431 3245977 2738742 2594373
12751 2594373 2664574 2710884 2508473 2487155 2569973 2552528 2691485 2871097 2412723 1792761
12741 1792761 1652320 1393817 1308459 1923347 2600902 2750938 2366273 1484875 980339 1023604
12731 1023604 1542002 1794285 1345006 847458 558548 332831 446541 620884 694050 794657
12721 794657 856866 1177533 1497611 1654932 1458472 1055566 1001566 880860 679627 680962
12711 680962 643918 850368 971127 1174757 1505830 1684652 1667749 1328080 827995 467470
12701 467470 332437 834611 1450610 1706951 1874208 1694449 1430993 1049169 988374 1297512
12691 1297512 1679706 1800683 1721630 1314713 1130271 1189948 1066802 602375 496055 397252
$$ packed form
12761D192622p66383k9134M33914K79020j29871j45239k16498l72454n07235j44369
12751B594373P0201M6310k02411k1318Q2818j7445J38957J79612m58374o19962
12741A792761j40441k58503q5358O14888O77555J50036l84665q81398n04536M3265
12731A023604N18398K52283m49279m97548k88910k25717J13710J74343P3166J00607
12721G94657O2209L20667L20078J57321j96460m02906n4000j20706k01233J335
12711F80962l7044K06450J20759K03630L31073J78822j6903l39669n00085l60525
12701D67470j35033N02174O15999K56341J67257j79759k63456l81824o0795L09138
12691A297512L82194J20977p9053m06917j84442N9677j23146m64427j06320r8803
$$ plain form
12681 397252 161763 264252 545394 621169 531635 195273 -227242 -61696 340130 206027
12671 206027 -241740 -167138 233864 662514 863875 1098339 1214766 961007 633881 612667
12661 612667 508175 231351 350646 711852 1211027 1400708 1282352 1007736 1030811 698642
12651 698642 448859 587976 559308 752288 690203 344783 282568 90951 -4419 33633
12641 33633 -322562 -401744 -141304 -78554 84892 358827 709456 477230 94217 218248
12631 218248 644972 679857 813008 1142245 1078899 894270 878048 953995 969267 962912 1196938
12620 1196938 899893 250567 -52878 -43461 -18494 111992 478588 745418 530767 87424
12610 87424 317688 492487 502401 702787 733893 213712 -346874 -478623 -522167 -277834
$$ packed form
12681C97252k35489J02489K81142P5775q9534l36362m22515J65546M01826j34103
12671B06027m47767P4602M01002M28650K01361K34464J16427k53759l27126k1214
12661F12667j04492k76824J19295L61206M99175J89681j18356k74616K3075l32169
12651F98642k49783J39117k8668J92980o2085l45420o2215j91617r5370L8052
12641C3633l56195p9182K60440O2750J63446K73935L50629k32226l83013J24031
12631B18248M26724L4885J33151L29237o3346j84629j6222P5947J5272o355K34026
12620A196938k97045o49326l03445R417K4967J30486L66596K66830k14651m43343
12610H7424K30264J74799R914K00386L1106n20181n60586j31749m3544K44333
$$ plain form
12600 -277834 173834 196461 50113 -27718 29922 244167 520006 644382 120670 -276366
12590 -276366 -308457 -198659 -10900 438665 591188 373936 541092 539758 485719 454051
12580 454051 174021 24832 79479 316566 300408 -25820 -206433 -128475 427422 849027
12570 849027 771086 533551 480279 453674 573959 337264 228558 481665 439927 339009
12560 339009 206971 -266794 -594045 -333734 42432 -111953 -79070 432461 518023 292690
12550 292690 225591 -158172 -506203 -591737 -368305 -173072 223895 579971 528865 271705
12540 271705 101206 3453 206386 449314 977471 1264724 1122927 877823 656615 516740
12530 516740 690493 945977 810840 626364 912764 1308098 1140753 792016 10575 -605343
$$ packed form
12600b77834M51668K2627j46348p7831N7640K14245K75839J24376n23712l97036
12590b76366l2091J09798J87759M49565J52523k17252J67156j334n4039l1668
12580D54051k80030j49189N4647K37087j6158l26228j80613P7958N55897M21605
12570H49027p7941k37535n3272k6605J20285k36695j08706K53107m1738j00918
12560C39009j32038m73765l27251K60311L76166j54385L2883N11531Q5562k25333
12550B92690o7099l83763l48031q5534K23432J95233L96967L56076n1106k57160
12540B71705j70499r7753K02933K42928N28157K87253j41797k45104k21208j39875
12530E16740J73753K55484j35137j84476K86400L95334j67345l48737p81441o15918
$$ plain form
12520 -605343 -614569 -255793 284573 723269 919518 1071085 935500 686190 270594 214073
12510 214073 434653 339580 238364 -43478 -116294 -177395 -177944 -480865 -392696 -10733 303703
12499 303703 637701 494822 508154 548799 384410 330393 415331 453760 501995 449381 225009
12488 225009 281715 113549 -462670 -943639 -588277 119791 377947 523965 459596 784761
12478 784761 1251285 1168032 894511 781760 597555 296560 131717 544343 750812 526889
12468 526889 559527 543094 178216 11585 86496 23735 -281573 -336642 -270947 -291885 -392106
12457 -392106 -339957 -277990 -270974 -251225 -305581 -327542 505 558448 404334 -208910 -402745
12446 -402745 -395319 -175379 377151 713920 1076195 1912826 1864323 979409 322545 4887
$$ packed form
12520f05343r226L58776N40366M38696J96249J51567j35585k49310m15596n6521
12510B14073K20580r5073j01216k81842p2816o1101n49l02921Q8169L81963L14436
12499C03703L33998j42879J3332M0645j64389n4017Q4938L8429M8235n2614k24372
12488B25009N6706j68166n76219m80969L55362P08068K58156J46018o4369L25165
12478G84761M66524q3253k73521j12751j84205l00995j64843M12626K06469k23923
12468E26889L2638j6433l64878j66631P4911o2761l05308n5069O5695k0938j00221
12457c92106N2149O1967P016J9749n4356k1961L28047N57943j54114o13244j93835
12446d02745P426K19940N52530L36769L62275Q36631m8503q84914o56864l17658
$$ plain form
12436 4887 -121511 29383 -54111 -19395 327510 502438 616135 426640 -20507 -923026
12426 -923026 -1460669 -1275181 -494239 -184693 -503389 -839810 -1205613 -1366799 -1310626 -1348303
12416 -1348303 -1402570 -1558512 -1587207 -1318248 -877992 -136293 154461 -173935 -154411 -388058
12406 -388058 -941490 -969319 -748784 -841522 -835246 -530311 -102253 79260 379695 945265
12396 945265 1144253 919143 937963 427699 -284530 -183185 73981 81146 85888 -75919
12386 -75919 24186 422598 860136 941918 821441 684731 507798 451650 -10043 -604271
12376 -604271 -626717 -427757 192729 901819 1137063 542397 153416 176052 156220 362837
12366 362837 565571 595513 334754 -141936 -250265 -75287 -101211 -110040 -176224 -224280 -274275
$$ packed form
12436D887j26398J50894q3494L4716L46905J74928J13697j89495m47147r02519
12426i23026n37643J85488P80942L09546l18696l36421l65803j61186N6173l7677
12416a348303n4267j55942k8695K68959M40256P41699K90754l28396J9524k33647
12406c88058n53432k7829K20535r2738O276L04935M28058J81513L00435N65570
12396I45265J98988k25110J8820n10264p12229J01345K57166P165M742j61807
12386g5919J00105L98412M37538Q1782j20477j36710j76933n6148m61693n94228
12376f04271k2446J98960O20486P09090K35244n94666l88981K2636j9832K06617
12366C62837K02734K9942k60759m76690j08329J74978k5924q829o6184m8056m9995
$$ plain form
12355 -274275 -451102 -529858 -230128 -73639 -14731 44952 37698 134337 254507 491852 722249
12344 722249 687110 251976 -342958 -677704 -741950 -778985 -804073 -626423 -413475 -436834
12334 -436834 -806067 -963344 -825436 -235142 16183 -238061 -391372 -112320 168774 -44970
12324 -44970 -278456 -420863 -402626 -354245 -680006 -609722 -11843 609759 955616 510543
12314 510543 -207349 -315583 -192936 -324425 -197348 227833 313484 270042 516666 706822
12304 706822 513869 392862 81188 -249395 -453152 -580225 -753948 -871548 -450943 65618
12294 65618 -273486 -477283 -290805 -218140 -306016 -569346 -706331 -611510 -993940 -1340881
12284 -1340881 -1541531 -1795638 -1367021 -737039 -877052 -1082382 -766468 -713470 -665353 -245511
$$ packed form
12355b74275j76827p8756K99730J56489N8908N9683p254R6639J20170K37345K30397
12344G22249l5139m35134n94934l34746o4246l7035k5088J77650K12948k3359
12334d36834l69233j57277J37908N90294K51325k54244j53311K79052K81094k13744
12324d4970k33486j42407J8237M8381l25761P0284N97879O21602L45857m45073
12314E10543p17892j08234J22647j31489J27077M25181Q5651m3442K46624J90156
12304G06822j92953j21007l11674l30583k03757j27073j73723j17600M20605N16561
12294F5618l39104k03797J86478P2665q7876k63330j36985R4821l82430l46941
12284a340881k00650k54107M28617O29982j40013k05330L15914N2998M8117M19842
$$ plain form
12274 -245511 16223 451813 684982 523630 315187 -159637 -1100599 -1189660 -938787 -1138275
12264 -1138275 -1014556 -798621 -1011015 -1084703 -664707 -1722 177165 78896 -77707 -150503
12254 -150503 -28313 464567 884086 713581 338598 289524 149256 -337616 -261270 -40073
12244 -40073 306816 635744 443165 533691 618553 151781 -514173 -406862 235428 552467
12234 552467 517103 507179 330354 -192484 -667100 -764482 -407863 -374981 -513530 -668999
12224 -668999 -993052 -1016583 -621064 -171921 274161 257962 211366 131164 -173974 -416384
12214 -416384 -442341 -203367 -46976 -215181 -450784 -321103 3419 592082 473999 -6259
12204 -6259 43357 278876 178906 -275589 -159375 305824 450984 104277 -96501 222836
$$ packed form
12274b45511K61734M35590K33169j61352k08443m74824r40962q9061K50873j99488
12264a138275J23719K15935k12394p3688M19996O62985J78887r8269j56603p2796
12254a50503J22190M92880M19519j70505l74983m9074j40268m86872P6346K21197
12244d0073L46889L28928j92579R0526Q4862m66772o65954J07311O42290L17039
12234E52467l5364r924j76825n22838m74616r7382L56619L2882j38549j55469
12224f68999l24053k3531L95519M49143M46082j6199m6596q0202l05138k42410
12214d16384k5957K38974J56391j68205k35603J29681L24522N88663j18083m80258
12204f259M9616K35519r9970m54495J16214M65199J45160l46707k00778L19337
$$ plain form
12194 222836 581543 572372 386861 379276 296844 89487 171171 460245 707345 693752 579595
12183 579595 668913 631597 605758 746298 710452 423049 21852 -210795 -412962 -349302
12173 -349302 -157564 13381 232940 208051 -74637 91680 -191791 -972068 -1235843 -1389386
12163 -1389386 -1408436 -758442 -195310 -135325 -14571 662798 998244 744569 445020 48815
12153 48815 -298761 -233248 -457807 -576500 -169722 170165 187541 323699 406671 503644
12143 503644 227605 149700 40526 -154676 -77754 -34526 27688 368329 619288 579410
12133 579410 633760 553803 390752 290183 35996 41212 83979 257956 131505 -124797
12123 -124797 -76005 -113991 -143530 -409617 -881008 -882682 -597239 -304777 140240 287654
$$ packed form
12194B22836L58707r171j85511p585q2432k07357Q1684K89074K47100j3593j14157
12183E79595Q9318l7316k5839J40540l5846k87403m01197k32647k02167O3660
12173c49302J91738J70945K19559k4889k82688J66317k83471p80277k63775j53543
12163a389386j9050O49994N63132N9985J20754O77369L35446k53675k99549l96205
12153D8815l47576O5513k24559j18693M06778L39887J7376J36158Q2972R6973
12143E03644k76039p7905j09174j95202P6922M3228O2214L40641K50959l9878
12133E79410N4350p9957j63051j00569k54187N216M2767J73977j26451k56302
12123a24797M8792l7986k9539k66087m71391j674K85443K92462M45017J47414
$$ plain form
12113 287654 27440 -533689 -833004 -837761 -743399 -575665 -316507 -54641 33879 -163814
12103 -163814 -32274 122495 204183 -93509 -244917 -142290 -301529 -430579 -324480 -541683
12093 -541683 -450333 -154524 258612 655857 699831 334115 81102 324567 620875 927530
12083 927530 823546 798516 489721 -75059 -477302 -363869 -162982 15245 131294 -417764
12073 -417764 -822378 -776387 -676033 -886206 -1165882 -1107955 -960454 -731589 -458407 -539707
12063 -539707 -1036781 -1116362 -899966 -760092 -302674 31734 -131236 -290485 -538722 -1097204
12053 -1097204 -1135331 -852379 -461469 -404914 -455039 -678026 -591865 -190102 -514344 -783951
12043 -783951 -340079 183700 421200 482666 317998 -108281 -385932 -661652 -747058 -488084
$$ packed form
12113B87654k60214n61129k99315m757R4362J67734K59158K61866Q8520j97693
12103a63814J31540J54769Q1688k97692j51408J02627j59239j29050J06099k17203
12093e41683R1350K95809M13136L97245M3974l65716k53013K43465K96308L06655
12083I27530j03984k5030l08795n64780m02243J13433K00887J78227J16049n49058
12073d17764m04614M5991J00354k10173k79676N7927J47501K28865K73182q1300
12063e39707m97074p9581K16396J39874M57418L34408j62970j59249k48237n58482
12053a097204l8127K82952L90910N6555n0125k22987Q6161M01763l24242k69607
12043g83951M43872N23779K37500O1466j64668m26279k77651k75720q5406K58974
$$ plain form
12033 -488084 -498484 -884556 -1107384 -1263591 -1417556 -1056003 -638454 -286485 -331706 -741833
12023 -741833 -587053 -432406 -543851 -616663 13711 455088 188206 -88967 330 285113
12013 285113 262455 -77745 -297544 -542877 -837923 -571555 132517 539012 590876 426107
12003 426107 239673 400224 403330 194408 248189 441102 473533 280774 -108187 -335498
11993 -335498 -136228 151846 396590 394980 -40840 -381446 -352426 -154943 -39440 514155
11983 514155 974004 1007960 733882 691999 402756 -245785 -416355 -363947 -391004 -231302
11973 -231302 88371 53909 -571523 -1012942 -1156599 -1348912 -1297410 -879501 -917513 -1257541
11963 -1257541 -1210131 -757996 -391038 -436944 -1087689 -1259152 -938121 -545993 -236190 -343699
$$ packed form
12033d88084j0400l86072k22828j56207j53965L61553M17549L51969m5221m10127
12023g41833J54780J54647j11445p2812O30374M41377k66882k77173Q9297K84783
12013B85113k2658l40200k19799k45333k95046K66368P04072M06495N1864j64769
12003D26107j86434J60551L106k08922N3781J92913L2431j92759l88961k27311
11993c35498J99270K88074K44744j610m35820l40606K9020J97483J15503N53595
11983E14155M59849L3956k74078m1883k89243o48541j70570N2408k7057J59702
11973b31302L19673l4462o25432m41419j43657j92313N1502M17909l8012l40028
11963a257541M7410M52135L66958m5906o50745j71463L21031L92128L09803j07509
$$ plain form
11953 -343699 -716945 -742294 -479364 -493977 -388400 -56761 301214 522306 584083 939550
11943 939550 1308892 1499516 1315527 933879 932783 420050 45291 304885 -44235 -697257
11933 -697257 -696901 -278579 -227876 -360743 -336708 -227333 -213556 -346332 -232262 -200996 -378459
11922 -378459 -33290 277088 -10225 -208278 -274396 -257279 -233498 -353166 -394587 -385476 -168467
11911 -168467 51244 75638 177147 69541 42051 172510 741310 796629 433661 222264
11901 222264 -360926 -659981 -334897 503810 1122731 1259371 1348455 1567387 1397589 1215916
11891 1215916 830006 678297 1032333 1125205 860310 590793 222548 46457 143904 -31814
11881 -31814 -559709 -539480 -220674 13609 174754 443975 325290 -192787 -388173 -411381
$$ packed form
11953c43699l73246k5349K62930j4613J05577L31639L57975K21092O1777L55467
11943I39550L69342J90624j83989l81648j096n12733l74759K59594l49120o53022
11933f97257L56M18322N0703j32867K4035J09375J3777j32776J14070L1266j77463
11922c78459L45169L10378k87313j98053o6118J7117K3781j19668m1421R111K17009
11911a68467K19711K4394J01509j07606k7490J30459N68800N5319l62968k11397
11901B22264n83190k99055L25084Q38707O18921J36640Q9084K18932j69798j81673
11891A215916l85910j51709L54036R2872k64895k69517l68245j76091R7447j75718
11881c1814n27895K0229L18806K34283J61145K69221j18685n18077j95386k3208
$$ plain form
11871 -411381 -195531 -20458 13597 90773 46108 -6315 93520 332267 662918 680461 293876
11860 293876 -152127 193762 410527 570655 966224 1160771 1379704 1428282 1283656 1237019
11850 1237019 1716834 2192496 2130003 1772961 1373709 1178215 1602815 2874662 4089529
11841 4089529 5416248 7086689 9320481 12535263 15515570 17041537 16733310 15213704
11833 15213704 13325159 11039503 8344497 6412581 5298932 4336147 3862159 3236403
11825 3236403 2696733 2189459 1468714 900188 800462 1053573 1304043 1505172 1790615 1899219
11815 1899219 1542139 1037775 529654 143666 -84564 -260155 -492784 -721909 -794472 -488471
11805 -488471 -40524 112397 -95361 -267376 85147 290372 174023 -227449 -380555 -91199
$$ packed form
11871d11381K15850J75073L4055P7176m4665n2423R9835K38747L30651J7543l86585
11860B93876m46003L45889K16765J60128L95569J94547K18933M8578j44626m6637
11850A237019M79815M75662o2493l57042l99252j95494M24600J271847J214867
11841D089529J326719J670441K233792L214782K980307J525967l08227j519606
11833A5213704j888545k285656k695006j931916j113649r62785m73988o25756
11825C236403n39670n07274p20745n68526r9726K53111K50470K01129K85443J08604
11815A899219l57080n04364n08121l85988k28230j75591k32629k29125p2563L06001
11805d88471M47947J52921k07758j72015L52523K05225j16349m01472j53106K89356
$$ plain form
11795 -91199 315769 577810 573334 393286 -245668 -733457 -992832 -1049897 -1059056 -1017393 -865432
11784 -865432 -717145 -809001 -709851 -706282 -949163 -936308 -211507 404054 327544 252321 85172
11773 85172 33171 240097 384231 332625 454902 579510 461936 361783 566773 661163
11763 661163 659850 836665 699158 394294 446067 635997 892025 834739 347329 127639
11753 127639 732806 844631 470358 346608 475428 549088 554455 754547 872189 566663
11743 566663 55315 -275494 -150778 -59178 -172769 -304136 49273 195031 177290 -34993
11733 -34993 -447781 -676899 -433857 -53217 -15207 -130276 -105824 -71588 -103323 -196106 -31308
11722 -31308 570821 810096 517858 221990 7011 -15804 12898 -146242 -18030 -188157
$$ packed form
11795i1199M06968K62041m476j80048o38954m87789k59375n7065r159M1663J51961
11784h65432J48287r1856R9150L569k42881J2855P24801O15561p6510p5223j67149
11773H5172n2001K06926J44134n1606J22277J24608j17574j00153K04990R4390
11763F61163j313J76815j37507l04864N1773J89930K56028n7286m87410k19690
11753A27639O05167J11825l74273j23750J28820P3660N367K00092J17642l05526
11743E66663n11348l30809J24716R1600j13591j31367L53409J45758j7741k12283
11733c4993m12788k29118K43042L80640L8010j15069K4452L4236l1735r2783J64798
11722c1308O02129K39275k92238k95868k14979k2815K8702j59140J28212j70127
$$ plain form
11712 -188157 -485970 -620059 -865278 -841764 -579335 -169033 -62018 116038 143074 -59724
11702 -59724 -401892 -408110 -328552 -186417 82487 203653 -8078 -32691 359250 301670 209890
11691 209890 418158 759194 1004377 976822 795489 563562 842351 1348268 1285276 475995
11681 475995 44596 37017 278755 675028 662767 418598 156561 226527 499316 881374
11671 881374 957666 1171169 1118153 1178255 1020269 484510 -84728 -256947 -82022 37911
11661 37911 88973 18737 26060 -45358 -241991 -473927 -865806 -530381 143379 685946 1279336
11650 1279336 1328944 1434407 2271920 3725333 5275784 6272412 5664501 4434642 3620515
11641 3620515 2529284 1359760 740765 666541 836399 836413 706428 390260 -143713 -416446
$$ packed form
11712a88157k97813j34089k45219K3514K62429M10302J07015J78056K7036k02798
11702e9724l42168o218P9558J42135K68904J21166k11731k4613L91941n7580r1780
11691B09890K08268L41036K45183k7555j81333k31927K78789N05917o2992q09281
11681D75995m31399p579K41738L96273j2261k44169k62037O9966K72789L82058
11671H81374P6292K13503n3016O0102j57986n35759n69238j72219J74925J19933
11661C7911N1062p0236P323p1418j96633k31936l91879L35425O73760N42567N93390
11650A279336M9608J05463Q37513J453413J550451R96628o07911j229859q14127
11641C620515j091231j169524o18995p4224J69858J4j29985l16168n33973k72733
$$ plain form
11631 -416446 -538373 -577738 -416976 68379 876133 1256257 1106821 1365333 1350311 1187009
11621 1187009 1264663 1093417 847750 656079 350207 404474 665566 779180 1169258 1576792
11611 1576792 1823666 2011457 2119107 2150301 2082561 2130640 2338896 3037923 4035468 5010595
11601 5010595 5953226 6582072 7037919 7904078 8829373 9440469 9494994 9180549 9268438 9713149
11591 9713149 9999475 10270188 10251221 9932713 9298159 8790595 8704637 8772222 8593227 8325540
11581 8325540 8563145 8628045 8411923 8412279 8371601 8479335 8829475 9003399 9215741 9434689
11571 9434689 9917216 10752049 11912239 14145963 17240358 21005718 25886248 32860925
11563 32860925 42928175 55571044 69855432 78861847 78246886 70932110 59205029 47484229
$$ packed form
11631d16446j21927l9365J60762M85355Q07754L80124j49436K58512j5022j63302
11621A187009P7654j71246k45667j91671l05872N4267K61092J13614L90078M07534
11611A576792K46874J87791J07650L1194o7740M8079K08256O99027R97545R75127
11601E010595R42631O28846M55847Q66159R25295O11096N4525l14445Q7889M44711
11591I713149K86326K70713j8967l18508o34554n07564q5958O7585j78995k67687
11581H325540K37605O4900k16122L56m0678J07734L50140J73924K12342K18948
11571I434689M82527Q34833J160190K233724L094395L765360M880530O974677
11563C2860925J0067250J2642869J4284388R006415o14961p314776j1727081j1720800
$$ plain form
11555 47484229 38953837 33288106 29737431 27769751 27472727 28499219 30553254 34125128
11547 34125128 39728566 48005938 60136448 76201441 92147913 98696105 93307745 86089560
11539 86089560 83296183 82366786 76188323 63341633 49697414 39275537 31790880 26125854
11531 26125854 21674710 18199292 16134699 14654006 12871134 10960535 9604832 8532382
11523 8532382 7777991 7707426 7367914 6370575 5400158 4906773 4072070 3494593 3315068 3683076
11513 3683076 3662594 3386880 2951686 2082705 1710212 1932810 2196989 2260834 2300878 1861700
11503 1861700 1138935 830673 1008582 1359551 1619389 1627369 1298317 1118722 1483158 1763876
11493 1763876 1391852 1371705 1610247 1646995 1680398 1699785 1855572 1832744 1491128 1796472
$$ packed form
11555D7484229q530392n665731l550675j967680k97024J026492K054035L571874
11547C4125128N603438Q277372J2130510J6064993J5946472O548192n388360p218185
11539H6089560k793377r29397o178463j2846690j3644219j0421877p484657n665026
11531B6125854m451144l475418k064593j480693j782872j910599j355703j072450
11523H532382p54391p0565l39512r97339r70417m93385q34703n77477j79525L68008
11513C683076k0482k75714m35194q68981l72493K22598K64179O3845M0044m39178
11503A861700p22765l08262J77909L50969K59838P980l29052j79595L64436K80718
11493A763876l72024k0147K38542L6748L3403J9387J55787k2828l41616L05344
$$ plain form
11483 1796472 1928637 1332028 644574 551126 911142 1416518 2226306 2854643 2789575 2454942
11473 2454942 1921521 1332066 632601 252800 430893 845997 1213658 936484 913124 625639
11463 625639 185096 277977 701681 887272 721182 435286 126594 -100881 -193481 106798
11453 106798 564866 715605 834505 875705 794027 554377 352776 261558 812396 1411172
11443 1411172 1779692 2055210 1769866 1237758 959509 793336 617582 172423 -96974
11434 -96974 -27598 2984 -335320 -997781 -1352836 -1140419 -564188 -7519 231666 565700
11424 565700 777731 756619 333616 -263220 -697812 -667505 -380468 -287085 -39793 389827
11414 389827 598858 135448 -294677 -583322 -718155 -433254 135633 729563 980042 918287
$$ packed form
11483A796472J32165n96609o87454r3448L60016N05376Q09788O28337o5068l34633
11473B454942n33421n89455o99465l79801J78093M15104L67661k77174k3360k87485
11463F25639m40543R2881M23704J85591j66090k85896l08692k27475r2600L00279
11453A06798M58068J50739J18900M1200q1678k39650k01601r1218N50838N98776
11443A411172L68520K75518k85344n32108k78249j66173j75754m45159k69397
11434i6974O9376L0582l38304o62461l55055K12417N76231N56669K39185L34034
11424E65700K12031k1112m23003n96836m34592L0307K87037R3383K47292M29620
11414C89827K09031m63410m30125k88645j34833K84901N68887N93930K50479o1755
$$ plain form
11404 918287 798176 656823 348484 -6823 -211919 -380966 -680404 -669877 -465513 -546447
11394 -546447 -593981 -152433 273739 725517 1672136 1929127 1185771 880106 829200 785973
11384 785973 733865 485801 139102 70705 161330 -222332 -603711 -686782 -831295 -542738
11374 -542738 -323688 -61256 439209 510339 521124 461509 303544 -110566 -633233 -1199285
11364 -1199285 -1551129 -1240311 -740870 -447279 -308918 -335405 -685193 -1259064 -1254375 -813181
11354 -813181 -633309 -541829 -482832 -508992 -443975 -149312 -427011 -618594 236887 652299
11344 652299 694152 868731 757489 446599 117658 -260718 -405777 -384824 -250688 520975
11334 520975 1307716 1675145 1275958 242122 -43224 131731 369741 571053 619234 877934
$$ packed form
11404I18287j20111j41353l08339l55307k05096j69047k99438J0527K04364q0934
11394e46447m7534M41548M26172M51778R46619K56991p43356l05665n0906m3227
11384G85973n2108k48064l46699o8397R0625l83662l81379q3071j44513K88557
11374e42738K19050K62432N00465P1130J0785n9615j57965m14110n22667n66052
11364a199285l51844L10818M99441K93591J38361k6487l49788n73871M689M41194
11354h13181J79872R1480N8997k6160O5017K94663k77699j91583Q55481M15412
11344F52299M1853J74579j11242l10890l28941l78376j45059K0953J34136P71663
11334E20975P86741L67429l99187j033836k85346J74955K38010K01312M8181K58700
$$ plain form
11324 877934 987924 616943 273819 65653 -76189 -139335 -77022 -39449 -397933 -497328
11314 -497328 -122083 562119 796000 333622 263912 354966 -255797 -181626 578002 746878
11304 746878 548740 169001 -239977 -512808 -703780 -783939 -725152 -557508 -603320 -774941
11294 -774941 -832840 -197538 432342 734256 799496 825470 885850 623557 380004 11526
11284 11526 -309277 -330287 -465675 -556740 -908251 -1002833 -804490 -756919 -489851 -156076
11274 -156076 -532438 -890459 -755353 -422035 -221843 116145 510953 764598 558278 247187
11264 247187 139334 35993 192899 505610 626384 439773 256769 223092 -173029 -436380
11254 -436380 -382787 -191158 -94860 -425538 -400078 -261183 -595817 -396690 -284225 -212648
$$ packed form
11324H77934J09990l70981l43124k08166j41842o3146O2313L7573l58484r9395
11314d97328L75245O84202K33881m62378o9710R1054o10763P4171P59628J68876
11304G46878j98138l79739m08978k72831j90972q0159N8787J67644m5812j71621
11294g74941n7899O35302O29880L01914O5240K5974O0380k62293k43553l68478
11284A1526l20803k1010j35388r1065l51511r4582J98343M7571K67068L33775
11274a56076l76362l58021J35106L33318K00192L37988L94808K53645k06320l11091
11264B47187j07853j03341J56906L12711J20774j86611j83004l3677l96121k63351
11254d36380N3593J91629R6298l30678K5460J38895l34634J99127J12465P1577
$$ plain form
11244 -212648 -82080 134214 641424 480827 13652 -403957 -515774 -268945 619730 1344178
11234 1344178 1765436 1699115 1463804 1637841 1926868 2101906 2108795 2186996 1891656 1757480
11224 1757480 1735049 1504506 1610090 1457371 1209446 886955 412706 69943 20491 123811
11214 123811 353123 170084 -70944 -89015 -52786 -79482 -87576 11376 -223964 -210063 151966
11203 151966 182566 208612 175988 -76246 -254204 -197100 28202 277853 393374 552289
11193 552289 389709 296412 482566 794078 938675 1038052 970642 624747 216924 -164246
11183 -164246 -183068 234340 372203 410568 395063 243413 363964 389565 464720 472930 383326
11172 383326 470725 488111 249684 139373 116703 -99294 -375638 -452495 -300390 -233379
$$ packed form
11244b12648J30568K16294N07210j60597m67175m17609j11817K46829Q88675P24448
11234A344178M21258o6321k35311J74037K89027J75038O889P8201k95340j34176
11224A757480k2431k30543J05584j52719k47925l22491m74249l42763m9452J03320
11214A23811K29312j83039k41028j8071L6229k6696q094R8952k35340J3901L62029
11203A51966L0600K6046l2624k52234j77958N7104K25302K49651J15521J58915
11193E52289j62580r3297J86154L11512J44597R9377o7410l45895m07823l81170
11183a64246j8822M17408J37863L8365j5505j51650J20551K5601P5155Q210q9604
11172C83326Q7399J7386k38427j10311k2670k15997k76344p6857J52105O7011
$$ plain form
11162 -233379 -294125 -247735 68842 242025 116738 413800 517787 351009 105717 -99140
11152 -99140 287631 630027 745351 482422 311129 67661 55179 348680 448343 579677
11142 579677 823545 898130 999989 1164878 825967 396325 243488 310026 321560 400738
11132 400738 200323 -115420 -674243 -763960 -201381 -99785 -228519 -235810 8837 -125425
11122 -125425 -208322 116058 472742 645449 743082 689097 702788 520589 242360 247885 -84800
11111 -84800 -73708 145061 -29906 -377767 -729393 -578572 -312757 -399298 57777 373743
11101 373743 183749 -57832 -340964 -685082 -944592 -1245522 -1310561 -1155788 -995702 -571431
11091 -571431 -125494 80668 432834 639475 421754 207914 197274 -26975 137287 770505
$$ packed form
11162b33379o0746M6390L16577J73183j25287K97062J03987j66778k45292k04857
11152i9140L86771L42396J15324k62929j71293k43468j2482K93501R9663J31334
11142E79677K43868P4585J01859J64889l38911m29642j52837O6538J1534P9178
11132D00738k00415l15743n58823q9717N62579J01596j28734p291K44647j34262
11122a25425q2897L24380L56684J72707R7633n3985J3691j82199k78229N525l32685
11111h4800J1092K18769j74967l47861l51626J50821K65815q6541M57075L15966
11101C73743j89994k41581k83132l44118k59510l00930o5039J54773J60086M24271
11091e71431M45937K06162L52166K06641k17721k13840j0640k24249J64262O33218
$$ plain form
11081 770505 1295087 1524049 944939 272788 118116 -33024 90977 353525 443526 191673
11071 191673 -100891 -40213 -135551 -260347 -101642 -86009 -471278 -766407 -588724 -282822
11061 -282822 -413599 -827663 -1114277 -902889 -447578 125665 648114 898583 855265 434644
11051 434644 -31560 -149520 -199063 -197210 -383782 -569787 -601233 -641892 -632823 -582222 -466957
11040 -466957 -462907 -683324 -370058 499073 901978 677497 754150 763865 524426 -63425
11030 -63425 -756377 -831376 -661268 -430458 -5167 559116 1194207 1459796 1481143 1562894
11020 1562894 1182646 667656 485803 275246 19627 107886 372129 395012 544112 476403
11010 476403 451977 380336 -175341 -215302 288492 314655 68623 -381381 -689790 -635265
$$ packed form
11081G70505N24582K28962n79110o72151j54672j51140J24001K62548R0001k51853
11071A91673k92564O0678r5338j24796J58705J5633l85269k95129J77683L05902
11061b82822j30777m14064k86614K11388M55311N73243N22449K50469m3318m20621
11051D34644m66204j17960m9543J853j86572j86005l1446m0659R069N0601J15265
11040d66957M050k20417L13266Q69131M02905k24481P6653R715k39439n87851
11030f3425o92952p4999J70108K30810M25291N64283O35091K65589K1347Q1751
11020A562894l80248n14990j81853k10557k55619Q8259K64243K2883J49100o7709
11010D76403k4426p1641n55677l9961N03794K6163k46032m50004l08409N4525
$$ plain form
11000 -635265 -443977 -23326 247690 491948 700999 757258 549385 499910 695475 777457
10990 777457 786986 624938 815758 947396 639141 384877 268518 672744 1268374 1062912
10980 1062912 441008 -86411 -370167 -217062 53336 -399825 -748321 -996732 -1012850 -1043274
10970 -1043274 -779112 -487085 -262879 81589 99204 -48094 -223613 -462099 -892274 -1155564
10960 -1155564 -921619 -617254 -565434 -529623 -525646 -454993 -190294 -376275 -1027247 -1265678
10950 -1265678 -775569 -14266 340453 45801 -55355 498388 1267026 1398916 1293690
10941 1293690 1509637 1440184 1177207 939223 692808 373651 160676 -129653 -82802 225779
10931 225779 200110 234329 449994 468914 362694 258698 48447 -324879 -451733 -443486
$$ packed form
11000f35265J91288M20651K71016K44258K09051N6259k07873m9475J95565Q1982
10990G77457R529j62048J90820J31638l08255k54264j16359M04226N95630k05462
10980A062912o21904n27419k83756J53105K70398m53161l48496k48411j6118l0424
10970a043274K64162K92027K24206L44468J7615j47298j75519k38486m30175k63290
10960a155564K33945L04365N1820L5811L977P0653K64699j85981o50972k38431
10950a265678M90109P61303L54719k94652j01156N53743P68638J31890j05226
10941A293690K15947o9453k62977k37984k46415l19157k12975k90329M6851L08581
10931B25779k5669L4219K15665J8920j06220j03996k10251l73326j26854Q247
$$ plain form
10921 -443486 -220994 201925 432257 345491 342434 345367 563290 777834 780823 612597 672087
10910 672087 517627 325940 155236 35246 234371 397406 397336 179330 -214193 -613951
10900 -613951 -778580 -559122 -410180 -504536 -491377 -301875 -169485 354726 458793 279166
10890 279166 274932 155715 256152 489741 739876 838984 557395 389723 171908 -81824
10880 -81824 -314695 -486689 -390005 94016 490734 247023 -367592 -731664 -358635 37182
10870 37182 151439 38908 -199269 232938 570649 406282 69101 -1802 15595 120742
10860 120742 294970 59576 40938 350630 476824 397137 333362 695971 830790 383660
10850 383660 327035 402657 181225 209185 711144 875501 560420 355631 478595 818320
$$ packed form
10921d43486K22492M22919K30332q6766l057K933K17923K14544K989j68226N9490
10910F72087j54460j91687j70704j19990J99125J63035p0k18006l93523l99758
10900f13951j64629K19458J48942r4356J3159J89502J32390N24211J04067j79627
10890B79166m234j19217J00437K33589K50135R9108k81589j67672k17815k53732
10880h1824k32871j71994R6684M84021L96718k43711o14615l64072L73029L95817
10870C7182J14257j12531k38177M32207L37711j64367l37181p0903J7397J05147
10860A20742J74228k35394j8638L09692J26194p9687o3775L62609J34819m47130
10850C83660n6625P5622k21432K7960N01959J64357l15081k04789J22964L39725
$$ plain form
10840 818320 1300923 1799938 2011765 1613051 1187060 1050257 1156695 1555619 1928183 1812917
10830 1812917 1489731 1310816 959994 826495 700245 602176 889925 928341 875640 867539
10820 867539 692160 740896 553904 294199 138686 32723 -42191 200991 661171 815532
10810 815532 746861 641743 649747 704315 955951 1491850 1953610 2207455 2051750 1606360
10800 1606360 1101462 1123522 1468029 1781387 2182937 2431522 2119491 1837451 1919111 2231577
10790 2231577 2225886 2137453 2879744 4205653 4945483 5128927 4969563 4512132 4247453 3991683
10780 3991683 3655196 3108602 3126653 3477516 3300679 2972579 2720505 2743795 3120531 3576019
10770 3576019 4020503 4113890 4486535 4608966 3993581 3041070 3309398 4266275 4642327 4901481
$$ packed form
10840H18320M82603M99015K11827l98714m25991j36803J06438L98924L72564j15266
10830A812917l23186j78915l50822j33499j26250r8069K87749L8416n2701q101
10820H67539j75379M8736j86992k59705j55513j05963p4914K43182M60180J54361
10810H15532o8671j05118Q004N4568K51636N35899M61760K53845j55705m45390
10800A606360n04898K2060L44507L13358M01550K48585l12031k82040Q1660L12466
10790B231577n691q8433P42291J325909P39830J83444j59364m57431k64679k55770
10780C991683l36487n46594J8051L50863j76837l28100k52074K3290L76736M55488
10770C576019M44484R3387L72645J22431o15385r52511K68328R56877L76052K59154
$$ plain form
10760 4901481 4899063 4813892 4687453 4477075 4501967 4284821 3930826 3823501 3847846 4034463
10750 4034463 4290338 4522415 5053245 5864662 7012398 8802526 11369224 14536859 18558784
10741 18558784 24249526 32023138 40856914 46799156 45562471 38821344 31685202 26317520
10733 26317520 23036385 21557434 21472821 22826490 25879523 30510465 36779501 42915602
10725 42915602 45089974 43668609 42634432 44869570 51061437 57909717 60188813 56030299
10717 56030299 48896697 42557546 39207235 39477174 42974196 49851790 58375133 65146426
10709 65146426 69141983 70984865 68561457 61420467 52014916 43500062 37145653 33326294
10701 33326294 31539012 31414341 32743226 35383275 39912416 47497657 59107554 76630762
$$ packed form
10760D901481k418q5171j26439k10378K4892k17146l53995j07325K4345J86617
10750D034463K55875K32077N30830Q11417J147736J790128K566698L167635M021925
10741A8558784N690742P773612Q833776N942242j236685o741127p136142n367682
10733B6317520l281135j478951q4613J353669L053033M630942O269036O136101
10725D2915602K174372j421365j034177K235138O191867O848280K279096m158514
10717E6030299p133602o339151l350311K69939L497022O877594Q523343O771293
10709F5146426L995557J842882k423408p140990r405551q514854o354409l819359
10701C3326294j787282j24671J328885K640049M529141P585241J1609897J7523208
$$ plain form
10693 76630762 100412932 124911901 137358976 134366964 122324218 103221372 84236563
10686 84236563 72453665 68760137 72435432 83204861 101783042 128324714 155042688
10679 155042688 161138835 137389256 103428981 75623543 56397713 43490045 35072079
10672 35072079 29397854 25333786 22352489 19583062 16798664 14484318 12623218 11124831
10664 11124831 9974999 9123120 8388861 7779172 7468412 6758140 6223170 5931462 5520885
10655 5520885 5113925 5186813 5509867 5558640 5061661 4521560 4494171 4954377 5349509 5230954
10645 5230954 4608535 3884748 3188179 2854839 2474668 2083833 1715307 1672495 2019510 2335973
10635 2335973 2252357 2378562 2429696 2495245 2663725 2725444 2513743 2674303 2609363 2030389
$$ packed form
10693G6630762K3782170K4498969J2447075k992012j2042746j9102846j8984809
10686H4236563j1782898l693528L675295J0769429J8578181K6541672K6717974
10679A55042688O096147k3749579l3960275k7805438j9225830j2907668q417966
10672C5072079n674225m064068k981297k769427k784398k314346j861100j498387
10664A1124831j149832q51879p34259o09689l10760p10272n34970k91708m10577
10655E520885m06960P2888L23054M8773m96979n40101k7389M60206L95132j18555
10645E230954o22419p23787o96569l33340l80171l90835l68526m2812L47015L16463
10635B335973q3616J26205N1134O5549J68480O1719k11701J60560o4940n78974
$$ plain form
10625 2030389 1578120 1878124 2392756 2022965 1326179 1147383 1172819 800685 227640 40313
10615 40313 -181918 29165 712059 1082510 1204231 1026227 692783 305637 -110857 -106463
10605 -106463 106590 189718 445654 624030 362974 -21343 -34286 345555 515084 186895
10595 186895 233339 734556 871527 89127 -881496 -1245180 -743632 -135814 164747 343915
10585 343915 506621 997742 1545078 1397364 922477 631151 277953 9707 66759 601760
10575 601760 882233 539917 222773 184608 709776 1413178 1623056 1261199 686309 368208
10565 368208 -103567 -585146 -379844 160388 496229 280835 55663 75395 245667 -32751
10555 -32751 -316663 -301303 -232384 -107994 -73241 -15327 63288 -117238 -231669 238177 513714
$$ packed form
10625B030389m52269L00004N14632l69791o96786j78796K5436l72134n73045j87327
10615D0313k22231K11083O82894L70451J21721j78004l33444l87146m16494M394
10605a06463K13053Q3128K55936J78376k61056l84317j2943L79841J69529l28189
10595A86895M6444N01217J36971p82400r70623l63684N01548O07818L00561J79168
10585C43915J62706M91121N47336j47714m74887k91326l53198k68246N7052N35001
10575F01760K80473l42316l17144l8165N25168P03402K09878l61857n74890l18101
10565C68208m71775m81579K05302N40232L35841k15394k25172J9732J70272k78418
10555c2751k83912J5360O8919J24390L4753N7914P8615j80526j14431M69846K75537
$$ plain form
10544 513714 200677 149490 173548 15779 -10739 270564 -34944 -604215 -505251 -432266
10534 -432266 -482376 -229418 -8212 48887 100492 200641 127661 87362 358203 567388
10524 567388 621875 353717 -213398 -417077 -178329 63825 347414 570684 439959 78562
10514 78562 389760 961628 738998 -11797 -470677 -100570 313843 346129 -143505 -754902
10504 -754902 -1015944 -909143 -578068 -269528 -318251 -714239 -607858 -323760 -376607 -553863
10494 -553863 -140995 349676 555895 650847 638614 563250 498667 477437 557776 447101 -360785
10483 -360785 -918935 -956673 -864254 -734309 -589068 -333673 49058 1055 -91097 310871
10473 310871 210726 68252 587452 898402 514440 -42172 116500 357857 476806 520073
$$ packed form
10544E13714l13037n1187K4058j57769k6518K81303l05508n69271R8964P2985
10534d32266n0110K52958K21206N7099N1605J00149p2980m0299K70841K09185
10524E67388N4487k68158n67115k03679K38748K42154K83589K23270j30725l61397
10514G8562L11198N71868k22630p50795m58880L70107M14413L2286m89634o11397
10504g54902k61042J06801L31075L08540m8723l95988J06381K84098n2847j77256
10494e53863M12868M90671K06219R4952j2233p5364o4583k1230Q0339j10675q07886
10483c60785n58150l7738R2419J29945J45241K55395L82731m8003r2152M01968
10473C10871j00145j42474N19200L10950l83962n56612J58672K41357J18949M3267
$$ plain form
10463 520073 578238 728661 702892 725900 273706 -50272 -164771 -125777 382972 784109
10453 784109 858658 922915 439314 -88003 -379536 -454943 -115670 -122209 -366015 -307003 -210116
10442 -210116 -54169 77894 -133837 -295262 -416373 -645374 -793253 -805733 -1044004 -944770
10432 -944770 -616537 -334244 59516 419864 626721 772617 977194 868382 504958 219779
10422 219779 204399 434052 453447 500388 843258 520608 -99014 -88473 90553 295718
10412 295718 394512 644613 425936 13483 -117675 -179690 -64426 -144549 -516193 -680552
10402 -680552 -387082 -128425 -120676 -156386 52598 118414 -177704 -497746 -942485 -1245203
10392 -1245203 -1102011 -692226 -307336 -83395 -141474 -362310 -191462 64459 319583 717790
$$ packed form
10463E20073N8165J50423k5769K3008m52194l23978j14499L8994N08749M01137
10453G84109P4549O4257m83601n27317k91533p5407L39273o539k43806N9012R6887
10442b10116J55947J32063k11731j61425j21111k29001j47879j2480k38271R9234
10432i44770L28233K82293L93760L60348K06857J45896K04577j08812l63424k85179
10422B19779j5380K29653J9395M6941L42870l22650o19622J0541J79026K05165
10412B95718R8794K50101k18677m12453j31158o2015J15264q0123l71644j64359
10402f80552K93470K58657P749l5710K08984O5816k96118l20042m44739l02718
10392a245203J43192M09785L84890K23941n8079k20836J70848K55921K55124L98207
$$ plain form
10382 717790 1673110 2516223 2526469 1928542 1179538 571650 44458 -158552 -308893 -343060
10372 -343060 -90721 138570 526477 1196583 1606018 1698882 1966345 1709217 1210000 918431
10362 918431 964585 1401306 1345089 890721 556287 311878 -68743 -353845 -204997 -44093
10352 -44093 -14380 110349 377261 497375 367826 229233 -1843 -234480 -336412 -510728
10342 -510728 -184600 85214 -28151 944 201719 230609 -175066 -898033 -696629 -210003
10332 -210003 -300265 -547318 -616755 -772647 -689267 -503120 -607438 -471786 290606 1147926
10322 1147926 1400042 1244870 1058913 1028081 958014 757362 960482 1660896 1897751 1509921
10312 1509921 677772 208629 458545 615013 441932 111738 -415595 -890668 -1268202
$$ packed form
10382G17790R55320Q43113J0246n97927p49004o07888n27192k03010j50341l4167
10372c43060K52339K29291L87907O70106M09435R2864K67463k57128m99217k91569
10362I18431M6154M36721n6217m54368l34434k44409l80621k85102J48848J60904
10352d4093K9713J24729K66912J20114j29549j38593k31076k32637j01932j74316
10342e10728L26128K69814j13365K9095K00775K8890m05675p22967K01404M86626
10332b10003r0262k47053o9437j55892Q3380J86147j04318J35652P62392Q57320
10322A147926K52116j55172j85957l0832p0067k00652K03120P00414K36855l87830
10312A509921q32149m69143K49916J56468j73081l30194n27333m75073l77534
$$ plain form
10303 -1268202 -1264742 -629706 16642 252017 307182 408021 570033 594100 243117 -291432
10293 -291432 -471955 -466260 -261968 50469 333607 379204 186128 484 -62650 -195688
10283 -195688 -18587 298165 475784 403238 306800 412792 563256 674169 821304 624596
10273 624596 457148 231095 -140692 -539488 -251936 45084 -32702 -210500 -234408 31655
10263 31655 -14306 -174253 -45725 -78501 -327245 -183316 13743 60891 -135960 -451173
10253 -451173 -484328 -424939 -679653 -750960 -464218 -85506 -207486 -514488 -870332 -1085452
10243 -1085452 -845122 -835584 -991764 -756449 -264462 -228343 -80619 435133 746587 800090
10233 800090 354895 33179 -33795 -32171 60308 -193228 32042 304529 -49269 -414238
$$ packed form
10303a268202L460O35036O46348K35375N5165J00839J62012K4067l50983n34549
10293b91432j80523N695K04292L12437K83138M5597j93076j85644o3134j33038
10283a95688J77101L16752J77619p2546r6438J05992J50464J10913J47135j96708
10273F24596j67448k26053l71787l98796K87552K97020p7786j77798k3908K66063
10263C1655m5961j59947J28528l2776k48744J43929J97059M7148j96851l15213
10253d51173l3155N9389k54714p1307K86742L78712j21980l07002l55844k15120
10243a085452K40330R538j56180K35315M91987L6119J47724N15752L11454N3503
10233H00090m45195l21716o6974J624R2479k53536K25270K72487l53798l64969
$$ plain form
10223 -414238 -823450 -1308927 -1307829 -986566 -707235 -363059 -90664 -70884 283515 878164
10213 878164 855384 723263 1048829 1096770 684913 269611 -128261 -258621 -204141 -184129
10203 -184129 -361405 -536154 -672334 -675811 -667730 -527829 -590814 -325181 37398 477721
10193 477721 523153 292872 18522 -268750 -215018 -226598 -312522 -329806 -161910 -18694
10183 -18694 95116 -247544 -496087 -175596 402157 228184 119964 107771 -165221 -615599
10173 -615599 -859396 -813927 -914071 -1091593 -1127722 -1298644 -1330133 -792566 -263288 220780
10163 220780 409935 550983 678670 693204 816381 1117290 1135828 807451 322068 -365494
10153 -365494 -673756 -613306 -454337 -154657 -18810 173100 -275827 -805672 -773173 -712438
$$ packed form
10223d14238m09212m85477J098L21263K79331L44176K72395J9780L54399N94649
10213H78164k2780j32121L25566M7941m11857m15302l97872j30360N4480K0012
10203a84129j77276j74749j36180l477Q081J39901o2985K65633L62579M40323
10193D77721M5432k30281k74350k87272N3732j1580q5924j7284J67896J43216
10183a8694J13810l42660k48543L20491N77753j73973j08220j2193k72992m50378
10173f15599k43797M5469j00144j77522l6129j70922l1489N37567N29278M84068
10163B20780J89155J41048J27687J4534J23177L00909J8538l28377m85383o87562
10153c65494l08262O0450J58969K99680J35847J91910m48927n29845L2499O0735
$$ plain form
10143 -712438 -830681 -955616 -801304 -679576 -575033 -439674 -321617 40174 53641 -28596
10133 -28596 253040 354428 452538 430063 607138 612421 231747 377701 1039116 2269606
10123 2269606 3386386 3424607 2653936 1671489 1020064 722573 380810 342708 698526 885894
10113 885894 330652 -330685 -340018 -169582 -191430 -301151 -687729 -1070820 -1150799 -886802
10103 -886802 -124721 691996 1020755 1049908 983693 1075570 1098708 937903 714591 746019
10093 746019 864672 691874 259569 -327798 -375598 -436027 -480419 -450543 -190842 -76965
10083 -76965 -430924 -727865 -620824 -538276 -430227 -227085 163785 478933 456340 209065
10073 209065 -88797 -34032 444409 1003972 1446033 1923670 2167640 1688008 1231060 1037133
$$ packed form
10143g12438j18243j24935J54312J21728J04543J35359J18057L61791J3467q2237
10133b8596K81636J01388R8110k2475J77075N283l80674J45954O61415J230490
10123B269606J116780L8221p70671r82447o51425k97491l41763l8102L55818J87368
10113H85894n55242o61337r333J70436k1848j09721l86578l83091p9979K63997
10103h86802P62081Q16717L28759K9153o6215R1877K3138j60805k23312L1428
10093G46019J18653j72798m32305n87367m7800o0429m4392K9876K59701J13877
10083g6965l53959k96941J07041Q2548J08049K03142L90870L15148k2593k47275
10073B09065k97862N4765M78441N59563M42061M77637K43970m79632m56948j93927
$$ plain form
10063 1037133 812543 566349 402907 520740 528308 320461 272038 338529 511064 487472
10053 487472 223158 -13195 23991 -69364 370582 878730 1341793 1580362 1514266 1332614
10043 1332614 927624 361658 34750 -73483 201058 349852 126345 243857 598581
10034 598581 1252470 1886261 2124234 1765175 1702595 1963541 2022798 1888627 1602054 1465456
10024 1465456 1695855 1678279 1653808 1548135 1488444 1900087 2109029 1782488 1229440 1005086
10014 1005086 1361089 1329144 807872 492992 106093 -392543 -650591 -952073 -1113859 -1125069
10004 -1125069 -710863 103223 717461 1161432 1243598 792300 339678 -189138 -734609 -423495
9994 -423495 -102799 -172576 169331 463806 473586 226379 -23931 -403174 -423695 -187693
$$ packed form
10063A037133k24590k46194j63442J17833P568k07847m8423O6491J72535k3592
10053D87472k64314k36353L7186r3355M39946N08148M63063K38569o6096j81652
10043A332614m04990n65966l26908j08233K74541J48794k23507J17512L54724
10034E98581O53889O33791K37973l59059o2580K60946N9257j34171k86573j36598
10024A465456K30399j7576k4471j05673n9691M11643K08942l26541n53048k24354
10014A005086L56003l1945n21272l14880l86899m98636k58048l01482j61786j1210
10004a125069M14206Q14086O14238M43971Q2166m51298m52622n28816n45471L11114
9994d23495L20696o9777L41907K94475R780k47207k50310l79243k0521K36002
$$ plain form
9984 -187693 -26431 176606 254072 102945 96879 129935 -307673 -1197048 -1730902 -1885691
$$ packed form
9984a87693J61262K03037P7466j51127o066L3056m37608q89375n33854j54789
$$ [...]
##END NTUPLES=NMR SPECTRUM
##END=
