##TITLE=C13_SR6_K2
 CDCl3, 19000 sc

 30.1.2020
##JCAMPDX= 6.0         $$ Bruker NMR JCAMP-DX V2.0
##DATA TYPE= NMR SPECTRUM
##DATA CLASS= NTUPLES
##ORIGIN= UXNMR, Bruker Analytische Messtechnik GmbH
##OWNER= root
$$ XWIN-NMR		Version 3.5
$$ Fri Jan 31 13:48:06 2020 Russian Standard Time (UT+4h)  she@DPX200
##.OBSERVE FREQUENCY= 50.327896
##.OBSERVE NUCLEUS= ^13C
##.ACQUISITION MODE= SIMULTANEOUS
##.ACQUISITION SCHEME= undefined
##.AVERAGES= 18580
##.DIGITISER RES= 17
##SPECTROMETER/DATA SYSTEM= spect
##.PULSE SEQUENCE= zgpg30
##.SOLVENT NAME= DMSO
##.SHIFT REFERENCE= (INTERNAL, DMSO, 0, 222.624)
##AUDIT TRAIL= $$ (NUMBER, WHEN, WHO, WHERE, WHAT)
$$ ##TITLE= Audit trail, XWIN-NMR		Version 3.5
$$ ##JCAMPDX= 5.01
$$ ##ORIGIN= Bruker BioSpin GmbH
$$ ##OWNER= she
$$ F:/spectra/data/she/nmr/c13/1/pdata/1/auditp.txt
$$ ##AUDIT TRAIL=  $$ (NUMBER, WHEN, WHO, WHERE, WHAT)
(   1,<2020-01-31 10:08:25.06 +0400>,<she>,<DPX200>,
      <created by zg, POWCHK disabled, PULCHK disabled
       terminated by command 'halt'
       configuration hash MD5:
       00 E9 B6 7A A2 85 ED C7 34 08 36 98 17 FE 4E 26
       data hash MD5: 32K
       B3 90 84 C0 8C CB 12 05 43 9D 3C 63 F0 CB 0D CC>)
(   2,<2020-01-31 13:46:19.32 +0400>,<she>,<DPX200>,
      <Start of raw data processing
       efp BC_mod = 2 LB = 1 FT_mod = 6 PKNL = 1 PHC0 = -219.4157 PHC1 = 31.80638 SI = 32K 
       data hash MD5: 32K
       1B 79 9B B0 FD 7D 36 5A 57 3E 27 2A ED BC E7 41>)
(   3,<2020-01-31 13:46:37.43 +0400>,<she>,<DPX200>,
      <pk PHC0 = 3.704004 PHC1 = -3.8 
       data hash MD5: 32K
       7D 07 F5 69 3F 37 C3 BB 2B 28 4E D3 E7 1D 2E D7>)
(   4,<2020-01-31 13:46:40.85 +0400>,<she>,<DPX200>,
      <abs ABSG = 5 
       data hash MD5: 32K
       01 F7 63 AB 58 40 3B CA 41 E6 FD D2 3E 9D F1 74>)
(   5,<2020-01-31 13:46:57.95 +0400>,<she>,<DPX200>,
      <pk PHC0 = -2.59252 PHC1 = 4.000001 
       data hash MD5: 32K
       71 A6 1B A4 25 31 E9 92 A3 16 A3 A8 1A EB 9E F4>)
(   6,<2020-01-31 13:47:01.43 +0400>,<she>,<DPX200>,
      <abs ABSG = 5 
       data hash MD5: 32K
       8B EF 67 0A F3 5F 9B 7B B5 82 8F 41 1F 36 1F 5B>)
$$ ##END=
$$ 
$$ hash MD5
$$ B2 EE F3 07 77 5A 78 AC C7 F3 38 6E 81 A1 3A D4
##$RELAX= 
##$RELAX= 
##$RELAX= 
##$RELAX= 
##$RELAX= 
##$RELAX= 
##$RELAX= 
##$RELAX= 
$$ Bruker specific parameters
$$ --------------------------
##$DU= <F:/spectra>
##$EXPNO= 1
##$NAME= <c13>
##$PROCNO= 1
##$TYPE= <nmr>
##$USER= <she>
##$AMP= (0..31)
100 100 100 100 100 100 100 100 100 100 100 100 100 100 100 100 100 100 
100 100 100 100 100 100 100 100 100 100 100 100 100 100 
##$AQSEQ= 0
##$AQ_mod= 1
##$AUNM= <au_zg>
##$AUTOPOS= <>
##$BF1= 50.322709
##$BF2= 200.13
##$BF3= 50.322709
##$BF4= 500.13
##$BF5= 500.13
##$BF6= 500.13
##$BF7= 500.13
##$BF8= 500.13
##$BYTORDA= 1
##$CFDGTYP= 0
##$CFRGTYP= 5
##$CHEMSTR= <none>
##$CNST= (0..31)
1 1 145 1 1 1 1 1 1 1 1 1 1 1 1 1 1 1 1 1 1 1 1 1 1 1 1 1 1 1 1 1 
##$CPDPRG= <waltz16>
##$CPDPRG1= <>
##$CPDPRG2= <waltz16>
##$CPDPRG3= <>
$$ [...]
##$SUBNAM4= <"">
##$SUBNAM5= <"">
##$SUBNAM6= <"">
##$SUBNAM7= <"">
##$SUBNAM8= <"">
##$SUBNAM9= <"">
##$SW= 239.972175391363
##$SWIBOX= (0..15)
0 1 3 0 0 0 0 0 0 0 0 0 0 0 0 0 
##$SW_h= 12077.2946859903
##$TD= 32768
##$TD0= 1
##$TE= 0
##$TE2= 300
##$TE3= 300
##$TEG= 300
##$TL= (0..7)
120 120 120 120 120 120 120 120 
##$TP= (0..7)
150 150 150 150 150 150 150 150 
##$TP07= 0
##$TPNAME0= <>
##$TPNAME1= <>
##$TPNAME2= <>
##$TPNAME3= <>
##$TPNAME4= <>
##$TPNAME5= <>
##$TPNAME6= <>
##$TPNAME7= <>
##$TPOAL= (0..7)
0.5 0.5 0.5 0.5 0.5 0.5 0.5 0.5 
##$TPOFFS= (0..7)
0 0 0 0 0 0 0 0 
##$TUNHIN= 0
##$TUNHOUT= 0
##$TUNXOUT= 0
##$USERA1= <user>
##$USERA2= <user>
##$USERA3= <user>
##$USERA4= <user>
##$USERA5= <user>
##$V9= 5
##$VALIST= <valist>
##$VCLIST= <CCCCCCCCCCCCCCC>
##$VD= 0
##$VDLIST= <DDDDDDDDDDDDDDD>
##$VPLIST= <PPPPPPPPPPPPPPP>
##$VTLIST= <TTTTTTTTTTTTTTT>
##$WBST= 1024
##$WBSW= 4
##$XGAIN= (0..3)
0 0 0 0 
##$XL= 0
##$YL= 0
##$YMAX_a= 44141653
##$YMIN_a= -127220644
##$ZGOPTNS= <>
##$ZL1= 120
##$ZL2= 120
##$ZL3= 120
##$ZL4= 120
##$ABSF1= 222.624
##$ABSF2= -17.3728
##$ABSG= 5
##$ABSL= 3
##$ALPHA= 0
##$AQORDER= 0
##$ASSFAC= 0
##$ASSFACI= 0
##$ASSFACX= 0
##$ASSWID= 0
##$AUNMP= <proc_1d>
##$AZFE= 0.1
##$AZFW= 0.5
##$BCFW= 0
##$BC_mod= 2
##$BYTORDP= 0
##$COROFFS= 0
##$CY= -3
##$DATMOD= 1
##$DC= 0
##$DFILT= <>
##$DTYPP= 0
##$F1P= 0
##$F2P= 0
##$FCOR= 0.5
##$FTSIZE= 32768
##$FT_mod= 6
##$GAMMA= 0
##$GB= 0
##$INTBC= 1
##$INTSCL= 4.134877e-10
##$ISEN= 128
##$LB= 1
##$LEV0= 0
##$LPBIN= 0
##$MAXI= 10000
##$MC2= 0
##$MEAN= 0
##$ME_mod= 0
##$MI= 0.1934396
##$NCOEF= 0
##$NC_proc= 3
##$NLEV= 6
##$NOISF1= 120.0001
##$NOISF2= 80.00006
##$NSP= 0
##$NTH_PI= 0
##$NZP= 0
##$OFFSET= 222.624
##$PC= 1.4
##$PHC0= -218.3042
##$PHC1= 32.00638
##$PH_mod= 1
##$PKNL= yes
##$PPARMOD= 0
##$PSCAL= 0
##$PSIGN= 0
##$REVERSE= no
##$SF= 50.3227315989248
##$SI= 32768
##$SIGF1= 140
##$SIGF2= 120
##$SINO= 11.81781
##$SIOLD= 32768
##$SREGLST= <13C.CDCl3>
##$SSB= 0
##$STSI= 32768
##$STSR= 0
##$SW_p= 12077.2946859903
##$SYMM= 0
##$S_DEV= 0
##$TDeff= 32768
##$TDoff= 0
##$TI= <>
##$TILT= no
##$TM1= 0
##$TM2= 0
##$TOPLEV= 0
##$USERP1= <user>
##$USERP2= <user>
##$USERP3= <user>
##$USERP4= <user>
##$USERP5= <user>
##$WDW= 1
##$XDIM= 32768
##$YMAX_p= 278838577
##$YMIN_p= -1712326
$$ End of Bruker specific parameters
$$ ---------------------------------
##NTUPLES= NMR SPECTRUM
##VAR_NAME=  FREQUENCY,     SPECTRUM/REAL,   SPECTRUM/IMAG
##SYMBOL=    X,             R,               I
##VAR_TYPE=  INDEPENDENT,   DEPENDENT,       DEPENDENT
##VAR_FORM=  AFFN,          ASDF,            ASDF
##VAR_DIM=   32768,         32768,           32768
##UNITS=     HZ,            ARBITRARY UNITS, ARBITRARY UNITS
##FACTOR=    0.368581032318806, 1,           1
##FIRST=     11203.0474431902, 0,            0
##LAST=      -874.247242800138, 0,           0
##MIN=       -874.247242800138, -1712326,    0
##MAX=       11203.0474431902, 278838577,    0
$$ Real data points
##PAGE= N=1
##DATA TABLE= (X++(R..R)), XYDATA
$$ [...]
15992B15406J60034R1351l0532L0641L3399J97482J49864j28177j52659M5425
$$ 215406 375440 466791 436259 466900 500299 697781 847645 719468 566809 612234
15982F12234K20660n4766k24232o3603K0169k3897n5360j36675r5453J2757j0170
$$ 612234 832894 778128 553896 490293 510462 486565 431205 294530 199077 211834 201664
15971B01664o0299j38008r9656j46746k15412j32085J07220J71614P8164J3691
$$ 201664 141365 3357 -96299 -243045 -458457 -590542 -483322 -311708 -233544 -219853
15961b19853K23179K30528J3261k00948k18149J06194K85333J60622K0851J16432
$$ -219853 3326 233854 247115 46167 -171982 -65788 219545 380167 401018 517450
15951E17450L14968O6023k59800l54357k54598J27917K43092j20441l31896J074
$$ 517450 832418 898441 638641 284284 29686 157603 400695 280254 -51642 -50568
15941e0568j8315m2371N802M6482q978L2490M120n3116l7919j55351j17002J76505
$$ -50568 -68883 -111254 -105452 -58970 -67948 -35458 -31338 -84454 -122373 -277724 -394726 -218221
15929b18221K29237j6609P0037K64878K09169n6231m0982P8881j18418p4378l9707
$$ -218221 11016 -5593 64444 329322 538491 482260 441278 520159 401741 327363 287656
15918B87656o5815j04522n0738K9847K2225l6244k06587k20695K57475J29408
$$ 287656 221841 117319 66581 96428 118653 82409 -124178 -344873 -87398 42010
15908D2010k96223p7300l4781M5888N3949O7555j959l1522P543q2255j09487L5879
$$ 42010 -254213 -331513 -366294 -320406 -266457 -198902 -200861 -232383 -224840 -307095 -416582 -380703
15896c80703J27309K33025K05459J13350k41284l17745o1831m4716J07908L21886
$$ -380703 -253394 -20369 185090 298440 57156 -260589 -322420 -367136 -259228 62658
15886F2658J96589r4285p6423q8660n0483L9365j70754j06682R4662j45029k37950
$$ 62658 259247 164962 88539 -121 -50604 -11239 -181993 -288675 -194013 -339042 -576992
15875e76992O1385K71097K47853J71786J05985m6640j51067j10992k48981k8440
$$ -576992 -515607 -244510 3343 175129 281114 234474 83407 -27585 -276566 -305006
15865c05006K05019P5504M3483J28365j773r2654p6636p027p5231r271J03041
$$ -305006 -99987 -24483 19000 147365 145592 52938 -23698 -30725 -105956 -115227 -12186
15854a2186j0318K00103K93153l0r4648q0777j65222k75531j60301L4066J15060
$$ -12186 -22504 177599 470752 470722 376074 295297 130075 -145456 -305757 -271691 -156631
15843a56631J33235J01041J56869l6183j81465L0990K64597K12744k1184k45619
$$ -156631 -23396 77645 234514 198331 16866 47856 312453 525197 504013 258394
15833B58394l10224j38023n9788p032J25575j106k3913R2837J14483k9802j13149
$$ 258394 -51830 -189853 -249641 -256673 -131098 -132204 -156117 -63280 51203 21401 -91748
15822i1748j9412L7561J11336O0042j92896q5458j2493j31103j4985k66j07842
$$ -91748 -111160 -73599 37737 97779 -95117 -180575 -193068 -324171 -339156 -339422 -447264
15811d47264j15547J60124J84693O2871p7292q0912k7382m7108L9678J48022K61513
$$ -447264 -562811 -402687 -217994 -155123 -232415 -313327 -340709 -387817 -348139 -200117 61396
15800F1396J42811n019Q0319J92403J63604o5930p4013j9629L7644l8017k16529
$$ 61396 204207 199188 279507 471910 635514 569584 495571 475942 513586 475569 259040
15789B59040j2977J93645J86389O5187l13590l75226k61603j16471R7437K38138
$$ 259040 246063 439708 626097 691284 377694 2468 -259135 -375606 -278169 -40031
15779d0031J93524k2773Q9423P5975k12850k25095m5198K85389K39618j09395
$$ -40031 153493 130720 220143 296118 83268 -141827 -187025 98364 337982 228587
15769B28587j47842j91899k43216M834J67311K50585K37937p2948k17915j7209
$$ 228587 80745 -111154 -354370 -349536 -182225 68360 306297 233349 15434 -1775
15759a775O5047j75888j48485J06488J03781q8055r4570p3224J09988K41361J86300
$$ -1775 63272 -112616 -261101 -154613 -50832 -138887 -233457 -306681 -196693 44668 230968
15748B30968K3493j86987j62400j6351J32176K7253K2016P1251Q8955M6700k1708
$$ 230968 254461 67474 -94926 -111277 20899 48152 70168 141419 230374 277074 255366
15737B55366j9429o8609k6816Q8984n5463n5318P2851p5525j89966k15177l9878
$$ 255366 235937 167328 140512 229496 174033 118715 191566 116041 -73925 -289102 -328980
15726c28980Q6634J63340L19515L71353K03834K04008q0251k01237j30287k52422
$$ -328980 -242346 -79006 240509 611862 815696 1019704 939453 738216 607929 355507
15716C55507j94973k28233j04864R8798O8384M2918j6610r827n753j14127j66261
$$ 355507 160534 -67699 -172563 -73765 -5381 37537 20927 11100 5347 -108780 -275041
15705b75041j49419j21582J0119q572R9592J37300N6525M1257K2353r1467j7251
$$ -275041 -424460 -546042 -535923 -544495 -444903 -307603 -251078 -209821 -187468 -278935 -296186
15694b96186J01380R0789R9492r8966k62132k77747j48256K56374L56598j11691
$$ -296186 -194806 -104017 -4525 -103491 -365623 -643370 -791626 -535252 -178654 -290345
15684b90345j93217m981k9506J56374J18240j26815p1915J3467J27277J81917
$$ -290345 -483562 -488543 -518049 -361675 -243435 -370250 -442165 -428698 -301421 -119504
15674a19504J04580j2723p4861j65886M0150N6583N0893M9241j0618k4702O352
$$ -119504 -14924 -27647 -102508 -268394 -228244 -171661 -120768 -71527 -82145 -106847 -100495
15663a00495J59968O7326j41416q1566m2254L783o3341j17122K8635l6600J9185
$$ -100495 59473 126799 -14617 -96183 -138437 -134654 -197995 -315117 -286482 -323082 -303897
15652c03897k1432K0898P3331Q1406J39124O2493j09168m1444J3531P560m5064
$$ -303897 -325329 -304431 -231100 -149694 -10570 51923 -57245 -98689 -85158 -77598 -122662
15641a22662J88883K10579O7284J69325N1617k39049k71227j07821j40550j9085
$$ -122662 66221 276800 344084 513409 565026 325977 54750 -53071 -193621 -212706
15631b12706j282k5105J36394q1720j76433j33897K9280J39237J92083K34360
$$ -212706 -213988 -239093 -102699 -184419 -360852 -494749 -465469 -326232 -134149 100211
15621A00211N8476k9356m1715R322l9565j77140k30737l8818J34512J06875J11019
$$ 100211 158687 129331 87616 96938 57373 -119767 -350504 -389322 -254810 -147935 -36916
15610c6916J65725K7433m8243r1798j81362r7630r4359L1939R4490O1847J47372
$$ -36916 128809 156242 107999 16201 -165161 -262791 -357150 -325211 -230721 -168874 -21502
15599b1502K48879O0623m6514j91853l93305j28759L0541K45694K75911J56937
$$ -21502 227377 288000 241486 49633 -343672 -472431 -441890 -196196 79715 236652
15589B36652J47633N1457l9035J50537j79668m38904k5517J91020P3714L899k69191
$$ 236652 384285 435742 396707 547244 367576 -71328 -96845 94175 167889 171788 -97403
15578i7403k85140n8545l2833j01218N0472J14790Q4991P2856M6015L7481n9168
$$ -97403 -382543 -441088 -473921 -575139 -524667 -409877 -324886 -252030 -206015 -168534 -227702
15567b27702j27656P218J98701J54105J0263J4372J17993m1270j67685O1415K21811
$$ -227702 -355358 -348140 -149439 4666 14929 29301 147294 106024 -61661 -246 221565
15556B21565o8308p1461l8613p1002L8469L5782J67044L2258l8237p9353r8871
$$ 221565 153257 81796 43183 -27819 10650 46432 213476 245734 207497 128144 29273
15545B9273R8044p0573r5825K9630N9045K85125K14572O1128j84781j86879j61128
$$ 29273 127317 56744 -39081 -9451 49594 334719 549291 610419 425638 238759 77631
15534G7631k10120L4242J05867K4467M5056P0076K8765m2585p7334j80427Q4234
$$ 77631 -132489 -98247 7620 32087 77143 147219 175984 133399 56065 -124362 -40128
15523d0128K44177K51323J52252n4083k9135P0057l5281n9748j37086j82518j19201
$$ -40128 204049 455372 607624 553541 524406 594463 559182 499434 362348 179830 60629
15512F0629q6752k5318p7794J7521N8155n5508j32310o0755O0104L2428R5856
$$ 60629 -26123 -51441 -129235 -111714 -53559 -109067 -241377 -302132 -242028 -209600 -113744
15501a13744J08518J3216R3037P5661k2540l9295N1830K6820n301N8673K5397
$$ -113744 -5226 7990 101027 176688 154148 114853 166683 193503 188202 246875 272272
15490B72272r050M5861o0358J5556O1758N7588M5405M0250J40143m403j34498
$$ 272272 263222 309083 248725 264281 326039 383627 429032 469282 609425 605022 470524
15479D70524k43013r2117L1059j26393p9332j32633p0494P963j9461j3998K1491
$$ 470524 227511 135394 166453 40060 -39272 -171905 -242399 -234436 -253897 -267895 -246404
15468b46404J8966N5210m3451j02300q0953J52400J85639k2099n4861m3206K059
$$ -246404 -227438 -172228 -215679 -317979 -398932 -246532 -60893 -82992 -137853 -181059 -179000
15457a79000Q1587J95156J66658j38151q5979J0571j2911n2392J24408J08267
$$ -179000 -97413 97743 264401 126250 40271 50842 37931 -14461 109947 218214
15447B18214Q93N7626q5235k35372j9517N5398L0302K5738r8762k66632k02038
$$ 218214 219107 276733 191498 -43874 -63391 -7993 22309 48047 -50715 -317347 -519385
15436e19385k8252J11947K11745J78950K18193J04752p6906j19687k56595j07866
$$ -519385 -547637 -435690 -223945 -44995 173198 277950 201044 81357 -175238 -283104
15426b83104O1679L3610j35033L1509K97671L27671J14960j6963o6608k27718
$$ -283104 -221425 -187815 -322848 -291339 6332 334003 448963 432000 365392 137674
15416A37674j91794j17994o897R6281J87692J88979Q0930j04798K826L6158j00740
$$ 137674 -54120 -172114 -179011 -82730 104962 293941 374871 270073 272899 309057 208317
15405B08317o6384j3366K2048J9257n2163j64784k12322k21997O8884K43650K09445
$$ 208317 141933 128567 150615 169872 117709 -47075 -259397 -481394 -412510 -168860 40585
15394D0585J21161k040M2189K38551O8094k02770j00254R8467j08029n2573J12683
$$ 40585 161746 159706 201895 440446 508540 305770 205516 303983 195954 143381 256064
15383B56064K3723m2329j57920N9068J75868k5453k08797q0185j12874R7422K19005
$$ 256064 279787 237458 79538 138606 314474 289021 80224 39 -112835 -15413 203592
15372B03592j2870o0653q6336j2227j7162j63038r6934j50640p0996j06361m1497
$$ 203592 190722 130069 43733 31506 14344 -148694 -245628 -396268 -467264 -573625 -615122
15361f15122K94542J28997j94619j68516r5484J26208O6533q711R0745J81553
$$ -615122 -320580 -191583 -386202 -554718 -650202 -523994 -457461 -466172 -375427 -193874
15351a93874J55145R8502j323r3189K8816J6733r7502q8194M789N2934Q7803K6142
$$ -193874 -38729 59773 58450 -34739 -5923 10810 -86692 -174886 -170097 -117163 -29360 -3218
15339c218K8104J3449j25258j02098p3602K06668J94167P9630q9775j09448l6124
$$ -3218 24886 38335 -86923 -189021 -262623 -55955 138212 217842 128067 18619 -17505
15328a7505j32790k2127j9437j00509j06981j20630k9601L949q2779K0082J09268
$$ -17505 -150295 -172422 -191859 -292368 -399349 -519979 -549580 -545631 -628410 -608328 -499060
15317d99060J72559L4471n1654Q5360q9422q2628J00848K47683K20895r8771n5201
$$ -499060 -326501 -292030 -343684 -258324 -347746 -430374 -329526 -81843 139052 40281 -14920
15306a4920M4606q1268O0442L04100K57479n4601k43528k22086j52266o5238K2669
$$ -14920 29686 -51582 8860 312960 570439 515838 272310 50224 -102042 -167280 -144611
15295a44611Q6204K80143N9210o5051N5276K48784L52571O7377l31878l33847
$$ -144611 -58407 221736 280946 215895 271171 519955 872526 939903 608025 274178
15285B74178m2505o2506j7694J1962j31611k22060j55618j76793p5777J98757
$$ 274178 231673 169167 151473 163435 31824 -190236 -345854 -522647 -598424 -399667
15275c99667K65959J18587Q5590R8398o8357k35782j99402l7236P1880q779R8559
$$ -399667 -133708 -15121 70469 168867 100510 -135272 -334674 -371910 -300030 -308809 -210250
15264b10250J61263l200P0578J31404j1794q1587k33454k61987q3678J7890P8616
$$ -210250 -48987 -52187 18391 149795 138001 56414 -177040 -439027 -522705 -504815 -426199
15253d26199J89232L10510J75270N6953o9739j21610j24015m8222J18811j15883
$$ -426199 -236967 73543 248813 305766 236027 114417 -9598 -57820 60991 -54892
15243e4892j34699K01540J53682O858L6537N7136O2878P7959k5468j50518j08594
$$ -54892 -189591 11949 165631 172489 209026 266162 329040 406999 381531 231013 122419
15232A22419J17846j1311q3138L3482Q3029k52303k91974R3559j2169j02218k9610
$$ 122419 240265 228954 145816 179298 262327 10024 -281950 -188391 -200560 -302778 -332388
15221c32388J99966J14093j01409j30435J9034J17259Q5055j84603j98531Q4390
$$ -332388 -132422 -18329 -119738 -250173 -231139 -113880 -28825 -213428 -411959 -327569
15211c27569K31607m65j12688J17255L2151j23205k26421r7490J83866J92773
$$ -327569 -95962 -96427 -209115 -91860 -59709 -182914 -409335 -506825 -322959 -130186
15201a30186l1890R4374J32476j75766j47349J99318J60788k16948j8653K15563
$$ -130186 -162076 -67702 64774 -110992 -258341 -59023 101765 -115183 -133836 81727
15191H1727K2430j06480k1049M0129L3859l0846j36595j15956r4509j48961M9478
$$ 81727 104157 -2323 -23372 16757 50616 19770 -116825 -232781 -327290 -476251 -426773
15180d26773P9033O4211j0376M9969J22400P4927P5180m733p6224p1394P123J71112
$$ -426773 -347740 -283529 -293905 -243936 -121536 -46609 28571 23838 -52386 -123780 -116657 54455
15168E4455J14802k18680k6848o0248j1233K35512Q6288q9484j20643L104N0726
$$ 54455 169257 -49423 -76271 -136519 -147752 87760 174048 84564 -36079 -32975 17751
15157A7751k9647k17784j9464J50070M9690k1497o448M1286K2319n7467j1688
$$ 17751 -11896 -229680 -249144 -99074 -49384 -70881 -77329 -36043 -13724 -71191 -82879
15146h2879N7884J16985J62171j03580j60046L5067J4416q7825n3848K16771K78849
$$ -82879 -24995 91990 254161 150581 -9465 25602 40018 -47807 -101655 115116 393965
15135C93965R5532j14250r6306n3018n983L5511Q6045O0934j00914q968l033m022
$$ 393965 489497 375247 278941 225923 219940 255451 341496 402430 301516 292548 289515 285493
15123B85493k9947P148j4070p2892k3851k6208P5543n7404k98287k57508n9664
$$ 285493 255546 262694 248624 175732 151881 125673 201216 143812 -154475 -411983 -471647
15112d71647N9678j2852J23360J52472K2822Q4382J56260N1607m5436q9098J51475
$$ -471647 -411969 -424821 -301461 -148989 -126167 -41785 114475 166082 120646 31548 183023
15101A83023L25631K51918j57672j06217j18609q6686n76r3147q4101k7850j76083
$$ 183023 508654 760572 602900 496683 378074 291388 290812 197665 113564 85714 -90369
15090i0369j66991M5946J87507J83854J36310J18609O5916j35383j16336l628
$$ -90369 -257360 -211414 -23907 159947 296257 414866 480782 345399 229063 225435
15080B25435L676Q3692j27255j89006j18844k28832j89174M0488L83063K91721
$$ 225435 229111 312803 185548 -3458 -122302 -351134 -540308 -499820 -116757 174964
15070A74964q3149j59697j9826J76906l6956q671O7469j71722o341J07689M4288
$$ 174964 91815 -67882 -87708 89198 52242 43571 111040 -60682 -67023 40666 84954
15059H4954J61154J70137q6979k15875j42724J965P6559J613p380m3648L2555
$$ 84954 246108 416245 329266 113391 -29333 -27368 49191 50804 43424 -224 32331
15048C2331j83587O172R4461k1562k4516R0304J52290R5036k913P691K81200P8134
$$ 32331 -151256 -145084 -50623 -72185 -96701 -6397 145893 240929 238016 245707 526907 605041
15036F05041l0367n5553j55283j57501n9926R5705J27023J79661M4710j11936
$$ 605041 574674 519121 363838 206337 146411 242116 369139 548800 593510 481574
15026D81574o5148r1682k47320k78204P601J06646m3039L5942J5485J66805O8290
$$ 481574 416426 324744 77424 -200780 -193179 -86533 -129572 -93630 -78145 88660 156950
15015A56950k1631m002O7056J73916R9971j25875j77522k37405k1077J66833K1750
$$ 156950 135319 131317 198373 372289 472260 346385 168863 -68542 -89619 77214 98964
15004I8964j01453j26654j2074j45435k83454J0514J40494K03067P6434p439R3768
$$ 98964 -2489 -129143 -141217 -286652 -570106 -559592 -419098 -216031 -139597 -147036 -53268
14993e3268J08111R2868J00958R1047j10484k32698j50327L4105J21619l2175
$$ -53268 54843 147711 248669 339716 229232 -3466 -153793 -119688 1931 -30244
14983c0244k7116L1941K2700j3579N5046o2356l0370J55465R5440K4025Q8819
$$ -30244 -57360 -25419 -2719 -16298 38748 -23608 -53978 101487 196927 220952 309771
14972C09771j2612j53230j12355j16326p3617q1894p7157l2479l4559k7568J38802
$$ 309771 297159 143929 31574 -84752 -158369 -240263 -317420 -349899 -384458 -412026 -273224
14961b73224P2880j18967k4796J02815n9405j57987o9179L63370N02038M0609
$$ -273224 -200344 -319311 -344107 -241292 -300697 -458684 -527863 -164493 337545 378154
14951C78154r4029m1236j00261j44955J37519J59866n1438m7895R5915J3437k1320
$$ 378154 284125 242889 142628 -2327 135192 295058 243620 195725 291640 305077 283757
14940B83757P2379m9936j71239j37275N3622O7653m3669n2351j12267j92532N3932
$$ 283757 356136 306200 134961 -2314 51308 118961 75292 22941 -89326 -281858 -227926
14929b27926J98687J77216k4706k9322m1041J2670L3393J13934j330o0039L7318
$$ -227926 -29239 147977 123271 93949 52908 65578 98971 212905 211575 151536 188854
14918A88854N2832l7897q9813J4956r0378j85662Q572L3722m0978j11929k8789
$$ 188854 241686 203789 113976 128932 38554 -147108 -138536 -104814 -145792 -257721 -286510
14907b86510l8877L4515J64593k021l8789M0134J7927j04149q1449k2814q3735
$$ -286510 -325387 -290872 -126279 -128300 -167089 -126955 -109028 -213177 -294626 -317440 -401175
14896d01175j35733J99801J28577p1996j4094K6539Q8647O1641k7597l2659j55445
$$ -401175 -536908 -337107 -208530 -280526 -294620 -268081 -179434 -117793 -145390 -178049 -333494
14885c33494j64584Q1862J44392J49350R3415K49079K08061N6159j79143k75698
$$ -333494 -498078 -416216 -271824 -122474 -29059 220020 428081 484240 305097 29399
14875B9399k03091j4352J35354J01200J1269K6976M7979J26601j3756j66375L9583
$$ 29399 -173692 -188044 -52690 48510 59779 86755 134734 261335 247579 81204 120787
14864A20787N9262M0499n5922R1039L46426J27420O7110p0905j47520j6611j08281
$$ 120787 180049 220548 164626 255665 602091 729511 796621 725716 578196 561585 453304
14853D53304j92559j95001k32700j61983J04496Q7527j4641P5744p5144j30756
$$ 453304 260745 65744 -166956 -328939 -224443 -136916 -151557 -75813 -150957 -281713
14843b81713J10848K9280r4589L412K08881M8926j00281L7828N2342j0957N218
$$ -281713 -170865 -141585 -236174 -232762 -23881 25045 -75236 -37408 14934 3977 9195
14832I195L6751M5205k0321J03635j35372j66248o3025J00714J69590P7690J10782
$$ 9195 45946 91151 70830 174465 39093 -127155 -190180 -89466 80124 157814 268596
14821B68596j3641Q2490J81236J02813j78811l35254n3489P1697J4149k5158j6709
$$ 268596 254955 337445 518681 621494 442683 107429 53940 125637 139786 114628 97919
14810I7919q7408K4188M6988O1329R138j82662l4711J27875P2766n8521j14046
$$ 97919 10511 34699 81687 143016 152154 -30508 -65219 62656 135422 76901 -37145
14799c7145N8385Q3408J61851p777r982J99752o1599k16034r2971P6892L6545
$$ -37145 21240 104648 266499 258722 248740 448492 386893 170859 77888 154780 191325
14788A91325k7337j75696j89018l99382j75698Q0798K43545J05923p6041o5095
$$ 191325 163988 -11708 -200726 -600108 -775806 -695008 -451463 -345540 -421581 -486676
14778d86676j74460o9803J50264K30791P9225R0945j9732k32297j02548J34722
$$ -486676 -661136 -730939 -580675 -349884 -270659 -179714 -199446 -431743 -534291 -399569
14768c99569J30374J24958K15022L00529J40254j64576j4294Q6472r167q4893
$$ -399569 -269195 -144237 70785 371314 511568 346992 332698 419170 410003 325110
14758C25110k12614k85760o0295J09466J12742J23304J19016q9672k21530j3745
$$ 325110 112496 -173264 -233559 -124093 -11351 111953 230969 141297 -80233 -93978
14748i3978J06680r4667r7078m7317j09989O8659J3059k06312O7314K93444K94191
$$ -93978 12702 -81965 -179043 -226360 -336349 -267690 -254631 -460943 -393629 -100185 194006
14737A94006L3185j19670l2445o5567j53154J4859R9807J11241n708r8777j47245
$$ 194006 227191 107521 75076 9509 -143645 -128786 -28979 82262 76554 -22223 -169468
14726a69468l346J13441K21565J10546o4990n1263p8825l4157n289J07701K2275
$$ -169468 -172814 -59373 162192 272738 207748 156485 77660 43503 38214 145915 168190
14715A68190k82006k64850m2019L1681O1839K6902O8846J11530m7626r1076M7404
$$ 168190 -113816 -378666 -420685 -389004 -327165 -300263 -231417 -119887 -167513 -258589 -211185
14704b11185m0456M8689J96821K28181J16465j12777j01156p6069j67952n6569
$$ -211185 -251641 -202952 -6131 222050 338515 225738 124582 48513 -119439 -176008
14694a76008j7755n5493m3158n0105J1699J4569m8198J03307J39237p8195r8966
$$ -176008 -193763 -249256 -292414 -342519 -330820 -316251 -364449 -261142 -121905 -200100 -299066
14683b99066J5821N3313R9363J02400K3886N8138O5322n3173k3455j41413j05785
$$ -299066 -283245 -229932 -130569 -28169 -4283 53855 119177 66004 42549 -98864 -204649
14672b04649Q1276k4702n2642J18888o6584j27980P9814N5897J43168K21727K54081
$$ -204649 -123373 -148075 -200717 -81829 -148413 -276393 -196579 -140682 2486 224213 478294
14661D78294K48153R7912k12344l08948k34512j56142n7337j79725P5604N8173
$$ 478294 726447 824359 612015 303067 68555 -87587 -144924 -324649 -249045 -190872
14651a90872j19872j64523j02004J2459o3699K1834R2820K35481R3153k3900L5127
$$ -190872 -310744 -475267 -577271 -564812 -628511 -606677 -513857 -278376 -185223 -209123 -173996
14640a73996O1640J3497o5165J07763q7240M9990K80059q8764l57109j62831N3408
$$ -173996 -112356 -98859 -164024 -56261 -143501 -93511 186548 97784 -259325 -422156 -368748
14629c68748J24187n5775r1104l3066K7516J4047l2443R1018K90098J46862k50996
$$ -368748 -244561 -300336 -391440 -424506 -396990 -382943 -415386 -324368 -34270 112592 -138404
14618a38404o5448Q2672o9254J98215J78480J142k9357q0123j96902j94096k0917
$$ -138404 -203852 -121180 -190434 7781 186261 187403 158046 77923 -118979 -313075 -333992
14607c33992K43773K93765M8879j10509j37795o1493j37825k68066k10631m5307
$$ -333992 -90219 203546 252425 141916 4121 -57372 -195197 -463263 -673894 -719201
14597g19201L06380K48361k2737K5608J07199N8157m9582q9164p8762J02201N0997
$$ -719201 -412821 -164460 -187197 -161589 -54390 3767 -45815 -134979 -213741 -111540 -60543
14586f0543Q7468J35789n9772k415Q0114k7965r7427n9978k3038q9032k11783
$$ -60543 26925 162714 102942 100527 180641 152676 55249 -4729 -27767 -116799 -328582
14575c28582N4098J86195J31131J47862m3598n7796J04003o9595q2953r1327K3542
$$ -328582 -274484 -88289 42842 190704 147106 89310 193313 123718 40765 -50562 -27020
14564b7020M3062J15452j12146l13670j45982R3006J59824L3631J9961O546K19793
$$ -27020 16042 131494 19348 -294322 -440304 -347298 -187474 -153843 -133882 -127336 92457
14553I2457J34527j05401j67358r2281J21834J09418O6460N3293k1671R963o8415
$$ 92457 226984 121583 -45775 -138056 -16222 93196 159656 212949 191278 201241 132826
14542A32826j24392m9474J93182J43492Q1006O1723J10045j25827l65869k71113
$$ 132826 8434 -41040 152142 295634 376640 438363 548408 422581 56712 -214401
14532b14401j7181N5052J00223K03491P5532j23772j90059q9961p8099q4884J7340
$$ -214401 -231582 -176530 -76307 127184 202716 78944 -111115 -201076 -279175 -364059 -346719
14521c46719J93200J16574O659k9183O3606K22543R153j0911M5446j09313j70165
$$ -346719 -153519 -36945 -30286 -59469 4137 226680 235833 224922 270368 161055 -9110
14510i110q000R5312J35199J38213m4512j05433O5050l4799j79696j58018O6871
$$ -9110 -17110 78202 213401 351614 307102 201669 266719 231920 52224 -105794 -38923
14499c8923M1823j5330k56850k91392o01M7463J59085M00504J71251j73424j29028
$$ -38923 2900 -12430 -269280 -560672 -561273 -513810 -354725 45779 217030 43606 -85422
14488h5422m998J9115M5151J85217J62516o3585j76312k2500J59777J1173m5118
$$ -85422 -90420 -71305 -26154 159063 321579 257994 81682 59182 218959 230132 185014
14477A85014j70676k35597r7440M5638J10088J06781Q581K513J19422K90004K29180
$$ 185014 14338 -221259 -318699 -273061 -162973 -56192 -47611 -45098 74324 364328 593508
14466E93508L5471p2060p7197k04888j50342j28388j68416k8155o7410q9436p7574
$$ 593508 628979 556919 479722 274834 124492 -3896 -172312 -200467 -267877 -357313 -434887
14455d34887l0090J93188K70650J31182j62773k23163j06221j97032L1702J77301
$$ -434887 -464977 -271789 -1139 130043 -32730 -255893 -362114 -559146 -527444 -350143
14445c50143o7822q0264M0765J35189j08010j99543M8203J00538K02038K34146
$$ -350143 -417965 -498229 -457464 -322275 -430285 -629828 -581625 -481087 -279049 -44903
14435d4903J2189n0665j27226j74112Q0574J18930R2873J50477J14505M1404P429
$$ -44903 -32714 -83379 -210605 -384717 -304143 -185213 -92340 58137 172642 214046 221475
14424B21475p2466j85550k02416k7149Q9827N0916J7459K1742n5687l9151N6286
$$ 221475 149009 -36541 -238957 -266106 -176279 -125363 -107904 -86162 -141849 -181000 -124714
14413a24714K57767j7755j23524j54751j71155O744O2463n4488L9202J29966K22351
$$ -124714 133053 115298 -8226 -162977 -334132 -327388 -264925 -319413 -280211 -150245 72106
14402G2106j1835j00473Q6831J76641j03292k52353j26903j41806O3962R8583
$$ 72106 60271 -40202 46629 223270 119978 -132375 -259278 -401084 -337122 -238539
14392b38539k2086j60j7441l2272N6052K35673J66894j99048r3540J73818J27034
$$ -238539 -260625 -260785 -278226 -310498 -254446 -18773 148121 -50927 -144467 29351 156385
14381A56385J3761k2201N5636J5105m4429p4790j41456K3831K8392q8620l5262
$$ 156385 170146 147945 203581 218686 174257 99467 -41989 -18158 10234 -78386 -113648
14370a13648J43431K14879R1545k5620j38108j01714O3610J23442r8293j67859
$$ -113648 29783 244662 336207 310587 172479 70765 134375 257817 159524 -8335
14360h335o7601R7014J09544Q2157l1149j06755p7187m405J6286j3369L2481L7220
$$ -8335 -75936 21078 130622 212779 181630 74875 -2312 -6717 9569 -3800 28681 65901
14348F5901m5708j17478J25549J67652J44844J01996j06750k17166j52404J4963
$$ 65901 20193 -97285 28264 195916 340760 442756 336006 118840 -33564 -18601
14338a8601K1362J95765K25553k47329k91027m4069q378J13257J0650j86335K3193
$$ -18601 2761 198526 424079 176750 -114277 -158346 -166724 -53467 -42817 -229152 -205959
14327b05959L06782K06219o9993j62619j26960J3136k0474q9697k0775J37062
$$ -205959 100823 307042 237049 74430 -52530 -39394 -59868 -149565 -170340 -33278
14317c3278O5253K9934J8272k69958j39452J45648P5399J22236K66548J47593
$$ -33278 31975 61909 80181 -189777 -329229 -183581 -108182 14054 280602 428195
14307D28195J05340O0654Q3509n8112k50134j06127l4162o2852o9047L0212J8517
$$ 428195 533535 594189 677698 619586 369452 263325 229163 166311 97264 127476 145993
14296A45993n2287K7100J77974P4107L6797J06917k29366l31727j05323K0915
$$ 145993 93706 120806 298780 372887 409684 516601 287235 -44492 -149815 -128900
14286a28900J26857M866J11727L7649r9042p382M3500N2983k28281j97166K24141
$$ -128900 -2043 2823 114550 152199 53157 45775 89275 142258 -86023 -283189 -59048
14275e9048K32815m5943K2843k8223j64868q2361L9940k2563j82754o2228J12341
$$ -59048 173767 127824 150667 122444 -42424 -124785 -84845 -107408 -290162 -352390 -240049
14264b40049J17406O4346j05305Q8018K61578J24679k2292j10453J1841o4495
$$ -240049 -122643 -58297 -163602 -75584 185994 310673 288381 177928 189769 125274
14254A25274k55636k46909k03495K354N4071j12947n4033K12556K07240r638Q9587
$$ 125274 -130362 -377271 -580766 -578412 -524341 -637288 -691321 -478765 -271525 -281163 -191576
14243a91576O4796m3999p286J6398j64298M8731K68502n2434k52646j62567l5470
$$ -191576 -126780 -170779 -178065 -161667 -325965 -277234 -8732 -61166 -313812 -476379 -511849
14232e11849m3926M8560K20193K14066J03310n9783j47642q2842R210j10274N3342
$$ -511849 -555775 -507215 -287022 -72956 30354 -29429 -177071 -259913 -250703 -360977 -307635
14221c07635K07311K53335J4902k4237J4600j91589j79380k04167j27726K12312
$$ -307635 -100324 153011 167913 143676 158276 -33313 -212693 -416860 -544586 -332274
14211c32274M19710Q2846j63856j56474K0109N5013j4942L8922P8052n4039k28965
$$ -332274 87436 170282 6426 -150048 -129939 -74926 -89868 -50946 27106 -26933 -255898
14200b55898j88373L6442R4104P3617J85162L6487O0068K1622m3293O101r2571
$$ -255898 -444271 -407829 -313725 -240108 -54946 -18459 41609 63231 19938 26039 -66532
14189f6532j25840m3334L4643K17664K52367J18538R995k0090Q3833j20076j89146
$$ -66532 -192372 -235706 -201063 16601 268968 387506 397501 377411 461244 341168 152022
14178A52022L0846l6057k27410j55610j04690J02730K26460M0897j69964k26160
$$ 152022 182868 146811 -80599 -236209 -340899 -238169 -11709 29188 -140776 -366936
14168c66936n5271J88497L63585L21514P3546k58634k05011o9366j91895j82912
$$ -366936 -422207 -233710 129875 451389 524935 266301 61290 -8076 -199971 -382883
14158c82883j52743J55434K94537M4740O7746P8182j19178q0393J58479j00509
$$ -382883 -535626 -380192 -85655 -40915 26831 105013 -14165 -94558 63921 -36588
14148c6588l66071O8678J73791j65569j60494J0549l5245j28030J65168K95451
$$ -36588 -402659 -333981 -160190 -325759 -486253 -475704 -510949 -638979 -473811 -178360
14138a78360J43281P2129k137N3918p8846k72657l20602j63367K03285J02303
$$ -178360 -35079 37050 34913 88831 9985 -262672 -583274 -746641 -543356 -441053
14128d41053m1798Q657l7837L7760Q1222K06967J27792O4488J6882L7034K3589
$$ -441053 -482851 -474194 -512031 -474271 -393049 -186082 -58290 6198 23080 60114 83703
14117H3703q7687r4264j9051k4472J10516J90557J67613m501k47536j71546L7323
$$ 83703 -3984 -98248 -117299 -141771 -31255 159302 326915 322414 74878 -96668 -59345
14106e9345j4010q4822O307O6547j5763p6762J36544J29821Q6280j07517j52473
$$ -59345 -73355 -158177 -151870 -85323 -101086 -177848 -41304 88517 174797 67280 -85193
14095h5193o3623J24793J67607j47728j86475o5171r211P4736p8019o2035J50092
$$ -85193 -148816 -24023 143584 -4144 -190619 -255790 -265001 -190265 -268284 -330319 -180227
14084a80227J64743O1841l6675O6034J3223k73505L6010J07685L536J21331M6974
$$ -180227 -15484 46357 9682 75716 88939 -184566 -148556 -40871 -37335 83996 130970
14073A30970J1251j56624j87252q5759K43925L08819l1033l00910k50876K5800
$$ 130970 142221 -14403 -201655 -287414 -43489 265330 234297 -66613 -317489 -291689
14063b91689K04686J54623j92994m8580R0943P1098k3896k32377j68871j0423
$$ -291689 -87003 67620 -125374 -173954 -83011 -11913 -35809 -268186 -437057 -447480
14053d47480P4448n444j03314M7813J08630J64593L8140m2133j1944q6446q8922
$$ -447480 -373032 -378476 -481790 -433977 -325347 -160754 -122614 -164747 -176691 -263137 -352059
14042c52059l2174J4145M6069K05358J47705L5130J18452k9884q1488J9893J9131
$$ -352059 -384233 -370088 -324019 -118661 29044 64174 182626 152742 71254 91147 110278
14031A10278j0190q5104j58898k33362j90907j9476P1766J06494J50993n2181
$$ 110278 100088 14984 -143914 -377276 -568183 -587659 -515893 -409399 -258406 -310587
14021c10587j84460m6236J30111J48440J40062R0219N1622N0501k8561o7770K8521
$$ -310587 -495047 -541283 -411172 -262732 -122670 -32451 19171 69672 41111 -26659 1862
14010A862p5096p3700P6053j41649j92164p5370K1574J40053J45323O9928J98097
$$ 1862 -73234 -146934 -70881 -212530 -404694 -480064 -458490 -318437 -173114 -103186 94911
13999I4911Q6327P2136L4038j50031k4230N7703P220J5659m6841j86597j9309
$$ 94911 181238 253374 287412 137381 113151 170854 178074 193733 146892 -39705 -59014
13988e9014R9422n03M8133J07236p4274l92298k23469J13185O0658l658N8056
$$ -59014 40408 39905 88038 195274 121000 -271298 -494767 -381582 -320924 -324582 -266526
13977b66526O9940L0539J32042J69556O8430J198q0512N1017J54111N1919N3245
$$ -266526 -196586 -166047 -34005 135551 203981 205179 124667 175684 329795 381714 434959
13966D34959J90287Q6954j13116q4912j06770q9444o1384j26699j96821l0532
$$ 434959 625246 712200 599084 514172 407402 317958 256574 129875 -66946 -97478
13956i7478k2794j5956k9531o8997R2860K6184r5460j32254N091K49992J68385
$$ -97478 -120272 -136228 -165759 -234756 -141896 -115712 -211172 -343426 -338335 -88343 80042
13945H0042p658L1088j44531l00245j57193n0105N4018J50704l9295j71192j07368
$$ 80042 72384 103472 -41059 -341304 -498497 -548602 -494584 -343880 -383175 -554367 -661735
13934f61735q8366M0328L54090L56580J73179O223K8430O6341K7969M8032P4116
$$ -661735 -750101 -709773 -355683 897 174076 180299 208729 275070 303039 351071 425187
13923D25187j69178j31261J6224r358N9341J0165r5945j54435j9087j14073j60966
$$ 425187 256009 124748 140972 131614 190955 201120 105175 -49260 -68347 -182420 -343386
13912c43386j59520P5002K08059K9996k5188O963j28007o8195m3383J27518J54498
$$ -343386 -502906 -427904 -219845 -189849 -215037 -208074 -336081 -404276 -447659 -320141 -165643
13901a65643O8205q6615l4292j27806M7310L44033L35768J79100L1466L3274j13983
$$ -165643 -97438 -184053 -218345 -346151 -298841 45192 380960 560060 591526 624800 510817
13890E10817k91890l68450j32128N6210K13395K41022J37172Q7244j95134m03562
$$ 510817 218927 -149523 -281651 -225441 -12046 228976 366148 453392 258258 -145304
13880a45304k09641m8329L4841P1605L1629J55378L031q2858m5865m9758N2079
$$ -145304 -354945 -403274 -368433 -296828 -265199 -109821 -106790 -189648 -235513 -285271 -233192
13869b33192K7058N0200P0503m1909l8132k30219j11978R4504J49328K63150N8457
$$ -233192 -206134 -155934 -85431 -127340 -165472 -395691 -507669 -413165 -263837 -687 57770
13858E7770k9590j587j59992j18318R5767j75029j15122J50639J97424K56037
$$ 57770 28180 26593 -133399 -251717 -155950 -330979 -446101 -295462 -98038 157999
13848A57999O5185q0823j91063q1317j5963Q392Q7262k3197j96993j43668J48299
$$ 157999 223184 142361 -48702 -130019 -145982 -137590 -50328 -73525 -270518 -414186 -265887
13837b65887J67038l6957j09569p5547J01494J99028Q8643n1522o3627J8364l7287
$$ -265887 -98849 -135806 -245375 -320922 -219428 -20400 68243 16721 -46906 -28542 -65829
13826f5829L3964J12771n0187J4258J06693M2931j14727j36728p4602j0663J44035
$$ -65829 -31865 80906 30719 44977 151670 194601 79874 -56854 -131456 -142119 1916
13815A916K00525P5427J7227p0436k92788K5514J80220J70050K09072J09874j3608
$$ 1916 202441 277868 295095 224659 -68129 -42615 137605 307655 516727 626601 612993
13804F12993k1782r3265m5155J56451J01552j55151p4303o7872j63999j19667
$$ 612993 591211 497946 452791 609242 710794 555643 481340 413468 249469 129802
13794A29802n6288l5921q447l4686j04018o3066o2642q2894J5294K71817L85606
$$ 129802 73514 37593 29146 -5540 -109558 -172624 -235266 -318160 -302866 -31049 354557
13783C54557J86866M0698q1323j89836q1813r0522p9848r8469J13980J77901J96417
$$ 354557 541423 582121 500798 310962 229149 138627 58779 -39690 74290 252191 448608
13772D48608j0766k22129k49990l30549L7654K83822J15758k27565k52770J9082
$$ 448608 437842 215713 -34277 -364826 -327172 -43350 72408 -155157 -407927 -388845
13762c88845j9791n484O3404j6535j88056n9078O0067L9062J93050J34826k8490
$$ -388845 -408636 -414120 -350716 -367251 -555307 -614385 -554318 -515256 -322206 -187380 -215870
13751b15870M906m6892R6601J62122M5399K4677N0142n487j96509j11383J99406
$$ -215870 -210964 -257856 -161255 867 46266 70943 121085 115598 -80911 -192294 7112
13740G112J06379j42896L7206Q0951k4483j16871L083J594J4365R001j7266m5487
$$ 7112 113491 -29405 7801 88752 64269 -52602 -49519 -47925 -33560 -24559 -41825 -87312
13728h7312o8932q2659j06289L1427J56706K55176J24024J0165r5357K8848K15091
$$ -87312 -156244 -238903 -345192 -313765 -157059 98117 222141 232306 136949 165797 380888
13717C80888J44654p7435J2628Q8477j44738j14993o5732M545L2507k2775j77539
$$ 380888 525542 448107 460735 549212 404474 289481 223749 228294 260801 238026 60487
13706F0487k00870k04197q3462J3497O3822N6342j2474j51532l5201K21973M5955
$$ 60487 -140383 -344580 -428042 -414545 -350723 -294381 -306855 -458387 -493588 -271615 -225660
13695b25660j30129p3360J57004K97829Q2236k17428j15353O6931J44527J38004
$$ -225660 -355789 -429149 -272145 25684 107920 -109508 -224861 -157930 -13403 124601
13685A24601m5803k05219j74126N6878n2603m5317R0045P4023q753K3900J17163
$$ 124601 78798 -126421 -300547 -243669 -296272 -341589 -251544 -177521 -186274 -162374 -45211
13674d5211J11006J5642j5729o4195k10887k51289j86261n3049J71002O1602o0085
$$ -45211 65795 81437 65708 1513 -209374 -460663 -646924 -699973 -528971 -467369 -527454
13663e27454M9654J98855K38887P702q1054j41978k47747k08429K5246J49555
$$ -527454 -477800 -278945 -40058 -32356 -113410 -255388 -503135 -711564 -686318 -536763
13653e36763j6845R9601K22603J44090j8556L4304J25358l0418J2756P3842J85613
$$ -536763 -553608 -454007 -231404 -87314 -105870 -71566 53792 23374 36130 109972 295585
13642B95585J49980j09734j12267j12275k24287j50503j34366j8637n3752P8274
$$ 295585 445565 335831 223564 111289 -112998 -263501 -397867 -416504 -470256 -391982
13632c91982J95714J02292o3653L8581J42005M7702n8669o0346j13207r2454Q4124
$$ -391982 -196268 -93976 -157629 -119048 22957 70659 11990 -48356 -161563 -254017 -169893
13621a69893J35126N3355n5149p3320m2451J22441J28965j22489j66067n3577
$$ -169893 -34767 18588 -36561 -109881 -152332 -29891 99074 -23415 -189482 -243059
13611b43059N3625K93972j0786p8546J74557J25455j64721p8266M1086j01289
$$ -243059 -189434 104538 93752 15206 189763 315218 150497 72231 113317 12028
13601A2028k49529m0781j33170j54591J25866K82154J67486L11430K18523l7165
$$ 12028 -237501 -278282 -411452 -566043 -440177 -158023 9463 320893 539416 502251
13591E02251j21826q3624p497M2450q384k65070k44795j04812j51221o1470J43325
$$ 502251 380425 296801 289304 331754 323370 58300 -186495 -291307 -442528 -503998 -360673
13580c60673K56318J30708N965J23547j14646j79145J4046M6187R5255J74609
$$ -360673 -104355 26353 32318 155865 41219 -137926 -123880 -77693 17562 192171
13570A92171J8839J15184R8910m0870j12825j4383J2219j69374o8341J42533Q5607
$$ 192171 211010 326194 425104 384234 271409 257026 269245 99871 31530 174063 259670
13559B59670k3919m8640L466J18922N235k012J14697n891j05505K7947J8596j01832
$$ 259670 235751 187111 190577 309499 314734 312722 427419 421528 316023 343970 362566 260734
13547B60734j20722q2926k782N5044K1572j69080o440R3508q1327j17253n3140
$$ 260734 140012 57086 54304 109348 130920 -38160 -44600 48908 -32419 -149672 -202812
13536b02812O4482j23966r3776M8761K32591L09453J77191O3776j24115J6366
$$ -202812 -138330 -262296 -356072 -307311 -74720 234733 411924 475700 351585 367951
13526C67951J62289O4647M3532j34069k94659k59356k07237k0377K35904M34508
$$ 367951 530240 594887 638419 504350 209691 -49665 -256902 -277279 -41375 393133
13516C93133K81633r7250r0064K05266O8862k65453p2055j5462r5067j92221m9531
$$ 393133 674766 577516 487452 692718 761580 496127 424072 408610 313543 121322 71791
13505G1791J81231L0061p0519j878J06413J96766j85480k43083K7107J72723J95616
$$ 71791 253022 283083 212564 210686 317099 513865 328385 85302 112409 285132 480748
13494D80748K5648k47326k82774j44995n8107J51166J47286J00301K0180n1710
$$ 480748 506396 259070 -23704 -168699 -226806 -75640 71646 171947 192127 140417
13484A40417p0492M8225K26052O4320k11373j50533K8891K31820L89717K20537
$$ 140417 69925 118150 344202 408522 197149 46616 75507 307327 697044 917581
13474I17581K13174O1864j42555k26066j11432j18548k60858q0296q6615k42210
$$ 917581 1130755 1192619 1050064 823998 712566 594018 333160 252864 166249 -75961
13464g5961j23180J17914m6750q6284j6833J20183O0005j31142k45397Q7729L79098
$$ -75961 -199141 -81227 -127977 -214261 -231094 -110911 -50906 -182048 -427445 -339716 39382
13453C9382J62666p2029K9232N354m3614R9945J82699l1737q9147J63079K77336
$$ 39382 202048 130019 159251 164605 120991 220936 403635 371898 282751 445830 723166
13442G23166R0650k26208j94515q6121J576P1062P0799p9867k39731j54967J44427
$$ 723166 813816 587608 393093 306972 308548 379610 450409 370542 130811 -24156 120271
13431A20271J61699J4126K9187q0242j55977Q7373J68625j35803k26221L1521
$$ 120271 281970 296096 325283 245041 89064 176437 345062 209259 -16962 14559
13421A4559J79218J15333J24459k2583j5519p1810q7186k35106M101K33931J60701
$$ 14559 193777 309110 433569 410986 395467 323657 236471 1365 5466 239397 400098
13410D00098p7894j91759J1717J33831O1558O7676k65635k89114J1782K17623
$$ 400098 322204 130445 142162 275993 337551 405227 139592 -149522 -137740 79883
13400G9883K710j43647P7065L09122K19765l7269j0991J06088K6876k25379l19514
$$ 79883 82593 -61054 16011 325133 544898 507629 496638 602726 629602 404223 84709
13389H4709j50494N6336J59570J39143K12816M2130q6190N3736P6074j38553r9270
$$ 84709 -65785 -9449 150121 289264 502080 544210 458020 511756 587830 449277 350007
13378C50007L8962R7828M2832j09575P9161P6653j28359q0197j84847j84818p7024
$$ 350007 388969 486797 529629 420054 499215 575868 447509 367312 182465 -2353 -79377
13367g9377J9021J52761P7299J09521M422J19966J48619k25498j37599M3156J10719
$$ -79377 -60356 92405 169704 279225 283647 403613 552232 326734 189135 232291 343010
13356C43010J62006J57519J77702R2680k83007m69550p6396O3897O3425J59820
$$ 343010 505016 662535 840237 932917 649910 180360 103964 167861 231286 391106
13346C91106K82921J11652k53223p8685K02313K43430j1265r1264J7266j48106
$$ 391106 674027 785679 532456 453771 656084 899514 888249 796985 814251 666145
13336F66145j15063j03028j60219O3635P4260N5940j05256j57877q3728O1627
$$ 666145 551082 448054 287835 351470 425730 481670 376414 218537 134809 196436
13326A96436r1342o730K53347J24111j28795j82257m3227m1733P64j31422j88501
$$ 196436 105094 98364 351711 475822 347027 164770 121543 79810 80574 -50848 -239349
13315b39349j14408J29147K50387J85201r6135j29713K51176L38207R4078M20
$$ -239349 -353757 -224610 25777 210978 114843 -14870 236306 574513 668591 669011
13305F69011q9663j49656q6465o1494j07813j01697K5971k7961N8435J89357j01101
$$ 669011 579348 429692 343227 281733 173920 72223 98194 70233 128668 318025 216924
13294B16924q4945J19155o788Q9719J98999M797J5559N8478j82815j35375L5199
$$ 216924 131979 251134 244346 334065 533064 537861 553420 611898 429083 293708 328907
13283C28907L70896L39593j4477l20583l80082k30241q9044K97208K91290m8233
$$ 328907 699803 1039396 1024919 704336 324254 94013 4969 302177 593467 545234
13273E45234k10247k9167p5631K7865J11383k2351j10910j17439N2323Q3337Q4439
$$ 545234 334987 305820 230189 258054 369437 347086 236176 118737 171060 254397 338836
13262C38836J93709p9590N9213J19625j2710m1425r111k53109k41845L6797Q3655
$$ 338836 532545 452955 512168 631793 619083 577658 568547 315438 73593 110390 194045
13251A94045N0601J62918Q6468p4864p2344J0294L807j741L6814O0942P5638J08679
$$ 194045 244646 407564 494032 419168 346824 357118 360925 359184 395998 456940 532578 641257
13239F41257N4223J1179n6553k03302j17946k6605K7292K298j37475o9603o6387
$$ 641257 695480 706659 650106 446804 328858 302253 329545 331843 194368 124765 58378
13228E8378J4500N1930J06326J48307M0549J2534J38367K7223k26055k11849j97047
$$ 58378 72878 124808 231134 379441 419990 432524 570891 598114 372059 160210 -36837
13217c6837r1510K1836P3996M7859l4699L3170Q0862J34897J33487P4122j23865
$$ -36837 -128347 -106511 -32515 15344 -19355 13815 94677 229574 363061 437183 313318
13206C13318j20343Q3253k9317k19817M4699R1237L436n4943J03785K01730R5751
$$ 313318 192975 276228 246911 27094 71793 163030 166466 111523 215308 417038 512789
13195E12789l2268j6696Q4566j5966P956l2603R1620J91280N5581n3044q6787
$$ 512789 480521 463825 548391 532425 540381 507778 599398 790678 846259 793215 706428
13184G06428j9640j36368n7769L732J08982K98664J03267r3588m5009o2777J9259
$$ 706428 686788 550420 492651 496383 605365 904029 1007296 913708 868699 805922 825181
13173H25181l9502K6193J56540Q4978q9870j87397j42515p3404p2181N1927J52363
$$ 825181 785679 811872 968412 1053390 963520 776123 633608 560204 488023 539950 692313
13162F92313J016J7800J12747o932j26952k1949R8696J16331K47166J94427n1349
$$ 692313 693329 711129 823876 816944 689992 668043 766739 883070 1130236 1324663 1273314
13151A273314j58990j83720j04853N191L9421O0105K15211l8438o0676J03450
$$ 1273314 1114324 930604 825751 830942 870363 930468 1145679 1107241 1046565 1150015
13141A150015J6303k35801k02392L4715k532k06449n3952K37048Q0694l6602J0169
$$ 1150015 1166318 930517 728125 762840 760308 553859 499907 736955 817649 781047 791216
13130G91216j53729j30425P9674J77699J5948n0131N71J08045J79151j6101L994
$$ 791216 637487 507062 586736 764435 780383 730252 730823 838868 1018019 1001918 1005912
13119A005912o6720m9584J17201M4130P0138m0394j59257o1765O0567R6195J32928
$$ 1005912 939192 889608 1006809 1050939 1121077 1080683 921426 859661 920228 1016423 1149351
13108A149351K03891K794j25217j16967k4001l6936j34179q1107o7719J15405
$$ 1149351 1353242 1356036 1230819 1113852 1089851 1052915 918736 837629 769910 885315
13098H85315J29162l1150j43096o5089m4724q2739M0279L9820J03100L21225J07687
$$ 885315 1014477 983327 840231 775142 730418 647679 687958 727778 830878 1152103 1259790
13087A259790j22087j77218j74266K40796L82827J54647J12418l6520Q477n9269
$$ 1259790 1137703 960485 786219 1027015 1409842 1564489 1676907 1640387 1648864 1589595
13077A589595j30596j27068p4792J8369R4113K46194m4765J5199J66570Q3431
$$ 1589595 1458999 1331931 1257139 1275508 1369621 1615815 1571050 1586249 1752819 1836250
13067A836250m2315K6468k32504l22556l007J5358O0407K55927J62552R0934P8710
$$ 1836250 1793935 1820403 1587899 1265343 1262336 1277694 1338101 1594028 1756580 1847514 1926224
13056A926224k2711r4925K2465J22675J33943J70422R9249N7623J5831j97449
$$ 1926224 1903513 1808588 1831053 1953728 2087671 2258093 2357342 2414965 2430796 2233347
13046B233347k69040Q3437R3475l6060k3898P2857R6857j6514j20476l3847O0506
$$ 2233347 1964307 2047744 2141219 2105159 2081261 2154118 2250975 2234461 2113985 2080138 2140644
13035B140644J81921K36674L31720J94057o601L6285J14706K590j01650j29177
$$ 2140644 2322565 2559239 2890959 3085016 3078415 3114700 3229406 3231996 3130346 3001169
13025C001169o2116J44033M6896O3472K19029J07658o8574J06852K52625Q8470
$$ 3001169 2939053 3083086 3129982 3193454 3412483 3520141 3451567 3558419 3811044 3899514
13015C899514k5190N6236R2162m2651R938K24636K70490L33410L82470K48644
$$ 3899514 3874324 3930560 4022722 3980071 3990009 4214645 4485135 4818545 5201015 5449659
13005E449659K69572K80117K01641K13800M44584N15358O27261O70540O27718
$$ 5449659 5719231 5999348 6200989 6414789 6859373 7374731 8001992 8672532 9300250
12996I300250P85166R62089J083202J284552J540141J737081J963047K315849
$$ 9300250 10085416 11047505 12130707 13415259 14955400 16692481 18655528 20971377
12988B0971377L018242L986485N184193O172558P605197R887859J2925058J6908367
$$ 20971377 23989619 27976104 33160297 39332855 46938052 56825911 69750969 86659336
12980H6659336K2139513K9104548L7604501M4018880L9448848J5656779j8688900
$$ 86659336 108798849 137903397 175507898 219526778 258975626 274632405 255943505
12973B55943505m1039159m3731739l6528682k7818925k0469753j5233648j1640173
$$ 255943505 214904346 171172607 134643925 106825000 86355247 71121599 59481426
12966E9481426r077711p162109n639993m545625l833139l126220k704056k222870
$$ 59481426 50403715 43241606 37601613 33055988 29222849 26096629 23392573 21169703
12958B1169703j945514j938775j583931j228969j270916r78420p14333o29989
$$ 21169703 19224189 17285414 15701483 14472514 13201598 12223178 11508845 10878856
12950A0878856n50079n41412n75703n23188n24081o73997m84568l57589j54958
$$ 10878856 10328777 9787365 9211662 8688474 8164393 7490396 7005828 6648239 6493281
12941F493281j08632R7755K26202J8824j77429j88115j53006m2686J45238Q4227
$$ 6493281 6384649 6482404 6708606 6727430 6550001 6361886 6208880 6166194 6311432 6395659
12931F395659q3201j51067J8939K59589L41525J55432J16788M300J1372K48054
$$ 6395659 6312458 6161391 6180330 6439919 6781444 6936876 7053664 7057964 7069336 7317390
12921G317390N13188R36441J182236J119267R13842N18381m6901m62293k65768
$$ 7317390 7830578 8767019 9949255 11068522 11982364 12500745 12453844 11991551 11725783
12912A1725783k24J76879J68467M01631O31565Q70284R89557J274981J825995
$$ 11725783 11725559 11902438 12070905 12472536 13104101 13974385 14963942 16238923 18064918
12903A8064918K214492K626434L300127M006949N028255O193188Q063752J0579699
$$ 18064918 20279410 22905844 26205971 30212920 35241175 41434363 49498115 60077814
12895F0077814J3749869J8016042K3843606L1876693M0937157M5991038L7072504
$$ 60077814 73827683 91843725 115687331 147564024 188501181 234492219 271564723
12888B71564723P273854k7797272m5123046m3738739l4948602k6129093j9297392
$$ 271564723 278838577 251041305 205918259 162179520 127230918 101101825 81804433
12881H1804433j4270956j0792835q371930o569214n378103m464010l891941l287846
$$ 81804433 67533477 56740642 48368712 41799498 36421395 31957385 28065444 24777598
12873B4777598k525782k215515j877349j460278j191090j403259j308936r99131
$$ 24777598 22251816 20036301 18158952 16698674 15507584 14104325 12795389 11796258
12865A1796258p01965n94936p40481p22019n48160l80543k40926n8590l16355
$$ 11796258 11094293 10499357 9758876 9036857 8488697 8108154 7867228 7808638 7492283
12856G492283n86476l74683J368r4981l2555l105j52495j90711P5299r5011k75799
$$ 7492283 6905807 6531124 6532492 6437511 6404956 6401851 6249356 6058645 6133944 6038933 5763134
12845E763134k74230J7788J45412Q0202N8701K8085O2538n4209L6700J56079N2545
$$ 5763134 5488904 5506692 5652104 5732306 5791007 5819092 5881630 5827421 5864121 6020200 6072745
12834F072745o7096Q1892K32179K04219L84560M40076K57942K70903N90842O70412
$$ 6072745 6005649 6087541 6319720 6523939 6908499 7348575 7606517 7877420 8468262 9138674
12824I138674N60421N77181O68819J014789J307189J268476J413522J798807K276038
$$ 9138674 9699095 10276276 10945095 11959884 13267073 14535549 15949071 17747878 20023916
12815B0023916K884048L623618M415827N389517O610306Q453548J1268299J4994556
$$ 20023916 22907964 26531582 30947409 36336926 42947232 51400780 62669079 77663635
12807G7663635J9320515K5381172L3333928M1623539M3810088K9765039j963145
$$ 77663635 96984150 122365322 155699250 197322789 241132877 270897916 268934771
12800B68934771l2481341m4227537m0781568l2327293k4103159j7741344j3467831
$$ 268934771 236453430 192225893 151444325 119117032 95013873 77272529 63804698
12793F3804698j0358881p834321o233161n410104m565945l612602l007701k609597
$$ 63804698 53445817 45611496 39378335 33968231 29402286 25789684 22781983 20172386
12785B0172386j987745j683710j660985j356502j249523j192882r04311o90831
$$ 20172386 18184641 16500931 14839946 13483444 12233921 11041039 10136728 9445897
12777I445897p14178p34822n16778m35127m60479n35479m70568l09348m06317
$$ 9445897 8731719 7996897 7480119 7044992 6584513 6049034 5578466 5269118 4862801
12768D862801m84164p7040r1962l63434m08520l47767k50121l62712k95682O4884
$$ 4862801 4378637 4301597 4209635 3846201 3437681 3089914 2839793 2477081 2181399 2246283
12758B246283J51040m1444k41148j33459j52869L2960J43052r3509q9076l3704
$$ 2246283 2397323 2355879 2114731 1981272 1828403 1861363 2004415 1910906 1821830 1788126
12748A788126o7928j9183M616L8810O9097L4447j11524k48848j92965j58988o6061
$$ 1788126 1720198 1701015 1705631 1744441 1813538 1847985 1736461 1487613 1294648 1135660 1069599
12737A069599N7733p4888j61596j24650j21050Q4748K04443J22154j95646q9167
$$ 1069599 1127332 1052444 890848 766198 645148 729896 934339 1056493 860847 771680
12727G71680P8201J82543R8468M3544L9686k4681O1488K1047j34037m24754j45573
$$ 771680 849881 1032424 1130892 1174436 1214122 1189441 1250929 1271976 1137939 713185 567612
12716E67612K9575j45169k4929J51510L33808J29491j14088j04936j01203j29316
$$ 567612 597187 452018 427089 578599 912407 1041898 927810 822874 721671 592355
12706E92355r2364o9368L3564J72264N4243l7972p565p89k54168k23332k06965
$$ 592355 499991 430623 464187 636451 690694 652722 645157 644368 390200 166868 -40097
12695d0097J7378K86980J57999N6108j09185k9939j9284K0926o8922K130J24426
$$ -40097 -22719 264261 422260 478368 369183 339244 319960 340886 271964 274094 398520
12684C98520J15466J32276N6337n5580j57942j62091j36129r8043J10636J68702
$$ 398520 513986 646262 702599 647019 489077 326986 190857 92814 203450 372152
12674C72152q1111k37728j03116J15737K7352p4903n4842K54056N59800J45922
$$ 372152 291041 53313 -49803 65934 93286 18383 -36459 217597 777397 923319
12664I23319k83499l74080j31110q7926p4754K11885K99349K47575m9759j2725
$$ 923319 639820 265740 134630 46704 -28050 183835 483184 730759 681000 668275
12654F68275m974j80147k17735j95174n6368j5362k9907J18592J27475j62999
$$ 668275 663301 483154 265419 70245 13877 -1485 -31392 87200 214675 51676
12644E1676q0058J98227N0374m4245o2845j0543J59556J26236J83947N9373j75074
$$ 51676 -28382 169845 220219 175974 113129 102586 262142 388378 572325 631698 456624
12633D56624n1604K0309L3759p813q5201n5961k37298p9780j22162j19657N4277
$$ 456624 405020 425329 459088 451275 366074 310113 72815 -6965 -129127 -248784 -194507
12622a94507r152k3538J70463o3187j22295Q9997N7453q2595n245N4080j9034
$$ -194507 -203659 -227197 -56734 -119921 -242216 -152219 -94766 -177361 -182606 -128526 -147560
12611a47560J30650J05630k0249l7600j3075O1711j1453j14631R5360R6129O1949
$$ -147560 -16910 88720 68471 30871 17796 79507 68054 -46577 48783 144912 206861
12600B06861L9065k04883q8154m866o2821n5909r0979m9597J87242K92809K24539
$$ 206861 245926 41043 -47111 -51977 -114798 -170707 -261686 -311283 -124041 168768 393307
12589C93307J9494P9544K9754k32874j51785N2852J77542P6481r801N97l9072
$$ 393307 412801 492345 522099 289225 137440 190292 367834 444315 434514 435111 396039
12578C96039p1028O9178J0104j77423k4065J3317K14562P5982k07269j29280J4449
$$ 396039 325011 394189 404293 226870 202805 216122 430684 506666 299397 170117 184566
12567A84566J58663J77782J8494k91469k57870j18608K7753J09280J4295K5733
$$ 184566 343229 521011 539505 248036 -9834 -128442 -100689 8591 22886 48619
12557D8619J50985o2402r4006P8544J03641P1493J43026J85371m5192k74965m7371
$$ 48619 199604 137202 43196 121740 225381 296874 439900 625271 580079 305114 257743
12546B57743m1328j28654n2652j12396j28837o863P2067K91331L31315j6876l53543
$$ 257743 216415 87761 35109 -77287 -206124 -212987 -140920 150411 481726 464850 111307
12535A11307j60416J79503J32111Q0352j1122j85710p8233j10027q3636j41995
$$ 111307 -49109 130394 262505 342857 331735 146025 67792 -42235 -125871 -267866
12525b67866q8141N6852Q4025R3820N4192J7685o3727k7117q4812N7764K30604
$$ -267866 -356007 -299155 -215130 -121310 -67118 -49433 -113160 -140277 -225089 -167325 63279
12514F3279K68099P6591n076k31509m26977k19028J93787K56023O7368j03078
$$ 63279 331378 407969 402893 171384 -255593 -474621 -280834 -24811 42557 -60521
12504f0521j67639j16454J55080K33330q8869L6966K21257K68211K17826p270
$$ -60521 -228160 -344614 -189534 43796 -45073 -8107 213150 481361 699187 691917
12494F91917k39042j20530k4263O2321L031j53923k9411K43189L8939j04157o1649
$$ 691917 452875 332345 308082 370403 373434 219511 190100 433289 472228 368071 306422
12483C06422j18821l4875N3983q503l9956K0620l2860Q539k8702j14848j44956
$$ 306422 187601 152726 206709 198206 158250 178870 146010 154549 125847 10999 -133957
12472a33957j1664O7626M7828N7940M901k2848J04009J84223L2696o7055L5586
$$ -133957 -145621 -77995 -30167 27773 32674 9826 113835 298058 330754 263699 299285
12461B99285P569l50415j88662N9239N7458R7293J23985q662l2476J83364M7456
$$ 299285 306854 -43561 -232223 -172984 -115526 -18233 105752 97090 64614 247978 295434
12450B95434j14527M9106o7969j18169j19949m4595N105L9020J1505L4710J6169
$$ 295434 180907 230013 162044 43875 -76074 -120669 -115564 -76544 -65039 -30329 -14160
12439a4160J17314m7760l7428J51153J63415N9628j71613m4108N0890m9343m4658
$$ -14160 103154 55394 17966 169119 332534 392162 220549 176441 227331 177988 133330
12428A33330q0252l0620O7840j54926j51707p248J2101q7961j95318J11824J23203
$$ 133330 53078 22458 90298 -64628 -216335 -223583 -211482 -299443 -494761 -382937 -259734
12417b59734r4266j38379O73O5208J28200N6357j51325k04691j00151J42105K53497
$$ -259734 -354000 -492379 -491706 -426498 -298298 -241941 -393266 -597957 -698108 -556003 -302506
12406c02506Q1864K9609l9329L4458K19161Q5778K2640Q3673M9849j29293j66540
$$ -302506 -220642 -191033 -230362 -195904 23257 109035 131675 215348 265197 135904 -30636
12395c0636q0789j75584l4924M318L7227J65322R5471M436p9239n5068J00988
$$ -30636 -111425 -287009 -321933 -317615 -280388 -115066 -19595 -15159 -94398 -149466 -48478
12384d8478L3955j17126q3483N1194K47097P8334j07208j01797N8628K5107J38864
$$ -48478 -14523 -131649 -215132 -163938 83159 161493 54285 -47512 11116 36223 175087
12373A75087M4947j82512j67697M408J26128J70869L41402k34l70838k82424j42081
$$ 175087 220034 37522 -130175 -125767 361 171230 512632 512398 141560 -140864 -282945
12362b82945l4493K23277K154j17859o8453L8671M3484J6920J14067r607m7022
$$ -282945 -317438 -94161 -92007 -209866 -278319 -239648 -196164 -179244 -65177 -74784 -121806
12351a21806L1252J26724P5179J4590k4858o8843n5662O9990M7007J5745r3651
$$ -121806 -90554 36170 111349 125939 101081 32238 -23424 46566 93573 109318 15667
12340A5667k7018J25535J66337K2192M4412l7577j51458j16502q0408k43050q4175
$$ 15667 -11351 114184 280521 302713 347125 309548 158090 41588 -38820 -281870 -366045
12329c66045J02054J56128o0397L4560M7457J36384j5066j49689J01246L0063
$$ -366045 -263991 -107863 -168260 -133700 -86243 50141 35075 -114614 -13368 16695
12319A6695m1352n0334j53939r9286l4731q5068O0686J21862K01446J88057K05807
$$ 16695 -24657 -74991 -228930 -328216 -362947 -448015 -387329 -265467 -64021 124036 329843
12308C29843J82822L0446j39133j77061j06447L030n4285q3138j51544O4726J94224
$$ 329843 512665 543111 403978 226917 120470 123500 69215 -13923 -165467 -100741 93483
12297I3483K04746p5413l80731j00486P8048J42104K34643J5646k56317k35816
$$ 93483 298229 222816 -157915 -258401 -180353 -38249 196394 212040 -44277 -280093
12287b80093J501K18220K92026N8722r2783n6773p2008j24664r3889O0488J17759
$$ -280093 -278592 -60372 231654 290376 197593 140820 68812 -55852 -149741 -89253 28506
12276B8506k7558o7235J9963p9969j94433j87552j08882J5609J11683J3244p6481
$$ 28506 948 -66287 -46324 -126293 -320726 -508278 -617160 -601551 -489868 -476624 -553105
12265e53105p7556J22494J87874p963Q19m4027J61240L44310L08388O4511j50917
$$ -553105 -630661 -508167 -320293 -328256 -327437 -371464 -210224 134086 442474 506985 356068
12254C56068j43260l4294J6639j99311r2203m5519r026K29614J62660J0278j7015
$$ 356068 212808 178514 195153 -4158 -96361 -141880 -150906 78708 241368 251646 234631
12243B34631r1442j19162j12488o0211J9472J77722L30683K00894m8714j69756
$$ 234631 143189 24027 -88461 -148672 -129200 48522 379205 580099 531385 361629
12233C61629k11224j00553j83028k54670L505Q5098o4280L2605N4869R8327J36005
$$ 361629 150405 49852 -133176 -387846 -384341 -299243 -363523 -330918 -276049 -177722 -41717
12222d1717Q7295m331p7748J22956j4705j88110n0162N2842L0111k2526J96495
$$ -41717 45578 41247 -36501 86455 71750 -116360 -166522 -113680 -83569 -106095 90400
12211I0400J55174k0776k46726j98352O681J90338J25641j98370l51198r8429
$$ 90400 245574 224798 -21928 -220280 -213599 -23261 102380 -95990 -447188 -545617
12201e45617Q0688J64618J02499m0485m2326N7723Q4759K2317Q7278j176q4421
$$ -545617 -464929 -300311 -197812 -238297 -280623 -222900 -138141 -115824 -28546 -29722 -114143
12190a14143K6927J18244J42402J5264n5803n84o5360j41646j6573J68380K22945
$$ -114143 -87216 31028 173430 188694 132891 132307 66947 -74699 -91272 77108 300053
12179C00053N8758k72005j11047p2947j0840J82141J84381k2299k09409j30201
$$ 300053 358811 86806 -24241 -97188 -108028 74113 258494 236195 26786 -103415
12169a03415j26500K3749K10727J37969M874K9383N481Q879j11510j37315l351
$$ -103415 -229915 -206166 4561 142530 147404 176787 182268 191147 79637 -57678 -61029
12158f1029J3875j76907k0053P1398L5375J16860J71115K1080j89370j51211L8132
$$ -61029 -47154 -224061 -244114 -172716 -137341 -20481 150634 171714 -17656 -168867 -130735
12147a30735p172j19905K303M860j11675j9589R7253J8403J21963J32913r656
$$ -130735 -137907 -257812 -255509 -250649 -362324 -381913 -284660 -266257 -144294 -11381 -21037
12136b1037j08004k42418J8483K26134J74318J28451r2506j13018j90150j70748
$$ -21037 -129041 -371459 -352976 -126842 47476 175927 83421 -29597 -219747 -390495
12126c90495L6332K34694J63419j34808j77793m2240L2965J26286N472Q0623Q1834
$$ -390495 -354163 -119469 43950 -90858 -268651 -310891 -277926 -151640 -146168 -65545 16289
12115A6289L2882r4967j79007j7783M8410J07388m7991j23658k7335j98529J7275
$$ 16289 49171 -45796 -224803 -242586 -194176 -86788 -134779 -258437 -285772 -484301 -467026
12104d67026K72430J1389n4546N273L6025J00505M1781j02294j64680j68060J05279
$$ -467026 -194596 -183207 -237753 -232480 -196455 -95950 -54169 -156463 -321143 -489203 -383924
12093c83924K31510J53317K7906q649j31846q1466o7252j0367J37171l6383n580
$$ -383924 -152414 903 28809 20160 -111686 -193152 -260404 -270771 -133600 -169983 -175563
12082a75563P4943l1557J4907J94909K29290M4988p9947j65950k41353n9959r3994
$$ -175563 -100620 -132177 -117270 77639 306929 351917 271970 106020 -135333 -195292 -289286
12071b89286r1160J9597K17387K04990K9525j02402r7919p7788k15826J0649K47176
$$ -289286 -380446 -360849 -143462 61528 91053 -11349 -109268 -187056 -402882 -392233 -145057
12060a45057K34555J0940r3004j5641j2961j4004Q033Q1111K07695J37178m3848
$$ -145057 89498 100438 7434 -8207 -21168 -35172 -27139 53972 261667 398845 354997
12049C54997p3600J55117J43910Q4594L3610j04240j52156r7147n5435Q590J67871
$$ 354997 281397 436514 580424 665018 698628 594388 442232 345085 289650 298240 466111
12038D66111M0729j10556j01958r7843K9814K4253l1407Q031M0932j82277k14847
$$ 466111 506840 396284 294326 196483 226297 250550 219143 227174 268106 85829 -129018
12027a29018r224Q4948O4273q252L5263j8916q7607r6291J41294J76389Q869m2265
$$ -129018 -138242 -53294 10979 2727 37990 19074 -68533 -164824 -23530 152859 161728 119463
12015A19463o5083O5484K10292K0643L7084j00288n1910J14343o3303j89089k57745
$$ 119463 54380 119864 330156 350799 387883 287595 235685 350028 286725 97636 -160109
12004a60109k03659p8251J74844J87747L8299N4748K71651K8658j74953m802j45618
$$ -160109 -363768 -442019 -267175 -79428 -41129 13619 285270 313928 138975 134173 -11445
11993a1445l2825J05551Q3080N6574Q3642l4999J20246J00507k475o8796m3443
$$ -11445 -44270 61281 144361 200935 284577 249578 369824 470331 467856 399060 355617
11982C55617j92797o4714R7242O0369Q9606j337j68287j57477m7294j30198j85943
$$ 355617 162820 98106 195348 255717 345323 343986 175699 18222 -29072 -159270 -345213
11971c45213p9512Q2104K42264J43153R346q7964k19767j95173J07711J83039
$$ -345213 -424725 -342621 -100357 42796 52142 -35822 -255589 -450762 -343051 -160012
11961a60012p5987p8618m9843j78227o4606J49896K75316J8782r7230o8256l1867
$$ -160012 -235999 -314617 -364460 -542687 -607293 -457397 -182081 -163299 -260529 -328785 -360652
11950c60652J82086J63388k1165j41809O1198n9523J0336J56573l7366p8105J10798
$$ -360652 -178566 -15178 -36343 -178152 -116954 -176477 -166141 -9568 -46934 -125039 -14241
11939a4241J01856L6796j11023j85361J6683J55700K08771p2222j41411n5096
$$ -14241 87615 124411 13388 -171973 -155290 410 209181 136959 -4452 -59548
11929e9548O005L793k11210k31151J09006K59351J73634J40285Q7795M4555j88572
$$ -59548 -53543 -49750 -260960 -492111 -383105 -123754 49880 190165 277960 322515 133943
11918A33943j78869j61734j05469l6455J5410J28833j8050J21919L88959N7077
$$ 133943 -44926 -206660 -312129 -348584 -333174 -204341 -222391 -100472 288487 345564
11908C45564r7110k18031l07413j28655L7288J43570P0292R827J09061K53663
$$ 345564 248454 30423 -276990 -405645 -368357 -224787 -154495 -144668 -35607 218056
11898B18056n9556j27851q069n3643J58052J04768j59770p5211J86999Q8200J32834
$$ 218056 158500 30649 22580 -31063 126989 231757 71987 -3224 183775 271975 404809
11887D04809O3049j38685j47305p6291j48784j34880r4497p3956j6123Q9960N3447
$$ 404809 467858 329173 181868 105577 -43207 -178087 -272584 -346540 -362663 -272703 -219256
11876b19256j9256M0176J19399K763j19413j9923m4562j40610m019L78419L29856
$$ -219256 -238512 -198336 -78937 -76174 -195587 -215510 -260072 -400682 -404701 -26282 303574
11865C03574J5018r0421j74018l10820q635J42479L7360k00899k52720J87646
$$ 303574 318592 228171 54153 -256667 -265302 -122823 -85463 -286362 -539082 -351436
11855c51436L68292K38789P6425j71475k13209j00430p168O0694k4711j63949
$$ -351436 16856 255645 332070 160595 -52614 -153044 -160212 -99518 -124229 -288178
11845b88178m8139J45058K48767J32912l2894J8271q310j02579p9713n5009m5132
$$ -288178 -336317 -191259 57508 190420 157526 175797 167487 64908 -14805 -69814 -114946
11834a14946P269J18095k0600j19748r3704l2676K66332J90969j72746j59159
$$ -114946 -107677 10418 -10182 -129930 -223634 -256310 10022 200991 28245 -130914
11824a30914p9199J3393n615L0197J60000P4675n4946j74376o4797K4066J3678
$$ -130914 -210113 -196720 -202335 -172138 -12138 62537 7591 -166785 -231582 -207516 -193838
11813a93838J13660J10263k4148r4739J1977J17253J61297m5139j61621k26715
$$ -193838 -80178 30085 5937 -88802 -76825 40428 201725 156586 -5035 -231750
11803b31750r3774O2706j1145q6203j57152J86974K81954J45283K1223J5417N0266
$$ -231750 -325524 -262818 -273963 -360166 -517318 -330344 -48390 96893 118116 133533 183799
11792A83799o8214R410J05960K38567R2970r0577j27793j22620p6958J55236K13895
$$ 183799 115585 124995 230955 469522 562492 471915 344122 221502 144544 299780 513675
11781E13675P7168l2577j07617k43320k38562k07839k55662j55833Q018J60603
$$ 513675 590843 558266 450649 207329 -31233 -239072 -494734 -650567 -642549 -481946
11771d81946Q1650Q5610J42516j43678n5703L55639J85522r940r5640m0710j39401
$$ -481946 -400296 -314686 -172170 -315848 -371551 -15912 169610 159670 64030 23320 -116081
11760a16081j06672J24385J53647J73095m0836l07050k95791k08530J20969K93155
$$ -116081 -222753 -98368 55279 228374 187538 -119512 -415303 -623833 -502864 -209709
11750b09709J78726p9931k67896j6879L76249K23762j4324N4161O6998k9318j18771
$$ -209709 -30983 -110914 -378810 -395689 -19440 204322 189998 244159 311157 281839 163068
11739A63068R4327K20380J02651N6861k09810j72663R4949Q6385m6682j51248
$$ 163068 257395 477775 580426 637287 427477 254814 349763 436148 389466 238218
11729B38218j37868k33056o8636l7780J27830K51324J41965o8916k6070m927j37471
$$ 238218 100350 -132706 -201342 -239122 -111292 140032 281997 213081 187011 182084 44613
11718D4613r7547j26400K2437O3736J60329Q4473M7086r3960m27537l4557L60054
$$ 44613 -52934 -179334 -156897 -93161 67168 151641 198727 104767 -322770 -357327 2727
11707B727J75612K2511l3006j22049p2596N2864J77966L10887j34488j34532J81865
$$ 2727 178339 200850 167844 45795 -26801 26063 204029 514916 380428 245896 427761
11696D27761j8419j69587l4550k4179k715l6833q3664j5030O2754L7372l9149
$$ 427761 409342 239755 205205 181026 178311 141478 57814 42784 105538 142910 103761
11685A03761j4136p6888j18770l0088O5078R9186M5617m8300O200M396M793J06456
$$ 103761 89625 12737 -106033 -136121 -71043 28143 73760 25460 31660 36056 40849 147305
11673A47305K25097K15457q5600k09396j05127O2640J20211L04010J96729j91952
$$ 147305 372402 587859 502259 292863 187736 250376 370587 674597 871326 679374
11663F79374j77111j20736k94149k51119j17897R140Q7189P1576J90350J04581
$$ 679374 502263 381527 87378 -163741 -281638 -272498 -185309 -113733 76617 181198
11653A81198j39564j51481k2748O2657J04369K2800j49405j18839J11896J49443
$$ 181198 41634 -109847 -132595 -69938 34431 57231 -92174 -211013 -99117 50326
11643E0326J41946P6830O7538R383j21158j9309o031j19035J17179K75738Q9289
$$ 50326 192272 269102 336640 346023 224865 205556 199525 80490 197669 473407 562696
11632E62696o2151k1731j8152j38063M111m522k46361k86171n2532M3128J21702
$$ 562696 500545 478814 460662 322599 326710 322188 75827 -210344 -262876 -219748 -98046
11621i8046L25613J20629J48718K30756N1524r9470j86242j72894j06945Q7122
$$ -98046 227567 348196 496914 727670 779194 679724 493482 320588 213643 300765
11611C00765Q3731R5706Q8935L3507j29432j74271p8269O4181J82594R7250j06202
$$ 300765 384496 480202 569137 602644 473212 298941 220672 284853 467447 564697 458495
11600D58495k9277L5920j58590k30246j52274j64585R9219L3761N7939K57724
$$ 458495 429218 465138 306548 76302 -75972 -240557 -141338 -107577 -49638 208086
11590B08086J69207k3793N1662J86509J19298k1156J4293J65203J87453o6416
$$ 208086 377293 353500 405162 591671 710969 689813 704106 869309 1056762 990346
11580I90346k26891l5691K20640J70546K57953P7814j74619j1761J54926J53892
$$ 990346 763455 727764 948404 1118950 1376903 1454717 1280098 1268337 1423263 1577155
11570A577155J41977q9482j64112j6855o1530p3652N9136J17812Q0312J43680
$$ 1577155 1719132 1629650 1465538 1448683 1387153 1313501 1372637 1490449 1570761 1714441
11560A714441P5029J833L00K2277k8788K32920L92915J13728q7213j28225R0846
$$ 1714441 1789470 1791303 1791603 1813880 1785092 2018012 2410927 2524655 2437442 2309217 2400063
11549B400063L48234M10965M65633K69277K36243L56531M23997M62648N98861
$$ 2400063 2748297 3159262 3624895 3894172 4130415 4486946 4910943 5373591 5972452
11540E972452L88503P25463J245044J225906J248245J417254J550151J612415
$$ 5972452 6360955 7086418 8331462 9557368 10805613 12222867 13773018 15385433
11532A5385433J573605J100340L55155j22662o76130j215108j578871j680978
$$ 15385433 16959038 18059378 18414533 18291871 17615741 16400633 14821762 13140784
11524A3140784j344284j065714r95673q50389m97882j31628L3283q5760n83206
$$ 13140784 11796500 10730786 9735113 8884724 8386842 8255214 8288497 8202737 7619531
11515G619531j044302j094804p63616n69224p52506o02335k84798j27157m8769
$$ 7619531 6575229 5480425 4716809 4147585 3395079 2792744 2507946 2380789 2332020
11506B332020q1626r2285l7278p9332k2869J12257j19394j92102l02607k71954
$$ 2332020 2250394 2158109 2120831 2041499 2018630 2130887 2011493 1819391 1516784 1244830
11496A244830k62356k24555n9753P9127O002R16J80380K3187m3156K3445P2667
$$ 1244830 982474 757919 698166 777293 783295 784211 964591 987778 944622 968067 1040734
11485A040734R315n2813j69081j12781n6207j14442j90925Q869n462L174J48769
$$ 1040734 1050049 997236 828155 715374 659167 544725 353800 362669 357207 360381 509150
11474E09150j25696k0822o1834j14141N2085J96898P3385j92029p1728K04325
$$ 509150 383454 362632 300798 186657 238742 435640 509025 316996 245268 449593
11464D49593K9183j95271o0901p3080n6173L2449P5823J04880R6282Q2892l0401
$$ 449593 478776 283505 222604 149524 93351 125800 201623 306503 402785 485677 455276
11453D55276j12688j00058R867q5068l21371q3335K08384J72590O49o8941j30576
$$ 455276 342588 242530 252397 167329 -154042 -237377 -28993 143597 144246 75305 -55271
11442e5271l06802j20558J86372J47380J22191J3937O6169J33260Q1771J2989
$$ -55271 -362073 -482631 -296259 -148879 -26688 -12751 53418 186678 268449 281438
11432B81438L6227P1579q7358k9021Q1551l716p7865N0066O0990k98j3183J30637
$$ 281438 317665 389244 301886 272865 354416 350700 272835 322901 383891 383593 370410 501047
11420E01047J00490p0219j76056J31656J24058j55891k26597j72645l6543L856
$$ 501047 601537 531318 355262 486918 610976 455085 228488 55843 19300 23156
11410B3156j31325j88074k00176Q0640K97747K66876J97935J50512j13903l41374
$$ 23156 -108169 -296243 -496419 -415779 -118032 148844 346779 497291 383388 42014
11400D2014k41192q4722k6908K57930L56050j70195j98281j7457k0664J43559
$$ 42014 -199178 -283900 -310808 -52878 303172 132977 -65304 -82761 -103425 40134
11390D0134R5929P395o4170j23652k71728j44901K42890L58501R0142j21670j82257
$$ 40134 136063 143458 79288 -44364 -316092 -460993 -218103 140398 230540 108870 -73387
11379g3387o0353J5385k01434p0038K67277J27859r9237q4049R0926J63413Q9677
$$ -73387 -133740 -118355 -319789 -389827 -122550 5309 -93928 -177977 -87051 76362 166039
11368A66039p4720q7300P6887J23574o3216k17794j79628M9883Q8642P314K41671
$$ 166039 91319 4019 80906 204480 141264 -76530 -256158 -206275 -117633 -110319 131352
11357A31352K70053J31823n7209j73654j7295J19488k6871k43140k76922j94250
$$ 131352 401405 533228 476019 302365 285070 404558 377687 134547 -142375 -336625
11347c36625r155J41881R7158K2155Q8656O7811l1962j4292L7057M9361P2974
$$ -336625 -345780 -203899 -106741 -84586 4070 71881 39919 25627 62684 112045 185019
11336A85019k8112r6791M6838J42263k050k02731k62214j40254P9079Q2093p8635
$$ 185019 156907 60116 106954 249217 247167 44436 -217778 -358032 -278953 -196860 -275495
11325b75495j36851k16244j33873O2019K02993K06598k6982p9402j23406M3165
$$ -275495 -412346 -628590 -762463 -700444 -497451 -290853 -317835 -397237 -520643 -477478
11315d77478J98865L04053J92897K7161j24762j18365n1355q354o5067k97263
$$ -477478 -278613 25440 218337 245498 120736 2371 -48984 -57338 -122405 -419668
11305d19668o0739J77203Q39J50957J83392J25142J18736m6673L7479J15868n5833
$$ -419668 -480407 -303204 -302365 -151408 31984 157126 275862 229189 266668 382536 326703
11294C26703j98447j38005j70155k44916m8381J46366k4687J0013J83272J60237
$$ 326703 128256 -9749 -179904 -424820 -473201 -326835 -351522 -341509 -158237 2000
11284B000q738p7543m1908L3619k6269O1637J9642p0303q3558K1302J08391m7869
$$ 2000 -6738 -84281 -126189 -92570 -118839 -57202 -37560 -107863 -191421 -170119 -61728 -109597
11272a09597j08417j07528r8268n431J03227L3419K2297K1730M4193R1098O0220
$$ -109597 -218014 -325542 -423810 -429241 -326014 -292595 -270298 -248568 -204375 -113277 -53057
11261e3057j21007k50093j09092R0753M4285j07746j13178P6689J29322J96672
$$ -53057 -174064 -424157 -533249 -442496 -398211 -505957 -619135 -542446 -413124 -216452
11251b16452K69455J40895O9439J08655j20942k39874J0167q7689j0625J88834
$$ -216452 53003 193898 263337 371992 251050 11176 21343 -66346 -76971 111863
11241A11863N6540M4936n714n3135o1502j62750p3420K3234P654J03444J36796
$$ 111863 168403 213339 207625 154490 92988 -69762 -143182 -119948 -112294 -8850 127946
11230A27946Q2990j47575m3910K8001j69188J39088Q1244k32928k45458j97645
$$ 127946 210936 63361 19451 47452 -121736 17352 98596 -134332 -379790 -577435
11220e77435J94767K99421K05779p4282k48705o4269J70574j9874o5568L9045
$$ -577435 -382668 -83247 122532 48250 -200455 -264724 -94150 -114024 -179592 -140547
11210a40547J57922J01227K56398J81757j3086k6870k6031k6599O4299M4811k82475
$$ -140547 17375 118602 375000 556757 543671 516801 490770 464171 528470 573281 290806
11199B90806l24217r9363m6036j2156p4007k1543P4028R8799k4372j12953l8688
$$ 290806 -33411 -132774 -178810 -190966 -264973 -286516 -212488 -113689 -138061 -251014 -289702
11188b89702R1516L4939Q2358O4083o548m5729j21615k25865K6299J51227N8801
$$ -289702 -198186 -163247 -80889 -16806 -23354 -69083 -190698 -416563 -390264 -239037 -180236
11177a80236J0273p4j8156p7026j34873p4734K39544Q1867k7881M0019O6889j81636
$$ -180236 -169963 -170037 -188193 -265219 -400092 -474826 -235282 -153415 -181296 -141277 -74388 -256024
11165b56024k7445M7437j57993j42885j74519J92413L18429J32158k8333K5639
$$ -256024 -283469 -236032 -394025 -536910 -711429 -519016 -200587 -68429 -96762 -71123
11155g1123O5704j28668j02286K6503J10935Q4136n251M8148Q9450N1700N1386
$$ -71123 -5419 -134087 -236373 -209870 -98935 -14799 -20050 28098 117548 169248 220634
11144B20634k4637n7210Q3665P5337j07760j3655r57J8734K09648O0805k1818
$$ 220634 195997 138787 222452 297789 190029 176374 175417 194151 403799 464604 442786
11133D42786k867o6155p984O0986o1667j92986j34106o6102O7830O7326J1876
$$ 442786 439919 373764 365780 426766 365099 172113 38007 -28095 39735 107061 118937
11122A18937Q3826q2154j25913k0900k3842q9625j95577j3684J60318L3049j20483
$$ 118937 202763 120609 -5304 -26204 -50046 -139671 -335248 -348932 -188614 -155565 -276048
11111b76048k87891j79286R3388L95337K36604p748P0626j1725n8291m434K7263
$$ -276048 -563939 -743225 -649837 -254500 -17896 -25644 44982 33257 -25034 -29468 -2205
11100b205j14808k62347k19423K1019J69316K28130K4771L8438Q9933L5552J30585
$$ -2205 -117013 -379360 -598783 -577764 -408448 -180318 -155547 -117109 -27176 8376 138961
11089A38961K00366r388k29797j04908J41286J594n1869p0115j46160l02097j54639
$$ 138961 339327 329939 100142 -4766 136520 138114 86245 16130 -130030 -432127 -586766
11078e86766J02927K32103J95792L2547J9179J10726J32273K8957j23579j08211
$$ -586766 -483839 -251736 -55944 -23397 -4218 106508 238781 267738 144159 35948
11068C5948k0628j07229j83067k7680J55912N4315n7476O9073M7028M0343J14908
$$ 35948 15320 -91909 -274976 -302656 -146744 -92429 -149905 -80832 -33804 6539 121447
11057A21447p761k14557q8974P22r4167J6086o5297L0492Q4337l5395n3709n7965
$$ 121447 113686 -100871 -189845 -189123 -283290 -267204 -332501 -302009 -217672 -253067 -306776 -364741
11045c64741J43452K93490Q0466k62857k07730j6199K38521Q4655N0788M0436
$$ -364741 -221289 72201 152667 -110190 -317920 -334119 -95598 -10943 39845 80281
11035H0281j30762j09402j04296J47700J72832J4969Q9514k6811k44851k62365
$$ 80281 -50481 -159883 -264179 -116479 56353 71322 160836 134025 -110826 -373191
11025c73191n5115J64982J91755o0120j87239m8972p2224q1404j17875j10175
$$ -373191 -428306 -263324 -71569 -131689 -318928 -367900 -440124 -521528 -639403 -749578
11015g49578j29953J41289J96595K6281J19671L4301k5360J403o3254J3096j13999
$$ -749578 -879531 -738242 -541647 -515366 -395695 -361394 -386754 -385351 -448605 -435509 -549508
11004e49508j13939K3829L39526J31230j33589J00638J33784k23272j69666P3737
$$ -549508 -663447 -639618 -300092 -168862 -302451 -201813 -68029 -291301 -460967 -387230
10994c87230R4157K38496K5235j33225n8422k4293K6561Q157O1256J53711J63815
$$ -387230 -293073 -54577 -29342 -162567 -220989 -245282 -218721 -210564 -149308 4403 168218
10983A68218J79612j48639j29021J22142J15009j05899r5276p2635k60954k67554
$$ 168218 347830 199191 70170 192312 307321 201422 106146 33511 -227443 -494997
10973d94997j23198J02735L89129J51763j93394j89864M1726K23784K88949J28606
$$ -494997 -618195 -515460 -126331 25432 -167962 -357826 -316100 -92316 196633 325239
10963C25239Q11j08652l78834l15385j07880N8274J32303J88183J98746J5796
$$ 325239 326050 217398 -161436 -476821 -584701 -526427 -394124 -205941 -7195 8601
10953H601L152l5063k8507n7765K1625J24558m1205k00415N8052K29937k1731
$$ 8601 11753 -23310 -51817 -109582 -87957 36601 -4604 -205019 -146967 82970 61239
10942F1239l2977J4545j9702J93254L37290J6370j08319j9155k62287j62044J54599
$$ 61239 28262 42807 23105 216359 553649 570019 461700 442545 180258 18214 172813
10931A72813K57546J26576r4181j69129j86700j00008L8255P4443O4382J7943
$$ 172813 430359 556935 462754 293625 106925 6917 45172 119615 183997 201940
10921B01940R9727m1665O860P7775j14178j37272q0652M6680J19028J8345J5790
$$ 201940 301667 260002 266862 344637 230459 93187 12535 59215 178243 196588 212378
10910B12378k8517Q0747J74529J24863J59201Q8679l9889l65124k18980j05828
$$ 212378 183861 264608 439137 564000 723201 811880 771991 406867 187887 82059
10900H2059k7144J3021L5239M1069K33415J81281r6638o4917j18144m2345j8626
$$ 82059 54915 67936 103175 144244 377659 558940 462302 397385 279241 236896 218270
10889B18270j99403N9276K67849j6022k41647j91901k79553j77755K53904L44878
$$ 218270 18867 78143 345992 329970 88323 -103578 -383131 -560886 -306982 37896
10879C7896Q9353j01076r1376l7924j31409q8628J44302L26862K28047q3757k01620
$$ 37896 127249 26173 -65203 -103127 -234536 -323164 -178862 148000 376047 292290 90670
10868I0670j67926j86357j42852p257M7138N2979L6838j612K0199K7741k3925
$$ 90670 -77256 -263613 -406465 -413722 -366584 -313605 -276767 -278379 -258180 -230439 -254364
10857b54364O0094J3658o8608R723J41906J78391J36265r74P3283J35878j8197
$$ -254364 -194270 -180612 -249220 -239497 -97591 80800 217065 216091 289374 425252 407055
10846D07055k22755j53581m4169Q2609J25685O2304p7863j34833j80800k37056
$$ 407055 184300 30719 -13450 69159 194844 257148 179285 44452 -136348 -373404
10836c73404k64609O3247K77017J74946J07805J31412j7181q9408r0384m7080
$$ -373404 -638013 -574766 -297749 -122803 -14998 116414 99233 9825 -80559 -127639
10826a27639J17360J41988l4606j71464r4668Q9120J68914J10607O458k3700j10349
$$ -127639 -10279 131709 97103 -74361 -169029 -79909 89005 199612 206070 182370 72021
10815G2021j09106J72179P4750l304n366L6637K182N453j31725q6595j16490q9364
$$ 72021 -37085 135094 209844 206540 201174 237811 239993 245446 113721 27126 -89364 -178728
10803a78728j06477j85883j63311K664J89370K31999J37918K3735J34484r5484
$$ -178728 -285205 -471088 -634399 -631735 -442365 -210366 -72448 -48713 85771 -9713
10793i713k57681k7176j3491k0207p0682q0829p3444k5192k1517m5002J99127
$$ -9713 -267394 -294570 -308061 -328268 -398950 -479779 -553223 -578415 -599932 -644934 -445807
10782d45807L23090J18129o6515r3735Q260J66439L19667K72272n7408k55746
$$ -445807 -122717 -4588 -71103 -164838 -156578 9861 329528 601800 544392 288646
10772B88646j38445j02846Q535J06925N5619j5870n9035j1610o3116j01638j20159
$$ 288646 150201 47355 55890 162815 218434 202564 143529 131919 68803 -32835 -152994
10761a52994J2825O784n5581M1873K38196J66209p2756j50846j50289j22124j65921
$$ -152994 -140169 -133385 -188966 -147093 91103 257312 184556 33710 -116579 -238703 -404624
10750d04624j15937M814J61965K73423O0732J57081O8089j21663j40460m3370
$$ -404624 -520561 -515747 -353782 -80359 -19627 137454 205543 83880 -56580 -99950
10740i9950j39328j19664J16472K60673K17488R6683R7833K9463m2562K1543K6818
$$ -99950 -239278 -358942 -242470 18203 235691 332374 430207 459670 417108 438651 465469
10729D65469K4852J6348k6754n8558j01963j38410r888J12603J74851K18373m7296
$$ 465469 490321 506669 479915 421357 319394 180984 171096 283699 458550 676923 629627
10718F29627J56201J05367J14289j13929k85677o0857J35676J20988P1276L1962
$$ 629627 785828 891195 1005484 891555 605878 545021 680697 801685 872961 904923
10708I04923j37888J063K20338J03998J32861J82229J8055P105J8799J65077J49789
$$ 904923 767035 768098 988436 1092434 1225295 1407524 1425579 1432684 1451483 1616560 1766349
10697A766349Q2039K27370K77566K83882L11670N46200Q82241R23349Q79864J065763
$$ 1766349 1848388 2075758 2353324 2637206 2948876 3495076 4377317 5300666 6180530 7246293
10687G246293J463400K023717K454514L048268M078029M781380L961697J396851
$$ 7246293 8709693 10733410 13187924 16236192 20314221 25095601 29057298 30454149
10679C0454149j937967m187928m552819m033276l226178k247246j604892j318554
$$ 30454149 28516182 24328254 19775435 15742159 12515981 10268735 8663843 7345289
10671G345289j050354r72340q09107n76949o16772n34019l34706m8955r4866k2915
$$ 7345289 6294935 5322595 4513488 3936539 3319767 2785748 2451042 2402087 2307221 2284306
10661B284306K10937P0196p3744o2412J22960N1250j223N878o8719j51384j92733
$$ 2284306 2495243 2565439 2491695 2429283 2552243 2603493 2602270 2608148 2539429 2388045 2195312
10650B195312k27148l00363l24161k41092q7682j57897j62884N0551J96783j10479
$$ 2195312 1968164 1667801 1343640 1102548 1014866 856969 694085 744636 941419 830940
10640H30940m6993N7949m9542j23192k03546j36726j1552j3899P442l8589M4748
$$ 830940 783947 841896 792354 669162 465616 328890 317338 303439 310881 272292 317040
10629C17040K73682N5007k59291j36969P2666j7943L5364L2864P9815J05519N458
$$ 317040 590722 645729 386438 249469 322135 304192 339556 372420 452235 557754 563212
10618E63212j89462l7134j7429j21381N32J92452N7826k60813p2745K24309P1807
$$ 563212 373750 336616 319187 197806 198338 390790 448616 187803 115058 339367 411174
10607D11174j63118r3389j5260r4937j09688n0894j48418q5955J76548L67575
$$ 411174 248056 154667 139407 44470 -65218 -116112 -264530 -350485 -173937 193638
10597A93638J78569p0362j64730J17050K66340j6222j19611M0626k2260j66033
$$ 193638 372207 301845 137115 254165 520505 504283 384672 425298 403038 237005
10587B37005j09937J63066J62722j4684j40934l6130P1787N5243j02091k99969
$$ 237005 127068 290134 452856 438172 297238 261108 332895 388138 286047 -13922
10577a3922k44182J6327O099k4905m0990J40033J81907J0211j8487J0080j32871
$$ -13922 -258104 -241777 -235678 -260583 -301573 -161540 20367 30578 12091 22171 -110700
10566a10700m2885j30402m3398O9283J69518K28509m5371r0761Q7409J366j24962
$$ -110700 -153585 -283987 -327385 -258102 -88584 139925 94554 3793 91202 92568 -32394
10555c2394n1569l4162R1225J9370R0451K2425j09036j13985k2524j6770Q7545
$$ -32394 -83963 -118125 -26900 -7530 82921 105346 -3690 -117675 -140199 -156969 -69424
10544f9424L5669K843j33073q9894N3496K22035O1569k60256k55100J06776O7561
$$ -69424 -33755 -30912 -163985 -253879 -200383 21652 83221 -177035 -432135 -325359 -257798
10533b57798J26989J07618j37397j25948j15700q2382J22167J51544k7695j22648
$$ -257798 -130809 -23191 -160588 -286536 -402236 -484618 -362451 -210907 -238602 -361250
10523c61250O43N7146K4676J59081O7504j59855j28401p158O9130K4850m4334
$$ -361250 -360607 -303461 -278785 -119704 -52200 -212055 -340456 -347614 -278484 -253634 -297968
10512b97968J28509p6194j27587o536j5480R2956J32387l2861k53992Q240K26068
$$ -297968 -169459 -245653 -373240 -379776 -395256 -302300 -169913 -202774 -456766 -448526 -222458
10501b22458J06720K735K4067R581j56032j53414J17396P6352j38273k56097M2586
$$ -222458 -115738 -113003 -88936 -79355 -235387 -388801 -271405 -195053 -333326 -589423 -546837
10490e46837R2957p4279M8013M6573n3304K1111K79103L78206J97052K1848j65207
$$ -546837 -453880 -528159 -480146 -433573 -486877 -465766 -186663 191543 388595 410443 245236
10479B45236j49876o6633r0909n4884j17054j69129r1467n3777o8185O5462L80594
$$ 245236 95360 28727 -62182 -117066 -234120 -403249 -494716 -548493 -616678 -551216 -170622
10468a70622L17546J52985n0801l50280k19240J28704J69402j6317M4823J35073
$$ -170622 146924 299909 249108 -101172 -320412 -191708 -22306 -38623 6200 141273
10458A41273J13263L4174O7231J89262K385j77341j08262M9841L3545m1599j34360
$$ 141273 254536 288710 355941 545203 547588 370247 261985 311826 345371 303772 169412
10447A69412j17617j12710j61563j01659n5388l1205J83655k4474k05467n345
$$ 169412 51795 -60915 -222478 -324137 -379525 -410730 -227075 -251549 -457016 -462361
10437d62361j59696j50680J65639J33143O6505J29784n5276j22181J25708Q7396
$$ -462361 -622057 -772737 -607098 -473955 -407450 -277666 -332942 -455123 -329415 -242019
10427b42019k29261l1733J09020K07222J19983p0259p7664r1652Q0253N2666j9791
$$ -242019 -471280 -503013 -393993 -186771 -66788 -137047 -214711 -306363 -226110 -173444 -193235
10416a93235p6239j55131l675J74533R5681k9251O7037J35570J854j15743k5090
$$ -193235 -269474 -424605 -428280 -253747 -158066 -187317 -120280 15290 17144 -98599 -123689
10405a23689r1477m1539R2253m1730J8448J61874J70426J12799l6197J11641M9149
$$ -123689 -215166 -256705 -164452 -206182 -187734 -25860 144566 257365 221168 332809 381958
10394C81958j67394j2513N4731p2687N1969J85448M5029l472r0337k10094k34437
$$ 381958 214564 202051 256782 184095 236064 421512 466541 463069 372732 162638 -71799
10383g1799j81046m7652N8694K01787Q0206r5056J4228Q9593O7173j333q8519
$$ -71799 -252845 -300497 -241803 -40016 40190 -54866 -40638 48955 116128 114795 26276
10372B6276J62035J49598r9674j70111j54298n1423J27699N3038n166r3311l9370
$$ 26276 188311 337909 238235 68124 -86174 -137597 -9898 43140 37974 -55337 -94707
10361i4707J15089Q7785J8017j92440j92256j02158p3129N0559L8855J33239K13457
$$ -94707 20382 108167 126184 -66256 -258512 -360670 -433799 -383240 -344385 -211146 2311
10350B311l6837k31568j61069j5588K31163K29891J50993J84453j7441j08291
$$ 2311 -34526 -266094 -427163 -442751 -211588 18303 169296 353749 336308 228017
10340B28017l1317j36098j72631k28861j85021J93350L07643J01139M2269N8301
$$ 228017 196700 60602 -112029 -340890 -525911 -332561 -24918 76221 118490 176791
10330A76791j57484p8421k0131k291j2474j19514k08541n0666K6523J06033Q0984
$$ 176791 19307 -59114 -79245 -81536 -94010 -213524 -422065 -472731 -446208 -340175 -259191
10319b59191J78087J45738P5086J3505j16650k02981q8362k506L6214r1494q6629
$$ -259191 -81104 64634 139720 153225 36575 -166406 -254768 -257274 -221060 -312554 -399183
10308c99183K9076P4296K64094K19770j97180k98824j87058L8829R8600Q2388
$$ -399183 -370107 -295811 -31717 188053 -9127 -307951 -495009 -456180 -357580 -275192
10298b75192K23361R7346M5881K7553m7552o3517q5021J54790J14778l7925n2922
$$ -275192 -51831 45515 91396 118949 71397 7880 -77141 77649 192427 154502 101580
10287A01580k9643K1551l4306q3871o4366M4159J46264r3803l10892k57006K4383
$$ 101580 71937 93488 59182 -24689 -89055 -44896 101368 7565 -303327 -560333 -535950
10276e35950J88786J73508K31622J01944p6399j51038j43152m3946J66474P75
$$ -535950 -347164 -173656 57966 159910 83511 -67527 -210679 -254625 -88151 -87376
10266h7376J18989J62070k0856o455k8706M2432L3752k7440J13814R9459m9599
$$ -87376 31613 193683 172827 166372 137666 180098 213850 186410 300224 399683 350084
10255C50084j07311j25001q1314Q2698M8941p8585k06661k76597j24421m8865
$$ 350084 242773 117772 36458 119156 168097 89512 -117149 -393746 -518167 -567032
10245e67032J59603M25424K09425j1536l48384k16203K29894K59790j27443j78947
$$ -567032 -407429 17995 227420 215884 -132500 -348703 -118809 140981 13538 -165409
10235a65409o2374k9343j5453P8777P0847j6170R021o9589o3620J15237R8319
$$ -165409 -227783 -257126 -272579 -193802 -122955 -139125 -130104 -199693 -263313 -148076 -49757
10224d9757l7868j14278j06073p5727l823m2562r4305O5523K90482N6629j21089
$$ -49757 -87625 -201903 -307976 -383703 -387526 -430088 -524393 -458870 -168388 -111759 -232848
10213b32848Q1114J45716k6674j00858l5822L2994J7206n0935j32416j12029j12657
$$ -232848 -151734 -6018 -32692 -133550 -169372 -136378 -119172 -170107 -302523 -414552 -527209
10202e27209j13737n7983J24837P7002J17289K9376l6986J02443J14713O8798
$$ -527209 -640946 -698929 -574092 -497090 -379801 -350425 -387411 -284968 -170255 -101457
10192a01457L30434K51609o858K1373M421p9842n6053l28787l04360J59903J71391
$$ -101457 228977 480586 473728 495101 499522 419680 363627 34840 -269520 -109617 61774
10181F1774j5884j64935k1881j46344k27565j49215o3012N5704k0794M5263J53357
$$ 61774 45890 -119045 -140926 -287270 -514835 -664050 -727062 -671358 -692152 -646889 -493532
10170d93532J15808j15162j40211J30983R4735R9775M7956K19743J25686R6590
$$ -493532 -377724 -492886 -633097 -502114 -407379 -307604 -259648 -39905 85781 182371
10160A82371J2505q7551l7136o1508q1395j00628o4505O035O1528O7740K21487
$$ 182371 194876 107325 70189 8681 -72714 -173342 -237847 -231812 -170284 -102544 118943
10149A18943J529l07659k67520m8304o922K49145K95738M820j35706j98820j01598
$$ 118943 120472 -187187 -454707 -503011 -509933 -260788 34950 39770 -95936 -294756 -396354
10138c96354j70152j9587K04760J33024J58189m4185p1951r3313J07324J839k31764
$$ -396354 -566506 -586093 -381333 -248309 -90120 -134305 -206256 -299569 -192245 -190406 -422170
10127d22170j4784M8758p3812O6932K64152Q4853p0611o904r822j07064k9559
$$ -422170 -436954 -388196 -462008 -395076 -130924 -46071 -116682 -123586 -133408 -240472 -270031
10116b70031N8459J16894m8771j32233J06960L8747j10662m1800M7839O6075R2912
$$ -270031 -211572 -94678 -143449 -275682 -168722 -129975 -240637 -282437 -234598 -168523 -75611
10105g5611J30314J1086p5095j46937j80747L0097K64217L37521K79377P8847
$$ -75611 54703 65789 -9306 -156243 -336990 -306893 -42676 294845 574222 653069
10095F53069j37056k420j34297k61273k03243k19666r8150l0186M0266J06218
$$ 653069 516013 513593 379296 118023 -85220 -304886 -403036 -433222 -392956 -286738
10085b86738O1250K9464Q0930l5904j69057J8752k6976j20978J80361L28984J4349
$$ -286738 -225488 -196024 -115094 -150998 -320055 -301303 -328279 -449257 -268896 60088 74437
10074G4437J07429J83715J05340k20008l43145j46287j24697j58603n3986O7372
$$ 74437 181866 365581 470921 250913 -92232 -238519 -363216 -521819 -575805 -508433
10064e08433P9117J88936o8249j24049j04192l5911N548R3590J62661J86858O2711
$$ -508433 -429316 -240380 -308629 -432678 -536870 -572781 -567233 -473643 -310982 -124124 -61413
10053f1413K2337J05183l1973j29906J85881l6880j24978K59724J15908k74876
$$ -61413 -39076 66107 34134 -95772 90109 53229 -71749 187975 303883 29007
10043B9007k00799j78770l1632J44851R5993K2993o3878l8229n786l7541j9946
$$ 29007 -171792 -350562 -382194 -237343 -141350 -118357 -182235 -220464 -226250 -263791 -283737
10032b83737M6272J24309Q9972o2175j14494N3882J25719J7616q7426J052J92608
$$ -283737 -237465 -113156 -23184 -85359 -199853 -145971 -20252 -2636 -90062 -89010 103598
10021A03598J26453j08153k55207j52125k9367J12566K19746J46639J06150Q9504
$$ 103598 230051 121898 -133309 -285434 -314801 -202235 17511 164150 270300 359804
10011C59804m9247l16396k27840J3132Q2129N0697J09491L1142j19674p1204l9882
$$ 359804 310557 -5839 -233679 -220547 -138418 -87721 21770 52912 -66762 -137966 -177848
10000a77848K8873q6591k00807R394J14479J00248p6161j7344J1823P8008O5200
$$ -177848 -148975 -235566 -436373 -426979 -312500 -212252 -288413 -305757 -293934 -215926 -150726
9989a50726k9567Q9965K26910j4338r439j067k3340j15937n1359O9959O2376p014
$$ -150726 -180293 -90328 136582 122244 112805 111738 88398 -27539 -78898 -8939 53437 46423
9977D6423r3667K3948N4627m2973j86770j67375j24595n8375n4947l3444J26576
$$ 46423 -47244 -23296 31331 -11642 -198412 -365787 -490382 -548757 -603704 -637148 -510572
9966e10572J14622j2121m5552r3820j94551J23520K46617L4546j16638l4940O8171
$$ -510572 -395950 -408071 -453623 -547443 -741994 -618474 -371857 -337311 -453949 -488889 -420718
9955d20718Q689o5847j967j26539k97662m1399M2524P8933K68386K00132M2241
$$ -420718 -412029 -477876 -479843 -606382 -904044 -945443 -902919 -823986 -555600 -355468 -313227
9944c13227M7897p2402N8220R5103L7742k1090j7654J47799k2391Q6488J92943
$$ -313227 -265330 -337732 -279512 -184409 -146667 -167757 -185411 -37612 -60003 26485 219428
9933B19428j3167l7971q3489k06741j84014O5147Q2631P0529o2023r9278o2703
$$ 219428 206261 168290 84801 -121940 -305954 -240807 -158176 -87647 -149670 -248948 -311651
9922c11651M8752O2968J1058J11604P7717L8889J17902J31555j08822j40286L8614
$$ -311651 -262899 -199931 -188873 -77269 448 39337 157239 288794 179972 39686 78300
9911G8300L7857J18296n316k34993j50702p8918j99024m2543P778k4186J15244
$$ 78300 116157 234453 229137 -5856 -156558 -235476 -434500 -477043 -469265 -493451 -378207
9900c78207J88348J36879P7053Q2628m7315p8983l809K0132M9967j52053j37320
$$ -378207 -189859 -52980 24073 106701 59386 -19597 -23406 -3274 46693 -105360 -242680
9889b42680L1306m9009r4526O2445L240L8203R7606J24070J26240R4798K23967
$$ -242680 -211374 -260383 -354909 -292464 -289224 -251021 -153415 -29345 96895 191693 415660
9878D15660J4410j05895j25929j67746N1940L1013R57n3136j07321j31049k9312
$$ 415660 430070 324175 198246 30500 82440 113453 114410 61274 -46047 -177096 -206408
9867b06408M5370K01602J83923n2954N905M3747p1610o4709R055q8930M6821L55325
$$ -206408 -161038 40564 224487 171533 177438 221185 149575 84866 93921 4991 51812 407137
9855D07137J67911j98653j20859L0554K3932j31593q5654k5204l6454j54969l0044
$$ 407137 575048 376395 255536 286090 310022 178429 92775 67571 31117 -123852 -153896
9844a53896o955m9020j14523j00104K6817M1457j5795J48554J65796m8420k4602
$$ -153896 -160851 -209871 -324394 -424498 -397681 -356224 -372019 -223465 -57669 -106089 -130691
9833a30691J25445L1316p4963P0912J81261N5043j37031k34103n5808K2435J48842
$$ -130691 -5246 26070 -48893 22019 203280 258323 121292 -112811 -168619 -146184 2658
9822B658K9480p8173p2369r3730J02259J51735M9972m5647K9292J00324j03833
$$ 2658 32138 -46035 -118404 -212134 -109875 41860 91832 46185 75477 175801 71968
9811G1968j70008Q4396R0772Q6177J7756O0708j64158j74062l5035J65084J84521
$$ 71968 -98040 -13644 77128 163305 181061 241769 77611 -96451 -131486 33598 218119
9800B18119p9732j31117j20659M0270J57765M5543q8125j57710j0833J86372l134
$$ 218119 138387 7270 -113389 -73119 84646 130189 42064 -115646 -126479 59893 56759
9789E6759m3867J09092K53541M007k53343k04280j53112j09268K2826K65383K34173
$$ 56759 12892 121984 375525 379532 126189 -78091 -231203 -340471 -317645 -52262 181911
$$ [...]
##END NTUPLES=NMR SPECTRUM
##END=
