##TITLE=C13_SR69+TFAA(2)R
 CDCl3, 22200 sc

 31.5.2022
##JCAMPDX= 6.0         $$ Bruker NMR JCAMP-DX V2.0
##DATA TYPE= NMR SPECTRUM
##DATA CLASS= NTUPLES
##ORIGIN= UXNMR, Bruker Analytische Messtechnik GmbH
##OWNER= root
$$ XWIN-NMR		Version 3.5
$$ Wed Jun  1 13:44:59 2022 Russian Standard Time (UT+4h)  she@DPX200
##.OBSERVE FREQUENCY= 50.327896
##.OBSERVE NUCLEUS= ^13C
##.ACQUISITION MODE= SIMULTANEOUS
##.ACQUISITION SCHEME= undefined
##.AVERAGES= 22201
##.DIGITISER RES= 17
##SPECTROMETER/DATA SYSTEM= spect
##.PULSE SEQUENCE= zgpg30
##.SOLVENT NAME= CDCl3
##.SHIFT REFERENCE= (INTERNAL, CDCl3, 0, 222.111)
##AUDIT TRAIL= $$ (NUMBER, WHEN, WHO, WHERE, WHAT)
$$ ##TITLE= Audit trail, XWIN-NMR		Version 3.5
$$ ##JCAMPDX= 5.01
$$ ##ORIGIN= Bruker BioSpin GmbH
$$ ##OWNER= she
$$ F:/spectra/data/she/nmr/c13/1/pdata/1/auditp.txt
$$ ##AUDIT TRAIL=  $$ (NUMBER, WHEN, WHO, WHERE, WHAT)
(   1,<2022-06-01 13:42:44.71 +0400>,<she>,<DPX200>,
      <created by zg, POWCHK disabled, PULCHK disabled
       terminated by command 'halt'
       configuration hash MD5:
       00 E9 B6 7A A2 85 ED C7 34 08 36 98 17 FE 4E 26
       data hash MD5: 32K
       F8 A6 BB 09 6C 76 4B 85 84 CE DB 16 97 ED 19 D4>)
(   2,<2022-06-01 13:42:49.06 +0400>,<she>,<DPX200>,
      <Start of raw data processing
       efp BC_mod = 2 LB = 1 FT_mod = 6 PKNL = 1 PHC0 = -369.7633 PHC1 = 28.36232 SI = 32K 
       data hash MD5: 32K
       50 19 2C 51 79 33 98 0A 56 6A 21 FE E2 AE 4A F6>)
(   3,<2022-06-01 13:42:58.21 +0400>,<she>,<DPX200>,
      <abs ABSG = 5 
       data hash MD5: 32K
       73 F7 F0 98 F5 96 3B 27 2C 18 27 B3 04 BC 1D AC>)
(   4,<2022-06-01 13:43:26.25 +0400>,<she>,<DPX200>,
      <pk PHC0 = 8.189155 PHC1 = -5.8 
       data hash MD5: 32K
       4F 04 E0 BB C0 DA 65 86 3E 56 05 7F CA 04 89 DD>)
(   5,<2022-06-01 13:43:29.75 +0400>,<she>,<DPX200>,
      <abs ABSG = 5 
       data hash MD5: 32K
       6E AE ED F5 0D 94 31 E2 33 97 35 DA 58 8D 54 A5>)
$$ ##END=
$$ 
$$ hash MD5
$$ 8B 73 73 68 9C 96 FE 84 75 D8 04 84 55 FB 3A D1
##$RELAX= 
##$RELAX= 
##$RELAX= 
##$RELAX= 
##$RELAX= 
##$RELAX= 
##$RELAX= 
##$RELAX= 
$$ Bruker specific parameters
$$ --------------------------
##$DU= <F:/spectra>
##$EXPNO= 1
##$NAME= <c13>
##$PROCNO= 1
##$TYPE= <nmr>
##$USER= <she>
##$AMP= (0..31)
100 100 100 100 100 100 100 100 100 100 100 100 100 100 100 100 100 100 
100 100 100 100 100 100 100 100 100 100 100 100 100 100 
##$AQSEQ= 0
##$AQ_mod= 1
##$AUNM= <au_zg>
##$AUTOPOS= <>
##$BF1= 50.322709
##$BF2= 200.13
##$BF3= 50.322709
##$BF4= 500.13
##$BF5= 500.13
##$BF6= 500.13
##$BF7= 500.13
##$BF8= 500.13
##$BYTORDA= 1
##$CFDGTYP= 0
##$CFRGTYP= 5
##$CHEMSTR= <none>
##$CNST= (0..31)
1 1 145 1 1 1 1 1 1 1 1 1 1 1 1 1 1 1 1 1 1 1 1 1 1 1 1 1 1 1 1 1 
##$CPDPRG= <waltz16>
##$CPDPRG1= <>
##$CPDPRG2= <waltz16>
##$CPDPRG3= <>
##$CPDPRG4= <mlev>
##$CPDPRG5= <mlev>
##$CPDPRG6= <mlev>
##$CPDPRG7= <mlev>
##$CPDPRG8= <mlev>
##$CPDPRGB= <>
##$CPDPRGT= <>
##$D= (0..31)
$$ [...]
##$SUBNAM4= <"">
##$SUBNAM5= <"">
##$SUBNAM6= <"">
##$SUBNAM7= <"">
##$SUBNAM8= <"">
##$SUBNAM9= <"">
##$SW= 239.972175391363
##$SWIBOX= (0..15)
0 1 3 0 0 0 0 0 0 0 0 0 0 0 0 0 
##$SW_h= 12077.2946859903
##$TD= 32768
##$TD0= 1
##$TE= 0
##$TE2= 300
##$TE3= 300
##$TEG= 300
##$TL= (0..7)
120 120 120 120 120 120 120 120 
##$TP= (0..7)
150 150 150 150 150 150 150 150 
##$TP07= 0
##$TPNAME0= <>
##$TPNAME1= <>
##$TPNAME2= <>
##$TPNAME3= <>
##$TPNAME4= <>
##$TPNAME5= <>
##$TPNAME6= <>
##$TPNAME7= <>
##$TPOAL= (0..7)
0.5 0.5 0.5 0.5 0.5 0.5 0.5 0.5 
##$TPOFFS= (0..7)
0 0 0 0 0 0 0 0 
##$TUNHIN= 0
##$TUNHOUT= 0
##$TUNXOUT= 0
##$USERA1= <user>
##$USERA2= <user>
##$USERA3= <user>
##$USERA4= <user>
##$USERA5= <user>
##$V9= 5
##$VALIST= <valist>
##$VCLIST= <CCCCCCCCCCCCCCC>
##$VD= 0
##$VDLIST= <DDDDDDDDDDDDDDD>
##$VPLIST= <PPPPPPPPPPPPPPP>
##$VTLIST= <TTTTTTTTTTTTTTT>
##$WBST= 1024
##$WBSW= 4
##$XGAIN= (0..3)
0 0 0 0 
##$XL= 0
##$YL= 0
##$YMAX_a= 126098679
##$YMIN_a= -29980739
##$ZGOPTNS= <>
##$ZL1= 120
##$ZL2= 120
##$ZL3= 120
##$ZL4= 120
##$ABSF1= 222.1111
##$ABSF2= -17.88557
##$ABSG= 5
##$ABSL= 3
##$ALPHA= 0
##$AQORDER= 0
##$ASSFAC= 0
##$ASSFACI= 0
##$ASSFACX= 0
##$ASSWID= 0
##$AUNMP= <proc_1d>
##$AZFE= 0.1
##$AZFW= 0.5
##$BCFW= 0
##$BC_mod= 2
##$BYTORDP= 0
##$COROFFS= 0
##$CY= -3
##$DATMOD= 1
##$DC= 0
##$DFILT= <>
##$DTYPP= 0
##$F1P= 0
##$F2P= 0
##$FCOR= 0.5
##$FTSIZE= 32768
##$FT_mod= 6
##$GAMMA= 0
##$GB= 0
##$INTBC= 1
##$INTSCL= 4.134877e-10
##$ISEN= 128
##$LB= 1
##$LEV0= 0
##$LPBIN= 0
##$MAXI= 10000
##$MC2= 0
##$MEAN= 0
##$ME_mod= 0
##$MI= 0.1934396
##$NCOEF= 0
##$NC_proc= 2
##$NLEV= 6
##$NOISF1= 120.0001
##$NOISF2= 80.00006
##$NSP= 0
##$NTH_PI= 0
##$NZP= 0
##$OFFSET= 222.1111
##$PC= 1.4
##$PHC0= -361.5742
##$PHC1= 22.56232
##$PH_mod= 1
##$PKNL= yes
##$PPARMOD= 0
##$PSCAL= 0
##$PSIGN= 0
##$REVERSE= no
##$SF= 50.3227574020007
##$SI= 32768
##$SIGF1= 140
##$SIGF2= 120
##$SINO= 11.81781
##$SIOLD= 32768
##$SREGLST= <13C.CDCl3>
##$SSB= 0
##$STSI= 32768
##$STSR= 0
##$SW_p= 12077.2946859903
##$SYMM= 0
##$S_DEV= 0
##$TDeff= 32768
##$TDoff= 0
##$TI= <>
##$TILT= no
##$TM1= 0
##$TM2= 0
##$TOPLEV= 0
##$USERP1= <user>
##$USERP2= <user>
##$USERP3= <user>
##$USERP4= <user>
##$USERP5= <user>
##$WDW= 1
##$XDIM= 32768
##$YMAX_p= 302278311
##$YMIN_p= -2432686
$$ End of Bruker specific parameters
$$ ---------------------------------
##NTUPLES= NMR SPECTRUM
##VAR_NAME=  FREQUENCY,     SPECTRUM/REAL,   SPECTRUM/IMAG
##SYMBOL=    X,             R,               I
##VAR_TYPE=  INDEPENDENT,   DEPENDENT,       DEPENDENT
##VAR_FORM=  AFFN,          ASDF,            ASDF
##VAR_DIM=   32768,         32768,           32768
##UNITS=     HZ,            ARBITRARY UNITS, ARBITRARY UNITS
##FACTOR=    0.368581032318806, 1,           1
##FIRST=     11177.2429635054, 0,            0
##LAST=      -900.051722484855, 0,           0
##MIN=       -900.051722484855, -2432686,    0
##MAX=       11177.2429635054, 302278311,    0
$$ Real data points
##PAGE= N=1
##DATA TABLE= (X++(R..R)), XYDATA
$$ [...]
$$ plain form
15925 410819 274508 176998 -102901 -191002 43145 300690 368985 643557 821174 340727
15915 340727 -37709 8621 9332 280055 478332 675725 814000 669135 837864 1046076
15905 1046076 821735 639712 418399 347675 709429 770509 279249 -56913 -210910 -480131
15895 -480131 -492502 -342893 90001 735631 973876 732036 642109 507891 -217864 -839663
15885 -839663 -709039 -575292 -812279 -1115503 -1085101 -1059696 -1155673 -1332480 -1457015 -1247019
15875 -1247019 -830865 -201162 166461 465009 546939 343025 88589 -163493 -337080 -213480
15865 -213480 87302 -19465 -181067 -34713 202373 -84893 -507564 -289217 275772 546148
15855 546148 479353 268508 60423 -278703 -945789 -1777725 -2173514 -1947633 -1381518 -599766
$$ packed form
15925D10819j36311r7510k79899q8101K34147K57545O8295K74572J77617m80447
15915C40727l78436M6330P11K70723J98277J97393J38275j44865J68729K08212
15905A046076k24341j82023k21313p0724L61754O1080m91260l36162j53997k69221
15895d80131j2371J49609M32894O45630K38245k41840q9927j34218p25755o21799
15885h39663J30624J33747k36987l03224L0402K5405r5977j76807j24535K09996
15875a247019M16154O29703L67623K98548Q1930k03914k54436k52082j73587J23600
15865b13480L00782j06767j61602J46354K37086k87266m22671K18347N64989K70376
15855E46148o6795k10845k08085l39126o67086q31936l95789K25881N66115P81752
$$ plain form
15845 -599766 -32562 -115780 -429537 -305125 -258670 -530025 -864568 -1030283 -745881 -395420
15835 -395420 -365474 -705754 -739915 -761749 -787312 -800300 -914338 -703696 -441039 -482045 -454923
15824 -454923 -283134 -113829 319101 784087 936518 543816 -48710 -191333 -395116 -288820
15814 -288820 130686 435300 545625 553691 141309 -302378 -488146 -398571 -41250 -13461
15804 -13461 -208347 -257403 -359712 -405102 -111462 -93367 -138040 -96937 -258411 -361162 -167611
15793 -167611 164630 219005 22196 -246238 -631755 -935349 -1103271 -1327760 -1469229 -1118213
15783 -1118213 -617135 -395436 -121203 -254979 -540899 -713559 -640537 -543466 -692027 -457385
15773 -457385 401969 910695 1056872 579914 429772 340050 322808 285510 158118 -254767
$$ packed form
15845e99766N67204q3218l13757J24412M6455k71355l34543j65715K84402L50461
15835c95420K9946l40280l4161k1834k5563j2988j14038K10642K62657m1006K7122
15824d54923J71789J69305M32930M64986J52431l92702n92526j42623k03783J06296
15814b88820M19506L04614J10325Q066m12382m43687j85768Q9575L57321K7789
15804a3461j94886m9056j02309m5390K93640J8095m4673M1103j61474j02751J93551
15793a67611L32241N4375j96809k68434l85517l03594j67922k24489j41469L51016
15783a118213N01078K21699K74233j33776k85920j72660P3022R7071j48561K34642
15773d57385Q59354N08726J46177m76958j50142q9722j7242l7298j27392m12885
$$ plain form
15763 -254767 -998235 -1185939 -930670 -914164 -480600 -53367 13100 82057 228546 299677
15753 299677 73135 -97291 65835 461089 945851 1496605 1348875 667365 62521 -41123
15743 -41123 159478 374434 174938 -329996 -751233 -996134 -530893 -82517 -187610 82321
15733 82321 320071 412921 382622 467749 236098 -244147 -307983 34024 43761 -69112 460756
15722 460756 644551 121318 -641277 -648837 -303174 126316 617428 746059 1006037 1501720
15712 1501720 1690665 1654937 1369690 743167 432917 219440 184470 135395 -446785 -716102
15702 -716102 -388323 -150980 -442240 -522663 -334283 -668572 -1113485 -1142008 -681467 -47286
15692 -47286 270856 359267 355408 660821 644255 306372 -71380 -47921 118169 198135 225267
$$ packed form
15763b54767p43468j87704K55269J6506M33564M27233O6467O8957J46489P1131
15753B99677k26542j70426J63126L95254M84762N50754j47730o81510o04844j03644
15743d1123K00601K14956j99496n04934m21237k44901M65241M48376j05093K69931
15733H2321K37750R2850l0299Q5127k31651m80245o3836L42007R737j12873N29868
15722D60756J83795n23233p62595p560L45663M29490M91112J28631K59978M95683
15712A501720J88945l5728k85247o26523l10250k13477l4970m9075n82180k69317
15702g16102L27779K37343k91260q0423J88380l34289m44913k8523M60541O34181
15692d7286L18142Q8411l859L05413j6566l37883l77752K3459J66090P9966K7132
$$ plain form
15681 225267 209617 86747 187118 -17263 -640077 -524726 144716 124052 -289050 -600440
15671 -600440 -639807 -638269 -931841 -710903 -700873 -959635 -1017343 -1027581 -764475 -100162 336550
15660 336550 670506 772296 658884 628336 646423 594448 359997 376911 197071 -97889
15650 -97889 -10750 -135721 -194180 -101633 -125418 -33961 227211 -48951 -842172 -1099798 -1305079
15639 -1305079 -1329493 -958596 -741140 -958406 -1096476 -898168 -1095716 -1281004 -1432057 -1262547
15629 -1262547 -925668 -954449 -875421 -526941 -651158 -916839 -569505 -65000 449003 385415
15619 385415 113949 281496 300801 272607 315890 208878 139749 31408 136241 227444
15609 227444 -225058 -437192 -131502 132014 120581 -406960 -861004 -819067 -664724 -538985
$$ packed form
15681B25267j5650j22870J00371k04381o22814J15351O69442k0664m13102l11390
15671f00440l9367J538k93572K20938J0030k58762n7708j0238K63106O64313M36712
15660C36550L33956J01790j13412l0548J8087n1975k34451J6914j79840k94960
15650i7889Q7139j24971n8459R2547k3785R1457K61172k76162p93221k57626k05281
15639a305079k4414L70897K17456k17266j38070J98308j97548j85288j51053J69510
15629a262547L36879k8781P9028L48480j24217k65681L47334N04505N14003o3588
15619C85415k71466J67547J9305k8194M3283j07012o9129j08341J04833R1203
15609B27444m52502k12134L05690K63516j1433n27541m54044M1937J54343J25739
$$ plain form
15599 -538985 -473055 -66248 145397 -36517 -473890 -1045874 -1490223 -1280130 -1136599 -1498868
15589 -1498868 -1325942 -987583 -1082832 -1217212 -1337705 -1353934 -1219639 -1464946 -1583148 -1119325
15579 -1119325 -783756 -600429 -420230 -73062 215942 -214495 -702105 -533058 -95106
15570 -95106 222764 119722 -194114 -750990 -781561 -672343 -645684 -694483 -240629 353608
15560 353608 211766 466477 979546 1031008 323543 -300978 -532746 -161001 398925 494890
15550 494890 417569 -431142 -962811 -620423 -610231 -783036 -831547 -792905 -875313 -1067991
15540 -1067991 -1011688 -1051649 -1027066 -906073 -804330 -575559 -396424 -309966 247433 587268
15530 587268 323249 -192850 -357240 -305842 133124 445176 243154 -113822 -452094 -632557
$$ packed form
15599e38985O5930M06807K11645j81914m37373n71984m44349K10093J43531l62269
15589a498868J72926L38359r5249j34380j20493j6229J34295k45307j18202M63823
15579a119325L35569J83327J80199L47168K89004m30437m87610J69047M37952
15570i5106L17870j03042l13836n56876l0571J09218K6659m8799M53854N94237
15560C53608j41842K54711N13069N1462p07465o24521k31768L71745N59926R5965
15550D94890p7321q48711n31669L42388J0192j72805m8511L8642q2408j92678
15540a067991N6303l9961K4583J20993J01743K28771J79135Q6458N57399L39835
15530E87268k64019n16099j64390N1398M38966L12052k02022l56976l38272j80463
$$ plain form
15520 -632557 -445637 -524234 -603196 -151284 386630 49717 -279870 -379113 -295319 -443179
15510 -443179 -553366 -300599 198006 372132 -82427 -431365 -549074 -506098 -378048 -229423
15500 -229423 -204143 -379040 -743205 -750337 -426076 -174208 -190489 -242215 -118121 78016
15490 78016 421352 429352 98845 57349 197513 275330 361234 199353 365643 543202 448980
15479 448980 309619 175848 136960 83426 96808 165869 180590 203491 425401 410547 90708
15468 90708 -75854 -230376 -272490 -343838 -569238 -506517 -51957 101243 68233 -11279 -38533
15457 -38533 27065 64132 38680 -317665 -587698 -836103 -885853 -1028735 -1196386 -1111483 -1173445
15446 -1173445 -1362582 -1674784 -1547155 -1067569 -1025475 -1320417 -1574328 -1680015 -1836715 -1805673
$$ packed form
15520f32557J86920p8597p8962M51912N37914l36913l29587r9243Q3794j47860
15510d43179j10187K52767M98605J74126m54559l48938j17709M2976J28050J48625
15500b29423K5280j74897l64165p132L24261K51868j6281n1726J24094J96137
15490G8016L43336Q000l30507m1496J40164P7817Q5904j61881J66290J77559r4222
15479D48980j39361j33771l8888n3534J3382O9061J4721K2901K21910j4854l19839
15468I0708j66562j54522m2114p1348k25400O2721M54560J53200l3010p9512k7254
15457c8533O5598L7067k5452l56345k70033k48405m9750j42882j67651Q4903o1962
15446a173445j89137l12202J27629M79586M2094k94942k53911j05687j56700L1042
$$ plain form
15436 -1805673 -1728759 -1338478 -760849 -470410 -193239 -65286 -300483 -607619 -526603 -336172
15426 -336172 -508112 -545312 -220893 152828 202602 221774 126663 -20873 -325653 -733028
15416 -733028 -812402 -241981 303326 460726 -66376 -721129 -1131660 -1149610 -941727 -498630
15406 -498630 -255613 -177013 143166 167394 -281117 -271217 -135219 -765376 -1244968 -1391897
15396 -1391897 -1277240 -716010 -351917 -27021 -132708 -595031 -867618 -524918 132582
15387 132582 222520 -26215 -429544 -704848 -587959 -239890 -264202 71313 701879 745328
15377 745328 565124 810609 1285334 1362298 1010950 562473 634518 957244 981747 761852
15367 761852 725059 596493 260705 -149122 -674321 -679923 -311194 66075 516806 496527
$$ packed form
15436a805673P6914L90281N77629K90439K77171J27953k35197l07136Q1016J90431
15426c36172j71940l7200L24419L73721M9774J9172r5111j47536l04780m07375
15416g33028p9374N70421N45307J57400n27102o54753m10531j7950K07883M43097
15406d98630K43017P8600L20179K4228m48511R900J35998o30157m79592j46929
15396a391897J14657N61230L64093L24896j05687m62323k72587L42700O57500
15387A32582Q9938k48735m03329k75304J16889L48069k4312L35515O30566M3449
15377G45328j80204K45485M74725P6964l51348m48477P2045L22726K4503k19895
15367G61852l6793j28566l35788m09827n25199n602L68729L77269M50731k0279
$$ plain form
15357 496527 379247 295644 813120 1556870 1700539 1740223 1602456 848838 118134 -265511
15347 -265511 -106134 646765 901034 594287 379808 646651 799233 715534 492626 56191
15337 56191 -592289 -1009411 -1026880 -595795 -48158 62372 -65265 50410 -1720 -520967
15327 -520967 -1012274 -1145434 -1181890 -1601942 -1558876 -1087532 -537669 -331117 -339645 -14404
15317 -14404 449144 375839 419969 502808 264472 76976 288488 732899 761201 411121
15307 411121 30770 -354720 -239851 91350 447209 684411 255771 -262681 -443170 -167022
15297 -167022 283449 456664 434329 202462 149424 471741 423384 224600 431067 -29214
15287 -29214 -563560 -1030018 -1175976 -671679 -447481 -682646 -839911 -429562 142082 291627
$$ packed form
15357D96527j17280q3603N17476P43750J43669L9684j37767p53618p30704l83645
15347b65511J59377P52899K54269l06747k14479K66843J52582q3699k22908m36435
15337E6191o48480m17122j7469M31085N47637J10530j27637J15675n2130n19247
15327e20967m91307j33160l6456m20052M3066M71344N49863K06552q528L25241
15317a4404M63548p3305M4130Q2839k38336j87496K11512M44411K8302l50080
15307D11121l80351l85490J14869L31201L55859K37202m28640n18452j80489K76148
15297a67022M50471J73215k2335k31867n3038L22317m8357j98784K06467m60281
15287b9214n34346m66458j45958N04297K24198k35165j57265M10349N71644J49545
$$ plain form
15277 291627 554128 743924 691763 571090 538934 691180 463578 93795 -55225 -66363
15267 -66363 56970 203030 339772 40701 -223614 -532567 -1077611 -1682952 -2004189 -1955262
15257 -1955262 -1515890 -770905 -390460 -121714 66916 2530 -49250 23481 -36990 115470
15247 115470 -85917 -421675 -560846 -959768 -1366849 -1436438 -1075936 -775850 -486996 63619
15237 63619 568885 740019 714933 346666 -265280 -369299 13453 219023 127011 275300
15227 275300 390262 26803 -532148 -650967 -396947 -186999 -399843 -349879 -228700 67209
15217 67209 602624 720034 607359 307469 -117931 -199899 -194705 -86372 341656 613320
15207 613320 611396 532616 193759 -139046 -420061 -298516 -96653 19483 -75535 -216657
$$ packed form
15277B91627K62501J89796n2161j20673l2156J52246k27602l69783j49020j1138
15267f6363J23333J46060J36742k99071k64315l08953n45044o05341l21237M8927
15257a955262M39372P44985L80445K68746J88630o4386n1780P2731o0471J52460
15247A15470k01387l35758j39171l98922m07081o9589L60502L00086K88854N50615
15237F3619N05266J71134k5086l68267o11946j04019L82752K05570r2012J48289
15227B75300J14962l63459n58951j18819K54020K09948k12844M9964J21179K95909
15217F7209N35415J17410j12675k99890m25400q1968N194J08333M28028K71664
15207F13320j924p8780l38857l32805k81015J21545K01863J16136r5018j41122
$$ plain form
15197 -216657 -49823 196435 213334 199258 327053 241938 -256450 -546889 -747844 -1149479
15187 -1149479 -1172796 -647569 -388660 -456339 -402789 -330332 -77520 -102481 -278947 -108394
15177 -108394 177812 239479 251617 348142 506210 610957 629825 338628 -67541 -2881
15167 -2881 -112705 37413 -113426 -725642 -984834 -740164 -337366 -94599 213031 722831
15157 722831 1070470 596684 -112379 -171458 -34149 -67566 -147586 -104166 -80509 -151158 -441755
15146 -441755 -428259 -180924 -106784 210365 579487 535397 435913 266918 -103298 -296654
15136 -296654 -369451 -350124 -352851 -316279 -190504 -94281 353006 590259 704777 898658 770208
15125 770208 768876 728957 431732 -163467 -319032 -173776 -335565 -479367 -693458 -890229
$$ packed form
15197b16657J66834K46258J6899j4076J27795q5115m98388k90439k00955m01635
15187a149479k3317N25227K58909o7679N3550P2457K52812k4961j76466J70553
15177a08394K86206O1667J2138R6525J58068J04747J8868k91197m06169O4660
15167b881j09824J50118j50839o12216k59192K44670M02798K42767L07630N09800
15157G22831L47639m73786p09063n9079J37309l3417q0020M3420K3657p0649k90597
15146d41755J3496K47335P4140L17149L69122m4090r9484j68995l70216j93356
15136b96654p2797J9327k727L6572J25775R6223M47287K37253J14518J93881j28450
15125G70208j332l9919k97225n95199j55565J45256j61789j43802k14091j96771
$$ plain form
15115 -890229 -592958 -93295 -77536 -438928 -540820 -415995 -75783 646855 741399 69632
15105 69632 -448056 -760010 -506599 315924 826980 730797 567646 11852 -242826 -203836
15095 -203836 -90308 204184 283965 292777 16132 -741147 -1274367 -1223396 -1071747 -1030996
15085 -1030996 -960418 -510243 -331509 -137222 -133009 -172419 -44762 -65040 -188971 -435008
15075 -435008 -883923 -1279084 -1427441 -1336966 -996829 -1084318 -634300 115091 876549 1049075
15065 1049075 1096436 1284337 1183282 694163 405051 469682 464615 564128 926418 837996
15055 837996 429473 42326 44261 242476 94174 56692 181845 200798 224512 184162 -291789
15044 -291789 -620231 -729046 -1023312 -912564 -403594 532776 1005521 635588 50794 -276988
$$ packed form
15115h90229K97271M99663J5759l61392j01892J24825L40212P22638R4544o71767
15105F9632n17688l11954K53411Q22523N11056r6183j63151n55794k54678L8990
15095b03836J13528K94492P9781Q812k76645p57279n33220N0971J51649M0751
15085a030996P0578M50175J78734J94287M213l9410J27657k0278j23931k46037
15075d35008m48915l95161j48357R0475L40137q7489M50018P49391P61458J72526
15065A049075M7361J87901j01055m89119k89112O4631n067R9513L62290q8422
15055H37996m08523l87147J935J98215j48302l7482J25153J8953K3714m0350m75951
15044b91789l28442j08815k94266J10748N08970R36370M72745l69933n84794l27782
$$ plain form
15034 -276988 -8546 157864 48829 -96516 -95751 -38710 -191065 -327209 -402374 -322187 -217416
15023 -217416 179097 485005 239852 248786 499039 722653 481821 474919 792035 719056
15013 719056 324529 15343 -6736 9178 353103 1039250 851097 200914 28253 386616
15003 386616 424226 104828 37824 139184 67785 -312305 -659045 -380871 -204913 -158272
14993 -158272 -387221 -620813 -722954 -843179 -517515 -258809 -156238 283171 493148 883383
14983 883383 1346241 1363401 1235914 921599 842764 464476 19660 77113 533001 913700
14973 913700 666320 252681 123576 272884 306597 515650 564423 398922 -59861 -197965
14963 -197965 -37529 121231 295309 118917 -46406 54727 -115335 -474167 -750286 -966315
$$ packed form
15034b76988K68442J66410j09035j45345P65N7041j52355j36144p5165Q0187J04771
15023b17416L96513L05908k45153Q934K50253K23614k40832o902L17116p2979
15013G19056l94527l09186k2079J5914L43925O86147j88153o50183j72661L58363
15003C86616L7610l19398o7004J01360p1399l80090l46740K78174J75958M6641
14993a58272k28949k33592j02141j20225L25664K58706J02571M39409K09977L90235
14983H83383M62858J7160j27487l14315p8835l78288m44816N7453M55888L80699
14973I13700k47380m13639j29105J49308L3713K09053M8773j65501m58783j38104
14963a97965J60436J58760J74078j76392j65323J01133j70062l58832k76119k16029
$$ plain form
14953 -966315 -1262363 -1223345 -673290 -573715 -718634 -285104 145979 104286 506482 978499
14943 978499 1033485 660105 657945 791964 711519 430717 142505 42751 197192 199214 379489
14932 379489 41944 12435 370662 -37484 -298316 -744392 -1367525 -1783676 -2234089 -2333763
14922 -2333763 -1827330 -1598673 -1121961 -796923 -489068 -256341 -371860 -711153 -1114395
14913 -1114395 -832249 -690221 -756931 -776738 -778137 -634610 -887893 -1454719 -1657130 -1467140
14903 -1467140 -1295426 -1150425 -731450 -550173 -339810 -51255 109866 408631 424570 386293
14893 386293 -28108 -189780 -166119 -410236 -447701 -319903 -88665 -50436 83409 10611
14883 10611 -306648 -627569 -334974 93097 -125030 -287418 -405570 -567887 -652209 125041
$$ packed form
14953i66315k96048L9018N50055R9575j44919M33530M31083m1693M02196M72017
14943I78499N4986l73380k160J34019q0445k80802k88212r9754J54441K022J80275
14932C79489l37545k9509L58227m08146k60832m46076o23133m16151m50413r9674
14922b333763N06433K28657M76712L25038L07855K32727j15519l39293m03242
14913a114395K82146J42028o6710j9807j399J43527k53283n66826k02411J89990
14903a467140J71714J45001M18975J81277K10363K88555J61121K98765J5939l8277
14893C86293m14401j61672K3661k44117l7465J27798K31238L8229J33845p2798
14883A0611l17259l20921K92595M28071k18127j62388j18152j62317q4322P77250
$$ plain form
14873 125041 772649 1074884 1037330 462102 91347 153585 383772 139988 240864 485847
14863 485847 836016 896001 130951 -658027 -457220 -39484 -554698 -1119512 -1079720 -1069306
14853 -1069306 -1055140 -480700 -24917 -58510 -128713 -127880 73535 -256928 -713609 -922078
14843 -922078 -977359 -560695 -404123 -630642 -764483 -1050668 -1583949 -1978009 -1815722 -1433524
14833 -1433524 -1366241 -1178490 -858820 -653696 -271787 232769 514483 713014 469235 -156892
14823 -156892 -510684 -470525 -129152 147158 176823 -7639 -62243 -61770 -341773 -112491 209759
14812 209759 311036 299275 253450 257882 292294 56917 -283615 -471348 -564139 -738841 -648023
14801 -648023 -373068 -367230 -241191 163766 553149 551131 490747 191889 -134113 137010
$$ packed form
14873A25041O47608L02235l7554n75228l70755O2238K30187k43784J00876K44983
14863D85847L50169N9985p65050p88978K00807M17736n15214n64814L9792J0414
14853a069306J4166N74440M55783l3593p0203Q33K01415l30463m56681k08469
14843i22078n5281M16664J56572k26519j33841k86185n33281l94060J62287L82198
14833a433524O7283J87751L19670K05124L81909N04556K81714J98531k43779o26127
14823a56892l53792M0159L41373K76310K9665j84462n4604M73k80003K29282L22250
14812B09759J01277j1761m5825M432L4412k35377l40532j87733r2791j74702R0818
14801f48023K74955N838J26039M04957L89383k018o0384k98858l26002K71123
$$ plain form
14791 137010 289052 -176447 -384254 -256097 -348819 -421073 -120450 625159 1116699 1265901
14781 1265901 1237904 1052596 339881 -348383 -567304 -857836 -822442 -500204 58434 525666
14771 525666 478653 41887 -376528 -753324 -564676 198363 719909 878027 865971 802711
14761 802711 737567 464608 230413 371886 838878 913647 979945 1068844 858784 453786
14751 453786 163269 342100 474742 244122 327115 517897 546638 313630 -288932 -686077
14741 -686077 -910202 -900305 -834619 -879898 -1046082 -1304373 -1025750 -358676 149766 543983
14731 543983 1027180 841612 555508 920022 1465281 1619549 1145030 418202 40410 176259
14721 176259 342574 163789 39141 327349 158529 -236500 -330780 -416489 -576714 -610685
$$ packed form
14791A37010J52042m65499k07807J28157r2722p2254L00623P45609M91540J49202
14781A265901k7997j85308p12715o88264k18921k90532L5394L22238N58638M67232
14771E25666m7013m36766m18415l76796J88648P63039N21546J58118j2056o3260
14761H02711o5144k72959k34195J41473M66992P4769O6298Q8899k10060m04998
14751D53786k90517J78831J32642k30620Q2993J90782K8741k33008o02562l97145
14741f86077k24125R897O5686m5279j66184k58291K78623O67074N08442L94217
14731E43983M83197j85568k86104L64514N45259J54268m74519p26828l77792J35849
14721A76259J66315j78785j24648K88208j68820l95029r4280q5709j60225l3971
$$ plain form
14711 -610685 -674302 -487201 -409092 -391510 -591409 -686625 -367846 -348593 -628911 -638393 -356961
14700 -356961 -204002 -426889 -579902 -436509 -130865 40462 130016 -237581 -461614 -496961
14690 -496961 -530287 -468981 -370406 -298027 -341531 -179943 -50433 144549 353653 455330
14680 455330 602072 812059 741073 539935 535728 521142 322039 351200 527070 334172
14670 334172 -273206 -717728 -569529 -341927 -246257 -37917 10433 -426083 -854583 -964715
14660 -964715 -732965 -27463 594923 651380 231420 -181040 -555156 -652449 -613105 -464975
14650 -464975 118328 873986 1066699 793814 643475 600861 533693 299396 229222 -53056
14640 -53056 -381216 -288145 -124445 -216816 -440178 -583561 -540056 -271140 -128589 -503258
$$ packed form
14711f10685o3617J87101P8109J7582j99899r5216L18779J9253k80318r482K81432
14700c56961J52959k22887j53013J43393L05644J71327Q9554l67597k24033l5347
14690d96961l3326O1306R8575P2379m3504J61588J29510J94982K09104J01677
14680D55330J46742K09987p0986k01138m207j4586j99103K9161J75870j92898
14670C34172o07378m44522J48199K27602R5670K08340M8350m36516m28500j10132
14660i64715K31750P05502O22386N6457m19960m12460l74116r7293L9344J48130
14650d64975N83303P55658J92713k72885j50339m2614o7168k34297p0174k82278
14640e3056l28160R3071J63700r2371k23362j43383M3505K68916J42551l74669
$$ plain form
14630 -503258 -557202 -505049 -893559 -1071542 -834444 -787964 -778207 -822025 -800867 -700918 -412274
14619 -412274 -236780 -660958 -878460 -723734 -730721 -772790 -476653 70239 490040 239049
14609 239049 102977 105302 -178109 -107436 328898 620229 754311 739384 331975 -541827
14599 -541827 -651989 -459008 -406129 -297545 -258681 -542197 -777824 -598174 -250314 -271329
14589 -271329 -282669 -153470 -698167 -1486591 -1465124 -978507 -365562 121739 259317 -142434
14579 -142434 -223635 22210 465064 293217 -251140 -474918 -599545 -578585 -552464 -638011
14569 -638011 -700450 -805133 -1146259 -1343430 -1182122 -1151539 -984029 -830076 -663638 -664710
14559 -664710 -208367 406747 506068 313029 138471 283279 59746 -188518 -128353 -32263
$$ packed form
14630e03258n3944N2153l88510j77983K37098M6480R757m3818K1158R9949K88644
14619d12274J75494m24178k17502J54726o987m2069K96137N46892M19801k50991
14609B39049j36072K325k83411P0673M36334K91331J34082j4927m07409q73802
14599e41827j10162J92981N2879J08584L8864k83516k35627J79650L47860k1015
14589b71329j1340J29199n44697p88424K1467M86617O12945M87301J37578m01751
14579a42434q1201K45845M42854j71847n44357k23778j24627K0960K6121q5547
14569f38011o2439j04683l41126j97171J61308L0583J67510J53953J66438j072
14559f64710M56343O15114R9321j93039j74558J44808k23533k48264O0165R6090
$$ plain form
14549 -32263 -42907 -24807 -12839 -2572 164028 39427 -55400 55883 297750 374552 21476
14538 21476 -278515 -687084 -644463 -828473 -1213188 -1255375 -1175272 -1270871 -1214937 -468788 268092
14527 268092 146852 -600435 -537676 -538298 -934518 -1383663 -956863 -402963 -546128 -513526
14517 -513526 -595473 -691220 -706885 -380037 -52459 -227451 -383712 -490750 -567417 -583700
14507 -583700 -540089 -138239 -140336 -548629 -975744 -1125512 -794152 -220415 175122 107029
14497 107029 -54577 -50743 -100377 -483281 -858896 -899026 -1009720 -1117319 -886014 -906322
14487 -906322 -1425885 -1928948 -2030668 -1426167 -852947 -343649 132055 540778 508537 417015
14477 417015 390893 241259 56097 -368311 -737661 -929990 -1254567 -895930 -429276 -269168
$$ packed form
14549c2263j0644J8100J1968J0267J66600j24601r4827J11283K41867P6802l53076
14538B1476k99991m08569M2621j84010l84715m2187Q0103r5599N5934P46149P36880
14527B68092j21240p47287O2759o22l96220m49145M26800N53900j43165L2602
14517e13526q1947r5747j5665L26848L27578j74992j56261j07038p6667j6283
14507e83700M3611M01850k097m08293m27115j49768L31360N73737L95537o8093
14497A07029j61606L834m9634l82904l75615m0130j10694j07599K31305k0308
14487i06322n19563n03063j01720O04501N73220N09298M75704M08723l2241r1522
14477D17015k6122j49634j85162m24408l69350j92329l24577L58637M66654J60108
$$ plain form
14467 -269168 290738 561583 -115552 -699237 -945696 -784819 -628248 -376449 -426431 -759192
14457 -759192 -1062615 -1194758 -1081629 -1459840 -1753003 -1615174 -1396838 -1317681 -1104785 -736758
14447 -736758 165757 1066196 1036403 513597 36670 -339845 -763701 -805363 -665692 -590007
14437 -590007 -373083 254898 682245 833182 757404 44775 -453953 -122566 433922 193037
14427 193037 -143865 -299752 -505350 -162618 668375 1019542 882128 558456 134121 -34135
14417 -34135 -264669 -377056 -45231 238906 -153120 -741002 -712700 -126637 307111 625362
14407 625362 529773 337818 552442 684902 356902 254948 753838 1235263 1259835 1038617
14397 1038617 1082087 1182820 1068516 1068126 792902 347844 36120 -438586 -854818 -1139830
$$ packed form
14467b69168N59906K70845o77135n83685k46459J60877J56571K51799m9982l32761
14457g59192l03423j32143J13129l78211k93163J37829K18336P9157K12896L68027
14447g36758R02515R00439k9793n22806m76927l76515m23856m1662J39671P5685
14437e90007K16924O27981M27347J50937p5778p12629m98728L31387N56488k40885
14427A93037l36902j55887k05598L42732Q30993L51167j37414l23672m24335j68256
14417c4135k30534j12387L31825K84137l92026n87882K8302N86063M33748L18251
14407F25362r5589j91955K14624J32460l28000j01954M98890M81425K4572k21218
14397A038617M3470J00733j14304l90k75224m45058l11724m74706m16232k85012
$$ plain form
14387 -1139830 -723639 29601 784911 878452 375735 229314 358765 1065468 1615907 1294161
14377 1294161 802153 616035 562674 427014 43064 331332 1019931 1171416 813715 418390
14367 418390 207774 286507 653635 998454 911175 560203 225549 375107 673978 735532
14357 735532 749815 748291 767428 816508 767625 410393 -290048 -966755 -932214 -763428 -554279
14346 -554279 -319333 -135578 -6873 195956 482577 275627 147130 475825 1118094 1448069
14336 1448069 1076537 775170 451614 287125 229080 304971 421729 789590 616230 125818
14326 125818 -63461 -299499 -135833 -19047 52502 393973 826610 1154797 1186099 559981
14316 559981 72245 -234971 -105322 68330 -200319 -238802 254868 100954 -223681 -322529
$$ packed form
14387a139830M16191P53240P55310R3541n02717j46421J29451P06703N50439l21746
14377A294161m92008j86118n3361j35660l83950K88268O88599J51485l57701l95325
14367D18390k10616P8733L67128L44819q7279l50972l34654J49558K98871O1554
14357G35532J4283j524J9137M9080m8883l57232p00441o76707L4541J68786K09149
14346e54279K34946J83755J28705K02829K86621k06950j28497L28695O42269L29975
14336A448069l71532l01367l23556j64489n8045P5891J16758L67861j73360m90412
14326A25818j89279k36038J63666J16786P1549L41471M32637L28187L1302o26118
14316E59981m87736l07216J29649J73652k68649l8483M93670j53914l24635r8848
$$ plain form
14306 -322529 -456923 -469557 -561648 -466555 -150499 53648 12518 232164 417852 331298
14296 331298 226591 34926 219146 587184 701085 578355 481120 250098 -7294 -535036
14286 -535036 -841985 -749835 -747088 -1254763 -1381132 -1445507 -1815057 -1630749 -1165360 -561635
14276 -561635 -581501 -1028621 -1268483 -1117483 -588514 -214471 80079 -1643 -578184 -559763
14266 -559763 -452724 -502194 -393839 -233717 -19837 82566 -6073 -342612 -638917 -783047
14256 -783047 -677330 57390 307409 222787 338127 523459 274046 -409904 -588963 -429238
14246 -429238 -69434 65203 229518 356472 227340 94645 -129343 167649 183594 -241574
14236 -241574 -137700 -210894 -596009 -540642 -177131 150050 281444 518768 850425 1363931
$$ packed form
14306c22529j34394j2634r2091R5093L16056K04147m1130K19646J85688q6554
14296C31298j04707j91665J84220L68038J13901j22730r7235k31022k57392n27742
14286e35036l06949R2150K747n07675j26369o4375l69550J84308M65389O03725
14276e61635j9866m47120k39862J51000N28969L74043K94550q1722n76541J8421
14266e59763J07039m9470J08355J60122K13880J02403q8639l36539k96305j44130
14256g83047J05717P34720K50019q4622J15340J85332k49413o83950j79059J59725
14246d29238L59804J34637J64315J26954j29132j32695k23988K96992J5945m25168
14236b41574J03874p3194l85115N5367L63511L27181J31394K37324L31657N13506
$$ plain form
14226 1363931 1536155 985414 484282 594567 500433 -127713 -953423 -1240681 -1055170 -476361
14216 -476361 64056 92477 -35861 -392422 -479587 107434 528554 530011 262948 25998
14206 25998 -203320 -579586 -691016 -762052 -589092 -466943 -368738 -441740 -447042 -34068 158525
14195 158525 212596 214550 119672 289305 403785 269105 188344 127382 173683 215183 180139
14184 180139 47837 -298048 -795971 -985190 -1204760 -951550 -290530 -75033 222689 716489
14174 716489 521336 361433 591224 556403 389038 545391 413500 -287244 -518014 -352030
14164 -352030 -64013 -14420 -582098 -779913 -705800 -278619 226658 399946 107040 -370047
14154 -370047 -580769 -289255 -5030 291501 782883 1076372 526311 470503 650009 408058
$$ packed form
14226A363931J72224n50741n01132J10285r4134o28146q25710k87258J85511N78809
14216d76361N40417K8421j28338l56561q7165N87021M21120J457k67063k36950
14206B5998k29318l76266j11430p1036J72960J22149R8205p3002n302M12974J92593
14195A58525N4071J954r4878J69633J14480j34680q0761o0962M6301M1500l5044
14184A80139j32302l45885m97923j89219k19570K53210O61020K15497K97722M93800
14174G16489j95153j59903K29791l4821j67365J56353j31891p00744k30770J65984
14164c52030K88017M9593n67678j97815P4113M27181N05277J73288k92906m77087
14154c70047k10722K91514K84225K96531M91382K93489n50061n5808J79506k41951
$$ plain form
14144 408058 147468 88154 59146 341951 940900 906156 386596 210992 207677 53415
14134 53415 91031 414086 638816 667746 908669 848038 492086 102935 -139631 -83980
14124 -83980 -194110 -284591 38151 408528 -27569 -533351 -428653 -230985 -429491 -671183
14114 -671183 -880439 -938656 -628764 -218684 24001 -286211 -489847 -206812 185948 274095
14104 274095 393499 568657 630958 773467 839679 437924 11530 -201023 -382317 -303323
14094 -303323 -425550 -725305 -781148 -599841 -625585 -748146 -695084 -296292 -64081 -414869
14084 -414869 -1225320 -1609763 -1307346 -1242107 -1509351 -1339213 -793972 -618567 -628271 -408164
14074 -408164 -302804 -147375 161113 205544 -71142 -648409 -879756 -1026968 -770729 -555141
$$ packed form
14144D08058k60590n9314k9008K82805N98949l4744n19560j75604l315j54262
14134E3415L7616L23055K24730K8930K40923o0631l55952l89151k42566N5651
14124h3980j10130r0481L22742L70377m36097n05782J04698J97668j98506k41692
14114f71183k09256n8217L09892M10080K42685l10212k03636K83035L92760Q8147
14104B74095J19404J75158O2301J42509O6212m01755m26394k12553j81294P8994
14094c03323j22227k99755n5843J81307k5744j22561N3062L98792K32211l50788
14084d14869q10451l84443L02417O5239k67244J70138N45241J75405r704K20107
14074d08164J05360J55429L08488M4431k76686n77267k31347j47212K56239K15588
$$ plain form
14064 -555141 -1011109 -1391470 -1424362 -1348738 -1107882 -1066179 -1168105 -824150 187314 790115
14054 790115 430170 -389922 -1070620 -1010011 -912094 -731948 -549608 -528469 -833887 -1109093
14044 -1109093 -894668 -685860 -584940 -534791 -668215 -448983 -138752 -129060 -98919 23777
14034 23777 248915 13001 -191523 194540 293995 -305445 -732794 -769596 -901692 -792181
14024 -792181 -645113 -943373 -1210393 -1067025 -590993 -347974 -614683 -568493 -9732 513466
14014 513466 488652 149638 -81041 26902 162760 90572 383174 757951 872325 531214
14004 531214 778413 462092 -404018 -874417 -644325 -309197 -75580 466957 723638 621675
13994 621675 739667 737236 194707 -168817 -231076 76679 211151 89175 -93117 -144298
$$ packed form
14064e55141m55968l80361l2892P5624K40856M1703j01926L43955J011464O02801
14054G90115l59945q20092o80698O0609R7917J80146J82340K1139l05418k75206
14044a109093K14425K08808J00920N0149j33424K19232L10231R692L0141J22696
14034B3777K25138k35914k04524L86063R9455n99440m27349l6802j32096J09511
14024g92181J47068k98260k67020J43368M76032K43019k66709M6190N58761N23198
14014E13466k4814l39014k30679J07943J35858p2188K92602L74777J14374l41111
14004E31214K47199l16321q66110m70399K30092L35128K33617N42537K56681j01963
13994F21675J17992k431n42529l63524o2259L07755J34472j21976j82292n1181
$$ plain form
13984 -144298 -47054 199637 679562 580622 298689 -94960 -138066 -92672 -227862 -362229
13974 -362229 -515965 -440459 -213927 -300194 -409116 -727803 -947932 -864719 -799232 -975811
13964 -975811 -981248 -464171 28823 102754 -159357 -197207 -26622 318614 433786 462053
13954 462053 302968 357381 905722 957159 552908 137618 -300916 -598399 -617776 -373691
13944 -373691 259116 339637 -240455 -256958 56851 33201 200474 188018 -16852 628965
13934 628965 1099433 888879 902253 658811 180383 117107 642046 642128 402881 26735 -219143
13923 -219143 -106769 -203765 -97039 429174 670799 666367 -120583 -966147 -1088649 -851287
13913 -851287 -707000 -583714 -316315 -424210 -533988 -596223 -247171 84827 277375 416754
$$ packed form
13984a44298R7244K46691M79925r8940k81933l93649m3106M5394j35190j34367
13974c62229j53736P5506K26532q6267j08922l18687k20129Q3213O5487j76579
13964i75811n437N17077M92994P3931k62111l7850J70585L45236J15172K8267
13954D62053j59085N4413N48341N1437m04251m15290m38534k97483j9377K44085
13944c73691O32807Q0521n80092j6503L13809k3650J67273j2456k04870O45817
13934F28965M70468k10554J3374k43442m78428o3276N24939Q2k39247l76146k45878
13923b19143J12374r6996J06726N26213K41625m432p86950q45564j22502K37362
13913h51287J44287J23286K67399j07895j09778o2235L49052L31998J92548J39379
$$ plain form
13903 416754 190659 124982 100924 -484291 -945789 -1402322 -1724891 -1509602 -1119778 -663170
13893 -663170 -468708 -693423 -933547 -1346111 -1985024 -2072726 -1749379 -1296454 -1295636 -1612471
13883 -1612471 -1610919 -1281745 -905586 -387526 98142 -202651 -447209 -165399 3165 -454931
13873 -454931 -1021030 -1322869 -1260668 -710164 -524619 -1181803 -1599875 -1511246 -1121205 -669196
13863 -669196 -429709 39279 149264 501423 580276 304977 455133 718552 719276 618182
13853 618182 199178 -264629 -39536 215409 283744 -87917 -123471 142867 297976 53839
13843 53839 -246698 -267995 -685872 -723665 -161106 60923 -181291 -797218 -994586 -865586
13833 -865586 -974955 -1386269 -1391706 -958340 -589149 24579 205955 30780 -360160 -703745
$$ packed form
13903D16754k26095o5677k4058n85215m61498m56533l22569K15289L89824M56608
13893f63170J94462k24715k40124m12564o38913q7702L23347M52925Q18l16835
13883a612471J552L29174L76159N18060M85668l00793k44558K81810J68564m58096
13873d54931n66099l01839O2201N50504J85545o57184m18072Q8629L90041M52009
13863f69196K39487M68988J09985L52159P8853k75299J50156K63419P24j01094
13853F18182m19004m63807K25093K54945O8335l71661l5554K66338J55109k44137
13843E3839l00537k1297m17877l7793N62559K22029k42214o15927j97368J29000
13833h65586j09369m11314n437M33366L69191O13728J81376j75175l90940l43585
$$ plain form
13823 -703745 -642768 -115863 388720 370462 15192 -154117 -754358 -1193634 -1176290 -1358393
13813 -1358393 -1147640 -932258 -631672 -414956 -433465 -450656 -579507 -541075 -645223 -1247504
13803 -1247504 -1552722 -1284731 -1026408 -884246 -337429 271922 342861 -15982 -330542 -571777
13793 -571777 -1183266 -1662664 -1392408 -991878 -1071748 -1308798 -1304629 -1057538 -1045365 -938200
13783 -938200 -530924 -197952 72238 214494 140144 -471073 -1216487 -1479248 -1230837 -777152
13773 -777152 -183356 -189372 -784250 -806662 -699558 -545557 -581541 -517556 -688531 -984266
13763 -984266 -1008404 -1228303 -1245295 -1017656 -441231 74031 357093 415088 145701 174209
13753 174209 305948 429529 425429 353894 227964 58499 -144794 -259482 -139121 -193869
$$ packed form
13823g03745O0977N26905N04583j8258l55270j69309o00241m39276J7344j82103
13813a358393K10753K15382L00586K16716j8509j7191j28851L8432j04148o02281
13803a247504l05218K67991K58323J42162N46817O09351P0939l58843l14560k41235
13793e71777o11489m79398K70256M00530p9870k37050M169K47091J2173J07165
13783i38200M07276L32972K70190J42256p4350o11217p45414k62761K48411M53685
13773g77152N93796o016n94878k2412J07104J54001l5984O3985j70975k95735
13763i84266k4138k19899j6992K27639N76425N15262K83062N7995k69387K8508
13753A74209J31739J23581m100p1535j25930j69465k03293j14688J20361n4748
$$ plain form
13743 -193869 -371563 -130892 125568 -115453 -759539 -964763 -627462 -733514 -318293 280888
13733 280888 545294 565528 320310 334817 926186 1204800 999113 602943 411147 160147
13723 160147 -240424 -373993 -13150 -93565 -536843 -939417 -920596 -988248 -1426472 -1576210
13713 -1576210 -1006572 -248106 85780 46857 -315376 -571473 -493080 -166705 56243 63459
13703 63459 397561 220284 -29732 59980 -23398 78884 262585 235748 32272 -115544
13693 -115544 96851 324316 14687 -26610 175950 -15950 -401965 -462777 105083 364653
13683 364653 469726 724067 309427 -409229 -665584 -518295 -201201 -148065 -442175 -612149
13673 -612149 -137182 174790 -143358 -38557 20912 -342747 -952583 -1179105 -975526 -827362
$$ packed form
13743a93869j77694K40671K56460k41021o44086k05224L37301j06052M15221N99181
13733B80888K64406K0234k45218J4507N91369K78614k05687l96170j91796k51000
13723A60147m00571j33569L60843q0415m43278m02574J8821o7652m38224j49738
13713a576210N69638P58466L33886l8923l62233k56097P8393L26375K22948P216
13703F3459L34102j77277k50016Q9712q3378J02282J83701k6837k03476j47816
13693a15544K12395K27465l09629m1297K02560j91900l86015o0812N67860K59570
13683C64653J05073K54341m14640p18656k56355J47289L17094N3136k94110j69974
13673f12149M74967L11972l18148J04801N9469l63659o09836k26522K03579J48164
$$ plain form
13663 -827362 -772131 -859151 -456748 69700 489169 645502 669334 704017 416480 -135622
13653 -135622 -673975 -524513 -6734 -63182 -407118 -810229 -855348 -457549 -129353 291161
13643 291161 282527 -51810 -163814 216034 680462 584469 460180 750177 442438 -541210
13633 -541210 -727368 -762758 -983045 -984949 -1342872 -1645363 -1437146 -846779 -461508 77739
13623 77739 372103 110567 -258350 -585483 -447685 -252358 -193421 -360629 -341860 -463322
13613 -463322 -681047 -1114493 -1531524 -1362224 -885466 -485286 -572981 -826365 -560964 -440036
13603 -440036 -212623 459103 905972 618317 409894 427144 552309 378313 -87171 -570574
13593 -570574 -1000511 -798699 -740200 -859291 -913960 -1087326 -1367214 -1415558 -1109340 -561388
$$ packed form
13663h27362N5231q7020M02403N26448M19469J56333K3832L4683k87537n52102
13653a35622n38353J49462N17779n6448l43936m03111m5119L97799L28196M20514
13643B91161q634l34337j12004L79848M64428r5993j24289K89997l07739r83648
13633e41210j86158l5390k20287j904l57923l02491K08217N90367L85271N39247
13623G7739K94364k61536l68917l27133J37798J95327N8937j67208J8769j21462
13613d63322k17725m33446m17031J69300M76758M00180q7695k53384K65401J20928
13603d40036K27413O71726M46869k87655k08423J7250J25165j73996m65484m83403
13593e70574m29937K01812N8499j19091n4669j73366k79888m8344L06218N47952
$$ plain form
13583 -561388 -748460 -972588 -809151 -493984 -581151 -816904 -995657 -965081 -595437 -366619
13573 -366619 -558485 -724657 -551618 18179 589065 1043938 939030 550483 -113455 -943433
13563 -943433 -1050934 -963432 -1187261 -1273063 -986769 -476540 -389502 -569645 -907647 -1151187
13553 -1151187 -1061744 -666989 -217263 -285218 -707887 -1067753 -1061874 -772148 -296488 89699
13543 89699 126292 -187105 -5542 270603 245998 254786 281209 309766 259517 447870 487125
13532 487125 386343 177063 -170880 -498657 -818963 -895390 -1281329 -979562 -632603 -587423
13522 -587423 -602711 -896580 -1434731 -1286403 -831429 -710387 -986998 -1014984 -1004747 -966593
13512 -966593 -911788 -862332 -957243 -718222 -153776 -154757 -327038 -189832 -40343 -278603 -734838
$$ packed form
13583e61388j87072k24128J63437L15167q7167k35753j78753L0576L69644K28818
13573c66619j91866j66172J73039N69797N70886M54873j04908l88547o63938q29978
13563i43433j07501Q7502k23829q5802K86294N10229Q7038j80143l38002k43540
13553a151187Q9443L94755M49726o7955m22669l59866N879K89726M75660L86187
13543H9699L6593l13397J81563K76145k4605Q788K6423K8557n0249J88353L9255
13532D87125j00782k09280l47943l27777l20306p6427l85939L01767L46959M5180
13522e87423j5288k93869n38151J48328M54974J21042k76611k7986J0237L8154
13512i66593N4805M9456r4911K39021N64446r81j72281J37206J49489k38260m56235
$$ plain form
13501 -734838 -1333624 -1410512 -987373 -557144 -339041 241119 571869 658470 597312 85401
13491 85401 -453500 -1053922 -1193619 -493711 223393 667194 812400 392121 -332021 -915732
13481 -915732 -1076211 -1006199 -691779 -273359 -301691 -583087 -881962 -861121 -1056820 -1239966
13471 -1239966 -1349230 -1197405 -382498 356926 592161 627582 455742 6466 35018 421272
13461 421272 821941 921069 714032 664887 1058651 1296937 682278 420695 800569 1178583
13451 1178583 1089582 845526 277393 5442 -206527 -451110 -686024 -597894 -465841 -587498
13441 -587498 -237292 -120167 -279426 -350589 -600391 -784997 -934905 -737001 -321987 -290609
13431 -290609 -170633 -178786 -400100 -361178 -567666 -850380 -916383 -646338 -540817 -501534
$$ packed form
13501g34838n98786p6888M23139M30229K18103N80160L30750Q6601o1158n11911
13491H5401n38901o00422j39697O99908P17104M43801J45206m20279p24142n83711
13481i15732j60479P0012L14420M18420k8332k81396k98875K0841j95699j83146
13471a239966j09264J51825Q14907P39424K35235L5421j71840m49276K8552L86254
13461D21272M00669R9128k07037m9145L93764K38286o14659k61583L79874L78014
13451A178583q9001k44056n68133k71951k11969k44583k34914Q8130J32053j21657
13441e87498L50206J17125j59259p1163k49802j84606j49908J97904M15014L1378
13431b90609J19976q153k21314L8922k06488k82714o6003K70045J05521L9283
$$ plain form
13421 -501534 -306027 -187710 23896 562533 913283 607809 265096 -224980 -709314 -691674
13411 -691674 -245325 44609 -18246 -84278 -149471 -217509 -220929 -381078 -497175 -834013 -1050423
13400 -1050423 -1160225 -1285192 -1078799 -852859 -369194 295435 712511 830837 497914
13391 497914 -99994 -402850 -329209 23479 144412 -277971 -477995 -188655 -186428 -179881
13381 -179881 -106014 -283884 -497998 -498560 -206500 381312 736515 659589 381972 62439
13371 62439 -189318 -687608 -458531 -240480 -346968 25863 393210 781818 1209231 1069187
13361 1069187 391201 -295283 -855404 -1267990 -1174232 -1186284 -1348806 -807679 -74065 -233509
13351 -233509 -890067 -1040730 -800199 -871870 -1295779 -1428154 -975422 -251242 259485 539340
$$ packed form
13421e01534J95507J18317K11606N38637L50750l05474l42713m90076m84334J7640
13411f91674M46349K89934o2855o6032o5193o8038l420j60149j16097l36838k16410
13400a050423j09802j24967K06393K25940M83665O64629M17076J18326l32923
13391D97914n97908l02856P3641L52688J20933m22383k00024K89340K227O547
13381a79881P3867j77870k14114n62K92060N87812L55203p6926k77617l19533
13371F2439k51757m98290K29077K18051j06488L72831L67347L88608M27413j40044
13361A069187o77986o86484n60121m12586R3758j2052j62522N41127P33614j59444
13351b33509o56558j50663K40531p1671m23909j32375M52732P24180N10727K79855
$$ plain form
13341 539340 810568 810487 533946 -50507 -238130 226735 -50621 -148027 109961 560251
13331 560251 836111 409367 -263054 -889848 -1036131 -886741 -1189936 -1231881 -568879 -14459
13321 -14459 -176082 -394322 -159596 -138279 -122422 134612 51427 -90189 -490443 -850637
13311 -850637 -665947 -230133 -318151 -781207 -961914 -877961 -882336 -536288 52160 343843
13301 343843 13758 -48255 -29585 175534 269957 411755 580612 817019 923493 643814
13291 643814 635390 620451 431129 158931 229280 463573 658599 574530 550873 1096492 1485113
13280 1485113 1487060 1560748 1530042 1139330 464311 312782 274079 195051 346418 465795
13270 465795 878438 962366 574058 385307 -8507 -158768 681495 1609677 1713101 1474562
$$ packed form
13341E39340K71228q1k76541n84453j87623M64865k77356r7406K57988M50290
13331E60251K75860m26744o72421o26794j46283J49390l03195m1945O63002N54420
13321a4459j61623k18240K34726K1317J5857K57034q3185j41616m00254l60194
13311h50637J84690M35814q8018m63056j80707Q3953m375L46048N88448K91683
13301C43843l30085o2013J8670K05119R4423J41798J68857K36407J06474k79679
13291F43814q424j4939j89322k72198P0349K34293J95026q4069k3657N45619L88621
13280A485113J947P3688l0706l90712o75019j51529l8703p9028J51367J19377
13270D65795M12643Q3928l88308j88751l93814j50261Q40263R28182J03424k38539
$$ plain form
13260 1474562 1350551 959530 672924 759383 791309 443355 230245 600873 969638 959563
13250 959563 760157 912464 1222263 1369425 1278616 816495 563239 501106 395143 348531
13240 348531 -226384 -313290 -277492 -74392 171386 -45984 -70201 117026 463206 925742
13230 925742 1165729 572860 124012 521839 848152 907849 703039 217107 -268657 -367016
13220 -367016 -121223 406143 585966 147737 -250096 -34849 265168 641671 905772 844476
13210 844476 935026 820471 603444 534872 496001 663540 902248 1143737 936250 662333
13200 662333 664095 442121 370239 338173 -232342 -323748 174736 500094 791150 556060
13190 556060 129028 363462 764020 782854 422249 74488 -339798 -647622 -576440 -209812
$$ packed form
13260A474562j24011l91021k86606Q6459L1926l47954k13110L70628L68765j0075
13250I59563j99406J52307L09799J47162r0809m62121k53256o2133j05963m6612
13240C48531n74915q6906L5798K03100K45778k17370k4217J87227L46180M62536
13230I25742K39987n92869m48848L97827L26313N9697k04810m85932m85764r8359
13220c67016K45793N27366J79823m38229l97833K15247L00017L76503K64101o1296
13210H44476R0550j14555k17027o8572l8871J67539K38708K41489k07487k73917
13200F62333J762k21974p1882l2066n70515r1406M98484L25358K91056k35090
13190E56060m27032K34434M00558J8834l60605l47761m14286l07824P1182L66628
$$ plain form
13180 -209812 81046 10472 187794 501506 773287 888479 1056251 755876 204690 130002
13170 130002 487873 1332927 2031946 1980696 1831594 1911647 2207052 2340704 1735417 846382
13160 846382 426328 317629 205455 39884 -186491 -78366 57730 218363 168030 192895
13150 192895 295189 177921 50730 32317 362597 514790 -111022 -260140 71382 457379
13140 457379 457079 257338 184387 186168 -31419 -331815 -94671 197517 -222362 -356404 -77852
13129 -77852 412464 481581 703940 988219 1302644 1133447 1068646 1235475 1405070 1366238
13119 1366238 934620 644051 677974 594564 534013 464095 635075 1168097 1546241 1654751
13109 1654751 1491207 1325426 1460527 1578892 1114929 974842 1332394 1317933 821758 235643
$$ packed form
13180b09812K90858p0574J77322L13712K71781J15192J67772l00375n51186p4688
13170A30002L57871Q45054O99019n1250j49102Q0053K95405J33652o05287q89035
13160H46382m20054j08699j12174j65571k26375J08125J36096J60633n0333K4865
13150A92895J02294j17268j27191j8413L30280J52193o25812j49118L31522L85997
13140D57379l00j99741p2951J781k17587l00396K37144K92188m19879j34042K78552
13129g7852M90316O9117K22359K84279L14425j69197o4801J66829J69595l8832
13119A366238m31618k90569L3923q3410o0551o9918J70980N33022L78144J08510
13109A654751j63544j65781J35101J18365m63963j40087L57552j4461m96175n86115
$$ plain form
13099 235643 243669 658018 825575 825574 980792 922872 1040802 1554014 1924723 1450931 855537
13088 855537 444708 120539 26340 86477 530941 1072844 1419982 1608810 1384864 876838
13078 876838 549648 676569 858628 1112610 1390822 1222649 1309105 1619314 1733065 1756762
13068 1756762 1833989 1773820 1951240 2156443 1934295 1240626 581441 818554 1135282 968963
13058 968963 924341 1143953 1861482 2510599 2452673 2173399 2179712 2271913 2274495 2349266 2506185
13047 2506185 2378110 2348826 2688728 2765138 2908058 3020693 2997717 2923672 2711078 2567009
13037 2567009 2741469 2978623 3394521 3550963 3735902 4180029 4485747 4725732 4834316
13028 4834316 5179996 5312297 5125730 4897736 4825935 4871176 5332938 6003104 6476178 6413295
$$ packed form
13099B35643Q026M14349J67557jJ55218n7920J17930N13212L70709m73792n95394
13088H55537m10829l24169r4199O0137M44464N41903L47138J88828k23946n08026
13078H76838l27190J26921J82059K53982K78212j68173Q6456L10209J13751K3697
13068A756762P7227o0169J77420K05203k22148o93669o59185K37113L16728j66319
13058I68963m4622K19612P17529O49117n7926k79274O313R2201K582P4771J56919
13047B506185j28075k9284L39902P6410J42920J12635k2976p4045k12594j44069
13037B567009J74460K37154M15898J56442J84939M44127L05718K39985J08584
13028D834316L45680J32301j86567k27994p1801M5241M61762O70166M73074o2883
$$ plain form
13018 6413295 6161704 6642297 7275921 7788672 8746545 9434059 9397985 9198417 9185928 9345866
13008 9345866 10036729 10411425 10444392 10311926 10842474 11967227 13044490 14112924 15474720
12999 15474720 16438188 16900801 17343629 18359791 19605938 21089175 22540839 23902559
12991 23902559 25425151 27215548 28932580 30791676 33428664 36032739 39094580 42491014
12983 42491014 46490915 51063067 55594549 61334389 68860487 78450389 90485871 106420350
12975 106420350 126533451 151507855 182624372 220538062 261508890 293136426 298046041
12968 298046041 271779696 228679057 185046848 148792133 121091194 100263461 84689485
12961 84689485 72169678 61875162 53939895 48132138 43100250 38689451 35026989 31635254
$$ packed form
13018F413295k51591M80593O33624N12751R57873O87514l6074j99568j2489J59938
13008I345866O90863L74696L2967j32466N30548J124753J077263J068434J361796
12999A5474720R63468M62613M42828J016162J246147J483237J451664J361720
12991B3902559J522592J790397J717032J859096K636988K604075L061841L396434
12983D2491014L999901M572152M531482N739840P526098R589902J2035482J5934479
12975A06420350K0113101K4974404L1116517L7913690M0970828L1627536M909615
12968B98046041k6266345m3100639m3632209l6254715k7700939k0827733j5573976
12961H4689485j2519807j0294516p935267n807757n031888m410799l662462l391735
$$ plain form
12953 31635254 28662153 26485690 24383082 21982983 20011622 18889469 18018207 16982667
12945 16982667 16006317 15304674 14445567 13582488 13143380 13354596 13273918 12932716 13037124
12936 13037124 13491549 13817535 13687634 13104393 12426287 12179800 12220267 12383516 12766110
12927 12766110 12712889 12486262 12678500 13240619 13813835 14290271 14555958 14528119 14881500 15381670
12917 15381670 16188265 18156961 20343804 21782713 23285337 25018164 26235613 26758361
12909 26758361 27263511 27549451 27360872 27768218 28446230 29282209 30423641 31623460 33249591
12900 33249591 35208834 37438412 39958556 43249904 47557808 52541953 58416879 65002499
12892 65002499 72997442 83227351 96169247 112137000 132627401 159178203 192779076
$$ packed form
12953C1635254k973101k176463k102608k400099j971361j122153q71262j035540
12945A6982667r76350p01643q59107q63079m39108K11216q0678l41202J04408
12936A3037124M54425L25986j29901n83241o78106k46487M0467J63249L82594
12927A2766110n3221k26627J92238N62119N73216M76436K65687k7839L53381N00170
12917A5381670Q06595J968696K186843J438909J502624J732827J217449N22748
12909B6758361N05150K85940j88579M07346O78012Q35979J141432J199819J626131
12900C3249591J959243K229578K520144L291348M307904M984145N874926O585620
12892F5002499P994943J0229909J2941896J5967753K0490401K6550802L3600873
$$ plain form
12885 192779076 233239086 274874231 302278311 298709415 265122453 219155116 176251934
12878 176251934 141924343 115730475 96106587 81102152 69236221 60036459 52862075
12871 52862075 47231389 42007050 37509093 33940084 30918886 28474276 26379465 24482402
12863 24482402 22825184 21011652 18944787 17234540 16047863 15191979 14711968 14378594
12855 14378594 14228429 14145397 13715349 13177441 12905084 13039600 13027660 12806738 12236595 11338769
12845 11338769 10962470 10916403 11120427 10937454 10945697 11623579 12318651 12536935 12560053 12766936
12835 12766936 12758280 12894180 13297649 13639755 13718869 14021075 14828751 15673829 16391650 17306412
12825 17306412 18613900 19556123 20136191 20710939 21567462 22584061 24006881 25507831 27325367
$$ packed form
12885A92779076M0460010M1635145K7404080l568896l3586962m5967337m2903182
12878A76251934l4327591k6193868j9623888j5004435j1865931r199762p174384
12871E2862075n630686n224339m497957l569009l021198k444610k094811j897063
12863B4482402j657218j813532k066865j710247j186677q55884m80011l33374
12855A4378594j50165q3032m30048n37908k72357J34516j1940k20922n70143q97826
12845A1338769l76299m6067K04024j82973Q243O77882O95072K18284K3118K06883
12835A2766936q656J35900M03469L42106P9114L02206Q07676Q45078P17821R14762
12825A7306412J307488R42223N80068N74748Q56523J016599J422820J500950J817536
$$ plain form
12816 27325367 29109125 31140188 33288986 35478476 38073754 41622972 45912680 50418553
12808 50418553 55207987 60751004 67837024 76534090 87052641 100131192 117026430 139145843
12800 139145843 167355550 202680070 243539753 281711259 300607433 287392939 249069547
12793 249069547 203516360 162696524 130961608 106980811 89010937 75311949 64716794
12786 64716794 56488002 49618947 43383149 37926600 33537262 30180710 27299874 24643144
12778 24643144 22145134 19837084 17681256 16209581 15390029 14328388 12895266 11904684
12770 11904684 11455274 10812612 10130349 9480825 8847027 8251466 7617126 6778187 6284282
12761 6284282 5916367 5500739 5348229 5511967 5742026 5230560 4915595 4702863 4288948
$$ packed form
12816B7325367J783758K031063K148798K189490K595278L549218M289708M505873
12808E0418553M789434N543017P086020Q697066J0518551J3078551J6895238K2119413
12800A39145843K8209707L5324520M0859683L8171506J8896174j3214494l8323392
12793B49069547m5553187m0819836l1734916k3980797j7969874j3698988j0595155
12786F4716794q228792o869055o235798n456549m389338l356552k880836k656730
12778B4643144k498010k308050k155828j471675q19552j061641j433122r90582
12770A1904684m49410o42662o82263o49524o33798n95561o34340q38939m93905
12761F284282l67915m15628j52510J63738K30059n11466l14965k12732m13915
$$ plain form
12752 4288948 4059369 4106664 4516259 4967784 4620932 3703349 3053139 2674152 2994564 3164383
12742 3164383 2849682 2758846 2948737 2994008 2876880 2414404 2044210 2012532 2244800 2061725
12732 2061725 1753185 1460668 1262775 1583179 2522876 3153441 3253400 2930819 2631769 2275892
12722 2275892 1859578 1637219 1842357 1928525 1741475 1962109 2081526 2115842 2050379 1924278
12712 1924278 1441788 751301 652067 1014884 1109598 1005966 861469 934588 1021446 1170414
12702 1170414 1189021 1390653 1406197 1433516 1617753 1749054 1693215 1392502 1140720 1014463
12692 1014463 644922 475781 188388 -15949 304588 601722 538347 578705 1041118 982952
12682 982952 524197 355289 670634 908210 1019887 1149031 1506194 1717427 1566143 1280254
$$ packed form
12752D288948k29579M7295M09595M51525l46852r17583o50210l78987L20412J69819
12742C164383l14701r0836J89891M5271j17128m62476l70194l1678K32268j83075
12732B061725l08540k92517j97893L20404R39697O30565R9959l22581k99050l55877
12722B275892m16314k22359K05138Q6168j87050K20634J19417L4316o5463j26101
12712A924278m82490o90487r9234L62817R4714j03632j44497P3119Q6858J48968
12702A170414J8607K01632J5544K7319J84237J31301n5839l00713k51782j26257
12692A014463l69541j69141k87393k04337L20537K97134o3375M0358M62413n8166
12682I82952m58755j68908L15345K37576J11677J29144L57163K11233j51284k85889
$$ plain form
12672 1280254 898991 974759 1213703 1173574 1008992 772607 516056 66464 -260343 -267989
12662 -267989 -25173 500443 664983 244907 50807 304360 539104 806432 1064099 1040719
12652 1040719 418041 219839 529516 793328 1173316 1435120 993913 824782 1142846
12643 1142846 1736205 1944666 1373399 621844 135248 33673 220952 226267 295227 527162
12633 527162 548401 5515 -658128 -619464 -309559 151816 622354 658411 462067 462589 418804
12622 418804 424871 681464 778671 477376 207091 317724 476947 348613 622871 679835
12612 679835 342246 328306 236393 -41693 -133505 -403713 -371880 -434038 -592639 -753357
12602 -753357 -526822 -214130 -152026 -122241 -163111 8752 158678 -92025 -505064 -625584
$$ packed form
12672A280254l81263P5768K38944m0129j64582k36385k56551m49592l26807p646
12662b67989K42816N25616J64540m20076j94100K53553K34744K67328K57667k3380
12652A040719o22678j98202L09677K63812L79988K61804m41207j69131L18064
12643A142846N93359K08461n71267p51555m86596j01575J87279N315O8960K31935
12633E27162K1239n42886o63643L8664L09905M61375M70538L6057j96344N22m3785
12622D18804O067K56593R7207l01295k70285J10633J59223j28334K74258N6964
12612F79835l37589j3940r1913k78086r1812k70208L1833o2158j58601j60718
12602g53357K26535L12692O2104K9785m0870J71863J49926k50703m13039j20520
$$ plain form
12592 -625584 -358432 334991 661666 663267 992865 993880 740254 681370 392324 49582
12582 49582 265039 993376 1319495 1200970 685628 437631 711191 1012441 1316336 1276233
12572 1276233 875857 616963 618192 591847 419848 -175892 -526685 -16167 638459 836016
12562 836016 1134117 1349078 1506089 1818060 1734912 1164647 739780 765986 413579 227183
12552 227183 705280 926616 940599 423755 -119689 -304576 -346664 -79798 102983 -276207
12542 -276207 -397809 -144998 -429685 -760098 -1101133 -755059 17431 211500 692030 1004845
12532 1004845 833211 560247 53646 -510415 -791862 -786902 -640094 -541103 -290796 240127
12522 240127 602311 828105 1009420 800632 363094 75584 -159126 -655707 -1165514 -1234914
$$ packed form
12592f25584K67152O93423L26675J601L29598J015k53626n8884k89046l42742
12582D9582K15457P28337L26119j18525n15342k47997K73560L01250L03895m0103
12572A276233m00376k58894J229k6345j71999n95740l50793N10518O54626J97557
12562H36016K98101K14961J57011L11971q3148n70265m24867K6206l52407j86396
12552B27183M78097K21336J3983n16844n43444j84887m2088K66866J82781l79190
12542b76207j21602K52811k84687l30413l41035L46074P72490J94069M80530L12815
12532A004845j71634k72964n06601n64061k81447M960J46808R8991K50307N30923
12522B40127L62184K25794J81315k08788m37538k87510k34710m96581n09807o9400
$$ plain form
12512 -1234914 -532661 -332791 -309341 24341 198864 -509952 -815466 -619956 -469706 -164756
12502 -164756 -75747 -29778 -4287 -164173 38897 -3717 -690711 -1514194 -1888865 -1805020
12492 -1805020 -1559534 -1426125 -1629989 -1990358 -1988048 -1459553 -764340 -455902 -218916 30353
12482 30353 -254766 -340502 292012 763770 773771 806425 373337 168074 208156 -86390
12472 -86390 -407315 -609429 -656401 -602874 -635193 -632598 -400994 66678 564161 897241 698848
12461 698848 878252 1184698 832971 445776 -31678 -353859 -373618 -543187 -313818 -582035
12451 -582035 -980509 -442304 -265786 -489025 -860162 -1104445 -1073814 -724573 -536207 -325977
12441 -325977 -13897 286037 130107 -458788 -565059 -202333 -249208 -246793 -78865 -122502
$$ packed form
12512a234914P02253J99870K3450L33682J74523p08816l05514J95510J50250L04950
12502a64756Q9009M5969K5491j59886K03070m2614o86994q23483l74671Q3845
12492a805020K45486J33409k03864l60369K310N28495O95213L08438K36986K49269
12482C0353k85119q5736O32514M71758J0001L2654m33088k05263M0082k94546
12472h6390l20925k02114m6972N3527l2319K595K31604M67672M97483L33080j98393
12461F98848J79404L06446l51727l87195m77454l22181j9759j69569K29369k68217
12451e82035l98474N38205J76518k23239l71137k44283L0631L49241J88366K10230
12441c25977L12080K99934j55930n88895j06271L62726m6875K415J67928m3637
$$ plain form
12431 -122502 -593501 -919950 -661170 -731215 -841842 -978106 -999487 -1054666 -1092666 -1217702
12421 -1217702 -1214950 -887729 -651783 -385101 -360916 -320482 -239170 -629807 -440313 -150227
12411 -150227 387899 849974 1132730 1016142 708953 482425 216158 -97851 -209585 184624
12401 184624 735537 767018 971492 1209270 982562 729873 327045 277693 614280 981619
12391 981619 1196873 1031770 678961 591345 1122119 948736 370105 -29489 -478206 -307367
12381 -307367 -163618 -377396 -673265 -706225 -560434 -248347 -294601 -837003 -1276279 -1061397
12371 -1061397 -687990 -567688 -388948 -120273 60850 -58165 -7122 190160 -20946 -347251
12361 -347251 -341432 -276856 -317684 -40738 383831 407861 831311 1157571 758374 200346
$$ packed form
12431a22502m70999l26449K58780p0045j10627j36264k1381n5179l8000j25036
12421a217702K752L27221K35946K66682K4185M0434Q1312l90637J89494K90086
12411a50227N38126M62075K82756j16588l07189k26528k66267l14009j11734L94209
12401A84624N50913L1481K04474K37778k26708k52689m02828m9352L36587L67339
12391I81619K15254j65103l52809q7616N30774j73383n78631l99594m48717J70839
12381c07367J43749k13778k95869l2960J45791L12087m6254n42402m39276K14882
12371a061397L73407J20302J78740K68675J81123j19015N1043J97282k11106l26305
12361c47251N819O4576m0828K76946M24569K4030M23450L26260l99197n58028
$$ plain form
12351 200346 -62086 296509 748514 995587 847273 622246 289216 -33120 -512467 -733452
12341 -733452 -940986 -1293013 -1384131 -1113762 -918321 -702172 -579401 -632385 -473334 -328459
12331 -328459 -653277 -865972 -320268 269990 320276 -433605 -1186133 -1245805 -655359 -86656
12321 -86656 252452 317564 96966 149324 161492 -113280 -109501 32030 116953 -239177 -432299
12310 -432299 -319039 -275583 -624501 -1205942 -1726981 -1581787 -931933 -175505 131415 392472
12300 392472 268523 -133277 -279352 -277287 111303 906759 1440665 1238481 506187 129384
12290 129384 -174726 -430782 -59964 500976 864489 812258 681329 213978 -208622 -103401
12280 -103401 288889 329909 187193 204600 218977 306832 578993 893400 929198 607657
$$ packed form
12351B00346k62432L58595M52005K47073j48314k25027l33030l22336m79347k20985
12341g33452k07534l52027r1118K70369J95441K16149J22771n2984J59051J44875
12331c28459l24818k12695N45704N90258N0286p53881p52528n9672N90446N68703
12321h6656L39108O5112k20598N2358J2168k74772L779J41531Q4923l56130j93122
12310d32299J13260M3456l48918n81441n21039J45194O49854P56428L06920K61057
12300C92472j23949m01800j46075K065L88590P95456N33906k02184p32294l76803
12290A29384l04110k56056L70818N60940L63513n2231j30929m67351m22600J05221
12280a03401L92290M1020j42716J7407J4377Q7855K72161L14407L5798l21541
$$ plain form
12270 607657 -117398 -825155 -642391 -166040 174779 308324 109471 -25156 172982 720972
12260 720972 1266283 945426 469142 224329 -147144 -388437 -374228 1784 827588 1544182
12250 1544182 1931092 1746025 1433722 947631 351147 555557 1146663 1185985 1030255 589688
12240 589688 119853 -123185 -71928 61940 74195 29819 196792 460275 327984 264404
12230 264404 366133 69010 -190681 -231150 -504751 -765234 -824162 -665512 -540688 -188990
12220 -188990 149370 261378 103964 -330947 -825132 -758533 -461743 -207109 443778 746927
12210 746927 226143 -203784 -360288 -600117 -500860 -735662 -805209 -466949 -546734 -350515
12200 -350515 135659 -47145 -396937 -323125 -353444 -432471 112964 587958 694288 617705
$$ packed form
12270F07657p25055p07757J82764M76351L40819J33545j98853j34627J98138N47990
12260G20972N45311l20857m76284k44813l71473k41293J4209L76012Q25804P16594
12250A544182L86910j85067l12303m86091n96484K04410N91106L9322j55730m40567
12240E89688m69835k43038N1257J33868J2255m4376J66973K63483j32291o3580
12230B64404J01729k97123k59691m0469k73601k60483n8928J58650J24824L51698
12220a88990L38360J12008j57414m34911m94185O6599K96790K54634O50887L03149
12210G46927n20784m29927j56504k39829R9257k34802o9547L38260p9785J96219
12200c50515M86174j82804l49792P3812l0319p9027N45435M74994J06330p6583
$$ plain form
12190 617705 354375 124993 2195 -119025 -597484 -1036459 -936841 -858330 -1004500 -1078584
12180 -1078584 -1471449 -1875484 -1800383 -1225965 -1173145 -1605483 -1344995 -963680 -991049 -996479
12170 -996479 -1279910 -1493837 -770003 374864 670720 475284 685180 950937 1027263 595663
12160 595663 578 -295029 -225158 346437 711511 897000 800606 733553 854416 947723
12150 947723 677798 191671 173 -135162 -299407 -493354 -571611 -559018 -229288 133067
12140 133067 278655 483572 386168 95423 -312626 -446057 -506994 -564665 -523775 -780850
12130 -780850 -628243 -116126 410583 235783 -287990 -360964 -332779 -559334 -1001563 -1406224
12120 -1406224 -1343821 -1198020 -1388134 -1197044 -765992 -229009 390975 598909 727082 340520
$$ packed form
12190F17705k63330k29382j22798j21220m78459m38975R9618P8511j46170p4084
12180a078584l92865m04035P5101N74418N2820m32338K60488L81315k7369n430
12170i96479k83431k13927P23834J144867K95856j95436K09896K65757P6326m31600
12160E95663n95085k95607O9871N71595L65074J85489r6394o7053J20863R3307
12150I47723k69925m86127j91498j35335j64245j93947p8257J2593L29730L62355
12140A33067J45588K04917r7404k90745m08049j33431o0937n7671M0890k57075
12130g80850J52607N12117N26709j74800n23773p2974K8185k26555m42229m04661
12120a406224O2403J45801j90114J91090M31052N36983O19984K07934J28173l86562
$$ plain form
12110 340520 -156983 -363036 -662522 -815870 -939412 -927981 -870442 -718709 -643614 -298276
12100 -298276 -36730 -77272 120030 474508 894662 1042509 907012 1206267 1033183 405405
12090 405405 73810 -151846 -132376 -275564 -213094 288483 143285 -473939 -494840 -373868
12080 -373868 -393352 -325647 -285029 -91127 86758 191099 124830 -58592 -332906 -785367
12070 -785367 -896429 -617805 -329925 -226677 -42790 420324 821541 908580 730365 154649
12060 154649 -339935 -290927 217221 561437 711784 470224 -123021 -396446 -111791 -303792
12050 -303792 -351701 -80173 351786 546453 426816 499059 543680 705086 939759 1088440
12040 1088440 890874 532707 -13193 -561232 -953416 -1034796 -747782 58988 480445 290397
$$ packed form
12110C40520m97503k06053k99486j53348j23542J1431N7539J51733P5095L45338
12100b98276K61546m0542J97302L54478M20154J47847j35497K99255j73084o27778
12090D05405l31595k25656J9470j43188O2470N01577j45198o17224k0901J20972
12080c73868j9484O7705M0618J93902J77885J04341o6269j83422k74314m52461
12070g85367j11062K78624K87880J03248J83887M63114M01217Q7039j78215n75716
12060A54649m94584M9008N08148L44216J50347k41560n93245k73425K84655j92001
12050c03792m7909K71528M31959J94667j19637P2243M4621J61406K34673J48681
12040A088440j97566l58167n45900n48039l92184q1380K87014Q06770M21457j90048
$$ plain form
12030 290397 159340 381499 445272 304124 -368550 -1180476 -1097916 -359407 39755 167808
12020 167808 260711 123119 159595 481781 507766 542828 551634 289806 516813 1129966 985032
12009 985032 329361 -134462 -441616 -544943 -398291 -359749 -449108 -555005 -366924 124385
11999 124385 826876 892793 418970 3627 81872 589935 466654 73856 -50942 -418019
11989 -418019 -854281 -1204957 -1723703 -1475491 -567596 -1115 -90344 -310711 -414115 -319412
11979 -319412 -287715 -461706 -538809 -949437 -1369781 -1459300 -1336816 -1049207 -1014152 -972878
11969 -972878 -596092 -589047 -1200999 -1332087 -1141920 -958654 -775173 -424283 -408871 -369659
11959 -369659 -49820 296085 476370 311262 155030 -338815 -300575 -93525 -76431 -141968
$$ packed form
12030B90397j31057K22159O3773j41148o72674q11926Q2560P38509L99162J28053
12020A67808R2903j37592L6476L22186K5985L5062Q806k61828K27007O13153j44934
12009I85032o55671m63823l07154j03327J46652L8542q9359j05897J88081M91309
11999A24385P02491O5917m73823m15343P8245N08063j23281l92798j24798l67077
11989d18019m36262l50676n18746K48212R07895N66481q9229k20367j03404R4703
11979c19412L1697j73991p7103m10628m20344q9519J22484K87609L5055M1274
11969i72878L76786P045o11952j31088J90167J83266J83481L50890J5412L9212
11959c69659L19839L45905J80285j65108j56232m93845L8240K07050J7094o5537
$$ plain form
11949 -141968 242978 315557 152639 150048 287967 488737 701668 980088 1085240 704826
11939 704826 244602 309972 137522 -124097 -296317 -471919 -872343 -938835 -919708 -934294
11929 -934294 -714757 -241325 241018 591061 193631 16872 90815 23513 177669 548196
11919 548196 960577 1258886 1201723 900634 1012472 878888 652377 418622 -155655 -732994
11909 -732994 -832471 -362782 -21249 164121 483299 1073005 1529980 1603899 1231129 810089
11899 810089 658515 562791 686807 1067097 955421 365013 9159 24656 305249 341880
11889 341880 170529 -110782 -352733 -199240 -97491 40015 324705 530702 279917 -113588
11879 -113588 243268 772071 901429 1085139 1296489 1278473 654379 143049 276891 443732
$$ packed form
11949a41968L84946P2579j62918k591J37919K00770K12931K78420J05152l80414
11939G04826m60224O5370j72450k61619j72220j75602m00424o6492J9127j4586
11929i34294K19537M73432M82343L50043l97430j76759P3943o7302J54156L70527
11919E48196M12381K98309n7163l01089J11838j33584k26511k33755n74277n77339
11909g32994r9477M69689L41533J85370L19178N89706M56975P3919l72770m21040
11899H10089j51574r5724J24016L80290j11676n90408l55854J5497K80593L6631
11889C41880j71351k81311k41951J53493J01749J37506K84690K05997k50785l93505
11879a13588L56856N28803J29358J83710K11350j8016o24094n11330J33842J66841
$$ plain form
11869 443732 261002 183013 80564 -241807 -265889 -182082 113715 335301 278663 505610
11859 505610 414679 134119 -28714 -857 34279 311984 427779 343926 613172 392862
11849 392862 -103926 223332 686030 1024348 1105232 1187787 1164484 638945 162297 352932
11839 352932 764720 836154 839624 434774 -184428 -661008 -591533 26691 191613 82580
11829 82580 145284 -255460 -467365 -242662 197589 520986 367935 461551 665402 798531
11819 798531 542326 -28378 -353865 -515670 -86382 620222 839272 677335 277307 1134
11809 1134 -115882 -484331 -476215 -238807 -358221 -767429 -842574 -776896 -568442 -543340 -635290
11798 -635290 -305612 230021 619464 582337 255509 180182 -186453 -220259 315484 750439
$$ packed form
11869D43732j82730p7989j02449l22371k4082Q3807K95797K21586n6638K26947
11859E05610r0931k80560j62833K7857L5136K77705J15795q3853K69246k20310
11849C92862m96788L27258M62698L38318Q0884Q2555k3303n25539m76648J90635
11839C52932M11788P1434L470m04850o19202m76580O9475O18224J64922j09033
11829H2580O2704m00744k11905K24703M40251L23397j53051R3616K03851J33129
11819G98531k56205n70704l25487j61805M29288P06604K19050j61937m00028k76173
11809A134j17016l68449Q116K37408j19414m09208p5145O5678K08454K5102r1950
11798f35290L29678N35633L89443l7127l26828p5327l66635l3806N35743M34955
$$ plain form
11788 750439 558499 -4503 -649779 -951853 -1121330 -745715 -523388 -1102870 -1376064 -1294106
11778 -1294106 -1268152 -1037397 -530039 -295661 -341709 -159318 174342 397419 -22902 -286777
11768 -286777 -248628 -23542 514650 725193 577226 463627 730424 758376 632709 375734
11758 375734 53191 111921 427261 266918 368551 614829 466129 481956 825821 1140518
11748 1140518 1526263 1343930 1139049 1130140 940066 507779 -137000 -452961 -396569 -460454
11738 -460454 -493221 -341485 -444160 -290495 -588773 -1160403 -1325399 -1297186 -1349595 -1304998
11728 -1304998 -1171561 -1098889 -838867 -520609 -423549 -693121 -869584 -798251 -537816 -277174
11718 -277174 -246268 256413 712000 455087 -64131 -560017 -533328 496 484626 222798
$$ packed form
11788G50439j91940n63002o45276l02074j69477L75615K22327n79482k73194Q1958
11778a294106K5954K30755N07358K34378m6048J82391L33660K23077m20321k63875
11768b86777L8149K25086N38192K10543j47967j13599K66797K7952j25667k56975
11758C75734l22543N8730L15340j60343J01633K46278j48700J5827L43865L14697
11748A140518L85745j82333k04881q909j90074m32287o44779l15961N6392o3885
11738d60454l2767J51736j02675J53665k98278n71630j64996K8213n2409M4597
11728a304998J33437P2672K60022L18258R7060k69572j76463P1333K60435K60642
11718b77174L0906N02681M55587k56913n19218m95886K6689N33824M84130k61828
$$ plain form
11708 222798 -105228 -343746 55111 510325 583369 97792 -698087 -1009406 -872377 -669794
11698 -669794 -256630 38792 -91271 -348316 -186665 426330 525230 2475 -396282 -444090
11688 -444090 -257513 -215547 -163722 91847 -10120 91139 399553 570168 457782 532725
11678 532725 340762 90843 257709 69615 -43960 574630 1011070 692090 553270 438206
11668 438206 252275 -48658 92627 386170 520750 506913 24843 -370482 -364338 7298
11658 7298 461324 529692 718670 823674 610248 271110 -96435 175098 960345 1151973
11648 1151973 993469 599236 -21743 -299009 -221587 66731 134601 -45111 -100880 315429
11638 315429 473952 371490 575103 305716 -45225 -353336 -667284 -603755 -513280 -378532
$$ packed form
11708B22798l28026k38518L98857M55214P3044m85577p95879l11319J37029K02583
11698f69794M13164K95422j30063k57045J61651O12995R8900n22755l98757m7808
11688d44090J86577M1966N1825K55569j01967J01259L08414J70615j12386P4943
11678E32725j91963k49919J66866j88094j13575O18590M36440l18980j38820j15064
11668D38206j85931l00933J41285K93543J34580j3837m82070l95325O144L71636
11658G298M54026O8368J88978J05004k13426l39138l67545K71533P85247J91628
11648A151973j58504l94233o20979k77266P7422K88318O7870j79712n5769M16309
11638C15429J58523j02462K03613k69387l50941l08111l13948O3529R0475J34748
$$ plain form
11628 -378532 -306375 -115623 178050 156451 -247754 -731407 -866834 -642762 -490755 -228862
11618 -228862 -259849 -236437 -1791 -71338 -2237 410637 587831 502369 571138 823689 601192
11607 601192 391056 431993 482798 287097 250940 384920 224432 -62685 -121594 193701
11597 193701 560795 635489 224247 -2060 -102114 -284049 -397861 -395739 -422386 -444755
11587 -444755 -334056 -449604 -111066 91360 484958 527972 691770 525981 514953 786769
11577 786769 373259 44890 309028 488068 179874 279476 276504 791 -88352 263082
11567 263082 397579 594310 851358 1028779 1002415 752668 540960 87387 -215124 -603970
11557 -603970 -387030 -6493 394245 802897 1359764 1467256 950256 807021 637891 -4046
$$ packed form
11628c78532P2157J90752K93673k1599m04205m83653j35427K24072J52007K61893
11618b28862l0987K3412K34646o9547O9101M12874J77194q5462O8769K52551k22497
11607F01192k10136M0937N0805j95701l6157J33980j60488k87117n8909L15295
11597A93701L67094P4694m11242k26307j00054j81935j13812K122k6647k2369
11587d44755J10699j15548L38538K02426L93598M3014J63798j65789j1028K71816
11577G86769m13510l28369K64138J79040l08194R9602k972k75713q9143L51434
11567B63082J34497J96731K57048J77421k6364k49747k11708m53573l02511l88846
11557f03970K16940L80537M00738M08652N56867J07492n17000j43235j69130o41937
$$ plain form
11547 -4046 -628351 -911918 -919400 -798454 -783262 -551194 -390372 -440290 -256085 130217 286380
11536 286380 19325 -51821 -136361 -176204 160593 -119280 -410096 -682533 -1138418 -973251
11526 -973251 -179736 741023 904097 339535 257428 708019 845220 658211 747908 645959
11516 645959 347097 124654 -135300 -80532 307278 736520 553382 562015 808788 653570
11506 653570 73157 153760 365625 4773 -286879 -127726 195736 351423 434596 367281
11496 367281 -104016 -1087717 -1754645 -1706102 -1335884 -1253033 -1057473 -820181 -591755 -489274
11486 -489274 -498864 -377102 -285779 -204331 66183 401571 865956 1324141 1269961 698967
11476 698967 498453 644420 1448202 2162571 2225295 2914870 4558651 6086705 7240199
$$ packed form
11547d046o24305k83567p482J20946J5192K32068J60822m9918J84205L86302J56163
11536B86380k67055p1146q4540l9843L36797k79873k90816k72437m55885J65167
11526i73251P93515R20759J63074n64562q2107M50591J37201j87009Q9697j01949
11516F45959k98862k22443k59954N4768L87810M29242j83138Q633K46773j55218
11506F53570n80413Q0603K11865l60852k91652J59153L23462J55687Q3173o7315
11496C67281m71297r83701o66928M8543L70218Q2851J95560K37292K28426J02481
11486d89274r590J21762R1323Q1448K70514L35388M64385M58185n4180n70994
11476F98967k00514J45967Q03782P14369O2724O89575J643781J528054J153494
$$ plain form
11467 7240199 7492438 6200917 4493817 3336493 2762140 2826532 2933239 2416439 1398303
11458 1398303 584654 365507 656873 933487 620394 -13449 -113431 150857 622553 719199
11448 719199 654455 612448 547702 576028 556671 349029 -32447 189214 534850 507369 153088
11437 153088 -284898 -399961 -360865 -833629 -831320 -699296 -692609 -628016 -776086 -618257 -176082
11426 -176082 259927 80428 -146196 -193645 -47360 -338900 -283006 -64995 239986 263944
11416 263944 81279 -190442 -354392 -279163 80475 81042 -160093 -357047 -331368 -54890
11406 -54890 383616 873942 730227 357975 379248 332208 358774 579299 617610 954298
11396 954298 1312995 1156798 820319 1035364 762186 477666 745666 830850 481572 255933
$$ packed form
11467G240199K52239j291521j707100j157324n74353O4392J06707n16800j018136
11458A398303q13649k19147K91366K76614l13093o33843r9982K64288M71696R6646
11448G19199o4744m2007o4746K8326j9357k07642l81476K21661L45636k7481l54281
11437A53088m37986j15063L9096m72764K309J32024O687O4593j48070J57829M42175
11426a76082M36009j79499k26624m7449J46285k91540N5894K18011L04981K3958
11416B63944j82665k71721j63950P5229L59638N67k41135j96954K5679K76478
11406e4890M38506M90326j43715l72252K1273m7040K6566K20525L8311L36688
11396I54298L58697j56197l36479K15045k73178k84520K68000Q5184l49278k25639
$$ plain form
11386 255933 431843 631022 848268 1306154 1252574 1002111 978035 904093 1054967 1155240
11376 1155240 1245980 1225732 813536 711690 810872 888863 773795 582419 675513 970542
11366 970542 994237 1069537 1377440 1464539 1291313 1138671 687367 179336 -280235 -759316
11356 -759316 -656494 -154052 -276173 -902234 -1107951 -911170 -638843 -449036 -542050 -419065
11346 -419065 -531324 -942409 -1000012 -902124 -736437 -610625 -180828 104323 374554 283973
11336 283973 63726 176705 176830 -275312 -563129 -488422 -1076504 -1321535 -807220 -722008
11326 -722008 -778690 -475251 40968 -165527 -811749 -1086713 -1373421 -1445678 -1241209 -1064525
11316 -1064525 -831573 -418094 -86896 -2403 29664 333397 277534 -332539 -529629 -42682
$$ packed form
11386B55933J75910J99179K17246M57886n3580k50463k4076p3942J50874J00273
11376A155240R0740k0248m12196j01846R9182P7991j15068j91376R3094K95029
11366I70542K3695P5300L07903Q7099j73226j52642m51304n08031m59571m79081
11356g59316J02822N02442j22121o26061k05717J96781K72327J89807r3014J22985
11346d19065j12259m11085n7603R7888J65687J25812M29797K85151K70231r0581
11336B83973k20247J12979J25m52142k87817P4707n88082k45031N14315Q5212
11326g22008n6682L03439N16219k06495o46222k74964k86708p2257K04469J76684
11316a064525K32952M13479L31198Q4493L2067L03733n5863o10073j97090M86947
$$ plain form
11306 -42682 376330 722724 787469 430774 -1574 209811 618538 403930 369350 661877
11296 661877 612771 26749 -486568 -697880 -862770 -948650 -689324 -127762 451905 215624
11286 215624 142943 321139 592894 633661 510343 76069 -587417 -1012891 -1383361 -1660931
11276 -1660931 -1219231 -506151 7741 209681 128433 -85578 -28805 194688 491432 789482
11266 789482 825231 787431 387090 -105595 -190491 -7425 235011 594756 500142 261371
11256 261371 605059 944473 280702 -748560 -1393488 -1286459 -708839 -175072 122216
11247 122216 -68436 -194808 -31359 -298946 -566680 -545887 -54174 276681 -36445 80233
11237 80233 134316 -364736 -946867 -1084025 -577664 -473158 -835020 -964707 -511732 -160568
$$ packed form
11306d2682M19012L46394O4745l56695m32348K11385M08727k14608l4580K92527
11296F61877m9106n86022n13317k11312j64890q5880K59326N61562N79667k36281
11286B15624p2681J78196K71755M0767j23318m34274o63486m25474l70470k77570
11276a660931M41700P13080N13892K01940q1248k14011N6773K23493K96744K98050
11266G89482L5749l7800m00341m92685q4896J83066K42436L59745r4614k38771
11256B61371L43688L39414o63771j029262o44928J07029N77620N33767K97288
11247A22216j90652j26372J63449k67587k67734K0793M91713L30855l13126J16678
11237H0233N4083m99052n82131j37158N06361J04506l61862j29687M52975L51164
$$ plain form
11227 -160568 -128800 63996 457257 487465 309965 148959 -98913 -63257 56370 70164
11217 70164 52994 82764 486841 1056446 1047972 831884 788845 978109 953308 712646 610684
11206 610684 198319 -23912 -37407 85193 490937 829746 896503 780481 819394 1394053
11196 1394053 1966399 2031952 1995337 1727128 994469 634444 264284 -266008 -377326 -81256
11186 -81256 -136508 -423653 -502816 -489496 -640394 -448179 -219697 -201257 -37228 232143
11176 232143 526002 973291 1322207 1603611 1588315 1403242 1283550 993642 845999 1634486
11166 1634486 2495615 2494737 1792085 1632725 2075642 2346868 2521841 2892496 3135638 3036733
11156 3036733 3193524 3712622 3916489 3873809 3730713 3538179 3635953 3701237 4021675 4268072
$$ packed form
11227a60568L1768J92796L93261L0208j77500j61006k47872L5656J19627J3794
11217G0164j7170K9770M04077N69605q474k16088m3039J89264k4801k40662j01962
11206F10684m12365k22231j3495J22600M05744L38809O6757j16022L8913N74659
11196A394053N72346O5553l6615k68209p32659l60025l70160n30292j11318K96070
11186h1256n5252k87145p9163J3320j50898J92215K28482J8440J64029K69371
11176B32143K93859M47289L48916K81404j5296j85073j19692k89908j47643P88487
11166A634486Q61129q78p02652j59360M42917K71226J74973L70655K43142r8905
11156C036733J56791N19098K03867m2680j43096j92534R7774O5284L20438K46397
$$ plain form
11146 4268072 4408731 4757487 4799376 4155051 3559616 3375300 3617787 3851671 3930182 3849825
11136 3849825 3652018 3268817 2678345 2281614 2025904 2080749 2013978 1938836 2056728 2212204
11126 2212204 2412482 2840928 3269592 3537762 3587286 3367087 2913206 2307014 1641035 1273720
11116 1273720 1426678 1646809 1406825 974585 454375 305836 599409 1104013 1444152
11107 1444152 1612573 1201340 941085 1298905 1607208 1632814 1393998 1346085 1662880 2247205
11097 2247205 2347366 1787212 1910769 2266498 2257065 2163253 2167219 2307675 2042535 1997992
11087 1997992 2116703 2396431 2605567 2434104 2452663 2374029 1899429 1441423 1048399 683289
11077 683289 889120 1594795 1998211 2271040 2168411 1593840 1125175 834502 672573 986616
$$ packed form
11146D268072J40659L48756M1889o44325n95435j84316K42487K33884P8511q0357
11136C849825j97807l83201n90472l96731k55710N4845o6771p5142J17892J55476
11126B212204K00278M28446M28664K68170M9524k20199m53881o06192o65979l67315
11116A273720J52958K20131k39984m32240n20210j48539K93573N04604L40139
11107A444152J68421m11233k60255L57820L08303K5606k38816m7913L16795N84325
11097B247205J00161n60154J23557L55729r433r3812L966J40456k65140m4543
11087A997992J18711K79728K09136j71463J8559p8634m74600m58006l93024l65110
11077F83289K05831P05675M03416K72829j02629n74571m68665k90673j61929L14043
$$ plain form
11067 986616 1500774 1648200 1878755 2030386 2184687 2368032 1989383 2152128 2615733 2753703
11057 2753703 2218038 1588214 1481841 1701550 2052613 2383259 2620423 2998386 3004409 2798281
11047 2798281 3033900 3183619 3237650 3463011 3784044 3673440 3176348 3029260 3156034 3664236
11037 3664236 4007019 3901069 3887457 4259191 4619287 4898423 4876588 5190506 5647756 6263890
11027 6263890 6842708 7563989 8772783 9625665 10278274 11411279 13165403 16115874 19921068
11018 19921068 23897266 27556904 31286862 34819564 37919334 40792642 42569826 43042316
11010 43042316 42643110 41310306 38677959 35075126 31784272 29356113 27088353 24047680
11002 24047680 21381422 19308690 17431662 15908812 14777438 13883189 13367173 12743026
$$ packed form
11067I86616N14158J47426K30555J51631J54301J83345l78649J62745M63605J37970
11057B753703n35665o29824j06373K19709L51063L30646K37164L77963O023k06128
11047B798281K35619J49719N4031K25361L21033j10604m97092j47088J26774N08202
11037C664236L42783j05950j3612L71734L60096K79136k1835L13918M57250O16134
11027F263890N78818P21281J208794Q52882O52609J133005J754124K950471L805194
11018A9921068L976198L659638L729958L532702L099770K873308J777184M72490
11010D3042316l99206j332804k632347l602833l290854k428159k267760l040673
11002B4047680k666258k072732j877028j522850j131374q94249n16016o24147
$$ plain form
10994 12743026 11628485 10985391 10395625 9205484 8212357 7583954 7058623 7035722 6621082
10985 6621082 5777275 5211044 4641698 4437994 4385476 4139453 3840769 3604407 3180145 2555851
10975 2555851 2121663 1894740 1492844 1018387 520510 151497 30810 -38392 28221 491284
10965 491284 762023 539088 449943 419843 440783 318695 -267550 -758020 -842932 -749277
10955 -749277 -448924 339537 1003038 1252581 1369618 1160489 1015485 911216 1249944 1376447
10945 1376447 1295504 1214852 1232735 1166402 999935 732607 358672 388492 922194 1038181
10935 1038181 871046 864960 991132 1142502 1288354 913557 495513 584302 629250 330838
10925 330838 239489 297431 303437 719677 855416 704102 614083 400071 469355 590325 772293
$$ packed form
10994A2743026j114541o43094n89766j190141r93127o28403n25331k2901m14640
10985F621082q43807n66231n69346k03704n2518k46023k98684k36362m24262o24294
10975B555851m34188k26923m01896m74457m97877l69013j20687o9202O6613M63063
10965D91284K70739k22935q9145l0100K0940j22088n86245m90470q4912R3655
10955g49277L00353P88461O63501K49543J17037k09129j45004j04269L38728J26503
10945A376447q0943q0652J7883o6333j66467k67328l73935K9820N33702J15987
10935A038181j67135o086J26172J51370J45852l74797m18044Q8789M4948k98412
10925C30838r1349N7942O006M16240J35739j51314r0019k14012O9284J20970J81968
$$ plain form
10914 772293 985856 593233 315636 495383 798777 527243 147913 -28433 -59435 -138770
10904 -138770 -363481 -806522 -941284 -441981 -114299 -410297 -663746 -442894 -281868 -302643
10894 -302643 -228382 -19430 -68407 79022 145411 277236 334597 441998 847364 1322051
10884 1322051 1177400 1058552 1118059 992682 840318 489481 436326 696858 323009 -368489
10874 -368489 -640611 -513172 -355251 -311927 -318208 66664 328330 230924 -40534 -542255
10864 -542255 -855770 -670128 -418890 -666102 -609777 -322992 -578853 -211181 107675 -152973
10854 -152973 -236534 -490438 -850193 -799285 -392775 -248541 -620297 -781154 -1029847 -1448571
10844 -1448571 -1642984 -965518 -547965 -1329592 -1517919 -1081590 -520653 -173787 113760
$$ packed form
10914G72293K13563l92623k77597J79747L03394k71534l79330j76346l1002p9335
10904a38770k24711m43041j34762M99303L27682k95998k53449K20852J61026k0775
10894c02643P4261K08952m8977J47429O6389J31825N7361J07401M05366M74687
10884A322051j44651j18848N9507j25377j52364l50837n3155K60532l73849o91498
10874c68489k72122J27439J57921M3324o281L84872K61666r7406k71458n01721
10864e42255l13515J85642K51238k47212N6325K86785k55861L67672L18856k60648
10854a52973q3561k53904l59755N0908M06510J44234l71756j60857k48693m18724
10844a448571j94413O77466M17553p81627j88327M36329N60937L46866K87547
$$ plain form
10835 113760 633382 418913 110967 154335 301167 440167 311088 647423 715571 537914
10825 537914 203488 91931 64158 192572 487480 304467 -108886 24528 494860 522104
10815 522104 44010 -425246 -1002568 -1352886 -1064962 -360798 85371 199941 36175 173266
10805 173266 662547 921480 841586 830825 896454 611013 365144 535101 404773 400820
10795 400820 368279 385866 543859 515195 319910 459992 511098 126049 -47079 -2671
10785 -2671 -117930 -155318 -207962 -467620 -461624 -806715 -1151840 -854758 -489220 -616967 -743781
10774 -743781 -856709 -865051 -572040 -369456 -164077 71067 563135 546465 424938 440818
10764 440818 141667 -58564 206236 568513 400345 115059 407338 679524 199394 53290
$$ packed form
10835A13760N19622k14469l07946M3368J46832J39000j29079L36335O8148j77657
10825E37914l34426j11557k7773J28414K94908j83013m13353J33414M70332K7244
10815E22104m78094m69256n77322l50318K87924P04164M46169J14570j63766J37091
10805A73266M89281K58933p9894j0761O5629k85441k45869J69957j30328l953
10795D00820l2541J7587J57993k8664j95285J40082N1106l85049j73128M4408
10785b671j15259l7388n2644k59658N996l45091l45125K97082L65538j27747j26814
10774g43781j12928q342K93011K02584K05379K35144M92068j6670j21527J5880
10764D40818k99151k00231K64800L62277j68168k85286K92279K72186m80130j46104
$$ plain form
10754 53290 181471 366851 280403 21493 -347331 -795872 -592910 357906 889281 852302
10744 852302 889351 642189 451312 621583 988995 992921 403095 281538 377000 130728
10734 130728 251251 501741 298218 335884 187660 -11001 -286014 -508385 -242163 325082
10724 325082 841132 1248698 1015709 759767 354821 -86439 -210181 -315386 -415982 -176369
10714 -176369 -320457 -732637 -570165 -135242 447369 1161937 1385912 892002 297387 -384624
10704 -384624 -412059 32623 255572 325400 177782 -281154 -843187 -737765 -547920 -227335
10694 -227335 548362 892362 558942 466428 636359 872725 1020527 533405 -127315 199903
10684 199903 839243 931701 664150 235219 267023 616754 958730 983219 568112 552494
$$ packed form
10754E3290J28181J85380q6448k58910l68824m48541K02962R50816N31375l6979
10744H52302L7049k47162j90877J70271L67412L926n89826j21557R5462k46272
10734A30728J20523K50490k03523L7666j48224j98661k75013k22371K66222N67245
10724C25082N16050M07566k32989k55942m04946m41260j23742j05205j00596K39613
10714a76369j44088m12180J62472M34923N82611P14568K23975m93910n94615o82011
10704c84624k7435M44682K22949O9828j47618m58936n62033J05422J89845L20585
10694b27335P75697L44000l33420r2514J69931K36366J47802m87122o60720L27218
10684A99903O39340R2458k67551m28931L1804L49731L41976K4489m15107j5618
$$ plain form
10674 552494 754476 883361 951588 921687 1016777 1091071 861860 368318 -181590 -798939
10664 -798939 -906840 -790126 -994209 -1610876 -1629920 -1073639 -799247 -1041971 -1457710 -1335743
10654 -1335743 -674119 -411258 -456345 -39112 276690 173482 -172633 -376164 -391421 -197686
10644 -197686 298082 460085 202451 274767 396662 -89092 -667941 -556256 -22411 170410
10634 170410 30980 -150046 -263283 -260924 -319820 -207413 -353674 -776450 -776210 -391726 -87139
10623 -87139 -252116 -329962 -447903 -241537 373247 650411 88619 -345859 -540794 -94256
10613 -94256 247705 130736 523407 729425 443114 -54585 -404061 -626110 -646379 37006
10603 37006 641092 641670 503638 451999 619867 461740 -333528 -807592 -627889 -565133 -736991
$$ packed form
10674E52494K01982J28885O8227k9901R5090P4294k29211m93542n49908o17349
10664g98939j07901J16714k04083o16667j9044N56281K74392k42724m15739J21967
10654a335743O61624K62861m5087M17233L15802j03208l46115k03531j5257J93735
10644a97686M95768J62003k57634P2316J21895m85754n78849J11685N33845J92821
10634A70410j39430j81026j13237K359n8896J12407j46261m22776K40L84484L04587
10623h7139j64977p7846j17941K06366O14784K77164n61792m34478j94935M46538
10613i4256L41961j16969L92671K06018k86311m97699l49476k22049k0269O83385
10603C7006O04086N78j38032n1639J67868j58127p95268m74064J79703O2756j71858
$$ plain form
10592 -736991 -703305 -384682 300243 661668 829747 1076621 1026130 607785 -35764 -785739
10582 -785739 -1014143 -71673 953533 818094 103973 -168252 -130252 -363556 -489803 -526402
10572 -526402 -335691 189791 659418 713549 390285 -199167 -603600 -612389 -723048 -1243699
10562 -1243699 -1361536 -1225782 -877783 -561190 -533099 -499818 -386302 -411177 -469602 -572678
10552 -572678 -914526 -919717 -547238 -297875 -372818 -639319 -1072751 -1312389 -935971 -520578
10542 -520578 -149032 251681 726928 869158 627582 238514 297118 565197 424254 206509
10532 206509 215889 605215 949010 949621 218452 -449840 -522657 -330886 -546489 -687407 -818083
10521 -818083 -1019796 -931738 -448171 253628 599851 281213 612797 665408 299185 -149420
$$ packed form
10592g36991L3686L18623O84925L61425J68079K46874n0491m18345o43549p49975
10582g85739k28404R42470J025206j35439p14121k72225L8000k33304j26247l6599
10572e26402J90711N25482M69627N4131l23264n89452m04433q789j10659n20651
10562a243699j17837J35754L47999L16593K8091L3281J13516k4875n8425j03076
10552e72678l41848n191L72479K49363p4943k66501m33432k39638L76418M15393
10542e20578L71546M00713M75247J42230k41576l89068N8604K68079j40943k17745
10532B06509R380L89326L43795O11p31169o68292p2817J91771k15603j40918j30676
10521h18083k01713Q8058M83567P01799L46223l18638L31584N2611l66223m48605
$$ plain form
10511 -149420 -776780 -939876 -680021 -410683 -530838 -953287 -1074139 -881647 -975162 -1419847
10501 -1419847 -2031530 -2432686 -2197366 -1492324 -546836 -115138 -354479 -670251 -766665 -625126
10491 -625126 -9814 506602 782531 1171493 1056658 419014 38584 -118668 -350620 -1020598
10481 -1020598 -1670499 -1782312 -1511743 -1469076 -1090886 -398292 54552 378765 206046 529998
10471 529998 877778 634709 812102 1268024 1162771 596372 142561 -364619 -460487 -66477
10461 -66477 -160858 -524777 -535108 -318514 -65744 118394 15602 5449 343908 627689
10451 627689 586002 346815 -346648 -561347 -170214 -391597 -1090010 -1157427 -496179 99964
10441 99964 81911 -307907 -614219 -425145 -108022 280605 311643 335283 911616 1451433
$$ packed form
10511a49420o27360j63096K59855K69338j20155m22449j20852J92492r3515m44685
10501a419847o11683m01156K35320P05042R45488M31698k39341l15772r6414J41539
10491f25126O15312N16416K75929L88962j14835o37644l80430j57252k31952o69978
10481a020598o49901j11813K70569M2667L78190O92594M52844L24213j72719L23952
10471E29998L47780k43069J77393M55922j05253n66399m53811n07180r5868L94010
10461f6477r4381l63919j0331K16594K52770J84138j02792j0153L38459K83781
10451F27689m1687k39187o93463k14699L91133k21383o98413o7417O61248N96143
10441I9964j8053l89818l06312J89074L17123L88627L1038K3640N76333N39817
$$ plain form
10431 1451433 1493927 1146060 846805 498854 177688 -150163 180861 770141 877406 800121
10421 800121 268812 -576044 -756278 -684897 -839329 -890540 -1202771 -1028885 -421816 -113348
10411 -113348 282560 197824 -81408 17951 -96979 281121 484049 396708 546512 376212
10401 376212 -133486 -71867 347512 614744 510625 181610 -164559 -355067 -207037 411703
10391 411703 627364 365212 -52544 -113679 274214 465352 110601 -71349 3945 -322108
10381 -322108 -564048 -636871 -444553 167934 167696 -618619 -1148366 -1031509 -457205 -61413
10371 -61413 -593360 -747159 -197814 -195120 -461519 -342790 -411178 -808885 -665820 -251411
10361 -251411 112765 391101 577167 672435 858824 712078 421838 -191411 -496732 -91390
$$ packed form
10431A451433M2494l47867k99255l47951l21166l27851L31024N89280J07265p7285
10421H00121n31309q44856j80234P1381j54432n1211l12231J73886O07069L08468
10411a13348L95908q4736k79232R9359j14930L78100K02928q7341J49804j70300
10401C76212n09698O1619M19379K67232j04119l29015l46169j90508J48030O18740
10391D11703K15661k62152m17756o1135L87893J91138l54751j81950P5294l26053
10381c22108k41940p2823J92318O12487k38p86315n29747J16857N74304L95792
10371f1413n31947j53799N49345K694k66399J18729o8388l97707J43065M14409
10361b51411L64176K78336J86066R5268J86389j46746k90240o13249l05321M05342
$$ plain form
10351 -91390 38704 20925 -436787 -779177 -819339 -1175182 -1207359 -920591 -538735 -360101
10341 -360101 -496977 -700374 -714364 -566930 -569111 -843871 -749201 -438189 -258751 -290815
10331 -290815 -160664 -239637 -215152 -251401 -356090 -427844 -183370 495313 751159 388250
10321 388250 203089 340764 591108 1002902 833611 257862 -35680 21110 -67106 -265228
10311 -265228 23075 252056 206380 51672 -110061 -468606 -454963 4218 234974 90648
10301 90648 -61324 346181 578334 628171 782992 1382133 1308191 717878 675941 616789
10291 616789 400436 49229 -206543 -313614 -233980 -147110 -137166 27549 225788 340380
10281 340380 410738 236966 44077 -179924 -524679 -884051 -1181345 -1218359 -1039002 -693222
$$ packed form
10351i1390J30094j7779m57712l42390m0162l55843l2177K86768L81856J78634
10341c60101j36876k03397j3990J47434k181k74760R4670L11012J79438l2064
10331b90815J30151p8973K4485l6249j04689p1754K44474O78683K55846l62909
10321C88250j85161J37675K50344M11794j69291n75749k93542N6790q8216j98122
10311b65228K88303K28981m5676j54708j61733l58545J3643M59181K30756j44326
10301I0648j51972M07505K32153M9837J54821N99141p3942n90313m1937n9152
10291F16789k16353l51207k55772j07071P9634Q6870R944J64715J98239J14592
10281C40380P0358j73772j92889k24001l44755l59372k97294l7014J79357L45780
$$ plain form
10271 -693222 -113089 57187 -333666 -486296 -230264 -51531 -58533 -366748 -457924 -573724
10261 -573724 -392019 -435304 -420337 -191805 -34948 247500 234971 196468 279110 14875
10251 14875 -525466 -485580 -468069 -486031 -179518 112727 196839 107710 -225361 -190221 37377
10240 37377 -7230 -280275 -408348 37815 348158 288500 -125836 -640604 -798937 -882488
10230 -882488 -1039213 -1295052 -1088951 -446853 37909 428796 553320 590849 578471 394883
10220 394883 541 -330238 -331453 -72031 55712 72555 -253084 -753226 -796864 -377985
10210 -377985 -373697 -663769 -1058562 -1496627 -1469665 -1327133 -1488747 -1347086 -1066728 -1130811
10200 -1130811 -1132393 -1220554 -1446799 -1156691 -787128 -189032 -166020 -552217 -473248 -400288
$$ packed form
10271f93222N80133J70276l90853j52630K56032J78733p002l08215r1176j15800
10261e73724J81705m3285J4967K28532J56857K82448j2529l8503Q2642k64235
10251A4875n40341L9886J7511j7962L06513K92245Q4112q9129l33071L5140K27598
10240C7377m4607k73045j28073M46163L10343n9658m14336n14768j58333q3551
10230h82488j56725k55839K06101O42098M84762L90887J24524L7529j2378j83588
10220C94883l94342l30779j215K59422J27743J6843l25639n00142m3638M18879
10210c77985M288k90072l94793m38065K6962J42532j61614J41661K80358o4083
10200a130811j582q8161k26245K90108L69563N98096K3012l86197P8969P2960
$$ plain form
10190 -400288 -331329 -238589 -497231 -732574 -845166 -1503536 -2026866 -1861647 -1118760 -307638
10180 -307638 545563 1299418 1144612 432664 41506 -345116 -484358 -262778 -26022 -73143
10170 -73143 -713339 -1206011 -600018 -323737 -524754 -619303 -878493 -952990 -749219 -503261
10160 -503261 -392303 -333983 30659 445860 164636 -229137 82724 892480 1301501 1104763
10150 1104763 1061970 1028859 756821 -13849 -481602 -36703 499616 323111 -347315 -818989
10140 -818989 -804572 -441284 324585 1030235 1046493 787067 568733 302201 -98668 -832079
10130 -832079 -1155286 -1264359 -895685 -499471 -248635 -54455 -363823 -529889 -261840 -95067
10120 -95067 -151806 -234349 -212002 -13070 -39438 -581573 -1066795 -813809 -769098 -901800 -525465
$$ packed form
10190d00288O8959R2740k58642k35343j12592o58370n23330J65219P42887Q11122
10180c07638Q53201P53855j54806p11948l91158l86622j39242K21580K36756m7121
10170g3143o40196m92672O05993K76281k01017r4549k59190p4497K03771K45958
10160e03261J10958N8320L64642M15201k81224l93773L11861Q09756M09021j96738
10150A104763m2793l3111k72038p70670m67753M44899N36319j76505o70426m71674
10140h18989J4417L63288P65869P05650J6258k59426k18334k66532m00869p33411
10130h32079l23207j09073L68674L96214K50836J94180l09368j66066K68049J66773
10120i5067n6739q2543K2347J98932k6368n42135m85222K52986M4711j32702L76335
$$ plain form
10109 -525465 -554191 -675942 -712509 -468469 -180236 -46321 -61170 263056 479524 323170
10099 323170 201565 -139371 -723153 -1358353 -1410747 -975822 -747643 -566368 -134622 -106274
10089 -106274 -551951 -1105224 -1198551 -905773 -429902 369570 482851 388906 239188 -226503
10079 -226503 -1067236 -1715743 -1575250 -966687 -707026 -606007 -593422 -226588 -123899 -709797
10069 -709797 -1353871 -1559690 -1594296 -1341774 -854391 -719655 -879039 -809932 -910709 -1292299
10059 -1292299 -1516742 -1696100 -1415403 -892036 -371766 47024 126106 35853 -40703 -295842
$$ packed form
10109e25465k8726j21751l6567K44040K88233J33915j4849L24226K16468j56354
10099C23170j21605l40936n83782o35200n2394M34925K28179J81275M31746K8348
10089a06274m45677n53273r3327K92778M75871P99472J13281r3945j49718m65691
10079b26503q40733o48507J40493O08563K59661J01019J2585L66834J02689n85898
10069g09797o44074k05819l4606K52522M87383J34736j59384O9107j00777l81590
10059a292299k24443j79358K80697N23367N20270M18790P9082r0253p6556k55139
$$ [...]
##END NTUPLES=NMR SPECTRUM
##END=
