##TITLE=C13_SR4_K
 CDCl3, 24150 sc

 25.12.2019
##JCAMPDX= 6.0         $$ Bruker NMR JCAMP-DX V2.0
##DATA TYPE= NMR SPECTRUM
##DATA CLASS= NTUPLES
##ORIGIN= UXNMR, Bruker Analytische Messtechnik GmbH
##OWNER= root
$$ XWIN-NMR		Version 3.5
$$ Thu Dec 26 13:41:19 2019 Russian Standard Time (UT+4h)  she@DPX200
##.OBSERVE FREQUENCY= 50.327896
##.OBSERVE NUCLEUS= ^13C
##.ACQUISITION MODE= SIMULTANEOUS
##.ACQUISITION SCHEME= undefined
##.AVERAGES= 20717
##.DIGITISER RES= 17
##SPECTROMETER/DATA SYSTEM= spect
##.PULSE SEQUENCE= zgpg30
##.SOLVENT NAME= CDCl3
##.SHIFT REFERENCE= (INTERNAL, CDCl3, 0, 222.624)
##AUDIT TRAIL= $$ (NUMBER, WHEN, WHO, WHERE, WHAT)
$$ ##TITLE= Audit trail, XWIN-NMR		Version 3.5
$$ ##JCAMPDX= 5.01
$$ ##ORIGIN= Bruker BioSpin GmbH
$$ ##OWNER= she
$$ F:/spectra/data/she/nmr/c13/1/pdata/1/auditp.txt
$$ ##AUDIT TRAIL=  $$ (NUMBER, WHEN, WHO, WHERE, WHAT)
(   1,<2019-12-26 10:04:22.84 +0400>,<she>,<DPX200>,
      <created by zg, POWCHK disabled, PULCHK disabled
       terminated by command 'halt'
       configuration hash MD5:
       00 E9 B6 7A A2 85 ED C7 34 08 36 98 17 FE 4E 26
       data hash MD5: 32K
       21 33 BF B9 AA C8 A6 56 FA DB 61 B6 53 44 B9 DE>)
(   2,<2019-12-26 13:39:34.82 +0400>,<she>,<DPX200>,
      <Start of raw data processing
       efp BC_mod = 2 LB = 1 FT_mod = 6 PKNL = 1 PHC0 = -224.6182 PHC1 = 26.40638 SI = 32K 
       data hash MD5: 32K
       F8 15 5A AE EB CC 80 B2 8A 72 5B 0F E8 14 F6 47>)
(   3,<2019-12-26 13:39:37.89 +0400>,<she>,<DPX200>,
      <abs ABSG = 5 
       data hash MD5: 32K
       8B 30 78 78 91 F1 48 10 19 09 01 EA 40 85 14 97>)
(   4,<2019-12-26 13:40:13.48 +0400>,<she>,<DPX200>,
      <pk PHC0 = 0.5011852 PHC1 = 4.8 
       data hash MD5: 32K
       EE 62 7D 73 E7 28 01 0D 79 44 7D D2 2F CA 6B 21>)
(   5,<2019-12-26 13:40:17.57 +0400>,<she>,<DPX200>,
      <abs ABSG = 5 
       data hash MD5: 32K
       0D 4F 3E 4C F6 D9 CA 09 39 13 8A E6 7D F9 52 CB>)
$$ ##END=
$$ 
$$ hash MD5
$$ 70 58 FE 56 AF 95 49 EF E3 BE 20 98 CE 97 C8 FD
##$RELAX= 
##$RELAX= 
##$RELAX= 
##$RELAX= 
##$RELAX= 
##$RELAX= 
##$RELAX= 
##$RELAX= 
$$ Bruker specific parameters
$$ --------------------------
##$DU= <F:/spectra>
##$EXPNO= 1
##$NAME= <c13>
##$PROCNO= 1
##$TYPE= <nmr>
##$USER= <she>
##$AMP= (0..31)
100 100 100 100 100 100 100 100 100 100 100 100 100 100 100 100 100 100 
100 100 100 100 100 100 100 100 100 100 100 100 100 100 
##$AQSEQ= 0
##$AQ_mod= 1
##$AUNM= <au_zg>
##$AUTOPOS= <>
##$BF1= 50.322709
##$BF2= 200.13
##$BF3= 50.322709
##$BF4= 500.13
##$BF5= 500.13
##$BF6= 500.13
##$BF7= 500.13
##$BF8= 500.13
##$BYTORDA= 1
##$CFDGTYP= 0
##$CFRGTYP= 5
##$CHEMSTR= <none>
##$CNST= (0..31)
1 1 145 1 1 1 1 1 1 1 1 1 1 1 1 1 1 1 1 1 1 1 1 1 1 1 1 1 1 1 1 1 
##$CPDPRG= <waltz16>
##$CPDPRG1= <>
##$CPDPRG2= <waltz16>
##$CPDPRG3= <>
##$CPDPRG4= <mlev>
##$CPDPRG5= <mlev>
##$CPDPRG6= <mlev>
##$CPDPRG7= <mlev>
##$CPDPRG8= <mlev>
##$CPDPRGB= <>
##$CPDPRGT= <>
##$D= (0..31)
$$ [...]
##$SUBNAM4= <"">
##$SUBNAM5= <"">
##$SUBNAM6= <"">
##$SUBNAM7= <"">
##$SUBNAM8= <"">
##$SUBNAM9= <"">
##$SW= 239.972175391363
##$SWIBOX= (0..15)
0 1 3 0 0 0 0 0 0 0 0 0 0 0 0 0 
##$SW_h= 12077.2946859903
##$TD= 32768
##$TD0= 1
##$TE= 0
##$TE2= 300
##$TE3= 300
##$TEG= 300
##$TL= (0..7)
120 120 120 120 120 120 120 120 
##$TP= (0..7)
150 150 150 150 150 150 150 150 
##$TP07= 0
##$TPNAME0= <>
##$TPNAME1= <>
##$TPNAME2= <>
##$TPNAME3= <>
##$TPNAME4= <>
##$TPNAME5= <>
##$TPNAME6= <>
##$TPNAME7= <>
##$TPOAL= (0..7)
0.5 0.5 0.5 0.5 0.5 0.5 0.5 0.5 
##$TPOFFS= (0..7)
0 0 0 0 0 0 0 0 
##$TUNHIN= 0
##$TUNHOUT= 0
##$TUNXOUT= 0
##$USERA1= <user>
##$USERA2= <user>
##$USERA3= <user>
##$USERA4= <user>
##$USERA5= <user>
##$V9= 5
##$VALIST= <valist>
##$VCLIST= <CCCCCCCCCCCCCCC>
##$VD= 0
##$VDLIST= <DDDDDDDDDDDDDDD>
##$VPLIST= <PPPPPPPPPPPPPPP>
##$VTLIST= <TTTTTTTTTTTTTTT>
##$WBST= 1024
##$WBSW= 4
##$XGAIN= (0..3)
0 0 0 0 
##$XL= 0
##$YL= 0
##$YMAX_a= 35080155
##$YMIN_a= -140039735
##$ZGOPTNS= <>
##$ZL1= 120
##$ZL2= 120
##$ZL3= 120
##$ZL4= 120
##$ABSF1= 222.624
##$ABSF2= -17.3728
##$ABSG= 5
##$ABSL= 3
##$ALPHA= 0
##$AQORDER= 0
##$ASSFAC= 0
##$ASSFACI= 0
##$ASSFACX= 0
##$ASSWID= 0
##$AUNMP= <proc_1d>
##$AZFE= 0.1
##$AZFW= 0.5
##$BCFW= 0
##$BC_mod= 2
##$BYTORDP= 0
##$COROFFS= 0
##$CY= -3
##$DATMOD= 1
##$DC= 0
##$DFILT= <>
##$DTYPP= 0
##$F1P= 0
##$F2P= 0
##$FCOR= 0.5
##$FTSIZE= 32768
##$FT_mod= 6
##$GAMMA= 0
##$GB= 0
##$INTBC= 1
##$INTSCL= 4.134877e-10
##$ISEN= 128
##$LB= 1
##$LEV0= 0
##$LPBIN= 0
##$MAXI= 10000
##$MC2= 0
##$MEAN= 0
##$ME_mod= 0
##$MI= 0.1934396
##$NCOEF= 0
##$NC_proc= 2
##$NLEV= 6
##$NOISF1= 120.0001
##$NOISF2= 80.00006
##$NSP= 0
##$NTH_PI= 0
##$NZP= 0
##$OFFSET= 222.624
##$PC= 1.4
##$PHC0= -224.117
##$PHC1= 31.20638
##$PH_mod= 1
##$PKNL= yes
##$PPARMOD= 0
##$PSCAL= 0
##$PSIGN= 0
##$REVERSE= no
##$SF= 50.3227315989248
##$SI= 32768
##$SIGF1= 140
##$SIGF2= 120
##$SINO= 11.81781
##$SIOLD= 32768
##$SREGLST= <13C.CDCl3>
##$SSB= 0
##$STSI= 32768
##$STSR= 0
##$SW_p= 12077.2946859903
##$SYMM= 0
##$S_DEV= 0
##$TDeff= 32768
##$TDoff= 0
##$TI= <>
##$TILT= no
##$TM1= 0
##$TM2= 0
##$TOPLEV= 0
##$USERP1= <user>
##$USERP2= <user>
##$USERP3= <user>
##$USERP4= <user>
##$USERP5= <user>
##$WDW= 1
##$XDIM= 32768
##$YMAX_p= 447916060
##$YMIN_p= -2770374
$$ End of Bruker specific parameters
$$ ---------------------------------
##NTUPLES= NMR SPECTRUM
##VAR_NAME=  FREQUENCY,     SPECTRUM/REAL,   SPECTRUM/IMAG
##SYMBOL=    X,             R,               I
##VAR_TYPE=  INDEPENDENT,   DEPENDENT,       DEPENDENT
##VAR_FORM=  AFFN,          ASDF,            ASDF
##VAR_DIM=   32768,         32768,           32768
##UNITS=     HZ,            ARBITRARY UNITS, ARBITRARY UNITS
##FACTOR=    0.368581032318806, 1,           1
##FIRST=     11203.0474431902, 0,            0
##LAST=      -874.247242800138, 0,           0
##MIN=       -874.247242800138, -2770374,    0
##MAX=       11203.0474431902, 447916060,    0
$$ Real data points
##PAGE= N=1
##DATA TABLE= (X++(R..R)), XYDATA
$$ [...]
15953d00280K8607k23320k33344J76707l32540l18847K21183K64580K66185M14725
15943a36344K51574q2066J29155M06013K87073K64075l44350o74917j89633J72641
15933H3221J61973j05710q9481n02162l18320K98856j97964k91026J14939k35652
15923a081326k64611K92208L97502J76133Q2147M893J16799J90849j97545K1716
15913b61235L84483M54968O0432n48016m49946k65987K07914L87760k05321j75026
15903d09974N02830J21898n24661m07335N4980N26324N17788M57796l0119m85777
15893C23750o30068l83034K64998N77075L06896l6961k79052k26642K68431N46022
15883G31415l5405q8068j71653n50595m84716o3232K46468K82107N2756r3921
$$ y = [-400280, -371673, -594993, -828337, -651630, -984170, -1303017, -1081834, -817254, -551069, -136344, 115230, 33164, 162319, 568332, 855405, 1119480, 775130, 100213, -89420, 83221, 245194, 139484, 50003, -452159, -770479, -471623, -669587, -960613, -845674, -1081326, -1345937, -1053729, -656227, -480094, -397947, -393054, -276255, -85406, -282951, -261235, 123248, 578216, 638648, 90632, -359314, -625301, -417387, -29627, -234948, -409974, 92856, 214754, -309907, -717242, -662262, -135938, 381850, 839646, 809527, 323750, -306318, -689352, -424354, 152721, 459617, 422656, 143604, -83038, 185393, 731415, 696010, 607942, 436289, -114306, -599022, -662254, -415786, -133679, -80923, -174844]
15873a74844l9182M0999J89798J4589n8985k13552K1028N07360M29466j62886
15863E53791r2611J00409l13129l33288p6901j71523J12020J99980k63110k62881
15853e47243j85544K14580K46517J33796q8156L1385J47494j30642j23596Q8276
15843b13133J21243j8048J22140K16312j63613l01568j08768J26698j04267j87363
15833e10367J5594L1825j1613k4719R0174J26417o9799p5742j93722m99347l6018
15822a157317K43060J28397J43511r1048j09420l33800L8449P12967P77104K43752
15812E95655l01374l67769m08870O5019K93706J04772p6824k97563l04952J0041
15802f88159j48858j6839M91004J74602l94341l68578M31814K98227k97774m67498
$$ y = [-174844, -214026, -173027, 16771, 31360, -27625, -241177, -220149, 287211, 716677, 553791, 461180, 561589, 248460, -84828, -161729, -333252, -221232, -21252, -284362, -547243, -732787, -518207, -271690, -137894, -226050, -194665, -47171, -177813, -301409, -213133, -91890, -109938, 12202, 228514, 64901, -236667, -345435, -218737, -323004, -510367, -494773, -462948, -474561, -499280, -409106, -282689, -352488, -428230, -621952, -1121299, -1157317, -914257, -785860, -642349, -733397, -842817, -1176617, -1138168, -425201, 351903, 595655, 294281, -73488, -482358, -417339, -123633, -18861, -95685, -393248, -698200, -688159, -837017, -853856, -362852, -188250, -582591, -951169, -519355, -221128, -518902, -986400]
15792i86400j91246M90606N56617J51825q8312k59889m6066J05762m292m23684
15782f95079m96730J16238K12052M16928M42997Q8212L3674P7027l11647k19562
15772c35890J39389K12637J78590M3778R7890R3005j37329k63130l83951J97962
15762a57049J01784l49162J0386L62788J14347j17908M81758M93835O0437k46761
15752G54455m57020q1691N32799L33290m7809m10576l71853K19573J19865k16358
15742C74675k88794M65Q4616N2269j12930n72460o4323K90264R7068K11308k31641
15731a59483l45733j39443J96631J07495K3567L1659n4621Q9429J31257k43731
15721c62973j31830K56407M357j23617k00737l4274Q874q8376K17867J49104k07124
$$ y = [-986400, -1177646, -687040, -130423, 21402, -66910, -326799, -372865, -267103, -271395, -695079, -1191809, -1075571, -863519, -446591, -3594, 84618, 118292, 195319, -116328, -335890, -196501, 16136, 194726, 238504, 336394, 429399, 292070, 28940, -355011, -157049, -55265, -404427, -394041, -31253, 83094, -34814, 446944, 940779, 1001216, 754455, 297435, 215744, 748543, 1081833, 1034024, 623448, 251595, 471168, 591033, 374675, 85881, 86346, 170962, 223231, 110301, -462159, -526482, -236218, -139150, 72158, -159483, -505216, -644659, -448028, -340533, -316966, -285307, -339928, -250499, -119242, -362973, -494803, -238396, -234039, -357656, -558393, -592667, -583793, -672169, -454302, -305198, -512322]
15710e12322j70407K4399o3671L56420L73324Q0192J71100j62515j41692j03703
15700a48875k1032j18137j67388K0255L559L2497J21048M34197O00320K44150
15690A000594n25201k74133K82788J02458j52239l63497l07914j42618k01384
15681e81146r8679L56143N03127O0457o20776k56739J32600k20594k80738L6932
15671i69413N33205M30417L12279J03516k34434k6435P6109j94467M5954R3106
15661A69837n4891l86107n22189m7929J21051O49l2934K25317K36964P9247P8986
15650a31999J64824k9333k58844m01353l36498J83222J30560K62292K19404L12048
15640A14323J12104J56785K1607k15114k78121m57093l72087P236L01999K62964
$$ y = [-512322, -682729, -658330, -722001, -365581, 7743, 87935, 259035, 96520, -45172, -148875, -169907, -288044, -455432, -435177, -431618, -399121, -278073, 156124, 756444, 1000594, 475393, 201260, 484048, 586506, 434267, 70770, -237144, -379762, -581146, -679825, -323682, 179445, 239902, -380874, -637613, -505013, -725607, -1006345, -969413, -436208, -5791, 306488, 410004, 175570, 149135, 225244, 30777, 76731, 169837, 114946, -271161, -793350, -841279, -720228, -719579, -752513, -527196, -290232, -210985, -131999, 32825, 3492, -255352, -656705, -993203, -809981, -679421, -417129, -197725, 114323, 226427, 383212, 404819, 189705, -88416, -545509, -917596, -910360, -608361, -345397]
15630c45397J15633j47178o2716K671K16255K50678K57011N7922l35170n51601
15620e41892m71218k21648Q9225N61303L67109k77630l27062K79013K53845N4922
15610b34033K25570K29114L93824O2659j70802p9250L28562O1089L2942L13521
15600A163196l233j12467k60143l88396q1550P2758J70632r92j9607O7777l22043
15589B85932k6804K97145k04290j60667m45014l73380J61940J05087P8157K0306
15579b61588l02749K681r9919q1835O8448J40268J94033K42791k5838k95064l98660
15568h17432K4408O17471M01084m71608q96155m86414J06174j58578q4552K94619
15558a470983L39635L34704K30525N2803J54304L40779j71620k71596Q6798l52108
$$ y = [-345397, -229764, -376942, -439658, -436987, -220732, 29946, 286957, 344879, 9709, -541892, -1013110, -1234758, -1145533, -584230, -217121, -494751, -821813, -542800, -288955, -234033, -8463, 220651, 614475, 677134, 506332, 427082, 755644, 816733, 849675, 1163196, 1159963, 1047496, 787353, 398957, 317407, 390165, 560797, 559805, 540198, 607975, 285932, 259128, 556273, 351983, 191316, -253698, -627078, -465138, -360051, -281894, -261588, -564337, -561656, -661575, -743410, -674962, -534694, -340661, -97870, -123708, -418772, -817432, -793024, -175553, 225531, -246077, -1142232, -1628646, -1522472, -1681050, -1765602, -1470983, -1131348, -796644, -566119, -513316, -359012, -18233, -189853, -461449, -374651, -726759]
15548g26759k97508K93827l0231P9063J76724o3149j45760l12456j54270j02254
15538a282773J12999K64056J14788K47445P2331L94260L97222j12029J51053J48464
15528E07816k64298q0101J00549J28966l86254j42097M58056N57207J16438o77501
15518C18781p27857l74515k43180O4410L61005K62785J02919j80255m26154l53972
15508a196033Q5453J16435r8078j70864J20305L71478O40628O14136n169j42114
15498C36177K31717L02054j29829n66030l15081L68134M49952M12718j18796k27204
15488G43812l82238j01202Q8354m91457m97183l55765k18958R1223L80337K76214
15478d66863J18792J98297L37734N58167K94475k22528k72808K21507n3726k12022
$$ y = [-726759, -1024267, -730440, -760671, -681608, -504884, -568033, -713793, -1026249, -1180519, -1282773, -1169774, -905718, -790930, -543485, -471154, -76894, 320328, 208299, 359352, 507816, 243518, 163417, 263966, 392932, 6678, -135419, 322637, 879844, 996282, 318781, -409076, -783591, -1026771, -962361, -601356, -338571, -235652, -415907, -842061, -1196033, -1110580, -994145, -1092223, -1263087, -1142782, -771304, -130676, 483460, 478291, 336177, 567894, 869948, 740119, 174089, -140992, 227142, 677094, 1089812, 971016, 743812, 361574, 260372, 348726, -142731, -639914, -995679, -1214637, -1123414, -743077, -466863, -348071, -149774, 187960, 746127, 1040602, 818074, 545266, 766773, 713047, 501025]
15468E01025j71761l49951p9411j18548l59154R5984L23350K12578j68626k89812
15458d04326n6674o6235K22733M00208K09247j10833J71246K77379k83001O8531
15448D28275L64836j15940n32804m90587j69752j32014K28695M45744J52459k45233
15438f6321l50592l36819N7522L15294j57909j67395Q0098p1120k04962L91552
15428e10652J56394n081J80638L65531k997l22246J86689L43019J73456j03702
15418D61049m41747p4119J97734L19081l58962o39229j239K24074J07457L11713
15408A05812K48813M17796Q0186l41039J6751j18524K27217m1522o03957l50115
15398c58582K18452J12703N1121L31338K60462p6457j61510p0123l2901P0231
$$ y = [501025, 329264, -20687, -100098, -218646, -577800, -481816, -158466, 54112, -114514, -404326, -461000, -527235, -304502, 95706, 304953, 194120, 365366, 642745, 359744, 428275, 793111, 677171, 144367, -346220, -515972, -647986, -419291, 26453, 178912, -66321, -416913, -753732, -696210, -380916, -538825, -706220, -626122, -697242, -902204, -510652, -354258, -359339, -178701, 186830, 183833, -138413, 48276, 391295, 564751, 461049, 19302, -54817, 142917, 461998, 103036, -536193, -537432, -313358, -205901, 105812, 354625, 772421, 852607, 511568, 528319, 409795, 637012, 595490, -8467, -358582, -140130, -27427, 23694, 355032, 615494, 539037, 377527, 307404, 274503, 344734]
15388C44734R8475k7854k73363o43530l17165J30413O63323J98029l89713k08431
15378d25082j31559j85953l7391K84676m9236J28936L3111q1822K13514o3959
15368c14765l28361p2620J7958Q0437M54712L51886J25850k660N1085J33679k59773
15357B37428j55077M55622M38898l35435m97104J9077m13887n34152j72744N00836
15347d56538J77819j87624L0811M74268L69767l72638n84548K34081K18146n9094
15337a55550M54217N66319L0393k54924l67802j64349r062l16357j96555r0765
15327e04435n060l2628N9542j01336j03104J59291k08600m35349K94909N83814
15317b92956M35364O6033k63832O6054L35362j06669j12366K55649J9907l57939
$$ y = [344734, 443209, 415355, 141992, -501538, -818703, -688290, -24967, 173062, -216651, -425082, -556641, -742594, -779985, -495309, -544545, -415609, -382498, -464320, -250806, -314765, -643126, -715746, -697788, -617351, -162639, 189247, 315097, 312437, 363522, 497201, 237428, 82351, 537973, 976871, 641436, 144332, 163409, -250478, -784630, -957374, -456538, -278719, -466343, -435532, 38736, 408503, 35865, -548683, -314602, -96456, -155550, 298667, 864986, 895379, 640455, 272653, 108304, 99242, -217115, -413670, -504435, -509495, -542123, -482581, -583917, -687021, -527730, -736330, -1171679, -876770, -292956, 142408, 208441, -55391, 10663, 346025, 239356, 126990, 382639, 402546, 44607]
15307D4607j35955q4251j28316J53353K6570j27272q3082l6238L7987L12256K46261
15296B25920J6106k54247k45292m3598J12592M94492K40486n22599q4719n1381
15286a12240l52525k55233L60025O84154J68326j11322N3728m0568j19926j62690
15276A11729j00915M767J9718K86534M15884K80712J24661l11412m29134m11638
15266i094m13505l01056j03514k41301K14709K13440j70808k15016K05888m3835
15256h64092l38868L36782M80173M23100P0695j69076M0985J2253L33081L16530
15246F41563j18926m1631M4524j20399j66636m22914k51223J38961k7653l68240
15236f92574k07845j86698l52931j27480L53182P20516m0765L0876P1065L82929
$$ y = [44607, -91348, -175599, -303915, -150562, -123992, -251264, -334346, -370584, -332597, -20341, 225920, 242026, -12221, -257513, -301111, -188519, 305973, 546459, 23860, -60859, -112240, -464765, -719998, -359973, 324181, 492507, 381185, 434913, 394345, 274419, 111729, 10814, 15581, 35299, 321833, 737717, 1018429, 1143090, 831678, 402544, -9094, -422599, -723655, -827169, -1068470, -853761, -640321, -811129, -1026145, -820257, -864092, -1202960, -866178, -386005, 37095, 107790, -61286, -20301, -8048, 325033, 641563, 522637, 481006, 525530, 405131, 238495, -184419, -435642, -296681, -324334, -692574, -900419, -1087117, -1440048, -1567528, -1214346, -493830, -534595, -503719, -432654, -49725]
15226d9725N16015j04881n11029N8276K33405R4146q8522k52464k59213J63416
15216b00576n6703j20535J9249L0981N4089q0840m1005M3486L45703M11791k26408
15205A79232o49102j74224R477K6232K38655m6983j47442J08680M45256M16725
15195D06506P9125L8063k75316l14713p050J62734k02845l95476l43444J96622
15185f55794N13639L80483R1999k39950m02987r2681k4315K20676N17462n5872
15175B52660j40411K19800L16436k70069o61242M758K71786l7485J07807J64775
15165B28815q7137Q7573j10641n38642n4579M2054L8225j75508O8999j16593K42837
15154c74597P05184J85670k09117n0785J59741K34908L12797J50569n1378j17989
$$ y = [-49725, 466290, 361409, -149620, -91344, 142061, 236207, 147685, -104779, -363992, -200576, -257279, -377814, -358565, -327584, -273495, -354335, -395340, -351854, -6151, 405640, 179232, -469870, -644094, -634617, -608385, -369730, -416713, -564155, -455475, -10219, 406506, 485631, 523694, 248378, -66335, -73385, 89349, -113496, -508972, -852416, -655794, -142155, 238328, 330327, 90377, -312610, -405291, -429606, -208930, 308532, 252660, 112249, 332049, 648485, 378416, -282826, -278068, -6282, -43767, 64040, 228815, 141678, 229251, 118610, -420032, -474611, -432557, -394332, -569840, -500841, -617434, -374597, 330587, 516257, 307140, 256355, 416096, 651004, 963801, 1114370, 1062992, 945003]
15144I45003K30553J61694o90392n69482j37656J86892J51468j6674j58599k34271
15134a31464l53875m90341J38925Q4764L34800M92902J35569O0033o7016l87357
15124a83060j7969j06491m10296k3004L09772K18987J25846J87079N62119K44535
15114I07518j67148m07066k63229k4747m22102l0735N20416j17697k09814O5114
15104a49490J33785K96180N8518P8244L12469l77086p17481l38533n1299k16452
15094i71145k69627R498J35498L23068K17337J12325J18425N1628o1600Q9165
15084b45428N8489j43429j5776l5309j07125R1208r3788k90225n62717k75231
15074a619331K33113N52830P52570M58859m47762m12669l23200j01946K37100
$$ y = [945003, 1175556, 1337250, 646858, 77376, -60280, 126612, 278080, 261406, 102807, -131464, -485339, -975680, -836755, -751991, -417191, 75711, 211280, 271313, 204297, -183060, -201029, -307520, -717816, -740820, -431048, -212061, -86215, 100864, 662983, 907518, 740370, 333304, 70075, 45328, -376774, -407509, 112907, -4790, -214604, -149490, -15705, 280475, 338993, 417237, 729706, 352620, -364861, -703394, -754693, -971145, -1240772, -1231274, -1095776, -772708, -555371, -443046, -324621, -272993, -334593, -245428, -186939, -330368, -346144, -381453, -488578, -397370, -491158, -781383, -1344100, -1619331, -1386218, -833388, -80818, 378041, -69721, -482390, -805590, -907536, -670436]
15065f70436K37699R5137J45573O3508J93700L36432J79307o57095l71691n9869
15055e07735p0380q2456K74802L87975L9527J21023j22536m28892J16795L35071
15045F3194K6649R3204K08770j42523l10137k74708p3182J56544Q7831j64239
15035c28597n46522l53168L4514K39855N3598J31688O27620M42846J41661q633
15025D34862m63065l19062K1591p103n6804l37421j64223O20025N92290K44850
15015E65940k3644l70017n12371P342K95912r8861k52008q1807k3475J3581j25904
15004f05312p1910K7600O4883J81995P21584M03945k33998p51744m95230j89822
14994i48009m0532n6813J28650L94688K76358J7251j52615m2223K38551K22840
$$ y = [-670436, -432737, -337600, -192027, -128519, 65181, 401613, 580920, -76175, -447866, -507735, -578115, -660571, -385769, 2206, 41733, 162756, 40220, -388672, -271877, 63194, 89843, 183047, 391817, 249294, -60843, -335551, -408733, -252189, -164358, -328597, -875119, -1228287, -1193773, -953918, -900320, -768632, -141012, 301834, 443495, 434862, -28203, -347265, -325674, -332777, -389581, -727002, -891225, -271200, 321090, 565940, 542296, 172279, -340092, -332750, -36838, -135699, -387707, -469514, -492989, -479408, -605312, -677222, -649622, -584739, -402744, 318840, 722785, 488787, -262957, -758187, -948009, -988541, -1045354, -916704, -522016, -245658, -228407, -381022, -423245, -184694, 38146]
14984C8146J7520o3827p1549k70642l24493K10657L67581k04930j49260L59539
14974i1258J40040J532J91942K66408K60070m51877l66493K54114o5633j78227
14964c9382K67993P8419r8890O9821R3224j72146k62925L1254Q7790q8797m2786
14953g6425N0416K57836P4440j75867j11946J36331k0917k91083k56755J44818
14943b69152n9723k84485M3268R9202n437J42031J97824k09273k51019K73961
14933c22803j81323l88384j96814L3993M40151N44969J41157m37413n52501L2379
14923h86589M06731N7488K28743M08916O0412n40734n69909j21041L31273J25590
14913d99120l08890n4412M98860L10030j30404k66900j65688M42269J78616k55470
$$ y = [38146, 55666, -8161, -79710, -350352, -674845, -464188, -96607, -301537, -450797, -91258, 48782, 50314, 242256, 508664, 768734, 316857, -49636, 204478, 138845, -39382, 228611, 307030, 208140, 277961, 371185, 199039, -63886, -32632, 55158, -33639, -76425, -26009, 231827, 306267, 130400, 18454, 154785, 133868, -157215, -413970, -269152, -328875, -613360, -570092, -470890, -476327, -334296, -136472, -345745, -596764, -322803, -504126, -892510, -1089324, -1055331, -615180, -70211, 70946, -366467, -918968, -886589, -479858, -422370, -193627, 215289, 275701, -265033, -834942, -955983, -624710, -499120, -808010, -862422, -363562, -53532, -183936, -450836, -616524, -174255, 4361, -251109]
14903b51109J6747Q9618J61420n0806j43948k7073k0703K5942k22012R8340J49655
14892a73929r89K00872o3430j51110J91184K70764j92462j49218K71500J36335
14882C39517m1872J03901J24413r4159l93791l61003l08466j97873K81690M87726
14872e9917K27933j57487l96872K06191J95866J1202j73881n34211m88741K00032
14862i69885N56271J13964l29319N0986M98931K38836m07700p09712j89233K57826
14852h89035J86452j26862q0856L58043L94573N5788M411j08102K1261m04848
14842e89175n24448r2076M26316L33406K38582K7852j49223j21895r0471J06609
14832d34523O6887J21842M5915J4576J91521K94618L87866p6827j35335j16305
$$ y = [-251109, -234362, -144744, 16676, -34130, -178078, -205151, -225854, -199912, -421924, -323584, -173929, -174918, 25954, -37476, -188586, 2598, 273362, 80900, -68318, 203182, 339517, 297645, 401546, 525959, 431800, 38009, -322994, -631460, -829333, -547643, -59917, 168016, 10529, -386343, -180152, 15714, 26916, -146965, -681176, -1169917, -969885, -413614, -299650, -628969, -577983, -79052, 159784, -247916, -957628, -1146861, -889035, -702583, -829445, -910301, -552258, -157685, -101897, -97486, -205588, -184327, -589175, -1113623, -1205699, -779383, -445977, -207395, -179543, -328766, -450661, -541132, -434523, -367636, -245794, -199879, -185303, 6218, 300836, 688702, 611875, 476540, 360235]
14822C60235l24963q5433r0047l20847n42288j1691L21472j19217l34467p5241
14812a222487J23311M0218K71505M91899K62829p3967K5428j44730k79961M13879
14802i2076M12218k50631l14287J12519L01147M03510K62178L53990J71997n55156
14792H05409m08605K1509J3299J69898k280j33906l69959l87885j73150J18407
14782c47263M7730l52127k24810k07185k49230k4486J08333J99818L77260J80355
14772d91605J96k01658m02910k5374M29269M52363M1095j3819n4645P4309L91969
14761A99190K67536K5621j04387m08457j83239p0975j18650q81N449k73397m9874
14750g12064K1922l0904k15843j16886n7407r0035p5956K08985K85662K65378
$$ y = [360235, 35272, -50161, -140208, -461055, -1003343, -1015034, -693562, -812779, -1147246, -1222487, -1099176, -1058958, -787453, -295554, -32725, -106692, -81264, -225994, -505955, -92076, 320142, 69511, -244776, -132257, 168890, 572400, 834578, 1188568, 1360565, 805409, 396804, 418313, 431612, 601510, 599230, 465324, 95365, -292520, -465670, -347263, -299533, -651660, -876470, -1083655, -1332885, -1357371, -1249038, -1049220, -671960, -491605, -491409, -693067, -1095977, -1121351, -692082, -239719, -198624, -212443, -267088, -192779, 199190, 466726, 492347, 387960, -20497, -203736, -274711, -393361, -394242, -388793, -662190, -712064, -690142, -721046, -936889, -1053775, -1111182, -1201217, -1277173, -1068188, -782526, -517148]
14740e17148J53161m974n27440k87675J92088K05841L80900K72505j10603l76496
14730f19841J55877L70479K01277M4932k66650l23567m6332k39922l4128M63861
14720b94014P30310P34818K12549n97451n80506j50128k93666j6559m7544J6412
14710b85779M1342j77333R6978K43434l70730n78872k67540j25503j61083j1047
14700a596133K44409J00105k96076k44265K60342J5406o3596K75876M09989K72700
14690f21243K79824K85365k08523l37600k48373M7992K15450J35353m3373R3666
14680d01462J41503k1726M5821l95894k42058K27664L14133J89101J72093N28559
14670E57734N32513K63953m98907q68945j12286R1079N5049K21278J69010k94789
$$ y = [-517148, -363987, -368961, -896401, -1184076, -991988, -786147, -405247, -132742, -243345, -619841, -463964, -93485, 107792, 152724, -113926, -437493, -483825, -723747, -757875, -294014, 436296, 1171114, 1383663, 786212, 205706, 55578, -238088, -254647, -302191, -285779, -244437, -421770, -324792, -81358, -452088, -1030960, -1298500, -1424003, -1585086, -1596133, -1351724, -1251619, -1547695, -1791960, -1531618, -1516212, -1579808, -1303932, -893943, -621243, -341419, -56054, -264577, -602177, -850550, -802558, -587108, -451755, -495128, -401462, -259959, -281685, -235864, -631758, -873816, -646152, -332019, -142918, 29175, 557734, 1090247, 1354200, 855293, -13652, -125938, -34859, 20190, 241468, 410478, 115689]
14660A15689k135j10808q2729J48618J94500l5424j52609j79207j14768l0941
14650b49814L15667J99152k25432k65459k37517J15997k6913K5096N77667P43310
14640I71754P8889m69035m17236k27561m41669l60927k1163K67409K53993K16427
14630a49119P3716O5611P2992L45297J33185l84029j75167K22770j812r8942K4898
14619A29400j41015j38406N5735P1755j42320k15844n6685L49221K39182j57652
14609f629k88933q5250j30952n4474n0486J66220J98069m22531r2550J91226j46188
14598g22478L1308K27723L54696K51000J32477J16397k39784l99298p8615O1131
14588b65443o7480J04765J25044J02832j00352k72803P5246R1381J4641M5124
$$ y = [115689, 113554, 2746, -79983, 68635, 263135, 227711, 75102, -104105, -218873, -249814, 65853, 265005, 39573, -225886, -463403, -347406, -374319, -349223, 228444, 971754, 1050643, 581608, 164372, -63189, -504858, -865785, -886948, -619539, -365546, -149119, -75403, -9792, 63200, 408497, 541682, 157653, -17514, 205256, 203444, 104502, 129400, -11615, -150021, -94286, -22531, -164851, -380695, -437380, -88159, 151023, -6629, -295562, -380812, -511764, -566238, -616724, -450504, -252435, -674966, -767516, -576290, -722478, -691170, -463447, -108751, 142249, 274726, 391123, 151339, -247959, -326574, -265443, -332923, -228158, -103114, -282, -100634, -373437, -298191, -206810, -192169, -147045]
14578a47045j67995N685N60397J46130o4543L22324J24032m19959l29329k32133
14568b02436l94310j71285l3545k70149J6249M41676O7564l60439m08849j66032
14558a481556o5753N6659M51598K71166K50398j7784j32779L93814N46218K16620
14548D88601O783l12293p38715k34646J71162J32389K48722L8889n1656k12512
14538d63276k0589O5213j81902j44036j26988j58004k46267K70472Q42021K41005
14528G7649j23103l57833j84508K45745K4584j89858j12586P7088J95375J72920
14518a74527J48353j16807J344J0327K40396J70169o7459m09442j02856J12323
14508a88179j14264R2129Q7979M84757M66475L22025j08496m21535l69012j07631
$$ y = [-147045, -315040, -309355, 251042, 397172, 332629, 654953, 778985, 359026, 29697, -202436, -596746, -768031, -801576, -1071725, -1055476, -613800, -546236, -906675, -1315524, -1481556, -1547309, -1490650, -1039052, -767886, -517488, -535272, -668051, -274237, 271981, 488601, 495384, 183091, -555624, -790270, -619108, -486719, -237997, -199108, -250764, -463276, -483865, -418652, -600554, -744590, -871578, -1029582, -1275849, -1005377, -163356, 77649, -45454, -403287, -587795, -342050, -317466, -507324, -619910, -542822, -347447, -174527, -26174, -142981, -141637, -131310, 109086, 279255, 211796, -197646, -300502, -188179, -302443, -210314, -122335, 362422, 828897, 1150922, 1042426, 620891, 251879, 144248]
14498A44248p0754r8292J68533K46952K70799K71784K33606k39541q71974p63494
14488g08133m7091m6441k7266j98413n7130M72103O30589J79266l11475J21377
14478G386j33256L9294L21935L89958K24349n41576n78102K20036O39814L08076
14468H97914k29814j60674l75245n49575j90086l09223k34196J49513J48028K81349
14458e72009K33857J0163K18215M03712j16452j98269j43218j32526J65101L23018
14448A91592J22805j27847j51643P5264L13682J61667m9499j16191n56491k93590
14438d30251R7366k57451M0197M242p2182J1685J31767l5064l08928l39285l8010
14427a195914L77677J33231j68098k50301k81187J71247M39486J55193K25030
$$ y = [144248, 73494, -24798, 143735, 390687, 661486, 933270, 1166876, 927335, 55361, -708133, -755224, -801665, -828931, -1027344, -1084474, -612371, 18218, 197484, -113991, 7386, -125870, -86576, 235359, 625317, 849666, 308090, -270012, -49976, 589838, 897914, 668100, 507426, 132181, -417394, -607480, -916703, -1150899, -1001386, -853358, -572009, -338152, -327989, -109774, 293938, 177486, -20783, -164001, -296527, -131426, 191592, 314397, 186550, 34907, 110171, 423853, 585520, 536021, 419830, -136661, -430251, -332885, -590336, -550139, -545897, -618079, -606394, -474627, -509691, -818619, -1157904, -1195914, -818237, -685006, -853104, -1103405, -1384592, -1213345, -773859, -618666, -393636]
14418c93636J88701k18848j91270L0315k1017K4881J69098J09822j98806n9233
14408e59993K93187k42424k87103J17682J33305k11836r0514K99514J53254j6457
14398d11385o90507k67830P08576M58344J9241J7418j26255P4233J07381n7103
14388a67887n1111j71025l06105N6684M20436K21349j62190m09926m8476J06756
14378e11495J76178J36812K7707K14075K0907L00882P0455j80512O4054Q1626
14368D00689q5558r4665q705o7404k2203P3175K35348o0446n83894k95591M3880
14357d65374L8420K76486M54510J08379p8114k93969k42318q6953k60125j63987
14347g13045M9349K41522L46762L08210J26013m7391j56571l33277n9107O52750
$$ y = [-393636, -204935, -423783, -615053, -584738, -605755, -580874, -411776, -301954, -500760, -559993, -266806, -509230, -796333, -678651, -545346, -757182, -847696, -548182, -394928, -411385, -1101892, -1369722, -661146, -202802, -183561, -166143, -292398, -218165, -110784, -167887, -218998, -390023, -696128, -639444, -219008, 2341, -159849, -569775, -618251, -511495, -335317, -198505, -170798, 43277, 64184, 365066, 435521, 255009, 319063, 400689, 315131, 220466, 211761, 144357, 122154, 195329, 430677, 370231, -213663, -509254, -465374, -426954, -150468, 304042, 412421, 334307, 40338, -201980, -288933, -549058, -713045, -663696, -422174, -75412, 232798, 358811, 311420, 154849, -178428, -237535, 415215]
14337D15215K91754m73933l02219M479m01351n16170J99106M68692P1988j59315
14327d01754Q4757j10311m8417J84813J8053k83598k36240k54404j33160M89694
14317f90567O17732N7847j77153j22285J33432k2782O0157K78753L18102R1722
14307E44958K5279K4852m440k51565l90892k6543K07361J53626j17207m78703
14297c13274p04718j44531k4977K65324L84050O1474O9126l5852m21493k80958
14287a145829O5943K09372L36018J754k81899J94026N05899K41542j68893j40561
14277a82628j75534M684J66948Q4416k8224j47465O4736L6524r1878J81836k10918
14266b97503l03086O2285k87649m34366r0103J21648K40409J71668J82265K33002
$$ y = [415215, 706969, 233036, -69183, -64704, -466055, -982225, -783119, -314427, -242439, -401754, -316997, -427308, -475725, -290912, -272859, -556457, -792697, -1047101, -1180261, -690567, -72835, -14988, -192141, -314426, -180994, -203776, -143619, 135134, 453236, 544958, 570237, 595089, 590649, 339084, -51808, -78351, 129010, 282636, 165429, -313274, -1017992, -1162523, -1187500, -922176, -538126, -476652, -407526, -443378, -864871, -1145829, -1079886, -870514, -534496, -532742, -814641, -620615, -114716, 126826, -42067, -182628, -358162, -353478, -186530, -102114, -130338, -277803, -213067, -176543, -268421, -86585, -297503, -600589, -538304, -825953, -1260319, -1350422, -1228774, -988365, -816697, -634432, -401430]
14256d01430M27886M74695K5229k74079r7665L45687L26146j9658j26356j79751
14246E00704J03411k48726o3537l6737q554N6319J33894J90672k34485n61149
14236a68188m80117k91244J46990J9084J40045L88138j19938l99399M719L28901
14226d31009K02042k03961k99336J25318J072L68843M60328L3200k16072m12896
14216c72471J50865L21773K07836K11704K64300l5146j27834l96291p65460l97609
14206i38333m9101K29775J97194N1751K98660l3431o06952n18942J00690J56697
14196a111992n8306J53117L51812K94944k33174O1181L58288o6248j08101P3971
14186b84508l5697K28216M01916L46387J41606k51658k26786k81257k83069J78166
$$ y = [-401430, 26456, 501151, 526380, 252301, 154636, 500323, 826469, 806811, 680455, 500704, 604115, 355389, 291852, 255115, 246561, 302880, 436774, 627446, 392961, -168188, -648305, -939549, -792559, -773475, -633430, -245292, -365230, -764629, -759910, -431009, -228967, -432928, -732264, -606946, -605874, -237031, 223297, 256497, 40425, -372471, -221606, 100167, 308003, 519707, 784007, 748861, 621027, 224736, -540724, -938333, -987434, -757659, -560465, -508714, -210054, -243485, -850437, -1369379, -1268689, -1111992, -1170298, -1017181, -665369, -370425, -603599, -542418, -184130, -250378, -358479, -284508, -320205, -91989, 309927, 656314, 797920, 546262, 319476, 38219, -244850, -66684]
14176f6684k2427J21603R7883l7155q704J5151R9265J9041j63785J0539j29246
14165f4519l07004k84099K98838M53499K2150j26273j40821j23408M0086k19859
14155d51410m56341l60848J33664M22154K67360n7244J56504N88499L75541K55366
14145H73245J33777j89353m77785n36595k27937j58610N5638k8311k19324k234
14135g77489J95554K91602k16592l03566k77221m6446j9787j73529J40155M96454
14125f90865M00197K20919O42129J57168k13652l26155j47771o3141j32856n15262
14115f69289n11303l84505j43186K97032P72370L81038J687K00166m7191R6958
14105f223p6343k86401O6023K00390K57015R6735L9532M0282R7758j3068K9798
$$ y = [-66684, -89111, 32492, 130375, 93220, 84516, 99667, 198932, 217973, 54188, 64727, -64519, -371523, -655622, -356784, 96715, 118865, -7408, -148229, -271637, -231551, -451410, -907751, -1268599, -1134935, -712781, -445421, -502665, -346161, 242338, 617879, 873245, 1007022, 817669, 339884, -196711, -424648, -583258, -527620, -555931, -775255, -777489, -581935, -290333, -506925, -810491, -1087712, -1134158, -1153945, -1327474, -1187319, -690865, -290668, -69749, 572380, 729548, 515896, 189741, 41970, -21171, -154027, -669289, -1180592, -1565097, -1708283, -1411251, -638881, -257843, -256156, -55990, -103181, -6223, -82566, -368967, -302944, -102554, 154461, 251196, 290728, 331010, 428768, 415700, 445498]
14094D45498M254N36046K42651m94946m50806j04156K33705K38389M29394J72516
14084A252545j84468k71208K1959R0672P5416j4356p8087m36281k25898l3067
14074A97227j09957k63856j72612j38093k23856j49106P2293K19962M37476K17725
14064H7203m6498n9547R5566J46757K62602K2675K11278j61572l83330p8845k3163
14053G3126j32942m2440j56346n65061l54160O62930N37444l47235m14817l98330
14043a137831j82625M02207P17102P58154J99516j67071l16353l38817l5557k44772
14033c46047j61705j49724l56599R7402N24254K31064J51302r1115p07338o80651
14023a489157k66198j23480l1811L29077L45253L25643K4887r3355L10799M68886
$$ y = [445498, 449752, 985798, 1228449, 733503, 282697, 178541, 412246, 650635, 1080029, 1252545, 1068077, 796869, 818828, 909500, 984916, 970560, 892473, 456192, 230294, 197227, 87270, -176586, -349198, -487291, -711147, -860253, -787960, -567998, -130522, 87203, 40705, -18842, 76724, 223481, 486083, 508758, 720036, 558464, 175134, 96289, 73126, -59816, -102256, -258602, -823663, -1177823, -514893, 22551, -324684, -739501, -1137831, -1320456, -918249, -201147, 557007, 756523, 589452, 273099, -65718, -101275, -346047, -507752, -657476, -1014075, -916673, -392419, -161355, -10053, -101168, -808506, -1489157, -1755355, -1878835, -1910646, -1581569, -1236316, -910673, -885786, -979141, -668342, -199456]
14013a99456n407l46916k21501l9168M34938L54329O9551k74747p8413L2125j40274
14002d14939p3188N65447K30372k21816j03375k63818q3988K32564M93981J33114
13992D94354J01650J07006L0813j79713l10686l24161j24219l0368j81096j56977
13982e73397o8635j02931l5475j610j13761Q4614J38876K19912q5135m21663K13389
13971g45816L45334k9637L3147q2584l69517k378M23119n2937M465K40260J77428
13960e9116l9074l53981Q0467J26790r7869L86532L97405K04600K51119j9667
13950H77206q3544o04503o90463j41676k5334n4615R6475K22798L70738K61505
13940B28587k87625j15411R4783J41011M740k55767J7954K29661R1845j96216
$$ y = [-199456, -204863, -551779, -773280, -812448, -377510, -23181, 46370, -228377, -306790, -274665, -414939, -488127, 77320, 307692, 85876, -17499, -281317, -365305, -132741, 361240, 494354, 596004, 703010, 733823, 554110, 243424, -80737, -204956, -235324, -416420, -573397, -642032, -744963, -780438, -782048, -895809, -811195, -672319, -452407, -537542, -959205, -745816, -400482, -430119, -396972, -479556, -849073, -851451, -428332, -481269, -476804, -236544, -59116, -98190, -452171, -371704, -244914, -342783, 43749, 441154, 645754, 896873, 877206, 793662, 189159, -501304, -642980, -668314, -722929, -626454, -403656, -32918, 228587, -59038, -174449, -79666, 61345, 66085, -189682, -171728, 57933, 149778, -46438]
13930d6438j86448j36615J5228K67305j35358o18305k60102L4022M02240N04081
13920a60390L70416K02789k30884Q6755L28007K9239J6661m06425l78563j0749
13910a53144o5599o2645J79081L11575K47757L06873k15130k91427N7167k20326
13900I4182m80288j39284p4506k27173j65395J82550K94443K00929R8597k72696
13890d88641l11050l9183k55459K3528L47117l6105L3583j78607k42792M29196
13880g18413M45258O8421j86151L7893o9568j02546L48068P2941n10450N7082
13870e57465L95331M79777Q4933k88139j55130o37043l89576J34968j10795j02047
13860a145186M55843L01876j97066j77510Q5613J16758k47332j39693K43819q838
$$ y = [-46438, -232886, -369501, -354273, -86968, -222326, -840631, -1100733, -1066711, -664471, -160390, 210026, 412815, 181931, 268686, 596693, 625932, 642593, 236168, -142395, -153144, -218743, -281388, -102307, 209268, 457025, 763898, 548768, 257341, 314508, 94182, -386106, -525390, -599896, -827069, -992464, -809914, -515471, -314542, -215945, -488641, -799691, -838874, -1094333, -1070805, -723688, -759793, -726210, -904817, -1147609, -718413, -273155, -204734, -390885, -352992, -422560, -525106, -177038, -104097, -614547, -557465, -162134, 317643, 402576, 114437, -40693, -677736, -1067312, -932344, -1043139, -1145186, -689343, -387467, -584533, -762043, -676430, -559672, -807004, -946697, -702878, -711716]
13850g11716j05825q1298l0893L47337K46025q1583l27256k58709Q4883M12617
13840e06418L50200k91844K2521O2860j35605n4999J14773K17566r2801k4565
13830c38312L75074L25944Q4220l91570n90669k53132o6792J20530J85984Q9426
13820d59297M03875M04372p2628m82715j87103J54051m9136R8185L02223O31060
13810G42887j4939p55770m79126k27678k06075j49983J05797K17119k29790k56152
13800a253710K51799L64271J17519K61459M06819K87280J22873J50205K53423
13791I61938j17980l79657M3808k15004j70137J99396q329q6528J66086Q4158
13781D77751j0031m4822l52724k76284j37484m27248m60233k92325p9729O0919
$$ y = [-711716, -817541, -898839, -929732, -582395, -336370, -417953, -745209, -1003918, -919035, -506418, -156218, -448062, -425541, -362681, -498286, -553285, -438512, -220946, -313747, -338312, 36762, 362706, 446926, 55356, -535313, -788445, -855237, -734707, -548723, -459297, -55422, 348950, 276322, -206393, -393496, -239445, -288581, -190396, 111827, 742887, 727948, -27822, -506948, -734626, -940701, -1090684, -984887, -767768, -997558, -1253710, -1001911, -637640, -520121, -258662, 148157, 435437, 558310, 708515, 961938, 843958, 464301, 508109, 293105, 122968, 322364, 314035, 227507, 393593, 477751, 467720, 422898, 70174, -206110, -343594, -770842, -1231075, -1523400, -1603129, -1542210]
13771a542210J33691J67067L72951L04749K92572J37512l00222M1012N25694M24234
13761E57050j2811n71594p92150l92447R5308J60421J98363L36809j7795K17340
13751b21506M06778L24336J21309J13533m517l30255j23258j70462r2680K99969
13741C23247M64934q8571o89288l89413J37639M20338L78109R8194m5198l75093
13731B34898n03984j97408K37021J52521o7194k83146j05336L04993K98055r8130
13721b7710j22812L3835j13750K8811R9392j5511N458M43446J59453k50234k28548
13710A1830j26825k48290k57389J74831J85849J36890k86135l95046M22982J14226
13700b67077k90134J70953K89581m4388k89063l042O6173K13871J42302n20115
$$ y = [-1542210, -1408519, -1241452, -868501, -563752, -271180, -133668, -433890, -392878, 132816, 557050, 544239, -27355, -819505, -1211952, -1116644, -956223, -757860, -421051, -438846, -221506, 185272, 509608, 630917, 744450, 739933, 409678, 286420, 115958, 23278, 323247, 788181, 699610, 10322, -379091, -241452, 178886, 556995, 655189, 609991, 234898, -269086, -466494, -229473, -76952, -144146, -427292, -532628, -227635, 70420, -27710, -150522, -116687, -230437, -201626, -102234, -117745, -112287, 331159, 490612, 240378, 11830, -114995, -363285, -620674, -445843, -259994, -123104, -409239, -804285, -381303, -267077, -557211, -386258, -96677, -141065, -430128, -433170, -366997, -153126, -10824, -530939]
13690e30939k23366L79141j98849k64106j55908k94497j91284J48014N30008K61594
13680e40192k6951K13874M4542k14704j05154L0365L70793L09752J11402k93198
13670i9471l40843N81021L79045o8742J52463m54380p39022m62910o3938K00137
13660i16640j33126k01201n0661J89470M3886j87163K28338R5426L26685K94843
13650c10143Q0858M83239O37566o9478k35593l95408n78486j64696R7052r437
13640d64526K95773N1710k59246k10759m82278k85509j5168M22318O96399M87943
13630B36657K81860j02030j73211r9892j72008O0590K37048K99651j376j68328
13620C98961K03017L41897k1004j76717m2538k21843j78471K44789K35313k88014
$$ y = [-530939, -754305, -375164, -574013, -838119, -994027, -1288524, -1479808, -1331794, -801786, -540192, -567143, -353269, -308727, -523431, -628585, -598220, -227427, 82325, 193727, -99471, -440314, 140707, 519752, 451010, 603473, 149093, -589929, -1052839, -1116777, -916640, -1049766, -1250967, -1301628, -1112158, -1068272, -1255435, -1027097, -931671, -604986, -310143, -229285, 253954, 891520, 822042, 586449, 191041, -387445, -552141, -455089, -464526, -168753, -117043, -376289, -587048, -1069326, -1354835, -1370003, -947685, -251286, 236657, 518517, 416487, 243276, 143384, -28624, 31966, 269014, 568665, 567289, 398961, 601978, 943875, 922871, 746154, 703616, 481773, 303302, 548091, 783404, 495390]
13610D95390l49721l0226L95751K97229j05201k82647k08510j27571K48204K14871
13600E47569L27034M06806r8168l11419k08961Q422j64485q595J34907J64018
13590G97128L92157K08910l5592k79264k74835m46691k16556N717l39287k33261
13580d21574L36929J89120l86742m40397j22807J15071p2810J95175K82157k45594
13570e71472j90165L06333L52194j51401l30288L7274L27282J10112K14272L58832
13560D62973k27632l92070l0689l64267l28682J27499k5488p6391K32098J64267
13550d58382l9482J29982M32188M92189K34703k44970l93173p7215K44085M62771
13540G82696O57862J93897k28054M5536j95333k60932n21101o00586k65298J51555
$$ y = [495390, 145669, 115443, 511194, 808423, 703222, 420575, 212065, 84494, 332698, 547569, 874603, 1281409, 1183241, 871822, 662861, 671283, 506798, 498203, 633110, 797128, 1189285, 1398195, 1362603, 1083339, 808504, 361813, 145257, 150974, -188313, -421574, -84645, 104475, -282267, -722664, -845471, -730400, -803210, -608035, -325878, -571472, -761637, -455304, -103110, -254511, -584799, -547525, -220243, -110131, 104141, 462973, 235341, -156729, -187418, -551685, -880367, -752868, -778356, -854747, -622649, -458382, -497864, -367882, 64306, 556495, 791198, 546228, 153055, 75840, 319925, 782696, 1440558, 1634455, 1406401, 1451937, 1256604, 995672, 474571, -126015, -391313, -239758]
13530b39758J56409k7932l2382K1261j71802j02223J79847J05344k4746M47442
13520C11460Q9494j60186j13689m07180l02070J15030K03017j74055K7016n1012
13510d62175n18371J51661K37126L98303L56784J43015R8141J53956K03932P4758
13500H37130j62190m04207l88039k56169p2214Q6741K65987J35543j00875l97188
13490d55481j56834L74315N42720K52244J97943J4448r4832R8046k82433o33696
13480a43560r3998K56705J30140j4162k99914l18180m62320O7542J89406L96830
13470b91511N40203N40875n0049l08173j68780m8453k93951O5331L46636O21059
13460I53187J16065o15545k86606M8689L86485M71310k63415k22911l47540o96474
$$ y = [-239758, -83349, -111281, -143663, -122402, -294204, -396427, -216580, -111236, -135982, 311460, 400954, 240768, 127079, -280101, -582171, -467141, -264124, -438179, -411163, -462175, -980546, -828885, -591759, -193456, 163328, 306343, 404484, 558440, 762372, 837130, 674940, 270733, -117306, -373475, -445689, -358948, -92961, 42582, -58293, -455481, -612315, -238000, 304720, 556964, 754907, 769355, 674523, 772569, 490136, -143560, -237558, 19147, 149287, 135125, -164789, -482969, -945289, -877747, -688341, -291511, 248692, 789567, 739518, 431345, 262565, 214112, -79839, -14508, 332128, 953187, 1069252, 453707, 167101, 215790, 602275, 1073585, 810170, 587259, 239719, -456755]
13450d56755l32511l593J87495L10958K75492m48447n43629J02875O63152J51166
13440i3797m00648m47377L4858r2948N0474M12627L29585J66800l72j29800K35403
13429F4805o4250l68457j61401l2525r3733K52285L89921K77826P2101j64821
13419A71751j88131j22573j22202L03517J86627J5352k12945k3698N82544L62427
13409I52669o823j35189j44649K6045k77291l46322j24875m9912O07425N93238
13399A094316j53811m24666j30389L11143R3548r2483M3680J18235l74837l97443
13389H7293M10040p9863p68378l4770J77044J7317L95535M8075k83094J73895
13379A43094J14571J12287l01860j48320J12533K22732J37626o20187n58803O3355
$$ y = [-456755, -789266, -792859, -605364, -294406, -18914, -467361, -1010990, -908115, -244963, -93797, -494445, -941822, -906964, -999912, -949438, -536811, -207226, -40426, -40798, -170598, 64805, 555, -367902, -529303, -561828, -655561, -403276, -13355, 264471, 336572, 171751, -16380, -138953, -261155, 42362, 228989, 244341, 31396, 7698, 590242, 952669, 945846, 810657, 666008, 692053, 414762, 68440, -56435, -106347, 501078, 1094316, 940505, 515839, 385450, 696593, 790141, 697658, 741338, 859573, 484736, 87293, 497333, 417470, -350908, -385678, -208634, -191317, 204218, 252293, -30801, 143094, 257665, 369952, 68092, -80228, 32305, 255037, 392663, -227524, -786327, -722972]
13369g22972O07819R12603L99500j14754k95538k24488J16208j35213o25864l59974
13359d42673k68338J84624L39381k23323l46503K41300N12505N31382L00162J31581
13349I60098j75206k25718k13351j96718J2271J69233L64989R742j53817k75416
13339B76107k36262j9218M6139j41686Q714M5967J04544N0983j520J38830P63136
13328A035734N53086n67490o56336k00635J84332J87012Q1932j42080k1383l15649
13318A38523l67468J92394J63195K23565K36979J25439o1432l10970l54088j78618
13308a92481N6889Q005j75482P2699L88382N05026j22732m44869j52688l0362
13298h7613r6096O0149L16121r5122O771K6811q4313Q2210m5424p31704m56533
$$ y = [-722972, -115153, 797450, 1196950, 1082196, 786658, 562170, 678378, 543165, -82699, -442673, -711011, -526387, -187006, -410329, -756832, -515532, -3027, 528355, 828517, 960098, 784892, 559174, 345823, 149105, 161376, 330609, 695598, 705340, 551523, 276107, 39845, 20627, 66766, -74920, -66206, -20239, 84305, 135288, 133768, 272598, 1035734, 1588820, 1021330, 364994, 164359, 348691, 535703, 617635, 475555, 454172, 138523, -228945, -36551, 126644, 350209, 587188, 712627, 651195, 340225, -13863, -192481, -135592, -127587, -303069, -230370, 158012, 663038, 540306, 95437, -57251, -87613, -183709, -123560, 192561, 97439, 104210, 131021, 46708, 128918, 83494, -648210, -1104743]
13287a104743M44236K19436p1576p1995N6390K694K69544K95652Q1120J06493
13277B27251N8492K62618K20849r8068J53951L26611N1409l45684j94604j22067
13267E40758k39366j88881L99158N56630M00298L93426J81697n88510p93754k95593
13257C65863L52937N29159J99211j75117j55317J33789m3492k03831J05241k5854
13247A082589n01966l84091k27703o407N18488M36187r3724r6793j71305K57820
13237H13095Q3834m31397j97560r5221J73985k6331l1003R0600K92589K95914
13227I68505J1173j57578j57989O1221K09560K02448o8308Q8341k22592o05389
13217C29392j74098M9353L5727m4547P8621N6370J78085j991k18536m97221m06326
$$ y = [-1104743, -660507, -441071, -512647, -584642, -528252, -525558, -256014, 39638, 120758, 227251, 285743, 548361, 769210, 671142, 825093, 1151704, 1203113, 857429, 662825, 540758, 301392, 112511, 511669, 1068299, 1468597, 1862023, 2043720, 1455210, 661456, 365863, 718800, 1247959, 1447170, 1272053, 1116736, 1250525, 1207033, 1003202, 1108443, 1082589, 580623, 196532, -31171, -37578, 480910, 917097, 823373, 726580, 555275, 813095, 896929, 465532, 267972, 172751, 346736, 320405, 289402, 380002, 672591, 968505, 979678, 822100, 664111, 725332, 934892, 1137340, 1069032, 1157373, 934781, 329392, 155294, 204647, 240374, 195827, 274448, 330818, 508903, 506912, 288376, -208845, -615171]
13206f15171K56499M53412K56866M78395L16989k32064J00933M42879K9649j15337
13196A373050m61653k58988j36836j80971q7791j57327k08768K3363L70180N0579
13186C24838K70083M99246J13205p8411k27156K3533O75390P5340m13440n27520
13176G35108k71748J29098K55309K25353R1562Q2298n5515k07716k10619l29636
13166D43494K0298L16266l3715J62346M94490K86791P179l00493j90569j49228
13156A056859m63792j85533J85035J55625K05183J87162j71063k77424n30568
13147A61484m08893K38696K22849j4626L5187N7950J17834K49184K79486J05428
13137A044579j82848l22851J845J14101k6522p2018n2836K82962N77573R0169
$$ y = [-615171, -358672, 94740, 351606, 830001, 1146990, 914926, 1015859, 1458738, 1488387, 1373050, 911397, 652409, 515573, 334602, 246811, 89484, -119284, -95921, 274259, 324838, 594921, 1094167, 1207372, 1128961, 901805, 925338, 1600728, 1676068, 1262628, 735108, 463360, 592458, 847767, 1073120, 1164682, 1246980, 1191465, 983749, 773130, 443494, 463792, 780058, 746343, 908689, 1403179, 1689970, 1697149, 1396656, 1206087, 1056859, 593067, 407534, 592569, 748194, 953377, 1140539, 969476, 692052, 161484, -247409, -8713, 214136, 199510, 234697, 292647, 410481, 659665, 939151, 1044579, 861731, 538880, 540725, 654826, 628304, 556286, 503450, 786412, 1363985, 1454154]
13127A454154l44321L39093P0588n36263O4461R43191N82737l37734p49617o78389
13117H07900l80998j53779j18144J53326K11480M62916M54070L587k16653R7515
13107A321220j68232k0259K98487J04567k02527j94114m64145j76708M19097J10502
13097A027888p5593k12169j46760j53122L73504N61653K09843K52014M58043L68663
13087B663964K9124k04806m08744l02550j84768l30018l01029k12868o8070J57885
13077H38120L22912r65l84745j91703J28718K44673N21175L36251P2150r136J13391
13066A990841K86246L97057j33176L089K25723k03009J3188J31178j16422K8333
13056B623048k96277l90125J8548J22038J4611Q7628p4214K56593N11492L28473
$$ y = [1454154, 1109833, 1448926, 1519514, 983251, 1047712, 1990903, 2573640, 2235906, 1486289, 807900, 426902, 273123, 154979, 308305, 519785, 982701, 1436771, 1440358, 1223705, 1321220, 1152988, 1132729, 1431216, 1535783, 1333256, 1139142, 674997, 498289, 917386, 1027888, 952295, 740126, 593366, 440244, 813748, 1375401, 1585244, 1837258, 2295301, 2663964, 2693088, 2488282, 2079538, 1776988, 1592220, 1262202, 961173, 748305, 680235, 838120, 1161032, 1160067, 775322, 583619, 712337, 957010, 1478185, 1814436, 1886586, 1877450, 1990841, 2277087, 2674144, 2540968, 2544057, 2769780, 2566771, 2579959, 2711137, 2594715, 2623048, 2326771, 1936646, 1955194, 2077232, 2091843, 2179471, 2105257, 2361850, 2873342, 3201815]
13046C201815l76840l23607J99400R5324J11155J29940P1823M887J32780L3648
13036C280325l4474j82513J02455L89294L20956J03117N0037j48913m84860K17688
13026C613112M28647J01840j64468k64343N0112L40398k00726k5132K91664K6988
13016D198092j48738O2316L91321J12978N6518L45773Q35809J282504N72243J07448
13006G816264L30048m2592J78771M66619N27059N60033O83085Q32033Q56242P50342
12996A2957904O42518R02269J484210K031541J729782K250428K855917L435973
12988B8290542M344718N440437O768153R139189J2187263J5877126K1423838K9915687
12980A33386953M1414514N5779368P0722972P6298816N3625565n11251n0654415
$$ y = [3201815, 2824975, 2501368, 2700768, 2796092, 2907247, 3037187, 3109010, 3113897, 3246677, 3280325, 3245851, 3063338, 3165793, 3555087, 3876043, 3979160, 4029197, 3880284, 3395424, 3613112, 4041759, 4143599, 3979131, 3714788, 3764900, 4105298, 3904572, 3879440, 4171104, 4198092, 4049354, 4111670, 4502991, 4615969, 4672487, 5018260, 5854069, 7136573, 7708816, 7816264, 8146312, 8103720, 8282491, 8749110, 9276169, 9836202, 10519287, 11351320, 12207562, 12957904, 13600422, 14502691, 15986901, 18018442, 19748224, 21998652, 24854569, 28290542, 32635260, 38075697, 44843850, 53983039, 66170302, 82047428, 103471266, 133386953, 174801467, 230580835, 301303807, 377602623, 431228188, 430716937, 380062522]
12973C80062522o9039484o3696476n0483789l7818479k8330281k1309506j6581050
12966I2803457j2960535j0250420q669026p504357o472422n330696m286001l570823
12958C3759177l037134k969871k621543j975289j629736j613831j469549j624241
12950A6817983j071954q32818q99922n80306n08061m74221l74099o02625n21615
12941A0952362q67092n28200J25576k81506p37359r7009L18569M2426r2431k49512
12931H585824L01002P77235M59796j59100k03989J60359L67780J65191O98267
12922A1152365J446286J714850J921993J862484J882250J709349P92845m41294
12914B2041128j306734j802661j089808l30335n8738m8003P96012J556926K142089
$$ y = [380062522, 311023038, 247326562, 196842773, 159024294, 130694013, 109384507, 92803457, 79842922, 69592502, 60923476, 53419119, 46946697, 41616001, 37330000, 33759177, 30722043, 27752172, 25130629, 23155340, 21525604, 19911773, 18442224, 16817983, 15746029, 14913211, 14013289, 13432983, 12924922, 12450701, 12076602, 11473977, 10952362, 10085270, 9557070, 9682646, 9401140, 8663781, 8566772, 8885341, 8927767, 8835336, 8585824, 8886826, 9664061, 10123857, 9964757, 9760768, 9921127, 10288907, 10454098, 11152365, 12598651, 14313501, 16235494, 18097978, 19980228, 21689577, 22482422, 22041128, 20734394, 18931733, 17841925, 17511590, 17452852, 17404849, 18200861, 19757787, 21899876]
12905B1899876K036448J969269K565461L753892M728514N855029P272891R526564
12897E9607944J2568371J6853250K3365975L2364605M4372678O0008398P5907349
12890C25048570P8227386M4640104j6657692o1596146p1648509o2062647m7937441
12883A88013625l6202068k6991673j9886797j5315940j2085102j0064504q809122
12876E8658419p035661n453427m778409l999793l483588k971702l061807l015204
12868B4858828k335323j784662j251439j129130j636619j467566j051389q10842
12860A3391858o96368n79844n55623l56132O4872k1323l87792l76457k67407l56761
12850I859023l28135k87925q4222j44177K42583p465n96907k84254L87889K15609
$$ y = [21899876, 23936324, 25905593, 28471054, 32224946, 36953460, 42808489, 50081380, 59607944, 72176315, 89029565, 112395540, 144760145, 189132823, 249141221, 325048570, 403275956, 447916060, 431258368, 369662222, 298013713, 235951066, 188013625, 151811557, 124819884, 104933087, 89617147, 77532045, 67467541, 58658419, 51622758, 46169331, 41390922, 37391129, 33907541, 30935839, 27874032, 24858828, 22523505, 20738843, 19487404, 18358274, 16721655, 15254089, 14202700, 13391858, 12695490, 12115646, 11560023, 11203891, 11268763, 11247440, 10859648, 10483191, 10215784, 9859023, 9530888, 9242963, 9158741, 9014564, 9257147, 9249682, 8652775, 8368521, 8756410, 8972019]
12840H972019j80040j16429J08376M14695J8648j40873K9812N45962N14203o4373
12830A0102000J99925L81549M69551Q76353L49853M28040P37763L77020P66616
12821A4688670J563054J673082J938602K204080K433452K650406L821897M738940
12813C5712183O090589Q074864J0149069J3705210J8942220K5491096L4729529
12806A52894760M7022787O2570315P5849789P0397399L0142492k7603888o3428152
12799C47845502o8509255n8119891m4702016l3472627k4992613j8956479j4588286
12792H4504335j1580458r987900q147323o629289n478065m740206m279775l942725
12784B9718594l698630k892367k137857j898393j564412r98693r27538r50272
$$ y = [8972019, 8791979, 8675550, 8783926, 9198621, 9217269, 9076396, 9106208, 9652170, 10166373, 10102000, 10301925, 10683474, 11153025, 12029378, 12379231, 12807271, 13545034, 13922054, 14688670, 16251724, 17924806, 19863408, 22067488, 24500940, 27151346, 30973243, 35712183, 41802772, 49877636, 60026705, 73731915, 92674135, 118165231, 152894760, 199917547, 262487862, 338337651, 408735050, 438877542, 411273654, 347845502, 279336247, 221216356, 176514340, 143041713, 118049100, 99092621, 84504335, 72923877, 62935977, 54788654, 48159365, 42681300, 37941094, 33661319, 29718594, 26019964, 23127597, 20989740, 19091347, 17526935, 16528242, 15600704, 14650432]
12776A4650432r39185r50728p95618n49686o09843q87977j077039q14881q54858
12767G170617l72781L81474k35380n18047j97051j9334k97097l94808j00457R8866
12757E516002K77385L5190o9145l6487k20966m22672j64020l40964n55596m26503
12747C592224l11764l68858l20713k21645l8159K13411K61888K04381M4950m63489
12737B592226n67343j64371j21962l42203m8130j2604J3556K54443M26367M4495
12727B074474L7612K48727L2993n7747j13869n5970k44830q2055P591M04065M03587
12716B654578n50270m61055J65029K79564J13794M1855j83801l12736K94752L99814
12706B441524j12168m31972l78378J70198L56298l94818o59585K64121O93969
$$ y = [14650432, 13711247, 12760519, 11964901, 11415215, 10805372, 9917395, 8840356, 8025475, 7170617, 6797836, 7179310, 6943930, 6425883, 6228832, 6209498, 5912401, 5517593, 5417136, 5516002, 5793387, 5828577, 5759432, 5722945, 5501979, 5079307, 4915287, 4574323, 4018727, 3592224, 3280460, 2911602, 2590889, 2369244, 2331085, 2544496, 2806384, 3010765, 3055715, 2592226, 2024883, 1860512, 1738550, 1396347, 1348217, 1335613, 1349169, 1603612, 2029979, 2074474, 2112086, 2360813, 2393806, 2336059, 2222190, 2166220, 1921390, 1839335, 1846926, 2250991, 2654578, 2104308, 1643253, 1808282, 2087846, 2201640, 2243495, 2059694, 1746958, 2041710, 2441524, 2329356, 1897384, 1519006, 1689204, 2045502, 1650684, 991099, 1255220, 1949189]
12697A949189K42822r9919q0065k94854m83959k64133K27865L78762L35478L5227
12687A946413M3571K95395J84516j28925k0971j91945k89587k11787O4564O6584
12677A757828L837J12029j82761j14036o2609L4061n09481o19180K08028N68603
12667A196319L76620K2805j87678m7062N714J25855j67502m1635Q2166M28549
12657A794151P2912l95800k88809j63417j15765j18449p4186k96375r1318k6255
12647B96689J07517O0531P1380J37660K06715M23936R2853r4416j07514m2913
12637A152438m97711m18656J88860O56823L77253l56090r9438L81437J51034j54166
12627A381784r3408j03764q7827L7484O2039j77468m92829Q2340K62260r6918
$$ y = [1949189, 2192011, 2092092, 2012027, 1717173, 1233214, 969081, 1196946, 1575708, 1911186, 1946413, 1989984, 2285379, 2469895, 2340970, 2319999, 2128054, 1838467, 1626680, 1691244, 1757828, 1761665, 1873694, 1690933, 1576897, 1514288, 1548349, 1038868, 419688, 627716, 1196319, 1572939, 1595744, 1408066, 1361004, 1366718, 1492573, 1325071, 1283436, 1365602, 1794151, 1867063, 1471263, 1182454, 1019037, 903272, 784823, 710637, 414262, 322944, 296689, 404206, 464737, 536117, 673777, 880492, 1304428, 1397281, 1302865, 1195351, 1152438, 654727, 236071, 424931, 1081754, 1459007, 1102917, 1003479, 1384916, 1535950, 1381784, 1288376, 1184612, 1096785, 1134269, 1196308, 1018840, 526011, 608351, 870611, 773693]
12617G73693Q3718L54615M10808l5892p33782n35486K41457L58885L23740K83815
12607A525571J6133m9536k43914l54373l76490k44618j21996K95811P09230J50982
12597A306800L6858j97668k25104m17560j55544O77938N04629r3964k59834M833
12587A181384j16924o70443m57727n0993M97629K55347J39802J35862L9452P8734
12577A032123j48929j74647p5945P7393o7744K7083J96668O4091J24035k74177
12567G79951J1259J55161j87266l10046J33766O46353L9474o12861l50928K05192
12557E10055M78683M00530l43020o17657j95865j52717j163K81195M0932j47194
12547B53779k13313K18376L80124L9041k07677k12950N8531K59225K51115K02954
$$ y = [773693, 857411, 1212026, 1622834, 1586942, 853160, 317674, 559131, 918016, 1241756, 1525571, 1541704, 1492168, 1248254, 893881, 517391, 272773, 150777, 446588, 1155818, 1306800, 1343658, 1145990, 920886, 503326, 347782, 1025720, 1530349, 1436385, 1176551, 1181384, 1064460, 394017, -63710, -114703, 382926, 638273, 778075, 913937, 953389, 1032123, 883194, 708547, 632602, 709995, 642251, 669334, 866002, 930093, 1054128, 779951, 791210, 946371, 759105, 449059, 582825, 1229178, 1268652, 655791, 304863, 510055, 988738, 1389268, 1046248, 428591, 232726, 80009, 78846, 360041, 400973, 253779, 40466, 258842, 638966, 678007, 470330, 257380, 315911, 575136, 826251, 1029205]
12537A029205L06888J16737l45834m52388k12512L18217J00253k75481m73164
12528A11921l26133p4774k42627K80403L44107R4389P2448k42594j49004L64998
12518B33134M05309J24061J7366K75733K99604p8251l13632j19066K22285r1580
12508I74963n12276k87048Q6574Q8545K2487J27843K00771n27689q25584n34820
12498a186234L3523N57778M57659J31794q969k21904j04314M5435j02173j11636
12488e09041j36381J5725K8118k8784J71274J70014M51896K24693j74599o8346
12478A44569L3567J60443j18036j50460j29456l1876K49525K07672P577j61974
12468B11551K42409K35607m5081l70291m65254l1440K51215q4119k58550K7647
$$ y = [1029205, 1336093, 1452830, 1106996, 654608, 442096, 760313, 860566, 585085, 111921, -214212, -288986, -531613, -251210, 92897, 187286, 259734, 17140, -131864, 233134, 638443, 762504, 779870, 1055603, 1355207, 1276956, 963324, 844258, 1066543, 974963, 462687, 175639, 262213, 350758, 373245, 501088, 701859, 174170, -651414, -1186234, -1152711, -594933, -137274, -5480, -14449, -236353, -340667, -295232, -397405, -509041, -645422, -629697, -601579, -630363, -459089, -289075, 162821, 387514, 212915, 144569, 178136, 338579, 220543, 70083, -59373, -91249, 158276, 365948, 373525, 211551, 453960, 689567, 644486, 274195, -191059, -222499, 28716, -55403, -313953, -286306]
12458b86306M87401j7384m03050m8105R8987P8109L2494j93466j58046J1804M8882
12447c48680K75063L32059p0713K56699k4119k42541m8178j76686j31462j61229
12437c39787N9914J61852J71640J35716J06590J35984K75226K47330k68877j90073
12427D95515K02761J0503k39623m20613m75757l02034j21665J92082M13004K15436
12417c0391l31210n8694J40995K06522N5132j33121K45262K22720k493J56292
12407D71014L74436L1810l18456l37246k0748J76893K62443J58973j07691p9746
12397F11682J5819j07740k93006m43727l27020j67344O0386M5613k35626j73924
12387a014887K48459L85721L30330J21724L39994M14740J04194k39994n78743
$$ y = [-286306, 201095, 183711, -219339, -267444, -168457, -90348, -57854, -251320, -409366, -397562, -348680, -73617, 258442, 187729, 444428, 420309, 177768, 129590, -47096, -178558, -339787, -279873, -118021, 53619, 189335, 295925, 431909, 707135, 954465, 685588, 495515, 698276, 708779, 469156, 48543, -427214, -729248, -850913, -658831, -245827, -30391, -361601, -420295, -279300, -72778, -17646, -150767, 94495, 317215, 314722, 471014, 845450, 877260, 558804, 221558, 200810, 377703, 640146, 799119, 691428, 611682, 627501, 519761, 226755, -216972, -543992, -711336, -650950, -605337, -840963, -1014887, -766428, -380707, -50377, 71347, 411341, 826081, 930275, 690281, 111538]
12378A11538k12835K46840J33553l28157k16574L44962P1749k36125J04583L65825
12368C85359J60891K48677R3108r3850j88306L3982J92420j21907Q2878K59314
12358A052566L95324k05861r20046m37580Q0899L8240j51470n9260K61944K87708
12348C42464O0702K27097K77557K34980j15458p5447R7020k6505j95174m87756
12338C39480o8017j32556k82231k34319J35090L74321J97987n5482L36807L07428
12328I18508r9888O3363o5933k64172k01335l30692m24516J6107N22480M25631
12318E59553J35581k02075l13868j43563k19582l3616K47415q416k11664j27292
12308c17527J83889J70391n2160k21437m09531k45627Q8090J90381J02390K29497
$$ y = [111538, -101297, 145543, 279096, -49061, -265635, 79327, 151076, -85049, 19534, 385359, 546250, 794927, 888035, 794185, 605879, 639861, 832281, 710374, 793252, 1052566, 1447890, 1242029, 321983, -115597, -34698, 3542, -147928, -207188, 54756, 342464, 403166, 630263, 907820, 1142800, 1027342, 951895, 1048915, 1022410, 827236, 339480, 271463, 138907, -143324, -377643, -242553, 131768, 329755, 274273, 611080, 918508, 818620, 881983, 816050, 551878, 350543, 19851, -404665, -388558, 133922, 559553, 695134, 493059, 179191, 35628, -183954, -217570, 29845, 21429, -190235, -317527, -133638, 36753, -15407, -236844, -646375, -892002, -803912, -613531, -511141, -281644]
12298b81644Q6390j43127k15093j0053L65125N87043J36760m24794J2529j08454
12288D682l20473N33996M99900J96404P025N5875o2660n0266k28625J0000L49824
12277I95682M63175J58164l52253n33278q6501J10801K92468L69704M12653j25850
12267A704765j38657j11437l99354o23996o32594k06931j80875J90066N57623
12258A58610J39353k66677l87022M0926N09732K72345J7244l66720q6293K90712
12248C22210p1860k52126r3102n9053J29778J500O8714L46461r7395l68498J02327
12237B8956M15095m6714k02234K48382K48112J67326J47345J2239l27404k79098
12227D12005k56730P4867J87612M31007K47433l34034n88803m05092k39987N7326
$$ y = [-281644, -195254, -338381, -553474, -563527, -198402, 388641, 525401, 100607, 113136, 4682, -315791, 218205, 718105, 914509, 921534, 977409, 914749, 864483, 635858, 645858, 995682, 1458857, 1617021, 1264768, 731490, 644989, 755790, 1048258, 1417962, 1830615, 1704765, 1566108, 1454671, 1055317, 431321, -201273, -408204, -589079, -399013, 158610, 297963, 31286, -355736, -314810, 194922, 467267, 484511, 117791, 31498, 322210, 250350, -1776, -94878, -153931, -24153, -22653, 46061, 392522, 295127, -73371, 28956, 444051, 397337, 195103, 443485, 691597, 858923, 1006268, 1018507, 691103, 412005, 155275, 230142, 417754, 848761, 1096194, 762160, 173357, -231735, -471722, -414396]
12217d14396K07285J10397M1351K06485K63988k68407k43963P6338J48806J64749
12207B92633j68248k25747k77462j71539q6473M743K77257J42818P2729J40029
12197G40J74226K0202K20276J89069j15126k81290m85002k59216O7602J34052
12187c34467N2310k09154k25526L8256L66929L65553K08517l9995K7444L32616
12177E82483R8697o5841j70724j06219j41340k76782l69972n22214o14045k50987
12167a836944L76631P34289O19738K63409k99376l47820Q5821L88769P0120Q9061
12157A43698M52749N01639L22872Q2315j34425o95153q54719m39531J8791J78290
12147d23474L39387J65642j07111r2915J23103J0337K32550K47030R4860k36621
$$ y = [-414396, -207111, -96714, -55363, 151122, 415110, 146703, -97260, -20922, 127884, 292633, 124385, -101362, -378824, -550363, -636836, -632093, -354836, -212018, -139289, 740, 174966, 195168, 415444, 604513, 489387, 208097, -276905, -536121, -468519, -334467, -282157, -491311, -716837, -678581, -311652, 53901, 262418, 222423, 249867, 582483, 681180, 615339, 444615, 338396, 197056, -79726, -449698, -971912, -1585957, -1836944, -1460313, -726024, -106286, 157123, -142253, -490073, -404252, -15483, 54637, 143698, 596447, 1098086, 1420958, 1503273, 1368848, 673695, -181024, -620555, -601764, -423474, -84087, 81555, -25556, -118471, 4632, 14969, 247519, 494549, 589409, 352788]
12137C52788O0550M48076K89593k14726k41634M48893K45215k2046k77519o06608
12127D82582K2895M95642K08877n30301m32092r3745J80547l8896j32474j50234
12117A2801O5330L74965L52858O4731k82632j49774K2766k91055l29854J56339
12107c525j24862k54974J37270p030J59680Q5750O768J37466n569l52294k87940
12096e09260J20330M60620N03420Q9526l48219l61607n06830l51566j7781n7207
12086i78574K37066N29681M59471j84133k53088M24522N01735J66801k87080j81677
12076D34724J35686J87411r430p8855k30175k50386j94582k48504m08322J176
12066f61257O4708n9987K10356O51326M01203J93630J49486l25186n31207j65925
$$ y = [352788, 413338, 861414, 1151007, 936281, 694647, 1143540, 1388755, 1366709, 1089190, 482582, 505477, 1001119, 1209996, 679695, 247603, 153858, 334405, 295509, 163035, 12801, 78131, 453096, 805954, 870685, 588053, 438279, 461045, 169990, -159864, -3525, -128387, -383361, -246091, -253121, -93441, -7691, -923, 136543, 130974, -221320, -509260, -388930, 71690, 575110, 664636, 316417, -45190, -552020, -903586, -921367, -978574, -741508, -211827, 247644, 63511, -189577, 234945, 736680, 903481, 616401, 434724, 570410, 757821, 748391, 669536, 439361, 188975, -5607, -254111, -662433, -661257, -596549, -656536, -446180, 205146, 606349, 799979, 949465, 624279, 93072, -72853]
12056g2853J50801k32449j61986P0875R9429l00758n28445p1154j1232N9650M2086
12045i56036l6920l7577J73301N09096N23581K91492j02991q6106j45802j53032
12035b0994k9014L21133j82539n49412J00271J29933j24601K08214j18009K94507
12025B9489M71902n45927m67761K25430N03871N62672M8306j49663m86598l21067
12015a29346n7684J41448P0759J25769j68841k68312j57282Q8731L10781J83256
12005A39279j26427r5451j13268k97079Q3268L16853r7827J90681J82360k68190
11995h5801k45928o772M4050J53897L14145J5496l6022K15710k91705k4164o0809
11984g903l42534K732q2600r6416K87755K92720K78683J74321K18555l77176l60474
$$ y = [-72853, 77948, -154501, -316487, -245612, -146183, -446941, -975386, -1046540, -1057772, -998122, -956036, -992956, -1030533, -857232, -348136, 175445, 466937, 363946, 277840, 132038, -20994, -50008, 271125, 88586, -460826, -360555, -230622, -355223, -147009, -265018, 29489, 501391, -44536, -512297, -286867, 217004, 779676, 827982, 678319, 191721, -129346, -187030, -45582, 25177, 150946, -17895, -286207, -443489, -354758, -43977, 139279, 12852, -82599, -195867, -492946, -409678, -92825, -190652, 29, 182389, -85801, -331729, -338501, -294451, -140554, 173591, 189087, 153065, 368775, 77070, 52906, -7903, -350437, -347705, -430305, -526721, -238966, 53754, 332437, 506758, 725313, 348137, -12337]
11973a2337N3574J68017L42763K67482j44904m39955m67834q3926M5719R9909
11963a71492N8450n0815p9655n3343l657J59754O1700p3469J51240k39876k97319
11952e38482J09611P0827j7314J98326L47463L4980j26759K84719K52099K61099
11942H76569N8957j91483L08123J53844m83137j1429J45509M1658j53581k60965
11932D84065q5189j54378R0051J81623p2055m48944l77660J76497R6295o6807
11922a76502J65124K36132R8237K06962K58511J16979k14780k29090k22910j83415
11912E5248L26117J76377J6423Q2338j54473L5320j88626J23280N48617K56502
11902A277123k45946o28059p6327k25065n9258P9946j89485l6857j73862k3434
$$ y = [-12337, 41237, 209254, 552017, 819499, 674595, 234640, -233194, -317120, -271401, -171492, -113042, -163857, -243512, -296855, -300512, -140758, -79058, -152527, -1287, -241163, -538482, -428871, -358044, -375358, -177032, 170431, 205411, 78652, 363371, 615470, 876569, 935526, 744043, 1052166, 1206010, 722873, 711444, 856953, 898611, 745030, 484065, 398876, 244498, 334549, 516172, 444117, -4827, -382487, -205990, -109695, -176502, -11378, 224754, 322991, 529953, 788464, 905443, 690663, 461573, 238663, 55248, 381365, 557742, 574165, 656503, 502030, 537350, 348724, 472004, 1020621, 1277123, 1031177, 403118, 326791, 101726, 42468, 122414, -67071, -103928, -277790, -301224]
11892c01224Q4226J02667l5419M5531K473J97066J77751k01781l75996l29475
11882f34181P7029J93822k0964L98076M57898o9176k58544l06114J91425L77913
11872D07184j19882j55713J03249Q6042j51409k05555j37919M81505Q85611O9357
11862A262470m50137j94772k16875r1034j2012j33899m17152l19306k3363O2495
11852e33585l12877k3759K42558L12918K67948J47562J33723J03864K01672Q0257
11842F20281K1334k68950k50871M9544j98106j35778L12576L92181J77620r4351
11832F25480m32984j32965J64670K65334l01049n95120m7581K92187L41900Q7539
11822B67411r4296n1907j59240m44174P8585N46642O55524L10586l19007m13607
$$ y = [-301224, -216998, -114331, -149750, -104219, -101746, 95320, 273071, 71290, -304706, -634181, -557152, -363330, -384294, 13782, 471680, 402504, 143960, -162154, 29271, 407184, 287302, 131589, 234838, 320880, 169471, -36084, -174003, 307502, 1193113, 1262470, 812333, 617561, 400686, 309652, 297640, 163741, -253411, -572717, -596080, -533585, -846462, -870221, -627663, -314745, -46797, 100765, 234488, 338352, 540024, 620281, 641615, 372665, 121794, 171338, -26768, -162546, 150030, 542211, 719831, 625480, 192496, 59531, 224201, 489535, 188486, -406634, -454215, -162028, 179872, 267411, 173115, 121208, -38032, -482206, -403621, 143021, 798545, 1109131, 790124, 376517]
11812C76517j12065k87438k95645J1350p5505j67168o67808l77772L35347K59861
11802a000326J09859Q0854j06822j87519p5952L11834M69407M03342J8086k45741
11792b22978j74523K50940M45868Q1566k41392k60768j02044J87249K84417l0043
11782B18292j04496j60638J59034J53410Q6220j04699o15584m41312K402J9201
11772g88170K97051K68192K21912L39141j75239j20613l30979m07921N2480L75401
11762b68745K09737j711j3709j85571J7516L48246K67551j75864k55891M1971
11752a6470J958K82211Q12259L12039m51040m99466J17375k1922o232N61842K66622
11741A359176M3006l128j98108k24454P494L77711n1574k08647j07419l91927
$$ y = [376517, 264452, -22986, -318631, -307281, -382786, -549954, -1217762, -1595534, -1260187, -1000326, -890467, -809613, -916435, -1103954, -1179906, -868072, -398665, 4677, 22763, -222978, -397501, -146561, 299307, 380873, 139481, -121287, -223331, -36082, 248335, 218292, 113796, -46842, 112192, 265602, 351822, 247123, -368461, -809773, -807371, -788170, -491119, -222927, -1015, 338126, 162887, 42274, -288705, -696626, -644146, -268745, -59008, -60719, -74428, -259999, -242483, 105763, 373314, 197450, -58441, -16470, -14512, 267699, 1079958, 1391997, 940957, 441491, 558866, 536944, 530712, 1092554, 1359176, 1402182, 1399054, 1200946, 976492, 983986, 1361697, 1310123, 1101476, 994057, 602130]
11731F02130l79288m9253L88806K36345P3666n0607l84186j80152L95603K68377
11721I21441k96885j131540j42189P48967M67553K00094K24384j31619j3855J86385
11711A032736l03642m76214k07594P2553k4411o3753R2834r2044j49911N2225
11701f7221K47039j62691n19271J02613M19304J90597m0333J21007J59071K64805
11691G14920K34300J52825P8623O342j82516m26607r7747L2905k10285l45191
11681d2431n0548L31822m04804o63202J62004M17196L51001J54476J52508P7121
11671D85143j92997Q9606J60197J97963L04110N8903l73016K789J24968k0471
11661H37195k9465K10354O0357J39756K76699m40314q80095j96389L2214m48839
$$ y = [602130, 222842, 173589, 562395, 798740, 872406, 821799, 437613, 257461, 653064, 921441, 624556, -506984, -649173, 99794, 567347, 767441, 991825, 860206, 846351, 1032736, 729094, 252880, 45286, 117839, 93428, 29675, 122509, 30465, -119446, -67221, 179818, 17127, -502144, -399531, 19773, 210370, 170037, 291044, 450115, 714920, 949220, 1102045, 1180668, 1187010, 1004494, 577887, 480140, 513045, 302760, -42431, -92979, 238843, -165961, -829163, -667159, -249963, 101038, 255514, 408022, 485143, 292146, 381752, 541949, 739912, 1044022, 1102925, 729909, 732698, 857666, 837195, 807730, 1018084, 1078441, 1218197, 1494896, 1054582, 174487, -21902, 10312, -438527]
11651d38527j50243l00996l91286K70593M13143J18078J00141J01903O3664j5871
11641b29401L18502M19635l64839n95051J96823K64288l16551l17359Q4738L22721
11631b16494P3009k04452k31546j64597k15573o2119J82748K43926P6764j46302
11621f64636k14825M7355K54582L77162M65691O22467L75021Q5497K48381J51641
11611A748336k33094n33227n87022j68208Q9854l56242l14143j12729K39532O55757
11601D28814L79824l35143J3159K11829l8784k70778P4447N21890L6507j86314
11591H35451j78798m80740k80253P3458M1475L68490K99010M6819J16534J70507
11581A011953j16864r4100k76743j37963j97118m8206N9466l06795j52907M98069
$$ y = [-438527, -588770, -889766, -1281052, -1010459, -597316, -479238, -379097, -277194, -213530, -229401, 89101, 508736, 143897, -451154, -254331, 9957, -306594, -623953, -539215, -216494, -143485, -347937, -579483, -744080, -959653, -1021772, -839024, -595098, -518334, -664636, -879461, -832106, -577524, -200362, 265329, 887796, 1262817, 1348314, 1596695, 1748336, 1515242, 982015, 394993, 226785, 316639, -39603, -353746, -466475, -226943, 428814, 808638, 473495, 486654, 698483, 659699, 388921, 463368, 985258, 1021765, 835451, 656653, 175913, -104340, -30882, 10593, 379083, 678093, 724912, 841446, 1011953, 895089, 800989, 524246, 386283, 189165, 140959, 200425, -106370, -259277, 238792]
11571B38792J44936n11894k82870O3478J38439Q351m5921O2027k8897K3122k84775
11560d75212o8280J56982j68235R0596K02527K25583L39237N03696L37475j08231
11550A036138l97547j88629J40890k77189m67015j46837l08588j3912J77089p4561
11540e20161L41715P34746O0919m499J18631j75157J39162K16680L30206j2061
11530A230181j99707J04056K24238K2323n0995J17918j17121n3361q3966k80607
11520I12959J56330J90308j77601j32371L76065K80443l71865k56565L97006O88834
11510B063543N16917M71436L54088L57079M46397J10057J60114L96231J479342
11501F355204K321145K299941K238345K946267M239767N670187O582900P117279
$$ y = [238792, 383728, -128166, -411036, -347558, -209119, -200768, -246689, -184662, -213559, -190437, -475212, -543492, -386510, -554745, -464149, -261622, -36039, 303198, 806894, 1144369, 1036138, 638591, 449962, 590852, 313663, -153352, -300189, -608777, -622689, -445600, -520161, -178446, 556300, 617219, 612720, 731351, 556194, 695356, 912036, 1242242, 1230181, 1030474, 1134530, 1358768, 1381091, 1330096, 1448014, 1330893, 1277532, 1193566, 912959, 1069289, 1259597, 1081996, 949625, 1325690, 1606133, 1234268, 977703, 1374709, 2063543, 2580460, 3051896, 3405984, 3763063, 4209460, 4319517, 4479631, 4875862, 6355204, 8676349, 10976290, 13214635, 16160902, 20400669, 26070856, 32653756, 39771035]
11493C9771035P997351J0521453J4824383K0641846K5935607K3028008N479797
11486A48199480j6753338k6789655k4436135j8316117j3423424r793030p378974
11479C1308807n930731m502215l376699k506670j864829j517991j470795j515096
11471H623781r50190n10456m93433l16393m31776n28878p40318r34404o71128
11462C046805l63118k54296p51115l94849J98659K2395k96779l39320K02932p2653
11452I98661j17284m274k61463k77890j20786p5602j90913R8529o6986j27183
11442a45191N9843L40929J82037r7166k77949j98204l5613J98875R0615r6053
11432B2123K01146K55051j38272K14334O71154M84559r842J77127j3130m39027
$$ y = [39771035, 47768386, 58289839, 73114222, 93756068, 119691675, 142719683, 148199480, 131446142, 104656487, 80220352, 61904235, 48480811, 38687781, 31308807, 25378076, 20875861, 17499162, 14992492, 13127663, 11609672, 10138877, 8623781, 7673591, 7163135, 6669702, 6353309, 5921533, 5392655, 4652337, 3717933, 3046805, 2683687, 2429391, 1678276, 1283427, 1482086, 1504481, 1207702, 868382, 1071314, 998661, 881377, 877103, 615640, 337750, 216964, 141362, -49551, 48978, -18008, -145191, -85348, 255581, 437618, 340452, 62503, -135701, -171314, 27561, 118176, 22123, 223269, 478320, 340048, 554382, 1225536, 1710095, 1700253, 1877380, 1864250, 1425223]
11422A425223k23351L25142K57936j71408j57550m21506p3135P3008j69803k38882
11412F25674n67669N991j04800k18092M4929J3386Q39793M05076k89530o23726
11402A31032k81720o2457l440J54535K50655O71941J76544k10318l76252m19647
11392C0873l02351J71271N73011M27627k08400o31669o91566k15198J25459J27572
11382e93371K29095J7214l0211P3742J52358K73919J94830J17828j35673m52306
11372a52575k82688J65989L12202M04319J40600k71289j02289J6216j94618k23683
11362a87816R6430O4319j81751k62029J52839L58219J88926Q167J79314L80198
11352G96816J31326j28785j49685j6757k41968j75825J15025k5590k80027j090
$$ y = [1425223, 1201872, 1527014, 1784950, 1613542, 1455992, 1034486, 961351, 1034359, 864556, 625674, 58005, 63996, -40804, -258896, -213967, -200581, 639212, 1044288, 754758, 131032, -150688, -213145, -216585, -62050, 188605, 860546, 1037090, 826772, 450520, 30873, -271478, -100207, 472804, 900431, 692031, 60362, -631204, -846402, -720943, -593371, -364276, -347062, -377273, -303531, -151173, 122746, 317576, 435404, 299731, -152575, -435263, -269274, 42928, 447247, 587847, 316558, 214269, 230485, 35867, -187816, -91386, -27067, -208818, -470847, -318008, 40211, 229137, 237304, 416618, 796816, 928142, 799357, 649672, 632915, 390947, 215122, 330147, 304557, 24530, 23440]
11342B3440O16264L34617j913j11391o06254k72301K67518R5486k49003M7682
11332A44145L84663K48560Q3796k00715k08745M4710k8232l59970n12949p3715
11322d78452P3402j22065J79586j11613k43514l12650J55186L83825M31581K0751
11312b3963j19388K13893K09648J27487o724k63800j64141K77086J09010j91932
11302A67176k56762J55952N60117K38769K88987M02670J28168n05031n29076M0869
11292F91839j06744l02667m9028k606m6913j89943P7840M45224P0112K43987m6757
11281G84344l91716j94666r5579m5904K1181M60942K17893l03896P5662P85170
11271A313431Q05253L44789J17527r4933l63282l63850l47244j12485k46959l31745
$$ y = [23440, 639704, 974321, 972408, 861017, 254763, -17538, 249980, 345466, 96463, 144145, 528808, 777368, 861164, 660449, 451704, 496414, 468182, 108212, -404737, -478452, -405050, -527115, -347529, -459142, -702656, -1015306, -860120, -476295, -44714, -23963, -143351, 70542, 280190, 407677, 400953, 137153, -26988, 250098, 359108, 167176, -89586, 66366, 626483, 865252, 1154239, 1556909, 1685077, 1180046, 650970, 691839, 585095, 282428, 233400, 230794, 183881, -6062, 71778, 517002, 587114, 831101, 784344, 392628, 197962, 102383, 56479, 77660, 538602, 756495, 452599, 528261, 1313431, 2118684, 2463473, 2581000, 2486067, 2122785, 1758935, 1411691, 1299206, 1052247, 720502]
11261G20502j96217J8055J22351l20261j45153p2177m32317m11903j20086k92044
11251a129250n2215o4664J8658k9101J92844L74467R4049j15858K12116K64334
11241b34620J63418k00897j63989k15890j0667N45106J91076k47108l2066n2770
11231b58407K642L96023L60716J44502j44180l27683j13068M42136O60731J34510
11221A297922m09166k53491l08497m4287J26481k36956o0996o0379q4764p0509
11211a04642J74014J83553J51211J8534k05968J36384L78241K04448r0414J45417
11201I90778K92983j04334R4127R0374j51090O5069J92338m4597k98952j6530
11191A110166j07488j17741J06491M7189o5012j27771m717j83761L9036J0856
$$ y = [720502, 524285, 542340, 664691, 344430, 199277, 127100, -305217, -717120, -837206, -1129250, -1181465, -1246129, -1227471, -1256572, -1063728, -689261, -595212, -711070, -498954, -234620, -71202, -272099, -436088, -651978, -662645, -117539, 73537, -173571, -205637, -258407, -255765, 140258, 500974, 645476, 501296, 173613, 60545, 502681, 1163412, 1297922, 888756, 635265, 326768, 282481, 408962, 172006, 111010, 50631, -34133, -104642, 69372, 252925, 404136, 422670, 216702, 353086, 731327, 935775, 845361, 990778, 1283761, 1179427, 1273554, 1363928, 1212838, 1277907, 1470245, 1425648, 1126696, 1110166, 1002678, 884937, 991428, 1038617, 973605, 845834, 841117, 657356, 696392, 707248]
11181G07248j32095l36327K1162J31162l73267n27773l34277K83087N28083O05557
11171E72560R9541l22759P9957J98458j06346q1592L2696j10477j81529j14454
11161F6055m3215l50501m62774j86569j36616K80244M77216N95090M84289L4157
11151G57376j20293j21390j52337j30865j93391j12991P9365L24031L15665K13191
11141H58361j5354m61157k84206k79996k24267O2544R3177L1288Q5933M09832
11131B76155k99256l54549J71122K30359M25627J71912j30228K96883j33315j31100
11121E23610N5496P1409L51746L08678l3154k04751j94128k7413j28704j55659
11111E67130Q6737J04993N4181j30608p99433n79545L7593n5206m6373k5132q5145
$$ y = [707248, 575153, 238826, 259988, 391150, 17883, -509890, -844167, -561080, -32997, 572560, 672101, 349342, 429299, 627757, 521411, 439819, 472515, 362038, 180509, 66055, 22840, -327661, -790435, -977004, -1113620, -833376, -356160, 238930, 723219, 757376, 637083, 515693, 363356, 232491, 39100, -73891, 5474, 329505, 645170, 858361, 843007, 381850, 97644, -182352, -406619, -344075, -250898, -219610, -133677, 276155, -23101, -377650, -206528, 23831, 449458, 621370, 491142, 788025, 654710, 523610, 579106, 650515, 1002261, 1310939, 1277785, 1073034, 878906, 851493, 722789, 567130, 653867, 758860, 813041, 682433, -117000, -696545, -658952, -714158, -760531, -785663, -870808]
11100h70808R9110r4446j14936J0964K83892L06916L73633j7139k78521L8812
11090b62523L73241K89133k23654r9233L35201L87188j50670n85641n37943l85520
11080h60421J98321N97894M81884m5294k82187k22465L7293r928j09450j80728
11070c95081j13817Q9043J25907j85451j3845j75515l66684j7088j16153L50721
11060h17963O40411K54235l26614l43035N6790K10106J12764K24260K90261k00023
11050A01192l84418j07938N9983k3684N750K79040P0745k46418j97026k36332
11040f79106n9410J1869P2619M87852L70084J39206J27250J67423O79k6148N7184
11029F69502K1764k29879m10455j35277K67526J5959k6980N8271Q1645R7919j98059
$$ y = [-870808, -771698, -866144, -981080, -970116, -686224, -379308, -5675, -22814, -301335, -262523, 110718, 399851, 176197, 76964, 412165, 799353, 648683, 63042, -474901, -860421, -662100, -64206, 417678, 372384, 90197, -132268, -94975, -104903, -214353, -395081, -508898, -419855, -293948, -479399, -493244, -668759, -1035443, -1052531, -1168684, -817963, -177552, 76683, -249931, -592966, -536176, -326070, -213306, 10954, 301215, 101192, -283226, -391164, -331181, -354865, -349115, -70075, 670, -245748, -442774, -679106, -738516, -726647, -654028, -166176, 203908, 343114, 470364, 637787, 638466, 612318, 669502, 691266, 461387, 50932, -84345, 183181, 199140, 172160, 230431, 312076, 409995, 211936]
11018B11936j23695J39694K01335P70j33968l50101l79896J00089j35391P1861
11008c97366K11914k00301m26347j87251Q7459J26192J91396L58076L37865j58276
10998e6639j30701L10055J56826j07447k97056k93391k09752j2777M2891Q8978
10988e09013q591j17523p9452J36272M73209M6660m56821k68896K20118L18323
10978b45714P1498o3435j70570J99338K69905K84968N4916l8652k51276l3475
10968G7503K29658k37420o67996o60104L1027L66455l27798L94359N20243j60340
10958d34413K23531K97757J28355j93241j81164k8621J6261K5570J01466J69170
10948A24671k96852n55802K30986M26917K25548o7246j16886K4578p4644K0567
$$ y = [211936, 88241, 227935, 429270, 430040, 296072, -54029, -433925, -333836, -469227, -397366, -185452, -385753, -812100, -999351, -911892, -785700, -594304, -236228, 101637, -56639, -187340, 122715, 279541, 172094, -124962, -418353, -628105, -640882, -597991, -509013, -517604, -635127, -714579, -578307, -105098, -58438, -515259, -784155, -564037, -245714, -174216, -237651, -408221, -208883, 61022, 345990, 400906, 362254, 110978, 77503, 307161, 69741, -598255, -1258359, -1227332, -860877, -1188675, -794316, -274073, -434413, -210882, 86875, 215230, 21989, -159175, -187796, -171535, -145965, -44499, 124671, -172181, -727983, -496997, -70080, 155468, 88222, -28664, -4086, -78730, -58163]
10938e8163j07779Q3198K01220J34837j73164o55042M454O03922K13535L9198
10928B86216q7360K9253J59706R9740k39999l93911l16006j63658j6008P6998
10918e65029K07876N00339M54851J60638k57429n73356m80227k5336R2743J22253
10908c62677K96722k46840l05113M3264n6985l64380l09617K55335N11323K82062
10898b56906R1912k32117r0028L75788M05359n4931n13737m07744J22753K56274
10888c03377J13979q3437M1149J4263J6168M29693j53379m95730k33310j33753
10878g87734L93658P00632P69464o9757n58843k59677j92699k87046k0281M16911
10868A04628m3632n99166m37338p3994K46380M01106K71342J38733j62896p445
$$ y = [-58163, -165942, -82744, 118476, 253313, 80149, -574893, -570439, 33483, 247018, 286216, 198856, 228109, 387815, 487555, 247556, -146355, -462361, -626019, -642027, -565029, -357153, 143186, 598037, 758675, 501246, -72110, -552337, -577673, -484930, -362677, -65955, -312795, -617908, -574644, -631629, -996009, -1305626, -1050291, -538968, -256906, -164994, -397111, -487139, -111351, 294008, 239077, -274660, -682404, -559651, -303377, -189398, -272835, -231686, -217423, -201255, 228438, 75059, -420671, -653981, -787734, -394076, 306556, 1076020, 1006263, 447420, 187743, -4956, -292002, -312283, 104628, 60996, -538170, -975508, -1049502, -803122, -402016, -130674, 8059, -154837, -162282]
10858a62282M74124K09499j19405k75704q3232J07592L6217J41399K30225q2916
10848D75517m12226l37159j45516n7280k37720j82538j4911M5453M25081L83383
10838e7916j34351O2309J31418j70363m83383l08251L9756j78688o8825K22190
10828i46104K77955N47146P33289K95728l47493n63775P4157J54456J00179N833
10818C31371j5900K83789J97296j86644l94572o79769k65135J20897J98341j14530
10808e24856m81847n04461k46869K37620N71839M14670J73920L39894K82523j75335
10798H7098l35160l68789j58559K60465M6951l83975m75507j0537K08550N08833
10788f20630J78272j90859m3702j38722k83722k23336k46897J66782N09519R7504
$$ y = [-162282, 311842, 521341, 401936, 126232, 43000, 150592, 186809, 328208, 558433, 475517, 63291, -273868, -419384, -476664, -714384, -896922, -911833, -866380, -441299, -57916, -192267, -129958, 1460, -168903, -652286, -960537, -920781, -1099469, -1168294, -946104, -668149, -121003, 612286, 908014, 560521, -3254, 70903, 225359, 325538, 331371, 315471, 599260, 796556, 609912, 215340, -464429, -729564, -608667, -410326, -524856, -1006703, -1511164, -1758033, -1520413, -948574, -533904, -359984, -20090, 262433, 87098, -248062, -616851, -775410, -514945, -467994, -851969, -1327476, -1338013, -1129463, -620630, -442358, -633217, -676919, -815641, -1099363, -1322699, -1569596, -1402814, -893295, -795791]
10778g95791M12582K25079j20961j47531L9987K19333Q303R2000M95942J26036
10768E54979j94187k13237k73624k85861r0609J8651l96570r3469P0275J47758
10758g55894K17823J65870P1111K11689O51867N44499k85184n70393j26120P1707
10748A96975K64778J27585J17944k8365m08504p732K1129q4896J9337l52752l68855
10737e03356k32796Q2180L87507J88444j59322j74759r9491m8487K18377L86283
10727D4580J75768l2916J17687k47423l38670k31151p7528j46854P1581k8606
10717f93532j6826k08127P6864K76341j86940l48827j31047j5459K12315K84783
10707g50455J58497J49429J8601J22350J82643J57448n627k63153j48420n7530
$$ y = [-795791, -383209, -158130, -279091, -426622, -386635, -167302, -158999, -66999, 428943, 554979, 360792, 147555, -126069, -411930, -502539, -483888, -880458, -973927, -903652, -755894, -538071, -372201, -301090, -89401, 562466, 1106965, 821781, 251388, 125268, 196975, 461753, 589338, 707282, 678917, 270413, 262681, 283810, 198914, 218251, -134501, -503356, -736152, -653972, -266465, -78021, -237343, -412102, -511593, -560080, -341703, 44580, 220348, 187432, 305119, 57696, -280974, -512125, -589653, -736507, -664926, -693532, -710358, -918485, -841621, -565280, -752220, -1101047, -1232094, -1247553, -1035238, -750455, -591958, -442529, -423928, -301578, -118935, 38513, 32886, -230267, -378687, -436217]
10697d36217k243J20121l96316k53528J22138M08374J75440K23926p820k68559
10687c14684J70657J54317K39617J67544n6603l50065l09467J57564K71282J76084
10677C06246M8148j22826r4451m7314j64543r7742j40272J227j1365p0152r7098
10666d90142M4524L16896K96326L4519k70678j41445j7176K46999P4359K95051
10656C89233M77009K15209O9003k90390n30797j11933l2999m05375j68148k02286
10646e91474j78033J07872L56042j29105j34977J11131j4255k73817K53859Q44093
10636C51336K14793k90855l51722o6521k24324n34812l04103K21469K40382Q3849
10626f60508N3255j51535m838J22126K64155L58777K22974j24674j69810j68590
$$ y = [-436217, -438460, -318339, -714655, -968183, -846045, -437671, -262231, -38305, -46125, -314684, -144027, 10290, 249907, 417451, 360848, 10783, -298684, -141120, 130162, 306246, 354394, 231568, 137117, 89803, -74740, -172482, -312754, -311527, -322892, -393044, -490142, -445618, -128722, 167604, 202123, -68555, -210000, -227176, 19823, 94182, 389233, 866242, 1081451, 1150454, 860064, 329267, 217334, 184335, -221040, -389188, -591474, -769507, -661635, -305593, -434698, -569675, -458544, -472799, -746616, -492757, 351336, 566129, 275274, -76448, -142969, -367293, -902105, -1206208, -984739, -744357, -660508, -607253, -758788, -763626, -641500, -377345, -18568, 204406, 79732, -90078, -258668]
10616b58668k86847k36814J69394N33494J03859o55098k23382J47441J93425N23594
10606A0398K10690j57536k69805j14182J92185l85l40130k24401l49506j27995
10596a170667K19465M21392L47150j9825l02198n030M18578J58792j82588m06265
10586e21196k26845j00816L38541M03161L8104k07500j36003J07832K19743M48822
10576C63843N90552M9976j44498L11214q3270q15106j179765m98492l6049N19924
10566i21671l2564l52765M97438O76129P8437n71118k2867K87041j01514l23411
10556g86865J63617L78716K8690j68733l72813q0595j848o6534J12170j159l27047
10545a122401q10757m81699L46980K30062J18195N65982K22389j5145J11782L44945
$$ y = [-258668, -545515, -782329, -612935, -79441, 24418, -630680, -854062, -706621, -513196, 10398, 221088, 63552, -206253, -320435, -128250, -128635, -468765, -693166, -1042672, -1170667, -951202, -529810, -182660, -202485, -504683, -509713, -91135, 67657, -114931, -521196, -748041, -848857, -510316, -107155, -69051, -276551, -412554, -304722, -84979, 363843, 954395, 1004371, 859873, 1171087, 1087817, 272711, -907054, -1405546, -1441595, -921671, -954235, -1307000, -809562, -133433, -54996, -626114, -648981, -361940, -463454, -786865, -623248, -244532, -215842, -384575, -757388, -837983, -839831, -906365, -794195, -795354, -1122401, -1933158, -2414857, -2067877, -1837815, -1719620, -1153638, -931249, -946394, -834612, -489667]
10535d89667N05399K34623m61783m40373L513J85952o6574l31502l61574m19066
10525a641052J89649N65928N55261J84709j20913J2252Q1744j00057m8459p1298
10515c92236Q6080J29221N4813L53229K28255j47625r3452O6961j50373j64892
10505c0019Q6058J90239m0890l11877j48132j4433k17733Q4763K44438r4867k22737
10494d75190l32073o8914M59832P55044N57573k97153k20020j15347l0375k2280
10484B11097Q5385N0497j89924j64495k33110j64598j3956L72250Q4272j52291
10474a14873j22020J21430L1131J49958k8436j70208p7574k1645M3985K55153
10464F6901L01598K0569l21554k07003j68137k87309o8201J05562J42342j81076
$$ y = [-489667, 15732, 250355, -211428, -651801, -648288, -462336, -528910, -860412, -1221986, -1641052, -1451403, -885475, -330214, -145505, -266418, -254166, -172422, -272479, -320938, -392236, -306156, -176935, -122122, 231107, 459362, 311737, 218285, 285246, 134873, -30019, 56039, 246278, 205388, -106489, -254621, -269054, -486787, -402024, -157586, -252453, -475190, -807263, -876177, -416345, 338699, 896272, 599119, 379099, 263752, 233377, 211097, 296482, 346979, 157055, -7440, -240550, -405148, -419104, -46854, 37418, -114873, -236893, -115463, -84332, 65626, 37190, -133018, -210592, -232237, -188252, 66901, 368499, 389068, 67514, -139489, -307626, -594935, -663136, -557574, -415232, -596308]
10454e96308J81694O3516m7412j3197j14603l7894j31524j91408J70591J52904
10444e63641j77091K27098M01250L31775K6236j7451P8433k16893j18055p5967
10434a04306r4731j56777J51052L0502m31217p785L39737M75283r2675m49810
10424c40727l04581M6297j41149k76161j11856K05047J59470K97499O90466K65925
10414D90230j67619j82510j87155J48749J85401l7605m16650Q4139J91173k81337
10404a73184l21397j96912p8387j07984r7645r8419j7679j73256k70111j15472
10394a650446L27905N78605N85264l00627k57414K22905L46493N69161J4254n40056
10384a03956k41609j76054m9560q5347K45483O58385K46959l94879m54536l18735
$$ y = [-596308, -414614, -351098, -398510, -411707, -526310, -564204, -695728, -887136, -716545, -563641, -740732, -513634, -112384, 219391, 245627, 228176, 306609, 89716, -28339, -104306, -199037, -355814, -204762, -174260, -605477, -613262, -273525, 201758, 109083, -340727, -645308, -599011, -740160, -1016321, -1128177, -923130, -763660, -466161, 224305, 490230, 322611, 140101, -47054, 101695, 287096, 249491, -167159, -83020, 108153, -173184, -494581, -691493, -769880, -877864, -975509, -1073928, -1091607, -1264863, -1534974, -1650446, -1322541, -743936, -158672, -459299, -716713, -493808, -147315, 421846, 436100, -103956, -345565, -521619, -571179, -656526, -411043, 247342, 494301, 99422, -355114, -673849]
10374f73849j88388j94609K675L68244N28289N26095P0437l13748k26992j97127
10364b98973Q4412K10686j82436j90793J05118j88978l05691l78914M369L44946
10354g96254J58883P7101N6798j13209j80886L84151K64088j44390J5705Q8724
10344a89289k87593M7903N08411L05114j63390k05471q2546j86291L8559J82202
10334c2391r5358k86736J7968j81436l70687J26988M22334M5251j42943k8211
10324e25221J6946J65468K71575N05788J63936M5941L15816L5609m62359n06931
10314B6568k36808J99545L17141p7897l41690p4688j69878j72432J14782O3795
10304c51562R3472L91773J04511j24436K5847L5036J41007K51865k92339j52290
$$ y = [-673849, -862237, -1056846, -1054171, -685927, -157638, 368457, 438894, 125146, -101846, -298973, -214561, -3875, -186311, -377104, -271986, -460964, -766655, -1145569, -1141200, -796254, -637371, -560270, -503472, -616681, -797567, -413416, -149328, -293718, -278013, -189289, -476882, -428979, 79432, 384546, 221156, 15685, -66861, -253152, -214593, -32391, -127749, -414485, -396517, -577953, -948640, -821652, -399318, -354067, -497010, -525221, -508275, -342807, -71232, 434556, 598492, 644433, 960249, 995858, 533499, 26568, -210240, -10695, 306446, 228549, -113141, -187829, -357707, -530139, -415357, -351562, -258090, 133683, 238194, 113758, 139605, 174641, 315648, 567513, 275174, 122884]
10294A22884K08804R9329l5630j87213k20819k40008l48209l85295k16895k11526
10284a414578J33073P42643P2770n92001n4204K21405K18556M93366J70199j55159
10274a63930J10932Q4314K40146N88076L70104m7301n47097p82186o4117R2876
10264a18183L57820K88780J44743k12972m86508J2359p3777k05416n6416J8447
10254c31123M67071J69146P7891j9574k42199J18407L01403j56471m71351l03863
10244c90663l89067L7570K48769k36179l10263O6692P9901R3594K23876O22567
10234D6797K27952m73597o50141j75068K62779L26921J39004J54455j84182j30457
10224d55537r6501K8583J53130K25235K13729P0878k46090l20407K56469k9976
$$ y = [122884, 331688, 431017, 395387, 208174, -12645, -252653, -600862, -986157, -1203052, -1414578, -1281505, -538862, -466092, -1058093, -1112297, -890892, -672336, -178970, -8771, -163930, -52998, 31316, 271462, 859538, 1229642, 1182341, 635244, -146942, -211059, -118183, 239637, 528417, 673160, 460188, -26320, -13961, -87738, -293154, -349570, -331123, 135948, 305094, 382985, 363411, 121212, 239619, 541022, 384551, -86800, -390663, -779730, -742160, -493391, -729570, -1039833, -973141, -893240, -799646, -575770, 46797, 274749, -198848, -848989, -1024057, -761278, -434357, -295353, -140898, -325080, -455537, -552038, -523455, -370325, -145090, 68639, 139517, -106573, -426980, -170511, -200487]
10214b00487k40579P2350K37222J94792N8800R3853l07070n72925k55718K37836
10204f81926P54984L22578Q5394R0076k33397m81661k73390j38725j49003j68652
10194h73722K1301J71178L77108K32640K56096j90802q414K95342l01782k50979
10184b72034J36161m7020j24559N7940L63243L03087L15168L0398j63015N6812
10174F56181M2257k37310k68611j68706K6286n5282J18245L34523J71826k91018
10164C28391l90837o3190o5100N558L900j8855j7400k66275k91534l8223N5492
10153g58073J51346J76055J95965q3771k67556J39689K22057o7654P4920M29742
10143B12720J73619l7472m02326o51096k20788j81529J27615J38826K9010k31091
$$ y = [-200487, -441066, -368716, -131494, 63298, 122098, 215951, -91119, -664044, -919762, -681926, 73058, 395636, 481030, 571106, 337709, -143952, -417342, -556067, -705070, -873722, -852421, -681243, -304135, -71495, 184601, -6201, -14615, 280727, -21055, -272034, -135873, -182893, -307452, -249512, 113731, 416818, 731986, 762384, 599369, 656181, 698438, 461128, 192517, 23811, 50097, -5185, 113060, 447583, 619409, 328391, -62446, -125636, -190736, -185178, -181278, -200133, -217533, -483808, -775342, -813565, -758073, -606727, -430672, -234707, -318478, -586034, -446345, -224288, -291942, -217022, 212720, 386339, 348867, -53459, -704555, -925343, -1106872, -979257, -840431, -811421, -1042512]
10133a042512m24575l14448J64266K98762K06538L13623K8283J52774K40419n03269
10123h80139p30930q30347l28958K53971M42050M30476J43832L97327J47740k32480
10113a187458J27450N01067J66675J1567K02354K73062j47700l0085k35048k79784
10103e97900J49152K90796k24191J4623O75331K67352j13419K0336L604j63702
10093C21982j15945m291J57031K25218L67002L46723L00717j50180q08804q61066
10083b21613k36000j72981J46159L24630L4118j58192j10818J66676P6474O0168
10073i1379J70598J45702l12227o13114k20913K0068K38142M90809J22635K55862
10063B06183N49668k25829k29028m2193J48632K79132J37660J63906j65424k0827
$$ y = [-1042512, -1467087, -1781535, -1617269, -1318507, -1111969, -798346, -770063, -617289, -376870, -880139, -1611069, -2441416, -2770374, -2516403, -2074353, -1643877, -1500045, -1102718, -954978, -1187458, -1060008, -558941, -392266, -380699, -178345, 94717, -52983, -83068, -318116, -597900, -448748, -157952, -382143, -367520, 307811, 575163, 461744, 482080, 485684, 321982, 206037, 201746, 358777, 583995, 950997, 1297720, 1598437, 1448257, 639453, -221613, -457613, -630594, -484435, -159805, -125687, -283879, -394697, -228021, -151547, -91379, 79219, 224921, -87306, -700420, -921333, -901265, -663123, -172314, -49679, 206183, 755851, 530022, 300994, 258801, 407433, 686565, 824225, 988131, 822707, 801880]
10053H01880o8622l68241r3673r9545n00533l75544J47148M35355N02441j54672
$$ y = [801880, 733258, 365017, 271344, 171799, -328734, -704278, -557130, -121775, 380666, 225994]
$$ [...]
##END NTUPLES=NMR SPECTRUM
##END=
