##TITLE=C13_SR47_K_vak
 CDCl3, 20800 sc

 26.10.2021
##JCAMPDX= 6.0         $$ Bruker NMR JCAMP-DX V2.0
##DATA TYPE= NMR SPECTRUM
##DATA CLASS= NTUPLES
##ORIGIN= UXNMR, Bruker Analytische Messtechnik GmbH
##OWNER= root
$$ XWIN-NMR		Version 3.5
$$ Thu Oct 28 09:54:32 2021 Russian Standard Time (UT+4h)  she@DPX200
##.OBSERVE FREQUENCY= 50.327896
##.OBSERVE NUCLEUS= ^13C
##.ACQUISITION MODE= SIMULTANEOUS
##.ACQUISITION SCHEME= undefined
##.AVERAGES= 20803
##.DIGITISER RES= 17
##SPECTROMETER/DATA SYSTEM= spect
##.PULSE SEQUENCE= zgpg30
##.SOLVENT NAME= D2O
##.SHIFT REFERENCE= (INTERNAL, D2O, 0, 222.653)
##AUDIT TRAIL= $$ (NUMBER, WHEN, WHO, WHERE, WHAT)
$$ ##TITLE= Audit trail, XWIN-NMR		Version 3.5
$$ ##JCAMPDX= 5.01
$$ ##ORIGIN= Bruker BioSpin GmbH
$$ ##OWNER= she
$$ F:/spectra/data/she/nmr/c13/1/pdata/1/auditp.txt
$$ ##AUDIT TRAIL=  $$ (NUMBER, WHEN, WHO, WHERE, WHAT)
(   1,<2021-10-28 09:53:01.84 +0400>,<she>,<DPX200>,
      <created by zg, POWCHK disabled, PULCHK disabled
       terminated by command 'halt'
       configuration hash MD5:
       00 E9 B6 7A A2 85 ED C7 34 08 36 98 17 FE 4E 26
       data hash MD5: 32K
       3C BF 5D B4 68 E5 B3 77 8B 86 61 FD 45 96 8D 4F>)
(   2,<2021-10-28 09:53:05.51 +0400>,<she>,<DPX200>,
      <Start of raw data processing
       efp BC_mod = 2 LB = 1 FT_mod = 6 PKNL = 1 PHC0 = -333.198 PHC1 = 38.16238 SI = 32K 
       data hash MD5: 32K
       D2 5C 5F F0 44 6A 7F 02 E7 C5 89 E8 C3 28 2F 72>)
(   3,<2021-10-28 09:53:08.18 +0400>,<she>,<DPX200>,
      <abs ABSG = 5 
       data hash MD5: 32K
       8B 4D A4 1C 7A 23 9B 42 73 A4 EB 65 88 E3 96 66>)
(   4,<2021-10-28 09:53:42.96 +0400>,<she>,<DPX200>,
      <pk PHC0 = 9.526182 PHC1 = -14.2 
       data hash MD5: 32K
       1C 79 82 8A 10 C9 14 83 23 1C 31 7D 72 EC 74 C6>)
(   5,<2021-10-28 09:53:54.15 +0400>,<she>,<DPX200>,
      <abs ABSG = 5 
       data hash MD5: 32K
       16 10 37 9A AD FF AB D5 38 C7 0E 2B 86 B3 C5 E8>)
(   6,<2021-10-28 09:53:59.07 +0400>,<she>,<DPX200>,
      <abs ABSG = 5 
       data hash MD5: 32K
       A1 16 42 3F 9D AB 73 F2 5B D5 6C 54 70 35 93 F5>)
$$ ##END=
$$ 
$$ hash MD5
$$ A8 49 07 6A 71 0C 5A 53 83 A1 5E 46 FB 57 FD 5D
##$RELAX= 
##$RELAX= 
##$RELAX= 
##$RELAX= 
##$RELAX= 
##$RELAX= 
##$RELAX= 
##$RELAX= 
$$ Bruker specific parameters
$$ --------------------------
##$DU= <F:/spectra>
##$EXPNO= 1
##$NAME= <c13>
##$PROCNO= 1
##$TYPE= <nmr>
##$USER= <she>
##$AMP= (0..31)
100 100 100 100 100 100 100 100 100 100 100 100 100 100 100 100 100 100 
100 100 100 100 100 100 100 100 100 100 100 100 100 100 
##$AQSEQ= 0
##$AQ_mod= 1
##$AUNM= <au_zg>
##$AUTOPOS= <>
##$BF1= 50.322709
##$BF2= 200.13
##$BF3= 50.322709
##$BF4= 500.13
##$BF5= 500.13
##$BF6= 500.13
##$BF7= 500.13
##$BF8= 500.13
##$BYTORDA= 1
##$CFDGTYP= 0
##$CFRGTYP= 5
##$CHEMSTR= <none>
##$CNST= (0..31)
1 1 145 1 1 1 1 1 1 1 1 1 1 1 1 1 1 1 1 1 1 1 1 1 1 1 1 1 1 1 1 1 
##$CPDPRG= <waltz16>
##$CPDPRG1= <>
##$CPDPRG2= <waltz16>
##$CPDPRG3= <>
##$CPDPRG4= <mlev>
$$ [...]
##$SUBNAM4= <"">
##$SUBNAM5= <"">
##$SUBNAM6= <"">
##$SUBNAM7= <"">
##$SUBNAM8= <"">
##$SUBNAM9= <"">
##$SW= 239.972175391363
##$SWIBOX= (0..15)
0 1 3 0 0 0 0 0 0 0 0 0 0 0 0 0 
##$SW_h= 12077.2946859903
##$TD= 32768
##$TD0= 1
##$TE= 0
##$TE2= 300
##$TE3= 300
##$TEG= 300
##$TL= (0..7)
120 120 120 120 120 120 120 120 
##$TP= (0..7)
150 150 150 150 150 150 150 150 
##$TP07= 0
##$TPNAME0= <>
##$TPNAME1= <>
##$TPNAME2= <>
##$TPNAME3= <>
##$TPNAME4= <>
##$TPNAME5= <>
##$TPNAME6= <>
##$TPNAME7= <>
##$TPOAL= (0..7)
0.5 0.5 0.5 0.5 0.5 0.5 0.5 0.5 
##$TPOFFS= (0..7)
0 0 0 0 0 0 0 0 
##$TUNHIN= 0
##$TUNHOUT= 0
##$TUNXOUT= 0
##$USERA1= <user>
##$USERA2= <user>
##$USERA3= <user>
##$USERA4= <user>
##$USERA5= <user>
##$V9= 5
##$VALIST= <valist>
##$VCLIST= <CCCCCCCCCCCCCCC>
##$VD= 0
##$VDLIST= <DDDDDDDDDDDDDDD>
##$VPLIST= <PPPPPPPPPPPPPPP>
##$VTLIST= <TTTTTTTTTTTTTTT>
##$WBST= 1024
##$WBSW= 4
##$XGAIN= (0..3)
0 0 0 0 
##$XL= 0
##$YL= 0
##$YMAX_a= 131373534
##$YMIN_a= -32006499
##$ZGOPTNS= <>
##$ZL1= 120
##$ZL2= 120
##$ZL3= 120
##$ZL4= 120
##$ABSF1= 222.6533
##$ABSF2= -17.34351
##$ABSG= 5
##$ABSL= 3
##$ALPHA= 0
##$AQORDER= 0
##$ASSFAC= 0
##$ASSFACI= 0
##$ASSFACX= 0
##$ASSWID= 0
##$AUNMP= <proc_1d>
##$AZFE= 0.1
##$AZFW= 0.5
##$BCFW= 0
##$BC_mod= 2
##$BYTORDP= 0
##$COROFFS= 0
##$CY= -3
##$DATMOD= 1
##$DC= 0
##$DFILT= <>
##$DTYPP= 0
##$F1P= 0
##$F2P= 0
##$FCOR= 0.5
##$FTSIZE= 32768
##$FT_mod= 6
##$GAMMA= 0
##$GB= 0
##$INTBC= 1
##$INTSCL= 4.134877e-10
##$ISEN= 128
##$LB= 1
##$LEV0= 0
##$LPBIN= 0
##$MAXI= 10000
##$MC2= 0
##$MEAN= 0
##$ME_mod= 0
##$MI= 0.1934396
##$NCOEF= 0
##$NC_proc= 2
##$NLEV= 6
##$NOISF1= 120.0001
##$NOISF2= 80.00006
##$NSP= 0
##$NTH_PI= 0
##$NZP= 0
##$OFFSET= 222.6533
##$PC= 1.4
##$PHC0= -323.6718
##$PHC1= 23.96238
##$PH_mod= 1
##$PKNL= yes
##$PPARMOD= 0
##$PSCAL= 0
##$PSIGN= 0
##$REVERSE= no
##$SF= 50.3227301237032
##$SI= 32768
##$SIGF1= 140
##$SIGF2= 120
##$SINO= 11.81781
##$SIOLD= 32768
##$SREGLST= <13C.CDCl3>
##$SSB= 0
##$STSI= 32768
##$STSR= 0
##$SW_p= 12077.2946859903
##$SYMM= 0
##$S_DEV= 0
##$TDeff= 32768
##$TDoff= 0
##$TI= <>
##$TILT= no
##$TM1= 0
##$TM2= 0
##$TOPLEV= 0
##$USERP1= <user>
##$USERP2= <user>
##$USERP3= <user>
##$USERP4= <user>
##$USERP5= <user>
##$WDW= 1
##$XDIM= 32768
##$YMAX_p= 341341086
##$YMIN_p= -7261341
$$ End of Bruker specific parameters
$$ ---------------------------------
##NTUPLES= NMR SPECTRUM
##VAR_NAME=  FREQUENCY,     SPECTRUM/REAL,   SPECTRUM/IMAG
##SYMBOL=    X,             R,               I
##VAR_TYPE=  INDEPENDENT,   DEPENDENT,       DEPENDENT
##VAR_FORM=  AFFN,          ASDF,            ASDF
##VAR_DIM=   32768,         32768,           32768
##UNITS=     HZ,            ARBITRARY UNITS, ARBITRARY UNITS
##FACTOR=    0.368581032318806, 1,           1
##FIRST=     11204.5221813685, 0,            0
##LAST=      -872.772504621842, 0,           0
##MIN=       -872.772504621842, -7261341,    0
##MAX=       11204.5221813685, 341341086,    0
$$ Real data points
##PAGE= N=1
##DATA TABLE= (X++(R..R)), XYDATA
$$ [...]
$$ plain form
15726 -490375 -503037 -584390 -529276 -115358 110279 -134289 -433727 -281900 -145234 -136415
15716 -136415 -447717 -501800 -516116 -300603 -279302 -455136 -109095 212706 145114 70409
15706 70409 263156 467725 456522 373920 779347 1352545 1297600 1010337 518644 421873
15696 421873 580241 405277 132170 -236205 -441064 -371973 -438157 -776589 -918609 -928865
15686 -928865 -866925 -938553 -854947 -677649 -728143 -775004 -541978 -424069 -259886 -617407
15676 -617407 -1088740 -925088 -511539 -238757 -228483 290855 944889 819105 -127541 -532850
15666 -532850 -350522 -255324 169931 747465 702067 137336 -194244 -288766 -223719 -330563
15656 -330563 -89808 373890 526801 532133 569121 368067 85081 -311605 -593861 -544959
$$ packed form
15726d90375j2662q1353N5114M13918K25637k44568k99438J51827J36666Q819
15716a36415l11302n4083j4316K15513K1301j75834L46041L21801o7592p4705
15706G0409J92747K04569j1203q2602M05427N73198n4945k87263m91693r6771
15696D21873J58368j74964k73107l68375k04859O9091o6184l38432j42020j0256
15686i28865O1940p1628Q3606J77298n0494m6861K33026J17909J64183l57521
15676f17407m71333J63652M13549K72782J0274N19338O54034j25784r46646m05309
15666e32850J82328R5198M25255N77534m5398n64731l31580r4522O5047j06844
15656c30563K40755M63698J52911N332L6988k01054k82986l96686k82256M8902
$$ plain form
15646 -544959 -181281 324794 260731 36867 -198359 -205390 -35850 -317583 -413462 -382062
15636 -382062 -500842 -643598 -676047 -846466 -867388 -703032 -755583 -913301 -670230 -494758
15626 -494758 -412624 -614677 -678045 -226283 -464956 -790735 -738475 -682951 -974301 -1083995
15616 -1083995 -1001108 -708012 -626140 -695638 -811590 -643906 -93040 223283 243861 218660
15606 218660 440972 485719 46145 -456689 -1047483 -900321 -211311 68870 259797 45234
15596 45234 -392335 -427950 -265456 -81545 -61942 -107286 79517 192930 284479 442528
15586 442528 511169 563188 289558 -19189 -270172 -326475 -461387 -573075 -276836 -258570
15576 -258570 -515580 -390822 -363267 -300761 -71826 -200458 -350652 -198486 -95359 -57944
$$ packed form
15646e44959L63678N06075o4063k23864k35226p031J69540k81733r5879L1400
15636c82062j18780j42756l2449j70419k0922J64356n2551j57718K43071J75472
15626d94758Q2134k02053o3368M51762k38673l25779N2260N5524k91350j09694
15616a083995Q2887K93096Q1872o9498j15952J67684N50866L16323K0578k5201
15606B18660K22312M4747m39574n02834n90794J47162O89010K80181J90927k14563
15596D5234m37569l5615J62494J83911J9603m5344J86803J13413R1549J58049
15586D42528O8641N2019k73630l08747k50983n6303j34912j11688K96239J8266
15576b58570k57010J24758K7555O2506K28935j28632j50194J52166J03127L7415
$$ plain form
15566 -57944 174108 591732 695068 355812 236649 -76793 -403735 -428054 -492666 -557121
15556 -557121 -659193 -823779 -781757 -826677 -1082246 -1119205 -949289 -859544 -507936 -421835
15546 -421835 -726577 -617224 -298181 58120 66850 218607 472840 625038 278505 -47741
15536 -47741 -165730 -307424 -189353 -4038 123711 66901 -75452 164739 509804 413622
15526 413622 -104202 -535136 -663994 -723107 -478859 122395 315815 472531 277790 -25222
15516 -25222 -223504 -115616 181153 288802 455539 400845 3769 -301311 -409983 -563843
15506 -563843 -261976 -416985 -1140211 -1784683 -1443960 -808544 -700560 -341950 -243108 -326010
15496 -326010 -165681 42421 -137522 -512149 -606446 -177107 527553 847303 691235 295196
$$ packed form
15566e7944K32052M17624J03336l39256j19163l13442l26942k4319o4612o4455
15556e57121j02072j64586M2022m4920k55569l6959J69916Q9745L51608Q6101
15546d21835l04742J09353L19043L56301Q730J51757K54233J52198l46533l26246
15536d7741j17989j41694J18071J85315J27749n6810j42353K40191L45065r6182
15526D13622n17824m30934j28858n9113K44248O01254J93420J56716j94741l03012
15516b5222j98282J07888K96769J07649J66737n4694l97076l05080j08672j53860
15506e63843L01867j55009p23226o44472L40723O35416J07984L58610R8842q2902
15496c26010J60329K08102j79943l74627r4297M29339P04660L19750j56068l96039
$$ plain form
15486 295196 381745 496572 133812 -311444 -577092 -581348 -41779 163569 -181964 -359314
15476 -359314 -508480 -870191 -823084 -502830 -481571 -582003 -317829 82689 147979 176645
15466 176645 309910 223480 269727 163477 -201612 -364410 -284171 -751321 -1298797 -1462895
15456 -1462895 -1187284 -777701 -645042 -434148 -439628 -473428 -61111 489786 695550 725371
15446 725371 501175 195594 -35006 -165813 -227638 -554837 -927830 -571048 -235857 22343
15436 22343 333205 420882 646502 957278 904089 700364 188094 -71028 316310 698825
15426 698825 741837 697238 547701 290262 278573 63324 -166679 -148288 84840 287447
15416 287447 414899 611344 840060 863105 858615 980669 761513 480669 220258 -164668
$$ packed form
15486B95196Q6549J14827l62760m45256k65648m256N39569K05348l45533j77350
15476c59314j49166l61711M7107L20254K1259j00432K64174M00518O5290K8666
15466A76645J33265q6430M6247j06250l65089j62798Q0239m67150n47476j64098
15456a462895K75611M09583J32659K10894n480l3800M12317N50897K05764K9821
15446G25371k24196l05581k30600j30807o1825l27199l72993L56782L35191K58200
15436B2343L10862Q7677K25620L10776n3189k03725n12270k59122L87338L82515
15426F98825M3012m4599j49537k57439j1689k15249k30003J8391K33128K02607
15416B87447J27452J96445K28716K3045m490J22054k19156k80844k60411l84926
$$ plain form
15406 -164668 -70414 281197 718421 821481 467432 203165 305081 257786 413984 1042949
15396 1042949 1048380 728229 558224 395841 418940 498393 327242 4149 -215071 -355531
15386 -355531 -276903 -242567 -515400 -446883 -46232 -60452 -487186 -743355 -313506 -107957
15376 -107957 -505854 -858395 -811660 -573451 -95576 439586 515251 321861 17334 -53613
15366 -53613 -2253 -20915 214999 125493 16473 111416 183364 354744 394753 512163 227375
15355 227375 -276798 -414371 -18662 636198 942920 701799 267044 -29653 -236623 -346051
15345 -346051 -620529 -850119 -719555 -727387 -713064 -645520 -645183 -787783 -526440 -167355 -96366
15334 -96366 149285 -159160 -728979 -1203571 -1124658 -580679 -696570 -924661 -590930 -145002
$$ packed form
15406a64668R4254L51611M37224J03060l54049k64267J01916m7295J56198O28965
15396A042949N431l20151j70005j62383K3099P9453j71151l23093k19220j40460
15386c55531P8628L4336k72833O8517M00651j4220m26734k56169M29849K05549
15376a07957l97897l52541M6735K38209M77875N35162P5665j93390l04527p0947
15366e3613N1360j8662K35914q9506j09020R4943P1948J71380M0009J17410k84788
15355B27375n04173j37573L95709O54860L06722k41121m34755k96697k06970j09428
15345c46051k74478k29590J30564p832J4323O7544L37j42600K61343L59085P0989
15334i6366K45651l08445n69819m74592P8913N43979j15891k28091L33731M45928
$$ plain form
15324 -145002 159219 48045 -208429 -465142 -488695 -285011 65072 497599 749856 310305
15314 310305 71058 538090 746076 636543 471244 308545 51295 -38827 -75123 -135215
15304 -135215 -185772 -262260 -337884 -444042 -689032 -419581 96561 384659 1009261 1278963
15294 1278963 840839 522773 295830 -51551 -315060 -129775 261682 185488 -26654 -136432
15284 -136432 -459696 -922274 -894420 -630605 -405002 -503863 -1098133 -1627001 -1862482 -1517418
15274 -1517418 -1158453 -1055288 -968837 -968170 -846038 -570048 22268 419597 273889 381986
15264 381986 625204 550609 447155 74839 -116504 -319925 -849077 -722513 -359706 -463302
15254 -463302 -634034 -898059 -859066 -523628 -173240 -148463 -37475 359256 641654 997812
$$ packed form
15324a45002L04221j11174k56474k56713k3553K03684L50083M32527K52257m39551
15314C10305k39247M67032K07986j09533j65299j62699k57250r0122l6296o0092
15304a35215n0557p6488p5624j06158k44990K69451N16142K88098O24602K69702
15294A278963m38124l18066k26943l47381k63509J85285L91457p6194k12142j09778
15284a36432l23264m62578K7854K63815K25603r8861n94270n28868k35481L45064
15274a517418L58965J03165Q6451O67J22132K75990N92316L97329j45708J08097
15264C81986K43218p4595j03454l72316j91343k03421n29152J26564L62807j03596
15254d63302j70732k64025L8993L35438L50388K4777J10988L96731K82398L56158
$$ plain form
15244 997812 1078306 911167 827625 837239 846584 509773 390184 678606 734454 401166 -151473
15233 -151473 122712 664272 823115 1087453 1130492 703291 626299 706376 437698 198481
15223 198481 236308 368046 209005 -175931 -362705 -281403 9593 61441 -275027 -226428
15213 -226428 248744 516346 432136 136496 45346 -153137 -204611 586249 872084 544319
15203 544319 569206 362452 155477 178833 16446 -128067 -246435 -225497 92987 102789
15193 102789 -180561 -404080 -107650 322743 348340 218760 -266777 -449270 -285329 -30287
15183 -30287 206195 268134 250972 225553 -40592 -278937 -290342 -332402 -109122 142986 142946
15172 142946 -22504 -233996 -436638 -552938 -498458 -525295 -801056 -789196 -587256 -552391
$$ packed form
15244I97812Q0494j67139q3542R614R345l36811j19589K88422N5848l33288n52639
15233a51473K74185N41560J58843K64338M3039m27201p6992Q0077k68678k39217
15223A98481L7827J31738j59041l84936j86774Q1302K90996N1848l36468M8599
15213b26428M75172K67602q4210k95640r1150j98483n1474P90860K85835l27765
15203E44319K4887k06754k06975K3356j62387j44513j18368K0938L18484R802
15193A02789k83350k23519K96430M30393K5597j29580m85537j82493J63941K55042
15183c0287K36482O1939j7162k5419k66145k38345j1405m2060K23280K52108m0
15172A42946j65450k11492k02642j16300N4480k6837k75761J1860K01940L4865
$$ plain form
15162 -552391 -530383 -221957 129334 460557 996381 1199635 888817 778166 608188 351753
15152 351753 345943 305733 163807 399440 487512 588262 564561 426567 355725 68307 -420365
15141 -420365 -646933 -474015 -145023 555643 767899 524081 172572 191845 550949 737241
15131 737241 785805 598870 457284 151737 206340 264353 -12239 -309350 -620678 -989914
15121 -989914 -993551 -710136 -848153 -872387 -437207 121337 432504 208876 -173844 -103634
15111 -103634 -134417 -339251 -592183 -713677 -377788 -355061 -552448 -963867 -996423 -819636
15101 -819636 -813691 -485298 72634 537409 538755 151090 12614 370008 512566 619567
15091 619567 560809 416415 459618 622762 841344 455287 -239533 -673826 -720946 -809341
$$ packed form
15162e52391K2008L08426L51291L31223N35824K03254l10818j10651j69978k56435
15152C51753n810m0210j41926K35633Q8072J00750k3701j37994p0842k87418m88672
15141d20365k26568J72918L28992P00666K12256k43818l51509J9273L59104J86292
15131G37241M8564j86935j41586l05547N4603N8013k76592k97111l11328l69236
15121i89914l637K83415j38017k4234M35180N58544L11167k23628l82720P0210
15111a03634l0783k04834k52932j21494L35889K2727j97387m11419l2556J76787
15101h19636N945L28393N57932M64775J346l87665j38476L57394J42558J07001
15091F19567n8758j44394M3203J63144K18582l86057o94820m34293m7120q8395
$$ plain form
15081 -809341 -1192833 -1454300 -1077108 -511261 -33185 37045 -168194 -329997 -194338 -63871
15071 -63871 81719 404445 470132 442533 303880 208662 247410 570607 917038 1245269
15061 1245269 1399297 1430367 1381855 1142991 1188755 1317206 1458797 1513028 1457926 1559077
15051 1559077 1517558 1214682 641192 603422 735960 831284 550059 215787 585055 1162866
15041 1162866 884696 784539 1017100 1330732 1266571 721230 371568 264144 161807 -78140
15031 -78140 -429215 -556635 -686768 -726647 -915671 -1000516 -525877 -138903 129208 296754
15021 296754 395306 456588 666363 947554 1069707 829885 519812 404254 221860 241255
15011 241255 242212 143488 -21615 -236449 -159227 -123060 11424 381645 133275 160809 264667
$$ packed form
15081h09341l83492k61467L77192N65847M78076P0230k05239j61803J35659J30467
15071f3871J45590L22726O5687k7599j38653r5218L8748L23197L46431L28231
15061A245269J54028L1070m8512k38864M5764J28451J41591N4231n5102J01151
15051A559077m1519l02876n73490l7770J32538R5324k81225l34272L69268N77811
15041A162866k78170j00157K32561L13632o4161n45341l49662j07424j02337k39947
15031g8140l51075j27420j30133l9879j89024q4845M74639L86974K68111J67546
15021B96754R8552O1282K09775K81191J22153k39822l10073j15558j82394J9395
15011B41255R57r8724j65103k14834P7222L6167J34484L70221k48370K7534J03858
$$ plain form
15000 264667 150735 81241 142245 307776 578878 664650 685326 631910 419023 559592
14990 559592 921819 1042123 729955 501102 164684 -2677 118039 283203 455236 330338
14980 330338 180895 316348 909621 1506481 1434038 1417702 1268506 995383 671964 548408
14970 548408 783814 920467 1081016 1282010 1210741 1108733 957812 663268 96404 -291952
14960 -291952 -83135 -9322 73953 519524 838760 438304 109455 512284 648888 673228
14950 673228 484688 132796 -127464 51423 185478 -172434 -120531 233451 586721 723005
14940 723005 599351 512166 472405 318447 -340639 -676003 -833263 -697603 -292527 -133330
14930 -133330 -411122 -751825 -680225 -182392 58029 -38437 176212 279613 -144826 -306744
$$ packed form
15000B64667j13932o9494O1004J65531K71102Q5772K0676n3416k12887J40569
14990E59592L62227J20304l12168k28853l36418j67361J20716J65164J72033j24898
14980C30338j49443J35453N93273N96860p2443j6336j49196k73123l23419j23556
14970E48408K35406J36653J60549K00994p1269j02008j50921k94544n66864l88356
14960b91952K08817P3813Q3275M45571L19236m00456l28849M02829J36604K4340
14950F73228j88540l51892k60260J78887J34055l57912N1903L53982L53270J36284
14940G23005j23654q7185l9761j53958o59086l35364j57260J35660M05076J59197
14930a33330k77792l40703P1600M97833K40421r6466K14649J03401m24439j61918
$$ plain form
14920 -306744 -407694 -770890 -817900 -728609 -567556 -219269 286413 845071 943013 696188
14910 696188 747398 587706 450594 705104 808591 531962 645661 960682 1014728 988237
14900 988237 633084 70310 -436695 -711470 -568971 -724186 -934378 -634982 -340408 46136
14890 46136 300909 244481 -228796 -562897 -380572 175007 737325 638072 380926 463778
14880 463778 351972 184083 347139 428871 406688 416056 282067 375787 499748 266580
14870 266580 182570 163349 -45852 33719 587882 923886 1128254 967058 342687 23653
14860 23653 309006 569558 528052 543761 227295 -181142 -711473 -1175385 -839365 -281282
14850 -281282 102337 101012 -139025 -328822 -323749 255948 681894 753865 907811 542377
$$ packed form
14920c06744j00950l63196m7010Q9291J61053L48287N05682N58658R7942k46825
14910F96188N1210j59692j37112K54510J03487k76629J13699L15021N4046k6491
14900I88237l55153n62774n07005k74775J42499j55215k10192K99396K94574L86544
14890D6136K54773n6428m73277l34101J82325N55579N62318r9253k57146Q2852
14880D63778j11806j67889J63056Q1732k2183R368j33989R3720J23961k33168
14870B66580q4010j9221k09201P9571N54163L36004K04368j61196o24371l19034
14860B3653K85353K60552m1506J5709l16466m08437n30331m63912L36020N58083
14850b81282L83619j325k40037j89797N073N79697M25946P1971J53946l65434
$$ plain form
14840 542377 -27058 -284084 -295642 -142648 -216649 -804329 -1698931 -2249709 -1935425 -1353407
14830 -1353407 -927990 -709133 -517396 -383199 -617404 -614327 -254317 3648 4725 -34790
14820 -34790 -183556 -36488 261929 201526 301609 488481 79528 -590761 -604396 -403728
14810 -403728 -528045 -656493 -737444 -816562 -491763 77311 449281 537069 424243 -71059
14800 -71059 -376689 -122597 65166 280352 775864 1161520 786770 89493 -10187 163905
14790 163905 180830 464733 526116 279463 307281 349621 570555 453459 -82786 -200347
14780 -200347 -341018 -390552 -222102 -186025 -282222 -97655 -124386 -151117 -93434 -46912 113864
14769 113864 234703 424892 749496 825942 636319 476216 531233 613620 227144 -68389
$$ packed form
14840E42377n69435k57026j1558J52994p4001n87680q94602n50778L14284N82018
14830a353407M25417K18857J91737J34197k34205L077L60010K57965J077l9515
14820c4790j48766J47068K98417o0403J00083J86872m08953o70289j3635K00668
14810d03728j24317j28448q0951p9118L24799N69074L71970Q7788j12826m95302
14800g1059l05630K54092J87763K15186M95512L85656l74750o97277r9680J74092
14790A63905J6925K83903O1383k46653K7818M2340K20934j17096n36245j17561
14780b00347j40671m9534J68450L6077r6197J84567k6731k6731N7683M6522J60776
14769A13864J20839J90189L24604P6446j89623j60103N5017Q2387l86476k95533
$$ plain form
14759 -68389 -86080 -49139 1806 -73494 -233113 -276842 -148386 -134401 -10854 388848 580075
14748 580075 756707 900551 868567 471853 -5415 -223391 -569952 -916442 -949386 -622611
14738 -622611 -404638 -378466 -431743 -602165 -829840 -931386 -830029 -532287 -518615 -814370
14728 -814370 -914883 -961802 -727815 -726281 -642934 -305927 -6115 76621 -224611 -725858
14718 -725858 -1084430 -1299955 -1023950 -445610 -145372 -277026 -559693 -754425 -812388 -605931
14708 -605931 -546106 -344137 -154311 -62508 83485 315988 255872 -56529 -449106 -418084
14698 -418084 -207577 -207970 -543274 -987706 -1121198 -1108615 -1424794 -1823481 -1507012 -731778
14688 -731778 -49303 271568 190080 64380 98108 -154764 -376506 -423336 -966211 -1315852
$$ packed form
14759f8389j7691L6941N0945p5300j59619m3729J28456J3985J23547L99702J91227
14748E80075J76632J43844l1984l96714m77268k17976l46561l46490l2944L26775
14738f22611K17973K6172n3277j70422k27675j01546J01357K97742J3672k95755
14728h14370j00513m6919K33987J534Q3347L37007K99812Q2736l01232n01247
14718g25858l58572k15525K76005N78340L00238j31654k82667j94732n7963K06457
14708f05931N9825K01969J89826R1803J45993K32503o0116l12401l92577L1022
14698d18084K10507l93l35304m44432j33492J2583l16179l98687L16469P75234
14688g31778O82475L20871q1488j25700L3728k52872k21742m6830n42875l49641
$$ plain form
14678 -1315852 -1138754 -854696 -221714 229062 250976 267120 376020 362649 445217 576658
14668 576658 189782 -168237 -137808 164290 187751 412946 779349 760541 1018731 1266074
14658 1266074 1179010 1111425 888656 582180 490807 339639 178794 -162862 -345374 -692887
14648 -692887 -947446 -713729 -699647 -1093470 -1087122 -677676 -440667 -501417 -608519 -808014
14638 -808014 -958483 -994491 -715849 -609390 -615379 -252151 -275669 -764780 -836548 -1011442
14628 -1011442 -1462234 -1767195 -1695552 -1528145 -1402260 -975455 -272970 -64178 -85373 -126621
14618 -126621 -54694 -40179 -38880 -8890 -276920 -556214 -661358 -520318 -41722 422556
14608 422556 878052 1069726 844708 585822 417632 719663 972342 622296 161674 -14687
$$ packed form
14678a315852J77098K84058O32982M50776K1914J6144J08900j3371Q2568J31441
14668E76658l86876l58019L0429L02098K3461K25195L66403j8808K58190K47343
14658A266074q7064o7585k22769l06476r1373j51168j60845l41656j82512l47513
14648f92887k54559K33717J4082l93823O348M09446K37009o0750j07102j99495
14638h08014j50469l6008K78642J06459n989L63228k3518m89111p1768j74894
14628a011442m50792l04961P1643J67407J25885M26805P02485K08792k1195m1248
14618a26621P1927J4515J299K9990k68030k79294j05144J41040M78596M64278
14608D22556M55496J91674k25018k58886j68190L02031K52679l50046m60622j76361
$$ plain form
14598 -14687 -164791 -391994 -129973 340659 715702 792514 124288 -616248 -673344 -428027
14588 -428027 -139762 -37292 5209 137287 205294 11438 -24344 323059 444134 402598
14578 402598 362311 212543 72549 -441459 -487273 -432856 -152191 736 -392701 -290391
14568 -290391 -120818 -70350 -21678 -117409 -548831 -927680 -1059603 -970707 -1006765 -916380 -774232
14557 -774232 -363673 104758 298868 421118 336758 177896 -34070 -193194 -295817 -673253
14547 -673253 -1092873 -1356704 -1004272 -407637 -68261 91159 283530 474013 580812 519937
14537 519937 418218 337905 383469 161918 -352546 -826869 -933745 -922290 -980265 -765474
14527 -765474 -129610 267229 512440 615735 525455 325178 -47549 -46923 -378095 -780222
$$ packed form
14598a4687j50104k27203K62021M70632L75043P6812o68226p40536n7096K45317
14588d28027K88265J02470M2501J32078O8007j93856l5782L47403J21075m1536
14578D02598m0287j49768j39994n14008m5814N4417K80665J52927l93437J02310
14568b90391J69573N0468M8672r5731m31422l78849j31923Q8896l6058R0385J42148
14557g74232M10559M68431J94110J22250q4360j58862k11966j59124j02623l77436
14547f73253m19620k63831L52432N96635L39376J59420J92371J90483J06799o0875
14537E19937j01719q0313M5564k21551n14464m74323j06876J1455n7975K14791
14527g65474O35864L96839K45211J03295r0280k00277l72727O26l31172m02127
$$ plain form
14517 -780222 -624523 -391678 -595086 -994777 -827921 -426369 -181215 -246987 -383378 100597
14507 100597 523609 747143 786399 132230 -113043 -205924 -23816 317422 457251 395964
14497 395964 259231 -71902 -325246 -413575 -318741 188687 462630 259300 95247 354037
14487 354037 88199 -683630 -551755 -116498 19077 -54027 -255662 -743437 -618480 -530372
14477 -530372 -915798 -849705 -315072 -45596 -26291 -213778 -249521 14260 44510 14179
14467 14179 -167341 -85559 341698 360757 123734 -125882 -411911 -190217 -133070 -412846
14457 -412846 -418440 -300806 -67126 101109 -75802 -95604 53360 126928 -65444 -252698
14447 -252698 -457574 -544293 -514477 -163411 166648 164082 -117056 -405120 -321765 -330431 -355837
$$ packed form
14517g80222J55699K32845k03408l99691J66856M01552K45154o5772j36391M83975
14507A00597M23012K23534L9256o54169k45273r2881J82108L41238J39829o1287
14497C95964j36733l31133k53344q8329R4834N07428K73943k03330j64053K58790
14487C54037k65838p71829J31875M35257J35575p3104k01635m87775J24957Q8108
14477e30372l85426O6093N34633K69476J9305j87487l5743K63781L0250l0331
14467A4179j81520Q1782M27257J9059k37023k49616k86029K21694N7147k79776
14457d12846n594J17634K33680J68235j76911j9802J48964P3568j92372j87254
14447b52698k04876q6719K9816L51066L30059k566k81138k88064Q3355q666k5406
$$ plain form
14436 -355837 -384779 -195814 -93049 -157200 -91456 150870 -18654 -166423 -381035 -735060
14426 -735060 -651159 -389321 -377857 -768399 -676812 -284855 -268966 -389464 -400576 -373831 -188705
14415 -188705 -133236 -377797 -731768 -613378 -211987 185752 384143 597895 605376 131327
14405 131327 -326820 -440083 -153189 -98263 -127099 346957 699294 560906 137780 137994
14395 137994 294419 148411 208849 408411 238556 -116618 -200315 -293469 -142962 52960
14385 52960 373341 383624 32272 -81263 -76459 -256240 -619843 -1102251 -1124616 -1000966
14375 -1000966 -870824 -491602 -292738 -512214 -637931 -518696 -654534 -675620 -173359 68143
14365 68143 -144960 -252172 -52326 170376 495350 435113 -16109 -115159 -244537 -373139
$$ packed form
14436c55837k8942J88965J02765o4151O5744K42326j69524j47769k14612l54025
14426g35060Q3901K61838J1464l90542R1587L91957J5889j20498j1112K6745J85126
14415a88705N5469k44561l53971J18390M01391L97739J98391K13752P481m74049
14405A31327m58147j13263K86894N4926k8836M74056L52337j38388m23126K14
14395A37994J56425j46008O0438J99562j69855l55174q3697r3154J50507J95922
14385E2960L20381J0283l51352j13535M804j79781l63603m82408k2365J23650
14375a000966J30142L79222J98864k19476j25717J19235j35838k1086N02261K41502
14365F8143k13103j07212J99846K22702L24974o0237m51222r9050j29378j28602
$$ plain form
14355 -373139 -603591 -711547 -570734 -396689 -587569 -548169 -369957 -141987 -150698 -389967
14345 -389967 -691773 -834458 -722820 -486490 -740375 -1274368 -1570211 -1616455 -1444162 -652232
14335 -652232 -288408 -169674 -49983 -220381 -242015 -54216 100569 -214655 -302295 -67067
14325 -67067 -130333 -349234 -415922 -584500 -515815 -743433 -1128747 -884636 -693086 -406477
14315 -406477 60815 102072 -121224 -371144 -329615 -161679 -135203 -29287 -255396 -769366
14305 -769366 -949211 -938790 -809079 -537332 -454505 -412416 -16638 630900 1053138 768804
14295 768804 612742 396212 -179004 -832026 -1135679 -1052238 -914530 -793280 -364153 130979
14285 130979 315865 245208 -92260 -459256 -570172 -601055 -442433 -287056 -845326 -1172113
$$ packed form
14355c73139k30452j07956J40813J74045j90880L9400J78212K27970q711k39269
14345c89967l01806j42685J11638K36330k53885n33993k95843m6244J72293P91930
14335f52232L63824J18734J19691j70398k1634J87799J54785l15224q7640K35228
14325f7067o3266k18901o6688j68578O8685k27618l85314K44111J91550K86609
14315d06477M67292M1257k23296k49920M1529J67936K6476J05916k26109n13970
14305g69366j79845J0421J29711K71747Q2827M2089L95778O47538M22238k84334
14295G68804j56062k16530n75216o53022l03653Q3441J37708J21250M29127M95132
14285A30979J84886p0657l37468l66996j10916l0883J58622J55377n58270l26787
$$ plain form
14275 -1172113 -1059635 -1109732 -1383779 -1475245 -995787 -240642 358546 986927 1186833 994766
14265 994766 932881 890868 574135 -259179 -560283 -562698 -712561 -1026392 -1487216 -1216145
14255 -1216145 -1060068 -839577 -663482 -632320 -183841 505916 522351 262354 191898 76904
14245 76904 56288 206943 112108 -109227 -33473 -45928 -57745 -73414 -235737 -169244 -9302
14234 -9302 267644 228121 403007 685900 840165 655277 184917 -242103 -392586 -233100
14224 -233100 -335696 -712117 -1029281 -849761 -477678 -197460 31640 94192 -25325 241641
14214 241641 421347 372136 79454 -288146 -860768 -1278341 -1076104 -916331 -745136 -863514
14204 -863514 -1220855 -1163667 -975140 -842625 -907527 -692773 -181388 114527 -2050 -282944
$$ packed form
14275a172113J12478n0097k74047r1466M79458P55145N99188O28381J99906j92067
14265I94766o1885m2013l16733q33314l01104k415j49863l13831m60824K71071
14255a216145J56077K20491J76095L1162M48479O89757J6435k59997p0456j14994
14245G6904k0616J50655r4835k21335P5754j2455j1817j5669j62323O6493J59942
14234i302K76946l9523J74886K82893J54265j84888m70360m27020j50483J59486
14224b33100j02596l76421l17164J79520L72083K80218K29100O2552j19517K66966
14214B41641J79706m9211k92682l67600n72622m17573K02237J59773J71195j18378
14204h63514l57341N7188J88527J32515o4902K14754N11385K95915j16577k80894
$$ plain form
14194 -282944 138217 248298 73320 12362 -19381 -277613 -371374 -130028 195625 18127
14184 18127 -318154 -452588 -851157 -1457351 -1447786 -1011332 -438319 -197009 -846716 -1138867
14174 -1138867 -1397205 -1169334 -847823 -578531 -433882 -274602 -414369 -216184 59736
14165 59736 353270 844503 709592 158879 -58039 -484099 -603143 -638363 -723429 -842465
14155 -842465 -783393 -268019 121434 27370 -394594 -770549 -872805 -802253 -574810 -293516
14145 -293516 -316763 -289484 262830 580867 272138 335892 780483 1132311 1152162 1028911
14135 1028911 1260458 1329437 1205611 1015652 587426 61195 -365903 -520309 -493391 -532006
14125 -532006 -260626 33190 -255373 -416388 -173078 333355 736463 476037 -36215 -269312
$$ packed form
14194b82944M21161J10081j74978o0958l1743k58232r3761K41346L25653j77498
14184A8127l36281j34434l98569o06194R565M36454N73013K41310o49707k92151
14174a138867k58338K27871L21511K69292J44649J59280j39767J98185K75920
14165E9736K93534M91233j34911n50713k16918m26060j19044l5220q5066j19036
14155h42465N9072N15374L89453r4064m21964l75955j02256P0552K27443K81294
14145b93516k3247K7279N52314L18037l08729O3754M44591L51828J9851j23251
14135A028911K31547O8979j23826j89959m28226n26231m27098j54406K6918l8615
14125e32006K71380K93816k88563j61015K43310N06433M03108k60426n12252k33097
$$ plain form
14115 -269312 -137701 470180 589848 331365 156872 198368 407270 472675 473249 226214
14105 226214 -365047 -802748 -1148370 -1000506 -729195 -545835 -532836 -451022 -378539 -136426
14095 -136426 67370 289391 784232 1133650 1093577 1003169 557424 -21564 -243800 -397234
14085 -397234 -328688 -136008 20424 172491 253776 99743 125958 453803 712032 703521
14075 703521 782020 918450 963271 772888 417606 555980 769403 968201 1460649 1667826
14065 1667826 1309728 984747 862015 795557 891122 689162 475253 210820 10798 -135970
14055 -135970 -260059 -493411 -935839 -976792 -455715 -35618 -20666 -544929 -918814 -876889
14045 -876889 -733198 -246864 -15427 -573 51335 34820 209304 -2206 -391039 -693379
$$ packed form
14115b69312J31611O07881J19668k58483j74493M1496K08902O5405N74k47035
14105B26214n91261m37701l45622J47864K71311J83360J2999Q1814P2483K42113
14095a36426K03796K22021M94841L49418m0073r0408m45745n78988k22236j53434
14085c97234O8546J92680J56432J52067Q1285j54033K6215L27845K58229q511
14075G03521P8499J36430M4821j90383l55282J38374K13423J98798M92448K07177
14065A667826l58098l24981j22732o6458R5565k01960k13909k64433k00022j46768
14055a35970j24089k33352m42428m0953N21077M20097J4952n24263l73885M1925
14045h76889J43691M86334K31437J4854N1908j6515J74484k11510l88833l02340
$$ plain form
14035 -693379 -565450 -92796 369009 298617 -211912 -330653 -2361 -293499 -529187 -191109
14025 -191109 417149 304994 -268008 -472500 -490188 -316292 -124803 -442064 -1051622 -1157105
14015 -1157105 -716423 -441791 -576281 -208014 -85872 -150639 -127940 142583 306910 312566
14005 312566 152915 -141776 -644520 -1005464 -734766 -414602 -219337 165493 424650 177130
13995 177130 -504086 -877069 -1110948 -869794 -439700 -32203 362241 499065 527304 415606
13985 415606 -4388 -341722 -455863 -22392 707650 471380 110818 243667 417323 607628
13975 607628 433898 -58267 -125107 508332 1003998 895104 426329 -3495 -81930 160258
13965 160258 265113 -84527 -173223 276408 584078 625515 593833 639620 721020 292182
$$ packed form
14035f93379J27929M72654M61805p0392n10529j18741L28292k91138k35688L38078
14025a91109O08258j12155n73002k04492j7688J73896J91489l17261o09558j05483
14015a157105M40682K74632j34490L68267J22142o4767K2699K70523J64327N656
14005C12566j59651k94691n02744l60944K70698L20164J95265L84830K59157k47520
13995A77130o81216l72983k33879K41154M30094M07497L94444J36824K8239j11698
13985D15606m19994l37334j14141M33471P30042k36270l60562J32849J73656J90305
13975F07628j73730m92165o6840O33439M95666j08894m68775m29824p8435K42188
13965A60258J04855l49640q8696M49631L07670M1437l1682M5787Q1400m28838
$$ plain form
13955 292182 -123521 89600 260963 -141299 -208522 -224384 -498163 -309011 -16342 67735
13945 67735 -371218 -739440 -498135 -259700 -382866 -642140 -1096217 -1368764 -1021334 -538878
13935 -538878 30290 589191 979908 1363091 919715 345611 184518 325310 555071 164001
13925 164001 -143836 -78090 62498 -51256 -591036 -919414 -1076676 -1611149 -1553117 -1143358
13915 -1143358 -1183318 -993297 -550608 -537602 -572599 -285023 7601 -206236 -537992 -210467
13905 -210467 333558 719989 459292 149396 327302 249626 46082 190072 -22639 -369777
13895 -369777 -360133 -395258 -122990 2938 -213677 -339853 -216403 -192179 -374607 -636117
13885 -636117 -812022 -1076658 -1398504 -1295513 -891538 -677844 -772444 -826105 -597474 -335012
$$ packed form
13955B92182m15703K13121J71363m02262o7223j5862k73779J89152K92669Q4077
13945F7735m38953l68222K41305K38435j23166k59274m54077k72547L47430M82456
13935e38878N69168N58901L90717L83183m43376n74104j61093J40792K29761l91070
13925A64001l07837O5746J40588j13754n39780l28378j57262n34473N8032M09759
13915a143358l9960J90021M42689J3006l4997K87576K92624k13837l31756L27525
13905b10467N44025L86431k60697l09896J77906p7676k03544J43990k12711l47138
13895c69777R644l5125K72268J25928k16615j26176J23450K4224j82428k61510
13885f36117j75905k64636l21846J02991M03975K13694r4600n3661K28631K62462
$$ plain form
13875 -335012 -8976 41692 -156241 -313223 -363271 -210778 264623 748915 649692 515029
13865 515029 464965 97988 -258814 -260520 -169877 116938 467779 677878 560516 620381
13855 620381 746190 594847 364853 -50473 -193766 -305203 -306973 -375301 -310931 125501
13845 125501 98719 -233845 -710869 -1210134 -1257906 -1159062 -1188065 -1106534 -868589 -579631
13835 -579631 -182011 340362 355851 -30993 169975 924373 1391115 1467050 1428111 931711
13825 931711 344617 196031 -43976 -296092 -278975 -255961 -333211 -431710 -486645 -423461 -397573
13814 -397573 -591755 -728181 -912158 -1179086 -1239695 -600446 -132421 -407360 -920656 -907626
13804 -907626 -648153 -323195 410558 1066170 1076662 673637 460958 354250 -25458 -235874
$$ packed form
13875c35012L26036N0668j97933j56982n0048J52493M75401M84292r9223j34663
13865E15029n0064l66977l56802j706R0643K86815L50841K10099j17362N9865
13855F20381J25809j51343k29994m15326j43293j11437j770o8328O4370M36432
13845A25501k6782l32564m77024m99265m7772R8844k9003Q1531K37945K88958
13835e79631L97620N22373J5489l86844K00968P54398M66742P5935l8939m96400
13825I31711n87094j48586k40007k52116J7117K3014p7250r8499n4935O3184K5888
13814c97573j94182j36426j83977k66928o0609O39249M68025k74939n13296J3030
13804i07626K59473L24958P33753O55612J0492m03025k12679j06708l79708k10416
$$ plain form
13794 -235874 -202384 38428 -218030 -737192 -887184 -666442 126418 414427 772907 915683
13784 915683 459733 97772 187483 140906 42802 -39024 64228 330966 287192 -267950
13774 -267950 -958900 -1241071 -793060 -206291 383493 890089 598841 99154 -281785 -308804
13764 -308804 -284020 -114655 -48033 -364280 -681709 -786184 -635370 -578721 -374920 -117679
13754 -117679 153475 378907 196236 -81472 -302589 -641849 -1028087 -1077306 -1010548 -1013993
13744 -1013993 -835712 -535843 -264313 -220942 -431679 -571541 -731993 -515304 -4412 402764
13734 402764 748435 671508 589322 272597 -85982 -147064 -127533 -65638 -227046 -519576
13724 -519576 -697401 -532202 -673663 -1032220 -1038466 -795494 -581669 -446225 -542038 -447236
$$ packed form
13794b35874L3490K40812k56458n19162j49992K20742P92860K88009L58480J42776
13784I15683m55950l61961Q9711m6577r8104q1826J03252K66738m3774n55142
13774b67950o90950k82171M48011N86769N89784N06596k91248m99687l80939k7019
13764c08804K4784J69365O6622l16247l17429j04475J50814N6649K03801K57241
13754a17679K71154K25432j82671k77708k21117l39260l86238m9219O6758l445
13744a013993J78281K99869K71530M3371k10737j39862j60452K16689N10892M07176
13734D02764L45671p6927q2186l16725l58579o1082J9531O1895j61408k92530
13724e19576j77825J65199j41461l58557o246K42972K13825J35444r5813R4802
$$ plain form
13714 -447236 -315229 -211337 -51630 -52233 -356605 -692917 -518272 -219701 110359 356412
13704 356412 464851 382316 123260 325330 591120 702180 691262 494219 303562 -228242
13694 -228242 -854885 -700461 -186872 142546 275519 375715 544594 296594 45996 46257
13684 46257 -130052 -502247 -653833 -473304 -450439 -533117 -393625 31241 322312 190316
13674 190316 -215167 -12663 427923 535548 658275 717114 807003 817384 856540 1049966
13664 1049966 646136 54054 -220543 -304057 -845147 -848056 -633106 -493208 -245083 53269
13654 53269 180306 -93107 -538658 -1019115 -1263922 -1243109 -970197 -808422 -501195 -248181
13644 -248181 -96934 -32683 181885 425961 410708 285776 385479 261877 -61214 -432003
$$ packed form
13714d47236J32007J03892J59707o03l04372l36312J74645K98571L30060K46053
13704C56412J08439q2535k59056K02070K65790J11060j0918j97043j90657n31804
13694b28242o26643J54424N13589L29418J32973J00196J68879k48000k50598K61
13684D6257j76309l72195j51586J80529K2865q2678J39492M24866K91071j31996
13674A90316m05483K02504M40586J07625J22727N8839Q9889J0381L9156J93426
13664A049966m03830n92082k74597q3514n41090k909K14950J39898K48125K98352
13654E3269J27037k73413m45551m80457k44807K0813K72912J61775L07227K53014
13644b48181J51247O4251K14568K44076j5253j24932R9703j23602l23091l70789
$$ plain form
13634 -432003 -682967 -663480 -925435 -1183106 -1207357 -732892 -321345 -321341 -18951 -34945 -165080
13623 -165080 18700 151159 80701 397383 493281 238841 -140600 -276235 -147946 -420963
13613 -420963 -870856 -1272847 -1831755 -2259393 -2007775 -1251891 -485259 -168836 2616 686104
13603 686104 1142158 1151577 862071 447099 195161 -100430 92319 654529 469252 -120620
13593 -120620 -396126 -310579 -44489 -129384 -358455 -375871 -333138 46970 43930 -229582 -104681
13582 -104681 188989 231872 -50062 -92972 147533 345217 488593 406396 152803 12889
13572 12889 120412 91240 50645 303401 591670 574044 468732 249062 401381 698727
13562 698727 705906 711698 664872 749894 1098158 1201112 1224452 1283222 1142303 1117477 1466815
$$ packed form
13634d32003k50964J9487k61955k57671k4251M74465M11547ML02390j5994j30135
13623a65080J83780J32459p0458L16682R5898k54440l79441j35635J28289k73017
13613d20963m49893m01991n58908m27638K51618P55884P66632L16423J71452O83488
13603F86104M56054R419k89506m14972k51938k95591J92749N62210j85277n89872
13593a20620k75506Q5547K66090q4895k29071j7416M2733L80108l040k73512J24901
13582a04681K93670M2883k81934m2910K40505J97684J43376q2197k53593j39914
13572A2889J07523k9172m0595K52756K88269j7626j05312k19670J52319K97346
13562F98727P179N792m6826Q5022L48264J02954K3340N8770j40919k4826L49338
$$ plain form
13551 1466815 1738033 1563083 820490 126126 -75132 -46380 -230732 -408708 -242817 -398032
13541 -398032 -778175 -972367 -488610 -213005 -105202 76948 113905 68861 -193178 -1071793
13531 -1071793 -1691093 -1750366 -1649910 -1422502 -1217701 -1004092 -658240 -194066 -105776 -241581
13521 -241581 -484104 -171532 51343 13212 -12739 -139667 -103769 110192 69220 62470 -10283
13510 -10283 42182 248851 205160 151860 77921 -123133 -196975 36746 185809 -146596 -491850
13499 -491850 -409697 -177963 -150572 25281 457994 472783 132731 -207652 -373922 -920558
13489 -920558 -1163719 -973074 -179136 438406 550065 519295 198042 -5286 -242631 -718519
13479 -718519 -877183 -610516 -447948 -209277 12504 -16990 96720 214727 391858 160434
$$ packed form
13551A466815K71218j74950p42593o94364k01258K8752j84352j77976J65891j55215
13541c98032l80143j94192M83757K75605J07803J82150L6957m5044k62039q78615
13531a071793o19300n9273J00456K27408K04801K13609L45852M64174Q8290j35805
13521b41581k42523L12572K22875l8131k5951j26928L5898K13961m0972o750p2753
13510a0283N2465K06669m3691n3300p3939k01054p3842K33721J49063l32405l45254
13499d91850Q2153K31734K7391J75853M32713J4789l40052l40383j66270n46636
13489i20558k43161J90645P93938O17542J11659l0770l21253k03328k37345m75888
13479g18519j58664K66667J62568K38671K21781k9494J13710J18007J77131k31424
$$ plain form
13469 160434 -601500 -866143 -416609 -232886 -200507 -192531 -204547 145573 531286 873974
13459 873974 1343346 1695510 1775680 1911257 1641211 787113 -73602 -571861 -702619 -680255
13449 -680255 -279372 111540 -102001 -412239 -160659 -112144 -378995 -617124 -795234 -478510
13439 -478510 -410101 -540302 -456518 -629914 -569975 -48709 155093 -89209 -650884 -710942
13429 -710942 -496177 -386210 -181950 -266574 -709693 -1146850 -883953 -495077 -350576 -223709
13419 -223709 -513464 -747491 -633247 -561165 -587603 -498191 -127194 339324 238683 -131261
13409 -131261 -127432 -246132 -232594 35769 375349 451384 -5510 -166561 168765 518015
13399 518015 938611 938695 409192 -326592 -505864 -287567 103460 529788 547620 481841 367000
$$ packed form
13469A60434p61934k64643M49534J83723L2379P976j2016L50120L85713L42688
13459H73974M69372L52164Q0170J35577k70046q54098q60715m98259j30758K2364
13449f80255M00883L90912k13541l10238K51580M8515k66851k38129j78110L16724
13439d78510O8409j30201Q3784j73396N9939N21266K03802k44302n61675o0058
13429g10942K14765J09967K04260q4624m43119m37157K62897L88876J44501J26867
13419b23709k89755k34027J14244P2082k6438Q9412L70997M66518j00641l69944
13409a31261L829j18700J3538K68363L39580P6035m56894j61051L35326L49250
13399E18015M20596Q4n29503p35784j79272K18297L91027M26328J7832o5779j14841
$$ plain form
13388 367000 -5564 -97915 165757 119118 69051 21591 -85903 -235725 -268513 -82896
13378 -82896 436923 821126 714443 551924 491132 198189 -22914 302566 620753 793145
13368 793145 872543 999934 1032361 1132313 1134718 1274850 1324215 1112658 738110 444942 309994
13357 309994 -52890 -150307 26722 28849 57064 351731 537736 433545 296233 218893
13347 218893 249328 567363 489339 -31357 -151467 -140588 -63043 337632 385475 303457 574545
13336 574545 600394 395382 195656 -155964 -190590 -149585 -285456 -699988 -664180 -263182
13326 -263182 -67891 -75091 -164031 -296201 -80917 192121 140105 105186 12694 -191622 -347818
13315 -347818 -329536 -104736 -66508 -31434 -72797 227647 788714 1001507 1020991 820536
$$ packed form
13388C67000l72564r2351K63672m6639n0067m7460j07494j49822l2788J85617
13378h2896N19819L84203j06683j62519o0792k92943k21103L25480L18187J72392
13368G93145P9398J27391L2427R9952K405J40132M9365k11557l74548k93168j34948
13357C09994l62884r7417J77029K127K8215K94667J86005j04191j37312p7340
13347B18893L0435L18035p8024n20696j20110J0879P7545M00675M7843q2018K71088
13336E74545K5849k05012j99726l51620l4626M1005j35871m14532L5808M00998
13326b63182J95291p200q8940j32170K15284K73038n2016l4919r2492k04316j56196
13315c47818J8282K24800L8228L5074m1363L00444N61067K12793J9484k00455
$$ plain form
13305 820536 576375 658676 1183334 1368572 1082829 500907 151023 264702 491859 725901
13295 725901 877581 696105 133378 112212 486337 785376 932701 701626 674915 901148
13285 901148 1037910 1128142 800409 907441 1070762 753905 559943 521956 534272 742151
13275 742151 1286962 1454573 976646 843550 971960 912164 926149 1318088 1417435 1221684
13265 1221684 1398080 1469385 1142808 881746 897996 1048905 1401677 1589710 1321305 940294
13255 940294 760960 903662 1050468 927129 818004 834071 862272 1231202 1620585 1461316
13245 1461316 1204717 1395717 1475220 1084304 705184 636059 498483 754080 1319111 1427569
13235 1427569 1234383 907143 704124 466172 219940 49769 30188 63357 352080 586313
$$ packed form
13305H20536k44161Q2301N24658J85238k85743n81922l49884J13679K27157K34042
13295G25901J51680j81476n62727k1166L74125K99039J47325k31075k6711K26233
13285I01148J36762R0232l27733J07032J63321l16857j93962l7987J2316K07879
13275G42151N44811J67611m77927j33096J28410n9796J3985L91939R9347j95751
13265A221684J76396P1305l26577k61062J6250J50909L52772J88033k68405l81011
13255I40294j79334J42702J46806j23339j09125J6067K8201L68930L89383j59269
13245A461316k56599J91000P9503l90916l79120o9125j37576K55597N65031J08458
13235A427569j93186l27240k03019k37952k46232j70171j9581L3169K88723K34233
$$ plain form
13225 586313 772855 1073466 1540665 1436734 1012129 976269 919478 768771 704865 609708
13215 609708 740316 910230 1088696 1057922 927708 858865 704534 590117 729892 624122
13205 624122 763888 1041412 1182285 1092599 961848 723904 876307 1307681 1081243 601288
13195 601288 532734 605593 890791 966678 886157 964630 1341970 1875711 1831471 1489058 1237332
13184 1237332 1285590 1690169 1814135 1457281 1090075 940126 702402 443138 636739 1016453
13174 1016453 1598567 2039722 1971193 1923883 1915485 1753406 1611798 1305777 968602 1234802
13164 1234802 1407709 1454696 1676352 1663227 1258027 755330 722909 642206 689247 821034
13154 821034 703118 769726 775018 559929 361575 323449 495472 641296 515869 113171
$$ packed form
13225E86313J86542L00611M67199j03931m24605l5860n6791j50707o3906r5157
13215F09708J30608J69914J78466l0774j30214o8843j54331j14417J39775j05770
13205F24122J39766K77524J40873q9686j30751k37944J52403M31374k26438m79955
13195F01288o8554P2859K85198P5887q0521P8473L77340N33741m4240l42413k51726
13184A237332M8258M04579J23966l56854l67206j49949k37724k59264J93601L79714
13174A016453N82114M41155o8529m7310q398j62079j41608l06021l37175K66200
13164A234802J72907M6987K21656j3125m05200n02697l2421q0703M7041J31787
13154H21034j17916O6608N292k15089j98354l8126J72023J45824j25427m02698
$$ plain form
13144 113171 -72723 -236743 -533762 -625541 -677790 -352905 297707 795190 1215733 1555777
13134 1555777 1598238 775584 -19855 -361717 -535280 -354076 246457 713021 983345 984688
13124 984688 1091458 1429262 1456769 1520319 1672212 1508177 1110869 776188 851527 1083537
13114 1083537 1376224 1405694 1155124 987219 1376847 1568982 1511184 1712189 1260502 931220
13104 931220 813193 826427 1165425 1527397 1718397 1714295 1623592 1686808 1585058 1586898 1627967
13093 1627967 1388009 1401948 1497175 1303824 1031302 1040017 1547683 1686569 1472869 1510309
13083 1510309 1470821 1329011 1452364 1449971 1160542 1479840 1809634 1941047 2201809 2291006
13073 2291006 2132448 2074392 1902137 1673835 1820086 2295037 2350287 1877127 1470307 1182871
$$ packed form
13144A13171j85894j64020k97019r1779n2249L24885O50612M97483M20543L40044
13134A555777M2461q22654p95439l41862j73563J81204O00533M66564K70324J343
13124I84688J06770L37804K7507O3550J51893j64035l97308l34681P5339K32010
13114A083537K92687K9470k50570j67905L89628J92135n7798K01005m51687l29282
13104I31220j18027J3234L38998L61972J91000m102r0703O3216j01750J840M1069
13093A627967k39958J3939R5227j93351k72522Q715N07666J38886k13700L7440
13083A510309l9488j41810J23353k393k89429L19298L29794J31413K60762Q9197
13073B291006j58558n8056j72255k28302J46251M74951N5250m73160m06820k87436
$$ plain form
13063 1182871 1184925 1711385 1925312 1744098 1683281 1557435 1604214 1756599 1361293 1105976
13053 1105976 1125389 980354 714532 561705 594460 967019 1363056 1611882 1519806 1342880
13043 1342880 1729105 2150745 2388950 2635093 2869636 2935491 3126032 3398850 3813335 4076792
13033 4076792 4058204 3948900 3760354 3680380 3520864 3350280 3509913 3911698 3951427 4121769
13023 4121769 4354504 4814010 5403392 5537671 5445938 5480997 5956997 6541213 7108578 7124321
13013 7124321 7313006 7449565 7212869 7141730 7198238 7637601 7863674 8204419 9082339 9526318
13003 9526318 9857092 10377652 10934005 11510153 12487802 13247638 14045841 15473195 16839514
12994 16839514 18143793 19092398 19982154 21390313 22983256 24338927 26039269 28300828
$$ packed form
13063A182871K054N26460K13927j81214o0817j25846M6779J52385l95306k55317
13053A105976J9413j45035k65822j52827L2755L72559L96037K48826r2076j76926
13043A342880L86225M21640K38205K46143K34543O5855J90541K72818M14485K63457
13033D076792j8588j09304j88546p9974j59516j70584J59633M01785L9729J70342
13023D121769K32735M59506N89382J34279r1733L5059M76000N84216N67365J5743
13013G124321J88685J36559k36696p1139N6508M39363K26073L40745Q77920M43979
13003I526318L30774N20560N56353N76148R77649P59836P98203J427354J366319
12994A6839514J304279R48605Q89756J408159J592943J355671J700342K261559
$$ plain form
12986 28300828 30836733 33430979 35762254 38312912 41946079 46129498 50791693 56128427
12978 56128427 62102128 68914702 76809418 86702756 98968573 113620483 132099870 156526718
12970 156526718 187958931 226444715 270958392 312637656 334636107 323774920 285960837
12963 285960837 238669986 194984948 159298133 132250141 111788241 95939553 83195578
12956 83195578 72910754 64607023 57607603 51544587 46068269 41662511 38198619 35136719
12948 35136719 32079768 29391722 27363325 25482566 23508163 21277198 19496455 18399704
12940 18399704 17483158 16546754 16089298 15874149 15310256 15032311 15088327 14594812 13458007
12931 13458007 12673369 12309435 12155249 12379970 12401943 12209592 12239064 12182253 12283288 12669400
$$ packed form
12986B8300828K535905K594246K331275K550658L633167M183419M662195N336734
12978E6128427N973701O812574P894716R893338J2265817J4651910J8479387K4426848
12970A56526718L1432213L8485784M4513677M1679264K1998451j0861187l7814083
12963B85960837m7290851m3685038l5686815k7047992k0461900j5848688j2743975
12956H3195578j0284824q303731o999420o063016n476318m405758l463892l061900
12948C5136719l056951k688046k028397j880759j974403k230965j780743j096751
12940A8399704r16546r36404m57456k15149n63893k77945N6016m93515j136805
12931A3458007p84638l63934j54186K24721K1973j92351K9472n6811J01035L86112
$$ plain form
12921 12669400 13163757 13779917 14574629 15158120 15652819 16128815 16926922 18070293 19980783
12912 19980783 22229163 24137068 26245653 28776871 31129878 32670324 32825662 32452270
12904 32452270 31966497 31675585 31978110 32891226 33886640 35574737 38014400 40294536 42784085
12895 42784085 45821049 49499256 53772958 58786058 64894014 72052261 80785394 91549046
12887 91549046 104214045 120092109 140596167 166594966 199701677 241261946 287433458
12880 287433458 326829703 341341086 320845885 276495148 228094887 186488110 153309534
12873 153309534 127666966 107977808 92752230 80676866 70685255 62737235 55935418
12866 55935418 50102089 44945823 40191882 36293231 32972982 30318601 28185358 26269686
$$ packed form
12921A2669400M94357O16160P94712N83491M94699M75996P98107J143371J910490
12912A9980783K248380J907905K108585K531218K353007J540446J55338l73392
12904C2452270m85773k90912L02525R13116R95414J688097K439663K280136K489549
12895D2784085L036964L678207M273702N013100O107956P158247Q733133J0763652
12887I1549046J2664999J5878064K0504058K5998799L3106711M1560269M6171512
12880B87433458L9396245J4511383k0495201m4350737m8400261m1606777l3178576
12873A53309534k5642568j9689158j5225578j2075364r991611p948020o801817
12866E5935418n833329n156266m753941l898651l320249k654381k133243j915672
$$ plain form
12858 26269686 24394120 22444819 20894371 19338981 17479487 16258385 15753796 15850862
12850 15850862 15566770 15164565 14937300 14226196 13370657 12698127 12460510 12985600 13194957
12841 13194957 12605136 12209708 12321824 12442187 12581176 12599183 12605053 12754957 12711952 12645691
12831 12645691 13194480 13918587 14565851 15256782 15777477 15804979 16060584 16537059 16769805
12822 16769805 17416407 18397386 19593813 20762963 21591943 22809293 24642756 26635347
12814 26635347 28955474 31491471 34110714 36437270 38777408 41616517 45201082 49187785
12806 49187785 53553409 58710733 64808153 72573731 81995463 93167070 106923386 124441183
12798 124441183 146193102 173686796 208767725 251112424 295660395 328663823 333034207
$$ packed form
12858B6269686j875566j949301j550448j555390j859494j221102n04589R7066
12850A5850862k84092m02205k27265p11104q55539o72530k37617N25090K09357
12841A3194957n89821l95428J12116J20363J38989J8007N870J49904m3005o6261
12831A2645691N48789P24107O47264O90931N20695K7502K55605M76475K32746
12822A6769805O46602R80979J196427J169150Q28980J217350J833463J992591
12814B6635347K320127K535997K619243K326556K340138K839109L584565L986703
12806D9187785M365624N157324O097420P765578R421732J1171607J3756316J7517797
12798A24441183K1751919K7493694L5080929M2344699M4547971L3003428M370384
$$ plain form
12791 333034207 305138288 259414212 212771748 173127679 141944022 118260826 100383905
12784 100383905 86212208 74890688 65598835 57579595 50876269 45474345 40983250 37053360
12776 37053360 33472629 30628807 28030548 25239454 22645946 20929001 19170958 17474271
12768 17474271 16350361 15398611 14059441 12487088 11364206 11042633 10686841 10205692 9825343
12759 9825343 9559393 9073705 8820627 8559066 7759395 6760831 5849928 5228260 4934624
12750 4934624 4550529 4264050 3920205 3586879 3602049 3756084 4208319 4706627 4985321 4489181
12740 4489181 4110413 4354902 4177946 3165056 2632091 2844573 2908977 2574747 2201540
12731 2201540 2261024 2230682 2075615 2057527 2350070 2946862 3069711 2876926 2647130 2493850
$$ packed form
12791C33034207k7895919m5724076m6642464l9644069l1183657k3683196j7876921
12784A00383905j4171697j1321520r291853q019240o703326n401924m491095l929890
12776C7053360l580731k843822k598259k791094k593508j716945j758043j696687
12768A7474271j123910r51750j339170j572353j122882l21573l55792m81149l80349
12759I825343k65950m85688k53078k61561p99671r98564r10903o21668k93636
12750D934624l84095k86479l43845l33326J5170J54035M52235M98308K78694m96140
12740D489181l78768K44489j76956j012890n32965K12482O4404l34230l73207
12731B201540N9484l0342j55067j8088K92543N96792J22849j92785k29796j53280
$$ plain form
12721 2493850 2196922 2098006 2096123 1844906 1410604 1155867 1137214 1322334 1587190 1963852
12711 1963852 2282214 2001086 1894084 2302966 2458435 1754154 1174862 694453 469867
12702 469867 519119 744438 893951 957319 1046284 820974 574426 523206 699558 1024381
12692 1024381 1104863 1075559 1228529 1272304 1046239 631389 584500 880993 1066392 1036588
12682 1036588 1202250 1044417 650411 441675 273005 413957 800532 937209 786395
12673 786395 412607 208386 212687 198612 368464 245896 123024 406335 583960 603538
12663 603538 643153 453049 256402 116330 -266454 -375737 -353239 -665716 -672976 -442943
12653 -442943 -32067 496817 325928 69716 296058 566505 344780 16454 246727 729986
$$ packed form
12721B493850k96928r8916j883k51217m34302k54737j8653J85120K64856L76662
12711A963852L18362k81128j07002M08882J55469p04281n79292m80409k24586
12702D69867M9252K25319J49513O3368Q8965k25310k46548n1220J76352L24823
12692A024381Q0482k9304J52970M3775k26065m14850m6889K96493J85399k9804
12682A036588J65662j57833l94006k08736j68670J40952L86575J36677j50814
12673G86395l73788k04221M301j4075J69852j22568j22872K83311J77625J9578
12663F03538L9615j90104j96647j40072l82784j09283K2498l12477p260K30033
12653d42943M10876N28884j70889k56212K26342K70447k21725l28326K30273M83259
$$ plain form
12643 729986 863979 774899 749734 771623 632235 520354 305280 357180 880388 1392067
12633 1392067 1507279 1165657 664957 530666 783942 885619 701799 1047390 1427356
12624 1427356 1516946 1351060 909999 521409 230134 48541 260819 371763 -869 -245511
12614 -245511 -87022 70566 87282 38147 -58252 65637 454311 774762 801640 798371 746724
12603 746724 267695 264797 467511 615637 842067 787793 505282 313518 239149 495163
12593 495163 429908 285157 346136 193941 -331760 -526287 149144 510726 421077 562677
12583 562677 683460 639412 22545 -104245 385915 937150 1226710 1055873 603141 61301
12573 61301 -277082 -107670 254624 568015 465872 450001 569782 949379 1368528 1294740
$$ packed form
12643G29986J33993q9080k5165K1889j39388j11881k15074N1900N23208N11679
12633A392067J15212l41622n00700j34291K53276J01677j83820L45591L79966
12624A427356Q9590j65886m41061l88590k91275j81593K12278J10944l72632k44642
12614b45511J58489J57588J6716m9135r6399J23889L88674L20451K6878l269n1647
12603G46724m79029k898K02714J48126K26430n4274k82511j91764p4369K56014
12593D95163o5255j44751O0979j52195n25701j94527O75431L61582q9649J41600
12583E62677J20783m4048o16867j26790M90160N51235K89560j70837m52732n41840
12573F1301l38383J69412L62294L13391j02143j5871J19781L79597M19149p3788
$$ plain form
12563 1294740 775852 596846 675545 718211 373910 -62931 -269431 -324538 -553072 -654292
12553 -654292 -634362 -409859 -176533 17816 164562 172431 204863 300566 367641 307240 546520
12542 546520 418398 245454 309365 314945 724603 1337543 1316684 1090267 1072028 801164
12532 801164 409871 297804 423198 587662 596225 757767 869274 856810 594290 419338
12522 419338 432868 726973 974660 909829 1059343 1342901 1283880 843382 596699 321366
12512 321366 17325 21355 37707 12818 196712 363177 335447 80654 -180308 112809
12502 112809 628249 594094 92208 -256887 -468251 -554439 -342755 -3393 284492 385371
12492 385371 649093 1080173 468103 -211424 -367190 -301515 -163095 -4715 -4283 281123
$$ packed form
12563A294740n18888j79006P8699M2666l44301m36841k06500n5107k28534j01220
12553f54292J9930K24503K33326J94349J46746P869L2432R5703O7075o0401K39280
12542E46520j28122j72944O3911N580M09658O12940k0859k26417j8239k70864
12532H01164l91293j12067J25394J64464Q563J61542J11507j2464k62520j74952
12522D19338J3530K94105K47687o4831J49514K83558n9021m40498k46683k75333
12512C21366l04041M030J6352k4889J83894J66465k7730k54793k60962K93117
12502A12809N15440l4155n01886l49095k11364q6188K11684L39362K87885J00879
12492C85371K63722M31080o12070o79527j55766O5675J38420J58380M32K85406
$$ plain form
12482 281123 600993 707592 353614 185658 365190 557611 752403 735746 600316 622684
12472 622684 905514 726747 170588 324657 976399 1092731 752857 77848 -202813 47121
12462 47121 104359 78413 -287311 -585777 -387528 -260675 -309946 -302837 -111599 409339 161745
12451 161745 -477650 -724188 -598169 -162584 163643 267369 360235 -15814 -266806 -215386
12441 -215386 -234061 -285028 -288870 75217 204288 -53910 -553135 -713734 -600820 -223088
12431 -223088 -166360 152418 756099 681460 573403 511432 548341 553470 405970 80644 -64190
12420 -64190 65603 315489 463386 383378 -65968 -505639 -706422 -600713 -470550 -481630
12410 -481630 -508687 56498 810893 1013628 772313 217366 -77112 -219912 -473181 -255948
$$ packed form
12482B81123L19870J06599l53978j67956J79532J92421J94792j6657j35430K2368
12472F22684K82830j78767n56159J54069O51742J16332l39874o75009k80661K49934
12462D7121N7238k5946l65724k98466J98249J26853m9271P109J91238N20938k47594
12451A61745o39395k46538J26019M35585L26227J03726R2866l76049k50992N1420
12441b15386j8675n0967l842L64087J29071k58198m99225j60599J12914L77732
12431b23088N6728L18778O03681p4639j08057o1971L6909N129j47500l25326j44834
12420f4190J29793K49886J47897q0008m49346m39671k00783J05709J30163j1080
12410d81630k7057N65185P54395K02735k41315n54947k94478j42800k53269K17233
$$ plain form
12400 -255948 60906 -67054 -192662 -163095 -162486 54389 65360 -326344 -399251 -183416 -13567
12389 -13567 100970 183120 -13530 -228878 -126182 -195797 -446516 -553183 -392687 -53928
12379 -53928 200821 8568 -97495 7128 -96056 -283736 -365504 -240449 -127698 -244458
12369 -244458 -529348 -990866 -1207039 -976706 -576190 -400888 -683808 -1038104 -994886 -563090
12359 -563090 -358638 -234541 270255 616976 451301 427589 458158 441781 335417 536201
12349 536201 566402 537374 342510 -222019 -521380 -535732 -355296 -30014 475710 548200
12339 548200 403067 170638 -23526 59219 75982 -156376 -84348 -57300 11189 150275
12329 150275 391528 329830 105900 39098 -297636 -563494 -494599 -629627 -632635 -59999
$$ packed form
12400b55948L16854j27960j25608K9567O09K16875J0971l91704p2907K15835J69849
12389a3567J14537Q2150j96650k15348J02696o9615k50719j06667J60496L38759
12379e3928K54749j92253j06063J04623j03184j87680q1768J25055J12751j16760
12369b44458k84890m61518k16173K30333M00516J75302k82920l54296M3218M31796
12359e63090K04452J24097N04796L46721j65675k3712L0569j6377j06364K00784
12349E36201L0201k9028j94864n64529k99361j4352J80436L25282N05724P2490
12339E48200j45133k32429j94164Q2745J6763k32358P2028K7048O8489J39086
12329A50275K41253o1698k23930o6802l36734k65858O8895j35028l008N72636
$$ plain form
12319 -59999 245882 351561 552245 540090 248274 203807 317713 20454 -42864 134442
12309 134442 -102523 -250991 -24062 -180671 -488782 -906441 -1093103 -595331 34522 461663
12299 461663 533374 367347 -146644 -498392 -299086 117793 115678 -89265 -20120 328610
12289 328610 549186 415726 -807 -433323 -717937 -873604 -792212 -685197 -611092 -228498
12279 -228498 -112214 -106442 52883 133059 -159629 -38371 587911 936076 955444 635326
12269 635326 252860 209525 254594 230790 281488 135462 209700 538518 955653 1178012
12259 1178012 879624 480571 212812 547788 775288 791102 560834 -10748 -250677 -147616
12249 -147616 -57354 158479 38049 15639 -16562 94501 865724 1388616 1282992 920365
$$ packed form
12319e9999L05881J05679K00684j2155k91816m4467J13906k97259o3318J77306
12309A34442k36965j48468K26929j56609l08111m17659j86662M97772O29853M27141
12299D61663P1711j66027n13991l51748J99306M16879k115k04943O9145L48730
12289C28610K20576j33460m16533m32516k84614j55667Q1392J07015P4105L82594
12279b28498J16284N772J59325Q0176k92688J21258O26282L48165J9368l20118
12269F35326l82466m3335M5069k3804N0698j46026P4238L28818M17135K22359
12259A178012k98388l99053k67759L34976K27500J5814k30268n71582k39929J03061
12249a47616R0262K15833j20430k2410l2201J11063P71223N22892j05624l62627
$$ plain form
12239 920365 428248 250120 479857 406874 102906 -452763 -733774 -777376 -674787 -609151
12229 -609151 -586995 -587702 -204721 280543 556643 485362 177143 141981 52870 19871 -69481
12218 -69481 -367401 -414538 -315290 -399095 -342062 108296 717657 809611 254841 -453255 -913933
12207 -913933 -1152814 -1333887 -1167309 -985024 -1157827 -946861 -645757 -634172 -597291 -538535
12197 -538535 -352874 -238659 -411936 -276508 35798 -38188 110583 486300 727084 902480
12187 902480 757461 61644 -468687 -767300 -525440 -250339 -208342 -508349 -696416 -678111
12177 -678111 -586825 -402239 -86206 283909 259647 -135218 -210949 -289989 -333097 -205192
12167 -205192 67115 455913 462954 611290 1204223 1474753 1311327 1034769 1173532 1400628
$$ packed form
12239I20365m92117j78128K29737p2983l03968n55669k81011m3602J02589O5636
12229f09151K2156p07L82981M85264K76100p1281l08219l5162q9111l2999q9352
12218f9481k97920m7137R9248q3805N7033M50358O09361R1954n54770p08096m60678
12207i13933k38881j81073J66578J82285j72803K10966L01104J1585L6881N8756
12197e38535J85661J14215j73277J35428L12306p3986J48771L75717K40784J75396
12187I02480j45019o95817n30331k98613K41860K75101M1997l00007j88067J8305
12177f78111R1286J84586L16033L70115k4262l94865p5731p9040m3108J27905
12167b05192K72307L88798P041J48336N92933K70530j63426k76558J38763K27096
$$ plain form
12157 1400628 1275356 907192 631943 261777 -24798 -451752 -982757 -852820 -343679
12148 -343679 18812 -14837 100374 339155 121207 -253198 -324647 -492552 -582547 -271815
12138 -271815 376583 645133 515043 476932 1045187 1177020 939584 561578 538757 656869
12128 656869 631390 555152 261034 -180056 -520099 -752905 -875852 -948462 -466016 3444
12118 3444 -78781 -410196 -782731 -1024772 -669117 -276562 216781 287032 -180730 -531697
12108 -531697 -746325 -442123 -597306 -885516 -890732 -882128 -818543 -1114098 -1162025 -664601 -346061
12097 -346061 244781 511782 219953 -385906 -835294 -1036013 -1172878 -908369 -702334 -711189
12087 -711189 -397710 8995 -174171 -744136 -715945 -621552 -770039 -1242948 -1750224 -1925054
$$ packed form
12157A400628j25272l68164k75249l70166k86575m26954n31005J29937N09141
12148c43679L62491l3649J15211K38781k17948l74405p1449j67905q9995L10732
12138b71815O48398K68550j30090l8111N68255J31833k37436l78006k2821J18112
12128F56869k5479p6238k94118m41090l40043k32806j22947p2610M82446M69460
12118C444q2225l31415l72535k42041L55655L92555M93343P0251m67762l50967
12108e31697k14628L04202j55183k88210n216Q604O3585k95555m7927M97424L18540
12097c46061N90842K67001k91829o05859m49388k00719j36865K64509K06035q855
12087g11189L13479M06705j83166n69965K8191R4393j48487m72909n07276j74830
$$ plain form
12077 -1925054 -2062465 -2013590 -1703471 -1537374 -1517132 -1728181 -1743972 -1408262 -1128520 -1121027
12067 -1121027 -1222952 -1183731 -1132840 -841978 -671360 -569969 -483566 259923 713447 426725
12057 426725 302183 607500 726086 664919 575449 317253 147340 128607 336279 276635
12047 276635 -160327 -180028 -149762 -267471 -164995 -16387 25748 -318354 -679011 -481235
12037 -481235 -351496 -889840 -1455201 -1213191 -664313 -471751 -381128 -441065 -574211 -629277
12027 -629277 -526413 -369543 -238455 21422 158960 174484 213679 368687 451709 51110
12017 51110 -373816 -603491 -525355 -152835 -30498 189673 173210 -237089 -611603 -583744
12007 -583744 -187326 509098 996454 1116869 1000445 816132 714899 643661 495491 203632
$$ packed form
12077a925054j37411M8875L10119J66097K0242k11049j5791L35710K79742P493
12067a121027j01925L9221N0891K90862J70618J01391Q6403P43489M53524k86722
12057D26725j24542L05317J18586o1167q9470k58196j69913j8733K07672n9644
12047B76635m36962j9701L0266j17709J02476J48608M2135l44102l60657J97776
12037d81235J29739n38344n65361K42010N48878J92562R0623n9937j33146n5066
12027f29277J02864J56870J31088K59877J37538J5524L9195J55008Q3022m00599
12017E1110m24926k29675P8136L72520J22337K20171j6463m10299l74514K7859
12007e83744L96418O96424M87356J20415j16424j84313j01233p1238j48170k91859
$$ plain form
11997 203632 129080 183337 60863 56909 149208 138130 279139 132224 -202350 -326705 -571732
11986 -571732 -593715 -485554 -161522 473856 576910 -84057 -345794 -211347 94282 315096
11976 315096 535339 525153 -27302 -455585 -417589 -83088 28688 -108984 14366 -54406
11966 -54406 -151581 -317938 -501941 -657462 -839020 -760885 -427829 -229954 -111039 2345
11956 2345 -302628 -431352 -425233 -284380 -141054 4486 -96154 144122 357335 465921
11946 465921 378135 30304 -218613 -296995 -308802 -207731 -113796 -359993 -498307 -195560
11936 -195560 -67183 -547188 -1018763 -754492 -306326 -70151 -160019 -129643 200857 769633
11926 769633 556090 -69703 -451154 -582469 -551977 -797268 -962207 -1340400 -1358749 -964179
$$ packed form
11997B03632p4552N4257j22474l954R2299j1078J41009j46915l34574j24355k45027
11986e71732k1983J08161L24032O35378J03054o60967k61737J34447L05629K20814
11976C15096K20243j0186n52455m28283L7996L34501J11776j37672J23350o8772
11966e4406r7175j66357j84003j55521j81558P8135L33056J97875J18915J13384
11956B345l04973j28724O119J40853J43326J45540j00640K40276K13213J08586
11946D65921q7786l47831k48917p8382j1807J01071R3935k46197j38314L02747
11936a95560J28377m80005m71575K64271M48166K36175q9868L0376L30500N68776
11926G69633k13543o25793l81451j31315L0492k45291j64939l78193j8349L94570
$$ plain form
11916 -964179 -626407 -733204 -696058 -324469 -201671 -111435 298902 576416 635837 337223
11906 337223 140659 -6795 -411772 -609647 -670306 -779227 -436162 25814 377786 665596
11896 665596 821511 907846 1091839 1414052 1358302 1162895 475302 -139837 -34010 262385
11886 262385 381281 641765 659203 642828 788164 770334 480302 82713 268885 430218
11876 430218 219676 -293640 -914971 -1096812 -949826 -717291 -470852 -403278 -197129 256650
11866 256650 404716 573144 1001247 1233460 1168649 919220 963709 1025649 509964 400313
11856 400313 762332 908711 917833 943542 847859 497317 59491 -372633 -591699 -716855
11846 -716855 -422341 92373 305910 439611 525197 464125 309936 23033 -638791 -977882
$$ packed form
11916i64179L37772j06797L7146L71589J22798R0236M10337K77514N9421k98614
11906C37223j96564j47454m04977j97875o0659j08921L43065M61976L51972K87810
11896F65596J55915Q6335J83993L22213n5750j95407o87593o15139J05827K96395
11886B62385J18896K60484J7438j6375J45336j7830k90032l97589J86172J61333
11876D30218k10542n13316o21331j81841J46986K32535K46439O7574K06149M53779
11866B56650J48066J68428M28103K32213o4811k49429M4489O1940n15685j09651
11856D00313L62019J46379R122K5709r5683l50542m37826m32124k19066j25156
11846g16855K94514N14714K13537J33701Q5586o1072j54189k86903o61824l39091
$$ plain form
11836 -977882 -643558 -132479 -56188 -404726 -479450 -496265 -439799 -211936 -2259 -287003
11826 -287003 -146085 159716 -86344 -391690 -785243 -1008566 -1042012 -813502 -648692 -368211
11816 -368211 -28203 203366 496772 885285 1106770 1104867 424401 -309383 -855293 -1041426
11806 -1041426 -687208 -317166 -435549 -460539 -638713 -769563 -828025 -703535 -374591 -428188
11796 -428188 -568393 -585712 -645975 -502494 28754 191243 231208 247709 212819 264262 210554
11785 210554 166350 378219 574264 645804 872131 1307356 1443195 1321648 972154 385615
11775 385615 -123778 -507328 -447832 -168648 45193 127715 -217288 -807862 -957722 -603826
11765 -603826 -350357 -213485 -318702 -499196 -256109 -51561 -417435 -717761 -440373 -261404
$$ packed form
11836i77882L34324N11079P6291l48538p4724j6815N6466K27863K09677k84744
11826b87003J40918L05801k46060l05346l93553k23323l3446K28510J64810K80481
11816c68211L40008K31569K93406L88513K21485j903o80466p33784n45910j86133
11806a041426L54218L70042j18383k4990j78174j30850n8462J24490L28944n3597
11796d28188j40205j7319o0263J43481N31248J62489L9965J6501l4890N1443n3708
11785B10554m4204K11869J96045P1540K26327M35225J35839j21547l49494n86539
11775C85615n09393l83550N9496K79184K13841Q2522l45003n90574j49860L53896
11765f03826K53469J36872j05217j80494K43087K04548l65874l00326K77388J78969
$$ plain form
11755 -261404 -186663 -500267 -836590 -680210 -498396 -412174 -366394 -584262 -297711 -7174
11745 -7174 212850 268453 -209775 -650264 -610066 -470187 -609794 -815379 -872123 -783908 -786416
11734 -786416 -695907 -770147 -597656 368284 567527 -130287 -611186 -914655 -930428 -507095
11724 -507095 -269163 -335705 -276182 11243 8187 -69734 -176223 -141474 -19889 -19473 163236
11713 163236 305124 539449 666736 270010 80410 -5571 474696 882087 794745 884116
11703 884116 902331 743606 606987 363330 625732 1172124 1045021 217231 -659749 -1111172
11693 -1111172 -889589 -746981 -741328 -303828 76426 85656 154869 43536 -395628 -729301
11683 -729301 -1043149 -741083 -219001 279924 284385 120962 -18645 -16852 73275 -34508
$$ packed form
11755b61404P4741l13604l36323J56380J81814Q6222M5780k17868K86551K90537
11745g174K20024N5603m78228m40489M0198J39879j39607k05585n6744Q8215k508
11734g86416R0509p4240J72491R65940J99243o97814m80899l03469j5773M23333
11724e07095K37932o6542N9523K87425l056p7921j06489L4749J21585M16J82709
11713A63236J41888K34325J27287l96726j89600q5981M80267M07391q7342Q9371
11703H84116J8215j58725j36619k43657K62402N46392j27103q27790q76980m51423
11693a111172K21583J42608N653M37500L80254R230O9213j11333m39164l33673
11683g29301l13848L02066N22082M98925M461j63423j39607J793R0127j07783
$$ plain form
11673 -34508 -541373 -1046540 -1100267 -1067964 -914807 -505908 -263451 -196243 -57676 369652
11663 369652 259810 -128208 -329556 -271584 -294460 -333213 -308993 -292332 -103876 4872
11653 4872 123920 311162 -23188 -246368 -222782 -325395 -399924 -560535 -766805 -798659
11643 -798659 -685400 -801833 -583227 256124 872691 1181925 1349147 1042626 238576 -233326
11633 -233326 -550741 -653287 -469029 -693850 -590377 -400643 -182029 -263875 -205695 -232894
11623 -232894 -598449 -711417 -513093 -132663 -148127 -146073 -171957 -290216 -463409 -395021
11613 -395021 -587159 -951634 -741844 -68456 210829 246588 145591 -318246 -663120 -550214
11603 -550214 -98183 446084 506052 119619 -488834 -737550 -741596 -700553 -650763 -528777
$$ packed form
11673c4508n06865n05167n3727L2303J53157M08899K42457O7208J38567M27328
11663C69652j09842l88018k01348N7972k2876l8753K4220J6661J88456J08748
11653D872J19048J87242l34350k23180K3586j02613p4529j60611k06270l1854
11643g98659J13259j16433K18606Q39351O16567L09234J67222l06521q04050m71902
11633b33326l17415j02546J84258k24821J03473J89734K18614q1846N8180k7199
11623b32894l65555j12968J98324L80430j5464K054k5884j18259j73193O8388
11613c95021j92138l64475K09790O73388K79285L5759j00997m63837l44874J12906
11603e50214M52031N44267N9968l86433o08453k48716m046M1043M9790J21986
$$ plain form
11593 -528777 -384327 -342555 -513920 -647893 -654725 -508599 -485554 -610278 -708172 -767622 -493218
11582 -493218 13868 294823 199307 -402128 -433648 -150962 -29280 201878 637254 739956
11572 739956 242645 -364318 -549186 -607413 -655062 -355198 311255 639527 473858 480806
11562 480806 676439 768055 624519 247130 -195550 -534392 -682316 -676012 -244373 168253
11552 168253 143924 69141 76354 -149355 -516642 -333031 -126384 202966 369162 69757
11542 69757 111423 -45491 -479449 -545372 -583888 -140918 96267 -13460 -132663 -172066
11532 -172066 -11537 246292 277449 452932 543303 380831 67714 -214319 -242584 -511823
11522 -511823 -1052775 -1068613 -762856 -495896 34400 43331 -107496 -117826 -386669 -554306
$$ packed form
11593e28777J44450M1772j71365j33973o832J46126K3045j24724r7894n9450K74404
11582d93218N07086K80955r5516o01435l1520K82686J21682K31158M35376J02702
11572G39956m97311o06963j84868n8227m7649K99864O66453L28272j65669O948
11562D80806J95633R1616j43536l77389m42680l38842j47924O304M31639M12626
11552A68253k4329p4783P213k25709l67287J83611K06647L29350J66196k99405
11542F9757M1666j56914m33958o5923l8516M42970K37185j09727j19203l9403
11532a72066J60529K57829L1157J75483R0371j62472l13117k82033k8265k69239
11522e11823n40952j5838L05757K66960N30296Q931j50827j0330k68843j67637
$$ plain form
11512 -554306 -619603 -442799 -195222 392193 659583 189185 -28218 -23723 82590 520579
11502 520579 540833 692763 1031152 943616 791626 591070 557755 553874 490046 615156 693320
11491 693320 466144 377607 199287 57404 -115391 -241850 -482145 -453747 203639 780292
11481 780292 934602 849079 526272 412491 549620 429983 436305 374604 261433 635267
11471 635267 1193619 1386015 1174393 1329136 1301080 1311411 834662 480534 247603 225250
11461 225250 352699 23053 -192139 -62945 314306 271838 -32937 -56688 305528 261787
11451 261787 71481 -95992 -104522 -331735 -536298 -560026 -517000 -629938 -435785 3273
11441 3273 287792 612011 897284 713945 189759 79592 320724 765450 993797 900120
$$ packed form
11512e54306o5297J76804K47577N87415K67390m70398k17403M495J06313M37989
11502E20579K0254J51930L38389q7536j51990k00556l3315l881o3828J25110P8164
11491F93320k27176q8537j78320j41883j72795j26459k40295K8398O57386N76653
11481G80292J54310q5523l22807j13781J37129j19637O322o1701j13171L73834
11471F35267N58352J92396k11622J54743k8056J0331m76749l54128k32931k2353
11461B25250J27449l29646k15192J29194L77251m2468l04775k3751L62216m3741
11451B61787j90306j67473q530k27213k04563k3728M3026j12938J94153M39058
11441C273K84519L24219K85273j83339n24186j10167K41132M44726K28347r3677
$$ plain form
11431 900120 509107 241569 841514 1651738 1005460 584560 442035 399254 330549 47810
11421 47810 -107520 -76576 -131975 -246510 233346 205791 -410750 -409021 321889 733622 407083
11410 407083 -194283 -402052 -376664 72499 535624 783631 850019 995282 862771 593645
11400 593645 323212 249957 386829 353501 454058 649350 663984 589673 371431 471778
11390 471778 575900 243252 -1758 49942 295427 481933 289360 -6611 112805 342738
11380 342738 398955 361053 376843 84539 -181803 -88152 45357 21339 -287654 -291512 -403665
11369 -403665 -769471 -1092199 -992670 -647943 -573778 -892910 -1101080 -841854 -540651 -317278
11359 -317278 -613423 -1062383 -1152893 -659742 -89549 153491 212920 87041 -132500 -102125
$$ packed form
11431I00120l91013k67538N99945Q10224o46278m20900j42525m2781o8705k82739
11421D7810j55330L0944n5399j14535M79856k7555o16541J729P30910M11733l26539
11410D07083o01366k07769K5388M49163M63125K48007O6388J45263j32511k69126
11400E93645k70433p3255J36872l3328J00557J95292J4634p4311k18242J00347
11390D71778J04122l32648k45010N1700K45485J86506j92573k95971J19416K29933
11380C42738N6217l7902J5790k92304k66342R3651J33509k4018l08993l858j12153
11369d03665l65806l22728R9529L44727P4165l19132k08170K59226L01203K23373
11359c17278k96145m48960r0510M93151N70193K43040N9429j25879k19541L0375
$$ plain form
11349 -102125 -55833 -224676 -543190 -923651 -704446 -29080 143701 -476010 -855279 -362122
11339 -362122 91854 -422213 -900602 -575258 -214346 -255219 -120899 -46281 -327373 -784412
11329 -784412 -831260 -658203 -26566 328265 231112 384034 559231 576411 365298 142355
11319 142355 -256992 -532960 -593003 -750413 -658698 -454141 74603 203009 24530 -133451
11309 -133451 131343 415522 441486 329756 125769 -354561 -427073 -231944 -214898 67
11299 67 537944 958435 1171657 981776 374326 -173741 -31263 378955 514554 445329
11289 445329 60963 -256061 -363761 -374204 -497977 -675444 -627559 -475620 -249125 -169326
11279 -169326 -227969 -350629 -397218 -727879 -1195561 -1160007 -879350 -914126 -1009112 -566613
$$ packed form
11349a02125M6292j68843l18514l80461K19205O75366J72781o19711l79269M93157
11339c62122M53976n14067m78389L25344L60912m0873J34320P4618k81092m57039
11329g84412m6848J73057O31637L54831r7153J52922J75197J7180k11113k22943
11319A42355l99347k75968o0043j57410R1715K04557N28744J28406j78479j57981
11309a33451K64794K84179K5964j11730k03987m80330p2512J95129J7046K14965
11299F7N37877M20491K13222j89881o07450n48067J42478M10218J35599o9225
11289D45329l84366l17024j07700j0443j23773j77467M7885J51939K26495P9799
11279a69326n8643j22660m6589l30661m67682L5554K80657l4776r4986M42499
$$ plain form
11269 -566613 -181974 -13016 26614 -8636 75234 382781 500586 237479 -107417 -15692
11259 -15692 336318 -27260 -418418 -224559 13443 130966 311370 267671 18654 -128906
11249 -128906 -339459 -514499 -769938 -954235 -1042925 -929821 -684950 -652847 -503196 -533603
11239 -533603 -733764 -772525 -435342 -393985 -674960 -896801 -919799 -514563 -130404 60060
11229 60060 -132446 -392540 -708616 -576939 128049 475135 521470 500392 336007 403108
11219 403108 414504 405810 280994 -63848 -423735 -569138 -414895 4954 172797 205634
11209 205634 335204 537304 94614 -439664 -502183 -96937 4671 147528 375454 568940
11199 568940 706183 1020926 1304604 1510124 1708932 1307910 790799 469264 142893 -226913
$$ packed form
11269e66613L84639J68958L9630l5250Q3870L07547J17805k63107l44896R1725
11259a5692L52010l63578l91158J93859K38002J17523J80404m3699k49017j47560
11249a28906k10553j75040k55439j84297q8690J13104K44871L2103J49651l0407
11239e33603k00161l8761L37183M1357k80975k21841k2998M05236L84159J90464
11229F0060j92506k60094l16076J31677P04988L47086M6335k1078j64385O7101
11219D03108J1396q694j24816l44842l59887j45403J54243M19849J67843L2837
11209B05634J29570K02100m42690n34278o2519M05246J01608J42857K27926J93486
11199E68940J37243L14743K83678K05520J98808m01022n17111l21535l26371l69806
$$ plain form
11189 -226913 -20795 62911 251781 570690 1131068 1034405 90179 -412760 -295051 260594
11179 260594 728377 1199222 1819899 2027182 1652480 1294183 1192249 1374578 1181583 641446
11169 641446 454606 255705 -150121 -196187 164666 424922 531907 551766 280186 234740
11159 234740 465497 105720 -365784 -493109 -472409 -357950 -360962 -553003 -619798 -632226
11149 -632226 -425057 -61924 305112 676533 743734 406156 -135549 -252901 -111716 88489
11139 88489 23087 -347969 -904831 -1109901 -1149278 -981127 -593606 -365882 -282809 -265298
11129 -265298 -513914 -590952 -523042 -547370 -888302 -1168654 -1474042 -1460543 -1465536 -1633515 -1833257
11118 -1833257 -2045280 -2115028 -2033604 -1682345 -1148182 -834771 -582067 -307603 -386301 -150955
$$ packed form
11189b26913K06118Q3706J88870L18909N60378r6663r44226n02939J17709N55645
11179B60594M67783M70845O20677K07283l74702l58297j01934J82329j92995n40137
11169F41446j86840j98901m05826m6066L60853K60256J06985J9859k71580m5446
11159B34740K30757l59777m71504j27325K0700J14459l012j92041o6795j2428
11149f32226K07169L63133L67036L71421O7201l37578n41705j17352J41185K00205
11139H8489o5402l71056n56862k05070l9377J68151L87521K27724Q3073J7511
11129b65298k48616p7038O7910k4328l40932k80352l05388J3499m993j67979j99742
11118a833257k12023o9748Q1424L51259N34163L13411K52704K74464p8698K35346
$$ plain form
11108 -150955 -21080 63026 36438 -232610 -705499 -1081990 -1430830 -1781626 -1744501 -1639398
11098 -1639398 -780068 -141614 -241508 -237432 -334849 -427829 -201111 17806 151171 -163743
11088 -163743 -497369 -556166 -169098 1398 -263471 -244025 -211754 -129795 -62695 21543 -142199
11077 -142199 17228 117169 227583 390400 240255 -72363 -368162 -386762 -390769 -524828
11067 -524828 -838831 -1220100 -1463599 -1482490 -1424840 -1416725 -1404722 -1135913 -1157376 -1116898 -521774
11056 -521774 95890 547865 600610 176965 93106 299576 741999 626470 300673 417594
11046 417594 823089 1052723 928344 1058793 816328 264438 404505 556024 488036 364875
11036 364875 149291 24898 -202227 318440 1008156 1218281 784460 372180 333579 253281
$$ packed form
11108a50955J29875Q4106k6588k69048m72889l76491l48840l50796L7125J05103
11098a639398Q59330O38454r9894M076r7417r2980K26718K18917J33365l14914
11088a63743l33626n8797L87068J70496k64869J9446L2271Q1959O7100Q4238j63742
11077a42199J59427R9941J10414J62817j50145l12618k95799j8600m007j34059
11067e24828l14003l81269k43499j8891N7650Q115J2003K68809k1463M0478N95124
11056e21774O17664M51975N2745m23645q3859K06470M42423j15529l25797J16921
11046D17594M05495K29634j24379J30449k42465n51890J40067J51519o7988j23161
11036C64875k15584j24393k27125N20667O89716K10125m33821m12280l8601q0298
$$ plain form
11026 253281 248100 493171 609377 648899 254608 -381957 -567981 -716762 -704797 -758489
11016 -758489 -706649 -489930 -637607 -1148401 -1095475 -458561 241779 761175 931396 786664
11006 786664 682389 984540 976148 686670 424463 208788 -195307 -498992 -309029 -268612
10996 -268612 -361820 -350800 -238645 -392225 -697285 -989409 -1205897 -1058857 -975077 -1019189
10986 -1019189 -1014689 -717719 -372414 157465 78780 278836 482532 198594 90594 162509
10976 162509 729243 776132 798082 1102105 1367557 1240749 739962 954619 856524 130007
10966 130007 -181204 107657 460913 464385 556855 571445 -30182 -489782 -689296 -474387
10956 -474387 32993 277461 19227 -762331 -1428761 -1361537 -969830 -927697 -892874 -746159
$$ packed form
11026B53281n181K45071J16206L9522l94291o36565j86024j48781J1965n3692
11016g58489N1840K16719j47677n10794N2926O36914P00340N19396J70221j44732
11006G86664j04275L02151q392k89478k62207k15675m04095l03685J89963M0417
10996b68612r3208J1020J12155j53580l05060k92124k16488J47040Q3780m4112
10986a019189M500K96970L45305N29879p8685K00056K03696k83938j08000P1915
10976A62509N66734M6889K1950L04023K65452j26808n00787K14657r8095p26517
10966A30007l11211K88861L53256L472R2470J4590o01627m59600j99514K14909
10956d74387N07380K44468k58234p81558o66430O7224L91707M2133L4823J46715
$$ plain form
10946 -746159 -507701 -224470 -47005 177377 536202 1017141 890192 295478 258397 677711
10936 677711 985350 872543 485723 315287 288329 381283 314155 -198797 -593812 -539541
10926 -539541 -499939 -796001 -937943 -719061 -309089 -64077 180222 500601 650383 679119
10916 679119 472476 383403 682688 998256 1028428 898330 1075166 1083275 891385 840126
10906 840126 607111 473529 904605 1399541 2004697 2619763 2970313 3291766 3629140 3587112
10896 3587112 3838798 4358290 4149233 3072690 2454309 1836997 1154000 1280282 1423122
10887 1423122 938208 537312 539788 520416 538891 881636 1080790 789527 362200 162946
10877 162946 261761 213232 297953 412934 529112 823552 1104783 1125386 775641 647276
$$ packed form
10946g46159K38458K83231J77465K24382L58825M80939j26949n94714l7081M19314
10936F77711L07639j12807l86820j70436k6958R2954o7128n12952l95015N4271
10926e39541L9602k96062j41942K18882M09972K45012K44299L20379J49782K8736
10916F79119k06643q9073K99285L15568L0172j30098J76836Q109j91890n1259
10906H40126k33015j33582M31076M94936O05156O15066L50550L21453L37374m2028
10896C587112K51686N19492k09057j076543o18381o17312o82997J26282J42840
10887A423122m84914m00896K476j9372J8475L42745J99154k91263m27327j99254
10877A62946R8815m8529Q4721J14981J16178K94440K81231K0603l49745j28365
$$ plain form
10867 647276 363307 94082 9787 78118 -117605 -272186 -67996 53915 -61873 -389604
10857 -389604 -257989 -127800 -119868 -145123 -146138 -79423 38979 65059 -212134 -620242 -952081
10846 -952081 -1243849 -1110233 -841649 -631433 -619256 -590566 -558180 -163799 229822 105318
10836 105318 -220981 63402 670225 838010 626324 390258 156569 12375 -223290 -181791
10826 -181791 92323 179415 -78286 -458318 -987003 -1282544 -1119364 -792678 -592606 -468022
10816 -468022 -317931 -314207 -545183 -137147 229469 291199 434238 448581 366154 324495 104615
10805 104615 -93709 -286261 -272674 -88744 191831 104355 -78845 -52334 -117133 -144518
10795 -144518 -337815 -520812 -786245 -858907 -1075396 -1458510 -1686991 -1777382 -1617146 -1186240
$$ packed form
10867F47276k83969k69225q4295O8331j95723j54581K04190J21911j15788l27731
10857c89604J31615J30189P932k5255j015O6715J18402K6080k77193m08108l31839
10846i52081k91768J33616K68584K10216J2177K8690L2386L94381L93621j24504
10836A05318l26299K84383O06823J67785k11686k36066k33689j44194k35665M1499
10826a81791K74114Q7092k57701l80032n28685k95541J63180L26686K00072J24584
10816d68022J50091L724k30976M08036L66616O1730J43039J4343q2427m1659k19880
10805A04615j98324j92552J3587J83930K80575q7476j83200K6511o4799k7385
10795a44518j93297j82997k65433p2662k16489l83114k28481r0391J60236M30906
$$ plain form
10785 -1186240 -1120100 -1036771 -888398 -590919 -172062 -11794 -22703 54312 -309233 -500975
10775 -500975 -593247 -690130 -442761 -106554 216462 683508 734930 277682 -35101 -78193
10765 -78193 -168052 -347425 -265604 -356726 -480436 -194338 -261757 -278625 -302242 -683709 -807752
10754 -807752 -678031 8090 294915 268755 342143 445344 563367 588611 572866 240082
10744 240082 -213477 -61303 3809 2269 -66826 -570150 -395618 18894 307943 484970
10734 484970 381786 84624 -70873 -13087 164385 458677 287227 122658 -70335 -561686
10724 -561686 -681394 -499502 -471369 -300986 97586 44031 -392897 -486687 -149534 -220471
10714 -220471 -379870 -284548 -230591 -153525 -76935 -354311 -603071 -388115 -461831 -719893
$$ packed form
10785a186240O6140Q3329J48373K97479M18857J60268j0909P7015l63545j91742
10775e00975r2272r6883K47369L36207L23016M67046N1422m57248l12783m3092
10765g8193q9859j79373Q1821r1122j23710K86098o7419j6868k3617l81467j24043
10754h07752J29721O86121K86825k6160P3388J03201J18023K5244j5745l32784
10744B40082m53559J52174O5112j540o9095n03324J74532M14512K89049J77027
10734D84970j03184k97162j55497N7786J77472K94292j71450j64569j92993m91351
10724e61686j19708J81892K8133J70383L98572n3555m36928r3790L37153p0937
10714b20471j59399R5322N3957P7066P6590k77376k48760K14956p3716k58062
$$ plain form
10704 -719893 -918952 -1033490 -697388 -350761 -533154 -605927 -527060 -144048 -270833 -510333
10694 -510333 -347499 -681734 -603445 -3547 413057 578990 893167 965043 707548 241899
10684 241899 -372552 -739356 -553090 -88232 574036 1029308 691677 52802 -172841 -139904
10674 -139904 -218015 -294631 -284706 -283219 -401619 -334535 262876 748248 1104075 1087053 1016627
10663 1016627 910054 273998 -124427 -293521 -416053 -425783 -101048 334180 446763 409646
10653 409646 -4522 -430540 -709402 -290780 444737 455993 525252 712581 649060 605501
10643 605501 127158 -91983 -37243 -57836 123427 489190 464308 -102305 -557823 -638319
10633 -638319 -290848 -46928 -148356 -327935 -311026 -426407 -532961 -617814 -843626 -1014179
$$ packed form
10704g19893j99059j14538L36102L46627j82393p2773P8867L83012j26785k39500
10694e10333J62834l34235P8289N99898M16604J65933L14177P1876k57495m65649
10684B41899o14451l66804J86266M64858O62268M55272l37631o38875k25643L2937
10674a39904p8111p6616R925J487j18400O7084N97411M85372L55827j7022p0426
10663A016627j06573o36056l98425j69094j22532r730L24735M35228J12583l7117
10653D09646m14168m26018k78862M18622P35517J1256O9259J87329o3521m3559
10643F05501m78343k19141N4740k0593J81263L65763k4882n66613m55518q0496
10633f38319L47471K43920j01428j79579J6909j15381j06554q4853k25812j70553
$$ plain form
10623 -1014179 -1127639 -1663951 -1823745 -1515550 -839705 637 414387 626449 660441 231709
10613 231709 -106698 -281602 -421013 -198072 32986 224634 279019 75387 -131003 289863
10603 289863 815659 680206 396159 375981 439474 552649 457899 265920 223574 -204294
10593 -204294 -358813 -264680 -523606 -591999 -412382 -541063 -1021825 -1165620 -987551 -780417
10583 -780417 -652134 -562990 -186501 -19267 -92690 -51868 -39747 179920 345408 210039
10573 210039 -18927 -203508 -297173 -253796 -98079 329235 482940 495735 94781 -211151
10563 -211151 -133839 160912 482043 426577 368086 360754 167369 -52584 74765 318140
10553 318140 305828 237033 196320 -52151 -16673 76133 -183137 -189763 59132 331242 624521
$$ packed form
10623a014179j13460n36312j59794L08195O75845Q40342M13750K12062L3992m28732
10613B31709l38407j74904j39411K22941K31058J91648N4385k03632k06390M20866
10603B89863N25796j35453k84047k0178O3493J13175r4750j91979m2346m27868
10593b04294j54519R4133k58926o8393J79617j28681m80762j43795J78069K07134
10583g80417J28283Q9144L76489J67234p3423M0822J2121K19667J65488j35369
10573B10039k28966j84581r3665M3377J55717M27314J53705J2795m00954l05932
10563b11151P7312K94751L21131n5466n8491p332j93385k19953J27349K43375
10553C18140j2312o8795m0713k48471L5478R2806k59270o626K48895K72110K93279
$$ plain form
10542 624521 1015902 1342563 1319211 1108144 725194 123258 -151057 35071 46252 -41264
10532 -41264 -139584 -75027 -108910 -224845 150267 274293 350562 598183 564911 616012 432686
10521 432686 130745 127987 79728 56471 696514 1191580 856006 596310 653914 834757
10511 834757 900428 872433 535966 313799 461297 584524 297986 -122660 -125451 -245893
10501 -245893 -91053 -51021 -591981 -872352 -627417 -751388 -517232 -31533 -88461 -22376
10491 -22376 12716 88670 -137484 -790662 -872917 -354955 327698 403032 180572 204552 102526
10480 102526 -50354 -77094 -40823 8263 191622 380614 585578 850141 1123392 1135506
10470 1135506 1106300 853030 434015 174755 188267 241281 256196 229686 -145536 -231920
$$ packed form
10542F24521L91381L26661k3352k11067l82950o01936k74315J86128J1181q7516
10532d1264r8320O4557l3883j15935L75112J24026P6269K47621l3272N1101j83326
10521D32686l01941k758m8259k3257O40043M95066l35574k59696N7604J80843
10511H34757O5671k7995l36467k22167J47498J23227k86538m20646k791j20442
10501b45893J54840M0032n40960k80371K44935j23971K34156M85699n6928O6085
10491b2376L5092P5954k26154o53178q2255N17962O82653P5334k22460K3980j02026
10480A02526j52880k6740L6271M9086J83359J88992K04964K64563K73251J2114
10470A135506k9206k53270m19015k59260J3512N3014J4915k6510l75222q6384
$$ plain form
10460 -231920 113862 576546 687005 614782 615836 324217 158293 -172450 -564231 -333868
10450 -333868 90132 54366 -320830 -999215 -1422866 -1399742 -1174599 -975403 -604791 -517851
10440 -517851 -596953 -545863 -437314 -17070 239463 360288 151190 7608 -237075 -553686
10430 -553686 -789863 -974205 -1040604 -1000702 -577441 -325941 -377686 -392895 -503192 -705971
10420 -705971 -517190 -457902 -969221 -1364106 -1355783 -1340149 -1195109 -1073377 -890164 -939897
10410 -939897 -615142 138740 664542 781581 664073 545901 295494 237987 -175802 -636127
10400 -636127 -778342 -601674 -547042 -717682 -908026 -977226 -446224 -249216 -437519 -343864
10390 -343864 134858 452224 16478 -280265 19616 231866 -53486 -33682 74954 135788
$$ packed form
10460b31920L45782M62684J10459p2223J054k91619j65924l30743l91781K30363
10450c33868M24000l5766l75196o78385m23651K3124K25143J99196L70612Q6940
10440e17851p9102N1090J08549M20244K56533J20825k09098j43582k44683l16611
10430e53686k36177j84342o6399L9902M23261K51500n1745j5209j10297k02779
10420g05971J88781N9288n11319l94885Q323J5634J45040J21732J83213m9733
10410i39897L24755P53882N25802J17039j17508j18172k50407n7507m13789m60325
10400f36127j42215J76668N4632j70640j90344o9200N31002J97008j88303R3655
10390c43864M78722L17366m35746k96743K99881K12250k85352J9804J08636O0834
$$ plain form
10380 135788 -51325 -455359 -833128 -806282 -427978 140106 469665 252463 218691 572053
10370 572053 876741 631504 258616 320498 805330 980373 680247 297396 188826 312761
10360 312761 622392 786206 845144 852558 624976 395926 270637 403470 219873 160205
10350 160205 360794 541022 781850 796847 1078812 1479537 1334960 971858 700194 325180
10340 325180 55091 -166753 -217236 232233 345598 5405 -204408 -286098 -143126 -108428
10330 -108428 -286592 -628243 -925613 -849264 -712624 -805881 -1009034 -1168515 -744100 -59594
10320 -59594 -65923 -588658 -786846 -753738 -116159 345424 -71555 -521558 -809232 -918423
10310 -918423 -689789 -366210 -127082 -365712 -451941 -408459 -308275 52078 277716 371867
$$ packed form
10380A35788j87113m04034l77769K6846L78304N68084L29559k17202l3772L53362
10370E72053L04688k45237l72888O1882M84832J75043l00126l82851j08570J23935
10360C12761L09631J63814N8938P414k27582k29050j25289J32833j83597n9668
10350A60205K00589J80228K40828J4997K81965M00725j44577l63102k71664l75014
10340C25180k70089k21844n0483M49469J13365l40193k09813q1690J42972L4698
10330a08428j78164l41651k97370P6349J36640r3257k03153j59481M24415O84506
10320e9594o329n22735j98188L3108O37579M61583m16979m50003k87674j09191
10310i18423K28634L23579K39128k38630q6229M3482J00184L60353K25638R4151
$$ plain form
10300 371867 401183 101652 -144643 15208 -123637 -274175 -385394 -462747 -597032 -712980
10290 -712980 -381116 -362972 -453243 -155111 -232318 -451760 -311450 348897 514048 217581
10280 217581 46309 -57793 -193353 -131224 -150457 -145747 49973 270905 64288 -158063
10270 -158063 -454279 -727654 -409573 -255858 -583946 -914541 -789675 -532885 -355269 -478736
10260 -478736 -435692 -54910 306006 614224 912844 881443 623563 381718 -1310 -4750
10250 -4750 143319 372268 294762 183991 184744 360970 397509 407153 52717 -317109 -306456
10239 -306456 -251406 96613 326147 458757 721589 800859 455290 129134 -76612 58126
10229 58126 271043 364272 160137 -162805 -315205 -675233 -637506 -123886 251151 69182
$$ packed form
10300C71867K9316k99531k46295J59851j38845j50538j11219p7353j34285j15948
10290g12980L31864J8144r0271K98132p7207k19442J40310O60347J65151k96467
10280B17581j71272j04102j35560O2129j9233M710J95720K20932k06617k22351
10270a58063k96216k73375L18081J53715l28088l30595J24866K56790J77616j23467
10260d78736M3044L80782L60916L08218K98620l1401k57880k41845l83028l440
10250d750J48069K28949p7506j10771P53J76226L6539R644l54436l69826J0653
10239c06456N5050L48019K29534J32610K62832P9270l45569l26156k05746J34738
10229E8126K12917R3229k04135l22942j52400l60028L7727N13620L75037j81969
$$ plain form
10219 69182 345051 512186 216639 327578 391225 -14671 -147049 -1679 15935 -124662
10209 -124662 -536227 -546606 -262274 -18103 -115803 -433396 -527833 -386572 10235 322356
10199 322356 746594 940788 638452 228654 -175207 -337735 -365687 -321570 -428714 -235353
10189 -235353 255205 473169 499910 432437 119178 -405114 -562171 -547086 -409180 -95781
10179 -95781 -58324 -101383 -403207 -973546 -1351272 -1212520 -732247 -261589 211008 429959
10169 429959 161486 225486 474266 480187 418821 133660 -354142 -566425 -284891 163666
10159 163666 260227 304325 704977 792246 456784 -100838 -422850 -521987 -511837 -475227 -474659
10148 -474659 -308299 -228418 -576606 -756158 -956248 -1257958 -1406462 -1093802 -722748 -772443
$$ packed form
10219F9182K75869J67135k95547J10939O3647m05896j32378J45370J7614j40597
10209a24662m11565j0379K84332K44171r7700l17593r4437J41261L96807L12121
10199C22356M24238J94194l02336m09798m03861j62528k7952M4117j07144J93361
10189b35353M90558K17964K6741o7473l13259n24292j57057J5085J37906L13399
10179i5781L7457m3059l01824n70339l77726J38752M80273M70658M72597K18951
10169D29959k68473O4000K48780N921o1366k85161m87802k12283K81534M48557
10159A63666R6561M4098M00652Q7269l35462n57622l22012r9137J0150L6610N68
10148d74659J66360P9881l48188j79552k00090l01710j48504L12660L71054m9695
$$ plain form
10138 -772443 -859377 -857218 -971071 -1171638 -1219622 -982996 -711469 -404366 -471351 -415543 -288258
10127 -288258 -331587 -402671 -261726 -73064 244446 157759 -145159 64678 -162664 -324449
10117 -324449 -465063 -429399 -72467 160686 117216 88494 19303 13506 -55087 192032 -4953
10106 -4953 69872 448647 294769 -17245 -142253 -518919 -845763 -1176909 -1327032 -1234014
10096 -1234014 -1441566 -1157357 -639892 -332121 -167349 -172861 -221558 -366384 -375566 -260849
10086 -260849 -39437 174797 163685 -300778 -177093 341186 602515 461860 371320 403188
10076 403188 350038 533400 773624 806755 788584 780047 903298 698101 95388 -30427
10066 -30427 216116 429426 -28923 -348039 -332374 -640022 -689623 -251303 -151810 -401692
$$ packed form
10138g72443q6934K159j13853k00567m7984K36626K71527L07103o6985N5808J27285
10127b88258m3329p1084J40945J88662L17510q6687l02918K09837k27342j61785
10117c24449j40614L5664L56932K33153m3470k8722o9191n797o8593K47119j96985
10106d953P4825L78775j53878l12014j25008l76666l26844l31146j50123R3018
10096a234014k07552K84209N17465L07771J64772n512m8697j44826r182J14717
10086b60849K21412K14234j1112m64463J23685N18279K61329j40655r0540L1868
10076D03188n3150J83362K40224L3131j8171q537J23251k05197o02713j25815
10066c0427K46543K13310m58349l19116J5665l07648m9601M38320R9493k49882
$$ plain form
10056 -401692 -279496 -424632 -571932 -255250 27205 206273 22412 73646 454780 856789
10046 856789 1239712 1438425 1052407 792123 575855 113233 -293441 -678603 -1032918 -1576687
10036 -1576687 -1702301 -1411339 -1109966 -544225 -569544 -691630 -231454 94981 106711 -214362
10026 -214362 -299965 -497664 -650390 -652093 -180771 480783 615212 297018 -232640 -450659
10016 -450659 -789756 -713313 -59538 669041 822697 754796 728650 385739 -42984 23562
10006 23562 394381 722897 943330 1299601 1129738 407587 -24343 12326 27657 -67119
9996 -67119 -160134 -217174 -114828 -412389 -717186 -741157 -645034 -303595 -7472 68930 -22334
9985 -22334 -156391 -90579 -174229 -653724 -1049334 -1422977 -1722854 -1492995 -1026190 -705041
$$ packed form
10056d01692J22196j45136j47300L16682K82455J79068j83861N1234L81134M02009
10046H56789L82923J98713l86018k60284k16268m62622m06674l85162l54315n43769
10036a576687j25614K90962L01373N65741k5319j22086M60176L26435J1730l21073
10026b14362q5603j97699j52726j703M71322O61554J34429l18194n29658k18019
10016d50659l39097P6443O53775P28579J53656o7901k6146l42911m28723O6546
10006B3562L70819L28516K20433L56271j69863p22151m31930L6669J5331r4776
9996f7119r3015n7040J02346k97561l04797k3971R6123L41439K96123P6402r1264
9985b2334j34057O5812q3650m79495l95610l73643k99877K29859M66805L21149
$$ plain form
9975 -705041 -716123 -750407 -907261 -1012259 -987013 -601066 -313216 -251437 289767 668336
9965 668336 216026 -554681 -651549 -286522 74376 430507 489737 131309 -369824 -512760
9955 -512760 -374685 -264744 -222835 -32260 -159082 -377039 -167625 -49179 -656217 -1175161
9945 -1175161 -1203298 -1016916 -828947 -227279 314765 356001 232796 2812 63203 207539
9935 207539 110817 108277 -199227 -743193 -781912 -708399 -886186 -1141967 -1169044 -1026956 -666838
9924 -666838 -438115 -373207 -411129 -553466 -308173 -6509 379081 779408 795777 687160
9914 687160 936986 852858 521317 318835 336108 196185 21377 -30585 -63192 -187144
9904 -187144 -249078 -378804 -570733 -580822 -227152 19341 68204 126648 320351 648929
$$ packed form
9975g05041j1082l4284j56854j04998K5246L85947K87850O1779N41204L78569
9965F68336m52310p70707r6868L65027L60898L56131N9230l58428n01133j42936
9955e12760J38075J09941M1909J90575j26822k17957K09414J18446o07038n18944
9945a175161k8137J86382J87969O01668N42044M1236j23205k29984O0391J44336
9935B07539r6722k540l07504n43966l8719P3513j77787k55781k7077J42088L60118
9924f66838K28723O4908l7922j42337K45293L01664L85590M00327J6369j08617
9914F87160K49826q4128l31541k02482J7273j39923j74808n1962l2607j23952
9904a87144o1934j29726j91929j0089L53670K46493M8863N8444J93703L28578
$$ plain form
9894 648929 823392 700437 542771 358488 41019 -200462 -311644 -156760 -192750 -251428
9884 -251428 9106 359465 503931 214267 -202050 -293454 32617 315896 555930 432203
9874 432203 466016 675077 674587 499274 497291 648765 781717 935990 954542 712864 490469
9863 490469 357456 238356 306770 444686 233799 -145362 -335825 -47987 149515 -118190
9853 -118190 -165731 -365003 -503132 -252935 93061 587923 996380 1041045 895166 1122742
9843 1122742 1599561 1501172 1082929 445455 -105712 -345603 -418082 -230200 -350626 -700794
9833 -700794 -785911 -254615 443532 369112 -58747 -39386 133625 216350 153510 -263321 -304132
9822 -304132 -49230 -35241 456160 1074422 1039990 477568 -13231 399392 1233086 1301093
$$ packed form
9894F48929J74463j22955j57666j84283l17469k41481j11182J54884l5990n8678
9884b51428K60534L50359J44466k89664m16317r1404L26071K83279K40034j23727
9874D32203L3813K09061m90j75313j983J51474J32952J54273J8552k41678k22395
9863D90469j33013j19100O8414J37916k10887l79161j90463K87838J97502k67705
9853a18190m7541j99272j38129K50197L45996M94862M08457M4665j45879K27576
9843A122742M76819r8389m18243o37474n51167k39891p2479J87882j20426l50168
9833g00794q5117N31296O98147p4420m27859J9361J73011Q2725o2840m16831m0811
9822c04132K54902J3989M91401O18262l4432n62422m90799M12623Q33694O8007
$$ plain form
9812 1301093 506293 99629 284094 319170 245415 446330 795533 932986 672224 815610
$$ packed form
9812A301093p94800m06664J84465L5076p3755K00915L49203J37453k60762J43386
$$ [...]
##END NTUPLES=NMR SPECTRUM
##END=
