##TITLE=C13_SR45z
 CDCl3, 600 sc

 28.4.2021
##JCAMPDX= 6.0         $$ Bruker NMR JCAMP-DX V2.0
##DATA TYPE= NMR SPECTRUM
##DATA CLASS= NTUPLES
##ORIGIN= UXNMR, Bruker Analytische Messtechnik GmbH
##OWNER= root
$$ XWIN-NMR		Version 3.5
$$ Wed Apr 28 16:40:49 2021 Russian Standard Time (UT+4h)  she@DPX200
##.OBSERVE FREQUENCY= 50.327896
##.OBSERVE NUCLEUS= ^13C
##.ACQUISITION MODE= SIMULTANEOUS
##.ACQUISITION SCHEME= undefined
##.AVERAGES= 1725
##.DIGITISER RES= 17
##SPECTROMETER/DATA SYSTEM= spect
##.PULSE SEQUENCE= zgpg30
##.SOLVENT NAME= D2O
##.SHIFT REFERENCE= (INTERNAL, D2O, 0, 222.653)
##AUDIT TRAIL= $$ (NUMBER, WHEN, WHO, WHERE, WHAT)
$$ ##TITLE= Audit trail, XWIN-NMR		Version 3.5
$$ ##JCAMPDX= 5.01
$$ ##ORIGIN= Bruker BioSpin GmbH
$$ ##OWNER= she
$$ F:/spectra/data/she/nmr/c13/1/pdata/1/auditp.txt
$$ ##AUDIT TRAIL=  $$ (NUMBER, WHEN, WHO, WHERE, WHAT)
(   1,<2021-04-28 16:35:40.34 +0400>,<she>,<DPX200>,
      <created by zg, POWCHK disabled, PULCHK disabled
       terminated by command 'halt'
       configuration hash MD5:
       00 E9 B6 7A A2 85 ED C7 34 08 36 98 17 FE 4E 26
       data hash MD5: 32K
       CF 4D 20 55 18 CD 07 5C 76 5A 8D 42 26 57 A1 79>)
(   2,<2021-04-28 16:35:44.04 +0400>,<she>,<DPX200>,
      <Start of raw data processing
       efp BC_mod = 2 LB = 1 FT_mod = 6 PKNL = 1 PHC0 = -283.7402 PHC1 = 35.36242 SI = 32K 
       data hash MD5: 32K
       CB 53 01 1A 55 DB 7B BA EB 89 99 87 EE 11 94 41>)
(   3,<2021-04-28 16:35:47.20 +0400>,<she>,<DPX200>,
      <abs ABSG = 5 
       data hash MD5: 32K
       DD 87 87 F0 AC F4 A3 94 D1 D1 C3 CB A5 DD EC F1>)
(   4,<2021-04-28 16:36:13.65 +0400>,<she>,<DPX200>,
      <pk PHC0 = -5.447726 PHC1 = 9.000006 
       data hash MD5: 32K
       BF 91 68 46 2D 6B 23 BB FC C4 14 FE CB C6 D2 34>)
(   5,<2021-04-28 16:36:17.12 +0400>,<she>,<DPX200>,
      <abs ABSG = 5 
       data hash MD5: 32K
       12 7B 88 B6 80 A4 98 50 95 D0 81 A1 70 98 01 6C>)
$$ ##END=
$$ 
$$ hash MD5
$$ CF DF 51 C4 93 B4 BC 0B C4 2E 2F C0 C6 EB 96 C3
##$RELAX= 
##$RELAX= 
##$RELAX= 
##$RELAX= 
##$RELAX= 
##$RELAX= 
##$RELAX= 
##$RELAX= 
$$ Bruker specific parameters
$$ --------------------------
##$DU= <F:/spectra>
##$EXPNO= 1
##$NAME= <c13>
##$PROCNO= 1
##$TYPE= <nmr>
##$USER= <she>
##$AMP= (0..31)
100 100 100 100 100 100 100 100 100 100 100 100 100 100 100 100 100 100 
100 100 100 100 100 100 100 100 100 100 100 100 100 100 
##$AQSEQ= 0
##$AQ_mod= 1
##$AUNM= <au_zg>
##$AUTOPOS= <>
##$BF1= 50.322709
##$BF2= 200.13
##$BF3= 50.322709
##$BF4= 500.13
##$BF5= 500.13
##$BF6= 500.13
##$BF7= 500.13
##$BF8= 500.13
##$BYTORDA= 1
##$CFDGTYP= 0
##$CFRGTYP= 5
##$CHEMSTR= <none>
##$CNST= (0..31)
1 1 145 1 1 1 1 1 1 1 1 1 1 1 1 1 1 1 1 1 1 1 1 1 1 1 1 1 1 1 1 1 
##$CPDPRG= <waltz16>
##$CPDPRG1= <>
##$CPDPRG2= <waltz16>
##$CPDPRG3= <>
##$CPDPRG4= <mlev>
##$CPDPRG5= <mlev>
##$CPDPRG6= <mlev>
##$CPDPRG7= <mlev>
##$CPDPRG8= <mlev>
##$CPDPRGB= <>
##$CPDPRGT= <>
##$D= (0..31)
$$ [...]
##$SUBNAM4= <"">
##$SUBNAM5= <"">
##$SUBNAM6= <"">
##$SUBNAM7= <"">
##$SUBNAM8= <"">
##$SUBNAM9= <"">
##$SW= 239.972175391363
##$SWIBOX= (0..15)
0 1 3 0 0 0 0 0 0 0 0 0 0 0 0 0 
##$SW_h= 12077.2946859903
##$TD= 32768
##$TD0= 1
##$TE= 0
##$TE2= 300
##$TE3= 300
##$TEG= 300
##$TL= (0..7)
120 120 120 120 120 120 120 120 
##$TP= (0..7)
150 150 150 150 150 150 150 150 
##$TP07= 0
##$TPNAME0= <>
##$TPNAME1= <>
##$TPNAME2= <>
##$TPNAME3= <>
##$TPNAME4= <>
##$TPNAME5= <>
##$TPNAME6= <>
##$TPNAME7= <>
##$TPOAL= (0..7)
0.5 0.5 0.5 0.5 0.5 0.5 0.5 0.5 
##$TPOFFS= (0..7)
0 0 0 0 0 0 0 0 
##$TUNHIN= 0
##$TUNHOUT= 0
##$TUNXOUT= 0
##$USERA1= <user>
##$USERA2= <user>
##$USERA3= <user>
##$USERA4= <user>
##$USERA5= <user>
##$V9= 5
##$VALIST= <valist>
##$VCLIST= <CCCCCCCCCCCCCCC>
##$VD= 0
##$VDLIST= <DDDDDDDDDDDDDDD>
##$VPLIST= <PPPPPPPPPPPPPPP>
##$VTLIST= <TTTTTTTTTTTTTTT>
##$WBST= 1024
##$WBSW= 4
##$XGAIN= (0..3)
0 0 0 0 
##$XL= 0
##$YL= 0
##$YMAX_a= 9220025
##$YMIN_a= -5834252
##$ZGOPTNS= <>
##$ZL1= 120
##$ZL2= 120
##$ZL3= 120
##$ZL4= 120
##$ABSF1= 222.6533
##$ABSF2= -17.34351
##$ABSG= 5
##$ABSL= 3
##$ALPHA= 0
##$AQORDER= 0
##$ASSFAC= 0
##$ASSFACI= 0
##$ASSFACX= 0
##$ASSWID= 0
##$AUNMP= <proc_1d>
##$AZFE= 0.1
##$AZFW= 0.5
##$BCFW= 0
##$BC_mod= 2
##$BYTORDP= 0
##$COROFFS= 0
##$CY= -3
##$DATMOD= 1
##$DC= 0
##$DFILT= <>
##$DTYPP= 0
##$F1P= 0
##$F2P= 0
##$FCOR= 0.5
##$FTSIZE= 32768
##$FT_mod= 6
##$GAMMA= 0
##$GB= 0
##$INTBC= 1
##$INTSCL= 4.134877e-10
##$ISEN= 128
##$LB= 1
##$LEV0= 0
##$LPBIN= 0
##$MAXI= 10000
##$MC2= 0
##$MEAN= 0
##$ME_mod= 0
##$MI= 0.1934396
##$NCOEF= 0
##$NC_proc= -1
##$NLEV= 6
##$NOISF1= 120.0001
##$NOISF2= 80.00006
##$NSP= 0
##$NTH_PI= 0
##$NZP= 0
##$OFFSET= 222.6533
##$PC= 1.4
##$PHC0= -289.1879
##$PHC1= 44.36243
##$PH_mod= 1
##$PKNL= yes
##$PPARMOD= 0
##$PSCAL= 0
##$PSIGN= 0
##$REVERSE= no
##$SF= 50.3227301278049
##$SI= 32768
##$SIGF1= 140
##$SIGF2= 120
##$SINO= 11.81781
##$SIOLD= 32768
##$SREGLST= <13C.CDCl3>
##$SSB= 0
##$STSI= 32768
##$STSR= 0
##$SW_p= 12077.2946859903
##$SYMM= 0
##$S_DEV= 0
##$TDeff= 32768
##$TDoff= 0
##$TI= <>
##$TILT= no
##$TM1= 0
##$TM2= 0
##$TOPLEV= 0
##$USERP1= <user>
##$USERP2= <user>
##$USERP3= <user>
##$USERP4= <user>
##$USERP5= <user>
##$WDW= 1
##$XDIM= 32768
##$YMAX_p= 321184534
##$YMIN_p= -5346775
$$ End of Bruker specific parameters
$$ ---------------------------------
##NTUPLES= NMR SPECTRUM
##VAR_NAME=  FREQUENCY,     SPECTRUM/REAL,   SPECTRUM/IMAG
##SYMBOL=    X,             R,               I
##VAR_TYPE=  INDEPENDENT,   DEPENDENT,       DEPENDENT
##VAR_FORM=  AFFN,          ASDF,            ASDF
##VAR_DIM=   32768,         32768,           32768
##UNITS=     HZ,            ARBITRARY UNITS, ARBITRARY UNITS
##FACTOR=    0.368581032318806, 1,           1
##FIRST=     11204.5221822817, 0,            0
##LAST=      -872.772503708586, 0,           0
##MIN=       -872.772503708586, -5346775,    0
##MAX=       11204.5221822817, 321184534,    0
$$ Real data points
##PAGE= N=1
##DATA TABLE= (X++(R..R)), XYDATA
$$ [...]
15788d0395k45118m88241l83116n2916M68451M89934M12159k08360O41616K71957
$$ -40395 -285513 -773754 -1156870 -1209786 -741335 -251401 160758 -47602 594014 865971
15778H65971k14850j129116j192666l11402R00477P46443K48562K61228j50838
$$ 865971 651121 -477995 -1670661 -1982063 -1081586 -335143 -86581 174647 23809
15769B3809O02900Q84421o31316j693756j230133j2426N92407Q89141J410P14957
$$ 23809 626709 1511130 879814 -813942 -2044075 -2056501 -1464094 -574953 -573543 141414
15759A41414J228876O69159k96636p69638j186177j184062K50010J090166L93425
$$ 141414 1370290 2039449 1742813 973175 -213002 -1397064 -1147054 -56888 336537
15750C36537j9662j404225q73247J095839P14715J32552o3846J78963K6631j125297
$$ 336537 316875 -1087350 -1960597 -864758 -150043 -17491 -81337 97626 124257 -1001040
15740a001040r24594j014056m63637R30929L91679O15226N00713L46900L78173
$$ -1001040 -1925634 -2939690 -3403327 -2472398 -2080719 -1465493 -964780 -617880 -239707
15731b39707K13128N21986K95855r78728o93191o98685k67371J386846M15004
$$ -239707 -26579 495407 791262 -187466 -880657 -1579342 -1846713 -459867 -44863
15722d4863K34760Q60223j44507q70598j165958Q6322L50870j59295j034289q7245
$$ -44863 189897 1050120 905613 35015 -1130943 -1044621 -693751 -853046 -1887335 -1974580
15712a974580J075245J113321K82425l02146l00879p95492j164938J99688P42450
$$ -1974580 -899335 213986 496411 194265 -106614 -902106 -2067044 -1867356 -1124906
15703a124906L58410O55775L52688Q75786N85758M12683K55580o39375j327302
$$ -1124906 -766496 -110721 241967 1117753 1703511 2116194 2371774 1732399 405097
15694D05097q60233M18382Q46270k13171j548169j000085j5396k72375K78381
$$ 405097 -455136 -36754 809516 596345 -951824 -1951909 -1967305 -2239680 -1961299
15685a961299N23878Q37521j90340o70142k90935j78527l99248L24604R50982
$$ -1961299 -1437421 -599900 -790240 -1460382 -1751317 -1929844 -2329092 -2004488 -1053506
15676a053506N58483j49499k05428K2152L94725K55358j83431j91283O63147L18582
$$ -1053506 -495023 -644522 -849950 -827798 -433073 -177715 -361146 -552429 110718 429300
15666D29300l31671K98952J89007n29804n24140L61856q7271l8711R69489N07699
$$ 429300 97629 396581 585588 55784 -468356 -106500 -193771 -232482 737007 1244706
15656A244706j75842o17698l5264K7888m13887n98341J01249P29441J04040m3757
$$ 1244706 1068864 451166 415902 443790 29903 -568438 -467189 262252 366292 322535
15646C22535l00844j84257L88585n91374p3881O67141m74091N1986N54390K52095
$$ 322535 21691 -162566 226019 -365355 -439236 227905 -246186 -194200 360190 612285
15636F12285N2002m52802j88258n0017m93290J64370K38083m91022k71233L94621
$$ 612285 664287 211485 23227 -26790 -520080 -355710 -117627 -608649 -879882 -485261
15626d85261m60605m14862O06778O96796n64050n36942Q28543K10500j082164
$$ -485261 -945866 -1360728 -753950 -57154 -621204 -1158146 -329603 -119103 -1201267
15617a201267p83234K38678J9051K3964J2711j46794k4469R32743O91584j37439
$$ -1201267 -1984501 -1745823 -1726772 -1702808 -1690097 -1836891 -1861360 -928617 -237033 -374472
15607c74472L63449J143537J365791l88632p79401m90069j109547j106947o17444
$$ -374472 -11023 1132514 2498305 2109673 1330272 840203 -269344 -1376291 -1993735
15598a993735L121O69129Q7616o3558K74696J83072N9693Q81500N26381j96926
$$ -1993735 -1990614 -1321485 -1233869 -1297427 -1022731 -839659 -779966 101534 627915 430989
15588D30989q26206j032144k15578k0950k85150l80990L77914L44145m43256p65079
$$ 430989 -395217 -1427361 -1642939 -1663889 -1949039 -2330029 -1952115 -1607970 -2051226 -2816305
15578b816305Q39035J839149R04428Q70146l39265r07963j149633n55589J018637
$$ -2816305 -1977270 -138121 766307 1636453 1297188 389225 -760408 -1315997 -297360
15569b97360Q5297n18518n27161q07268L51054P11220l40101n84033M57868j66044
$$ -297360 -212063 -730581 -1257742 -2065010 -1713956 -1002736 -1342837 -1926870 -1469002 -1635046
15559a635046q69064j08607J74471j26221l3118J405355P79662j65635M9874k94787
$$ -1635046 -2504110 -2612717 -2438246 -2564467 -2597585 -1192230 -412568 -578203 -528329 -823116
15549h23116j320539l66635Q00575P36690P40988J09521l51113Q9677o58659o78848
$$ -823116 -2143655 -2510290 -1709715 -973025 -232037 -122516 -473629 -383952 -1042611 -1721459
15539a721459O24782R29520M72177J78399q3575l3972J118451L13537n67116j262726
$$ -1721459 -1096677 -167157 305020 483419 399844 365872 1484323 1797860 1230744 -31982
15529c1982q64685k11533J19986K03458O86258j30133j002479l18218P42510J485013
$$ -31982 -896667 -1108200 -988214 -784756 -98498 -228631 -1231110 -1549328 -806818 678195
15519F78195k0607q56732r4167l10336L3662L36628K94304l08142j64463K59084
$$ 678195 657588 -199144 -293311 -603647 -569985 -233357 60947 -247195 -411658 -152574
15509a52574K7971J033696J339778l19895k97678k38278o04246K05415K74106
$$ -152574 -124603 909093 2248871 1928976 1631298 1393020 788774 994189 1268295
15500A268295p4863l09399q27261l98976P61479P72678k84120o06467j042623
$$ 1268295 1193432 884033 56772 -342204 419275 1191953 907833 301366 -741257
15491g41257J25416Q42714K9353J128479L08587r89251n85337K59621j19895O00641
$$ -741257 -615841 226873 256226 1384705 1693292 704041 118704 378325 258430 859071
15481H59071R31160M87825j58712o71230m8173J99520j00873j447464o67418J070606
$$ 859071 1790231 2278056 2119344 1448114 1399941 1599461 1498588 51124 -616294 454312
15471D54312J430176P96723P29314Q2997r61948q83305l77069l43042n01012j085271
$$ 454312 1884488 2681211 3410525 3493522 2531574 1648269 1271200 928158 427146 -658125
15461f58125o43172j69098n49484J05395m0820m19903J162613K111636J222395
$$ -658125 -1301297 -1470395 -2019879 -1914484 -1955304 -2375207 -1212594 899042 2121437
15452B121437j75581r33936n8310K4900j422359j015051m69631m13002n63981
$$ 2121437 1945856 1011920 953610 978510 -443849 -1458900 -1928531 -2341533 -2905514
15443b905514l47858J508850J882588J46467K47833O3011J4369Q62851R90833
$$ -2905514 -3253372 -1744522 138066 284533 532366 595377 609746 1472597 2463430
15434B463430L21639o4429m9244Q3962n07685j398651n83108M88259M06688j370971
$$ 2463430 2785069 2720640 2671396 2755358 2247673 849022 265914 754173 1160861 -210110
15424b10110q60912M33951M26473N92023N63324j26974l40435p60096k34208M11350
$$ -210110 -1071022 -637071 -210598 381425 944749 817775 477340 -282756 -516964 -105614
15414a05614O3243q76286m10244K04724q8786M81421R20203m9618q85064q86062
$$ -105614 -42371 -918657 -1328901 -1124177 -1212963 -731542 188661 139043 -746021 -1632083
15404a632083m96433P38007Q72450o0008L03671M75047O29080j9647J62456L93181
$$ -1632083 -2128516 -1390509 -518059 -578067 -274396 200651 829731 810084 972540 1365721
15394A365721m7703J71582k28128p48499n29273l1732K06199P91266J215772Q70511
$$ 1365721 1318018 1489600 1261472 512973 -16300 -48032 158167 949433 2165205 3035716
15384C035716J18386k27905l22435j465044j210442M4866J014449J331247M85839
$$ 3035716 3154102 2926197 2603762 1138718 -71724 -26858 987591 2318838 2804677
15375B804677k87025k95299p22898m23715o10035j039379o73362m44436q79838
$$ 2804677 2517652 2222353 1499455 1075740 465705 -573674 -1247036 -1691472 -2571310
15366b571310o8493J543922J595228Q73057n08574j241419n60497J22464J69860
$$ -2571310 -2639803 -1095881 499347 1372404 863830 -377589 -938086 -815622 -645762
15357f45762k71341J49241q4670p61899k43419R44799J188886P23438R62749K76961
$$ -645762 -917103 -767862 -852532 -1614431 -1857850 -913051 275835 999273 1962022 2238983
15347B238983n54597L82821J28340n81756j311766j150257q3464L73407N95020
$$ 2238983 1684386 2067207 2195547 1613791 302025 -848232 -931696 -558289 36731
15338C6731M07986R53737L43466r58250q40657p67512O84697J371334L43771K53134
$$ 36731 444717 1398454 1741920 783670 -56987 -824499 -139802 1231532 1575303 1828437
15328A828437n158j334477j168033K90618J92780m26587N07783O95990K42297
$$ 1828437 1823279 488802 -679231 -388613 -195833 -622420 -114637 581353 823650
15319H23650k64289o9110k20147o74527l23342L10502R50194K45537p12316j118573
$$ 823650 559361 490251 270104 -404423 -727765 -417263 532931 778468 66152 -1052421
15309a052421J91858Q57168Q56165l45125p44285m50835Q03160J284114p00043
$$ -1052421 -860563 -3395 852770 507645 -236640 -687475 115685 1399799 699756
15300F99756n23321j16753l06746n50717P1989R03676R1372K94279j63164j616060
$$ 699756 176435 59682 -247064 -797781 -725792 177884 269256 563535 400371 -1215689
15290a215689n67454J04258L26602J04231l30041Q06131J093143j01415l61627
$$ -1215689 -1783143 -1678885 -1352283 -1248052 -1578093 -771962 321181 219766 -141861
15281a41861k62232L50284J096139k78394o31025L93741Q37365L9362n96869n97148
$$ -141861 -404093 -53809 1042330 763936 132911 526652 1364017 1403379 806510 209362
15271B09362j249077l81914P32396R65644K55614k09897J372798N55096o23771
$$ 209362 -1039715 -1421629 -689233 276411 532025 322128 1694926 2250022 1626251
15262A626251j116161j057926j185502J26638J259977Q844L90296O93274N21101
$$ 1626251 510090 -547836 -1733338 -1606700 -346723 -337879 52417 745691 1266792
15253A266792K84831K46864N37969J158182o0397j274504p40093K82160J52849
$$ 1266792 1551623 1798487 2336456 3494638 3434241 2159737 1419644 1701804 1854653
15244A854653m68956K82458M792r83379j020168p14094J93768N12605l71540q19145
$$ 1854653 1385697 1668155 1672947 689568 -330600 -1044694 -850926 -338321 -709861 -1529006
15234a529006l90576N67964O90419O9912K33685L47658N11518L69220n32368j277592
$$ -1529006 -1919582 -1351618 -661199 -591287 -357602 -9944 501574 870794 338426 -939166
15224i39166l42542J358263M34870o68510p75925J44383L90026r65410m34171
$$ -939166 -1281708 76555 511425 -157085 -933010 -788627 -398601 -1364011 -1798182
15215a798182O29872N6106j97633M54706N78529R54042L712p67870Q50310J62682
$$ -1798182 -1168310 -1112204 -1309837 -855131 -276602 677440 681152 -86718 763592 926274
15205I26274n45401n04402j137624o86304n82493K6122M40220J60362K83383M85944
$$ 926274 380873 -123529 -1261153 -1947457 -2529950 -2503828 -2063608 -1903246 -1619863 -1133919
15195a133919Q53483N56873j6235N16818Q23977p18867p37066n03444o67976O53264
$$ -1133919 -280436 276437 260202 777020 1600997 882130 145064 -358380 -1026356 -373092
15185c73092J315166K10194l12805n76593K75388o25362r58618m75372j045204
$$ -373092 942074 1152268 839463 262870 538258 -87104 -1045722 -1521094 -2566298
15176b566298o48074J327902J382729P01711P83340q3736k14172r35903j240936
$$ -2566298 -3214372 -1886470 -503741 197970 981310 897574 683402 -252501 -1493437
15167a493437m76941n54161N06693P06209k74312p66126M59996J41319l7096K07402
$$ -1493437 -1970378 -2524539 -2017846 -1311637 -1585949 -2352075 -1892079 -1750760 -1787856 -1580454
15157a580454J035243J532576n13533q30491n35333j158738j203498R3767R71611
$$ -1580454 -545211 987365 473832 -356659 -891992 -2050730 -3254228 -3160461 -2188850
15148b188850j849p03278k72533N77077L77273j37857p1639J194471O24324K17063
$$ -2188850 -2190699 -2893977 -3166510 -2589433 -2212160 -2350017 -2421656 -1227185 -602861 -385798
15138c85798m03223j09252J253397M58891n72994p95816j75914M44171R82333
$$ -385798 -789021 -898273 355124 814015 241021 -554795 -730709 -286538 695795
15129F95795K67012k61383j00805N56348m17064n93852M13315L7540m27247j51991
$$ 695795 962807 701424 600619 1156967 739903 146051 559366 596906 169659 17668
15119A7668P66233J248689j89861j537723n86251j20599l67116r38795j528477
$$ 17668 783901 2032590 1842729 305006 -281245 -401844 -768960 -1707755 -3236232
15110c236232j454036k9612R67583J191921J195338J004601M96275q87056j363005
$$ -3236232 -4690268 -4719880 -3752297 -2560376 -1365038 -360437 135838 -751218 -2114223
15101b114223j93144J042001J022853k05001j117617m00395O11526P77379N79170
$$ -2114223 -2307367 -1265366 -242513 -447514 -1565131 -1965526 -1354000 -576621 2549
15092B549k49572l1510R82866j10973k27221m99847m15204j6867J197266N89397
$$ 2549 -247023 -278533 704333 593360 366139 -133708 -548912 -565779 631487 1220884
15082A220884M27101k24527l12233k06924n96357n96466K6954L17901m50091m70774
$$ 1220884 1647985 1423458 1111225 904301 307944 -288522 -261568 56333 -393758 -864532
15072h64532m37441l7437O92395J075553O38294O56989Q40k92389K81531m77603
$$ -864532 -1301973 -1339410 -647015 428538 1066832 1723821 1724661 1432272 1713803 1236200
15062A236200p58925K923l03362j39750M54714K34711Q9814l28999j387612p87235
$$ 1236200 477275 480198 176836 37086 491800 726511 816325 487326 -900286 -1687521
15052a687521N04927N28337J428998J744589R84481J36443j000449k078792o26792
$$ -1687521 -1182594 -654257 774741 2519330 3503811 3640254 2639805 561013 -65779
15043f5779N32792K46145o3490o78766m12085Q0991K25528M52519J12744J14220
$$ -65779 467013 713158 649668 -29098 -441183 -360192 -134664 317855 430599 544819
15033E44819J264862J215334P01184J05621p10587q61490j418246j550448j076643
$$ 544819 1809681 3025015 3726199 3831820 3121233 2259743 841497 -708951 -1785594
15024a785594L64988J327188J184158J211320N77875n7628o48615o43657n88573
$$ -1785594 -1420606 -93418 1090740 2302060 2879935 2822307 2173692 1530035 941462
15015I41462J35730N43142j65085j051007n90678N49139j3089n21132l79350j03351
$$ 941462 1077192 1620334 1455249 404242 -186436 362703 349614 -171518 -550868 -654219
15005f54219o47421o4560O65772J563305Q28505l69313j569222p47220O49310
$$ -654219 -1301640 -1366200 -700428 862877 1691382 1322069 -247153 -994373 -345063
14996c45063M03178O82510l58508r84304m16041O3688R67353j27458j064587K01907
$$ -345063 58115 740625 382117 -602187 -1018228 -954540 12813 -114645 -1179232 -977325
14986i77325J43179K08874N56735Q88J64173J90366M79489K26437n76346o98310
$$ -977325 -834146 -625272 -68537 -67649 96524 286890 766379 992816 416470 -281840
14976b81840m7942j25132p53330j189247j147160k97284J97012Q40320M51909
$$ -281840 -329782 -454914 -1208244 -2397491 -3544651 -3841935 -3644923 -2804603 -2352694
14967b352694J21132o6828Q97263P71434k75938N36721Q70383j31358j277219
$$ -2352694 -2231562 -2298390 -1401127 -629693 -905631 -368910 501473 370115 -907104
14958i07104o68998M40368j94687j731889j303215O84593J631914J288958K34017
$$ -907104 -1576102 -1135734 -1330421 -3062310 -4365525 -3680932 -2049018 -760060 -526043
14949e26043J40256l74114m80621J09943R4086K56929J02051k14132q22059o26012
$$ -526043 -385787 -759901 -1240522 -1130579 -1036493 -779564 -677513 -891645 -1713704 -2339716
14939b339716J54598R0850N69392R67261M81865O28748L39040Q5716k56549l67926
$$ -2339716 -2185118 -2094268 -1524876 -557615 -75750 552998 892038 977754 721205 353279
14929C53279o09494m53480J55583r5932n93956J10941P74881j32620J15758k18818
$$ 353279 -256215 -709695 -554112 -650044 -1244000 -1133059 -358178 -490798 -375040 -593858
14919e93858l25377j52183J5401J54310M57936O3759O79988Q05309N3007k40043
$$ -593858 -919235 -1071418 -1056017 -901707 -443771 -380012 299976 1105285 1158292 918249
14909I18249J8611m36905o11039l93598m34659r85088j144580J04253J284935
$$ 918249 936860 499955 -111084 -504682 -939341 -1924429 -3069009 -2964756 -1679821
14900a679821R44740N56903O58530k75414R6427J17352r32732k43481N190j067285
$$ -1679821 -735081 -178178 480352 204938 301365 418717 -514015 -757496 -752306 -1819591
14890a819591q7388O20714N08982J031666J265297N84577j43819p10424j065411
$$ -1819591 -1906979 -1286265 -777283 254383 1519680 2104257 1960438 1250014 184603
14881A84603j42496k08705m05056P7395L48466m04366j002599q16734J98224Q89481
$$ 184603 42107 -166598 -571654 -494259 -145793 -550159 -1552758 -2369492 -2171268 -1281787
14871a281787m1499n08955M55676M05778Q9064J045952r6900j27815K77017L6938
$$ -1281787 -1323286 -1832241 -1376565 -970787 -881723 164229 67329 -60486 216531 253469
14861B53469R58078J187954j74169n65152k77648J82871N42250k96611j340996
$$ 253469 1211547 2399501 2225332 1660180 1382532 1565403 2107653 1811042 470046
14852D70046k93106M22286m78429n9628M33611J002462L48012q17469r23969j079527
$$ 470046 176940 599226 120797 61169 494780 1497242 1845254 1027785 103816 -975711
14842i75711n91329P07579O49538l5805Q20755O19948r60733j407159m67311L41818
$$ -975711 -1567040 -859461 -209923 -245728 575027 1194975 234242 -1172917 -1640228 -1298410
14832a298410R0493r9031j61568J34720K60372J38941n69222J40855j26592n77973
$$ -1298410 -1207917 -1306948 -1468516 -1333796 -1073424 -934483 -1503705 -1362850 -1489442 -2067415
14822b067415p67992J57682Q06679M1869N11974O91368J12153q93451m70685j1290
$$ -2067415 -2835407 -2677725 -1871046 -1829177 -1317203 -625835 -513682 -1407133 -1877818 -1889108
14812a889108K65870Q29685J90240p75904k69923Q33039J12945r19113q37959
$$ -1889108 -1623238 -793553 -603313 -1379217 -1649140 -816101 -703156 -1622269 -2460228
14803b460228k90632p58565q32013J36585Q74711J721909o7539p42786J71577
$$ -2460228 -2750860 -3509425 -4341438 -4204853 -3330142 -1608233 -1675772 -2418558 -2246981
14794b246981R41636J051705K66135o45365m86235k45886o0651j46803k92884
$$ -2246981 -1305345 -253640 12495 -632870 -1119105 -1364991 -1425642 -1572445 -1865329
14785a865329L29307P71768Q72468m09966j361734M60982Q01094l66328K39560
$$ -1865329 -1536022 -764254 108214 -301752 -1663486 -1202504 -401410 -767738 -528178
14776e28178L96618Q45934P27568n59574r07420q8443L8168m97612j032486j384019
$$ -528178 -131560 714374 1441942 882368 -25052 -113495 -75327 -572939 -1605425 -2989444
14766b989444N62147J728635J299585M38667n15571j73789o71273j100158k54490
$$ -2989444 -2427297 -698662 600923 1039590 524019 350230 -321043 -1421201 -1675691
14757a675691n2541M59038O89621O92658J071881N84220K56794k12256m45315
$$ -1675691 -1728232 -1269194 -579573 113085 1184966 1769186 2025980 1813724 1368409
14748A368409k9344L13385K46976j86238n22549q67316n56949K79368L97950k54453
$$ 1368409 1339065 1652450 1899426 1713188 1190639 323323 -233626 45742 443692 189239
14738A89239j63805O92534L02442n08137p20121O3498J011829Q46026q69253j643097
$$ 189239 25434 717968 1020410 512273 -207848 -144350 867479 1713505 844252 -798845
14728g98845q26520o72724J298618J913220Q11067L65257j7787k87908K95987
$$ -798845 -1625365 -2298089 -999471 913749 1724816 2090073 2072286 1784378 2080365
14719B080365P4631l91424l00975O20590O39081K21261m03020j783576j115970
$$ 2080365 2154996 1763572 1462597 2083187 2722268 2943529 2540509 756933 -359037
14710c59037j9996J1061m53344k08120M84116M28194l15511q24575j33984J365113
$$ -359037 -379033 -367972 -821316 -1029436 -545320 -117126 -432637 -1257212 -1391196 -26083
14700b6083P42297R5631M19995j14211m59438j49151k10222q22269m59905l99663
$$ -26083 716214 811845 1231840 1117629 658191 509040 298818 -523451 -983356 -1383019
14690a383019q1615J331494P90687P6509n78887n9632J053251M47105j69925M6954
$$ -1383019 -1464634 -133140 657547 734056 155169 95537 1148788 1595893 1425968 1472922
14680A472922K76947R5707p54018j236227l93474j32391m91563k92849j292318
$$ 1472922 1749869 1845576 1091558 -144669 -538143 -670534 -1162097 -1454946 -2747264
14671b747264j57544Q48769L04903Q08247J478528L7322o74605j023816k26127
$$ -2747264 -2904808 -2056039 -1751136 -942889 535639 572961 -101644 -1125460 -1351587
14662a351587J823169J215315n94898j396876l85441L25540P21043P39889q61
$$ -1351587 471582 1686897 1091999 -304877 -690318 -364778 356265 1096154 1095293
14653A095293L37347J06877l71274l33417j53895L94670R49267k03638j219188
$$ 1095293 1432640 1539517 1168243 834826 680931 1075601 2024868 1821230 602042
14644F02042r53133k08001J186469m78787j393056m82135J88678O222r6254n75221
$$ 602042 -351091 -559092 627377 148590 -1244466 -1726601 -1537923 -1531701 -1627955 -2203176
14634b203176p72663J48641J11012q11487o21910R65674J891434J838651M088
$$ -2203176 -2975839 -2827198 -2716186 -3527673 -4149583 -3183909 -1292475 546176 550264
14625E50264j456335m11549R17204L58637m09710O48290M15923j178559n28573
$$ 550264 -906071 -1317620 -400416 -41779 -451489 196801 612724 -565835 -1094408
14616a094408M83925J55528J45496L99452J59223O24553J052460M83835J09823
$$ -1094408 -610483 -454955 -309459 89993 249216 873769 1926229 2410064 2519887
14607B519887j46367l95019K88398l07954m73418J80864n22055j466886j920584
$$ 2519887 2373520 1978501 2266899 1958945 1485527 1666391 1144336 -322550 -2243134
14598b243134j577238k58509O86607J73717n23269P64131J550974J007597M74977
$$ -2243134 -3820372 -4078881 -3392274 -3218557 -3741826 -2977695 -1426721 -419124 55853
14589E5853K52520M2852l22757L97382j94561o58340l27055K25497j0158M14364
$$ 55853 308373 351225 28468 425850 231289 -427051 -754106 -528609 -538767 -124403
14579a24403M8968j049466K13279J322116J96207L38876k20091j208789n36319
$$ -124403 -75435 -1124901 -911622 410494 606701 945577 725486 -483303 -1019622
14570a019622M3055R01970J255780K67716n52766l56295k20307m11997M55919
$$ -1019622 -976567 -74597 1181183 1448899 896133 539838 319531 -92466 363453
14561C63453J562040L19171p35030p13956j468838j083845L6205N35899R32263
$$ 363453 1925493 2244664 1509634 795678 -673160 -1757005 -1720800 -1184901 -252638
14552b52638P00933r4918K63481Q289J9371j58279j95489J58694K29982m21585
$$ -252638 448295 353377 616858 625147 644518 486239 290750 449444 679426 257841
14542B57841P1581j64817j027501n9923N30067R57860K9183n30883l84333K53085
$$ 257841 329422 164605 -862896 -922819 -392752 565108 594291 63408 -320925 -67840
14532f7840K93166K20120k42798m26707l58213p20291j99863P19033M01207M03357
$$ -67840 225326 445446 202648 -224059 -582272 -1302563 -1502426 -783393 -382186 21171
14522B1171M42994K33748j343587j613876j98922L54716P45386J162758O92672
$$ 21171 464165 697913 -645674 -2259550 -2458472 -2103756 -1358370 -195612 497060
14513D97060k73322p09311n8064J66179k4707J82566o40360j134564l37225J76692
$$ 497060 223738 -485573 -543637 -377458 -402165 -219599 -859959 -1994523 -2331748 -2155056
14503b155056O97424R98361O6064p34552j524753n92579L47708J50806L55425
$$ -2155056 -1457632 -459271 -393207 -1127759 -2652512 -3245091 -2897383 -2746577 -2391152
14494b391152R01315Q59324J055584k1541j230943j039657j87577J58035o5487
$$ -2391152 -1489837 -630513 425071 403530 -827413 -1867070 -2054647 -1896612 -1962099
14485a962099Q01309P07645L75092P03452n01169l01465J88947J10043j15433
$$ -1962099 -1160790 -453145 -78053 625399 124230 -177235 11712 121755 6322
14476F322k72903j102064p05771M71870Q02567J05234n20047P40399P05940M43814
$$ 6322 -266581 -1368645 -2074416 -1602546 -799979 -694745 -1214792 -474393 231547 675361
14466F75361J62025p66892p25885L45296J68767j62249K28840O42167R95979P92583
$$ 675361 837386 70494 -655391 -310095 -141328 -303577 -74737 567430 1563409 2355992
14456B355992O2258r6562j225638k062234r00608J97993N68764O40622P012j84664
$$ 2355992 2418250 2321688 1096050 -966184 -1866792 -1668799 -1100035 -459413 -452401 -637065
14446f37065m52044N1069r5696P691N25110O05581M05276m28161m34137r20758
$$ -637065 -1089109 -1038040 -1133736 -1126045 -600935 4646 409922 -18239 -452376 -1373134
14436a373134l43531K06143N89127K11488L36541K60067K01438r6900m30170k19417
$$ -1373134 -1716665 -1510522 -921395 -709907 -373366 -113299 88139 -8761 -438931 -658348
14426f58348n40485k45248m57572m96085N35024R97014N42195n0383o40337k5695
$$ -658348 -1198833 -1444081 -1901653 -2397738 -1862714 -865700 -323505 -373888 -1014225 -1039920
14416a039920l70696K39281Q46980L07203Q13092m710l55155P80338M07678r03322
$$ -1039920 -1410616 -1171335 -324355 -17152 795940 791230 436075 1216413 1624091 720769
14406G20769k89030p3442l55348k4466q63287k89444j24049J76344R30229J26595
$$ 720769 431739 358297 2949 -21517 -884804 -1174248 -1298297 -1121953 -191724 -65129
14396f5129J42404R91531m37527r15864r67318l40082k7810q3010P66227J080867
$$ -65129 77275 1068806 631279 -284585 -1251903 -1591985 -1619795 -1702805 -936578 144289
14386A44289N05638p84549o15832l27206l72638L4922O37863M88998K58447k72175
$$ 144289 649927 -134622 -750454 -1077660 -1450298 -1415376 -777513 -288515 -30068 -302243
14376c02243k77282J05209M08598j204001q68213O1522N41046P23597L71961P90502
$$ -302243 -579525 -474316 -65718 -1269719 -2137932 -2076410 -1535364 -811767 -439806 350696
14366C50696l05791j031477j65114J275630J141852R18781L6803j209085p75962
$$ 350696 44905 -986572 -1151686 123944 1265796 2184577 2221380 1012295 236333
14357B36333j31736j20459l25292k01748l39477J24487Q14963O87079m42202j099913
$$ 236333 104597 -15862 -341154 -542902 -882379 -757892 57071 744150 301948 -797965
14347g97965k75664j02612j29977l75667q16566J052942K308824J370931m01028
$$ -797965 -1073629 -1176241 -1306218 -1681885 -2498451 -1445509 863315 2234246 1833218
14338A833218o81632M21963K47145j008793j119805J07170K19869o9779k69565
$$ 1833218 1151586 1573549 1820694 811901 -307904 -200734 19135 -50644 -320209
14329c20209l96514K7971N02195N74273J93854o32154q73034l91245j76286l0826
$$ -320209 -716723 -688752 -186557 387716 581570 -50584 -923618 -1314863 -1491149 -1521975
14319a521975Q424N65262J164038K59780L51017p01329j99872J634347k73142
$$ -1521975 -1513551 -948289 215749 475529 826546 125217 -74655 1559692 1286550
14310A286550j144435n47169L97229L30716n93883k10871K54594J76861q4533
$$ 1286550 142115 -405054 -7825 322891 -270992 -481863 -227269 -50408 -134941
14301a34941k89579p23166K13476O27938O35601M71564l23972K95411L85836j41609
$$ -134941 -424520 -1147686 -934210 -306272 329329 800893 476921 772332 1158168 1016559
14291A016559j26193O39337O22584m55614p41015j480703q06791P19095m6837
$$ 1016559 890366 1529703 2152287 1696673 955658 -525045 -1331836 -612741 -659578
14282f59578J63306L95494Q32953P65479K28741o95022j96018N92869N29199K38342
$$ -659578 -496272 -100778 732175 1497654 1726395 1031373 835355 1428224 1957423 2195765
14272B195765n38092J17713J74830n30217q32597l64116O53206J176284o99047
$$ 2195765 1657673 1775386 1950216 1419999 587402 223286 876492 2052776 1353729
14263A353729j616804K64936J231860M43224n90302m86089k36471n75907o04335
$$ 1353729 -263075 1861 1233721 1676945 1086643 600554 364083 -211824 -816159
14254h16159j188360j129109l64693L13475P94170P27871R69144O31573r89468
$$ -816159 -2004519 -3133628 -3498321 -3184846 -2390676 -1662805 -693661 -62088 -1051556
14245a051556j074838J35414J130975J409895j55090m35779r34811j586382r9745
$$ -1051556 -2126394 -1990980 -860005 549890 394800 -40979 -975790 -2562172 -2661917
14236b661917K57694P7826M53072N19250K25747j76317m66321K32765R17182K08729
$$ -2661917 -2404223 -2326397 -1873325 -1354075 -1128328 -1304645 -1770966 -1538201 -621019 -412290
14226d12290O67587K54753j68563K59195o25433o26585J58796M14954k18732o48768
$$ -412290 255297 510050 341487 600682 -24751 -651336 -492540 -77586 -296318 -945086
14216i45086J11786J94700K85415L94076K3072r4332m13666P79760O28485l64052
$$ -945086 -833300 -638600 -353185 40891 63963 -30369 -444035 335725 964210 600158
14206F00158j3282l17849q1130J4375o85237q65313m43472Q92927J896147J605296
$$ 600158 586876 269027 187897 202272 -482965 -1348278 -1791750 -898823 997324 2602620
14196B602620J76105p83070j129111q00750l37262l63034k54211L86120M92509
$$ 2602620 2778725 1995655 866544 65794 -271468 -634502 -888713 -502593 -10084
14187a0084K18002N73691N95088m16176J95938K44045j52620M10496L0305o88596
$$ -10084 207918 781609 1376697 960521 1156459 1400504 1247884 1658380 1688685 1000089
14177A000089p01797q81752L9889N97301N65406P01229m04052q10605n19634o51408
$$ 1000089 298292 -583460 -543571 53730 619136 1320365 916313 105708 -413926 -1065334
14167a065334o87418j108834j824684o10993K86588P69472J867217J705905R29022
$$ -1065334 -1752752 -2861586 -4686270 -5297263 -5010675 -4241203 -2373986 -668081 260941
14158B60941K61657l49724q77150L55093Q11631O13696Q90847l82505m49729q10134
$$ 260941 522598 172874 -704276 -349183 462448 1076144 1966991 1584486 1134757 324623
14148C24623j076558K30294Q78453Q36265N36020j037865j976816p18884N13796
$$ 324623 -751935 -521641 356812 1193077 1729097 691232 -1285584 -2004468 -1490672
14139a490672O33260k68913n69110q51697L76161J243721K28803j66150N77674
$$ -1490672 -857412 -1126325 -1695435 -2547132 -2170971 -927250 -698447 -864597 -286923
14130b86923K92453l7477L15867j78781P89751J142795K10453l22023l38860j2068
$$ -286923 5530 -31947 283920 105139 894890 2037685 2248138 1926115 1587255 1575187
14120A575187p10994r69967l12810L51763P26236J75136j42125Q5461J88952M20393
$$ 1575187 864193 -105774 -418584 -66821 659415 834551 692426 777887 966839 1387232
14110A387232O37317J20206q01647j994159j616396m13686M325L32640J199958
$$ 1387232 2024549 2144755 1343108 -651051 -2267447 -2681133 -2676808 -2344168 -1144210
14101a144210J346079L43094P3998j01619l84512m00017k44361k72850O48907
$$ -1144210 201869 544963 618961 517342 132830 -267187 -511548 -784398 -135491
14092a35491J565364K003j387457j170061L90220Q55680k28642L85939M68342
$$ -135491 1429873 1431876 44419 -1125642 -735422 120258 -108384 277555 745897
14083G45897L71599k18228m68402J139884M46271j109530q00192L76028P39248
$$ 745897 1117496 899268 430866 1570750 2017021 907491 107299 483327 1222575
14074A222575L65260O98908O17321q19991j271926Q86o40935j029958M75224J178418
$$ 1222575 1587835 2286743 2904064 2084073 812147 813033 172098 -857860 -382636 795782
14064G95782Q57250o54417j521182q86779L70864j53950O88033N01015P58483
$$ 795782 1653032 998615 -522567 -1409346 -1038482 -1192432 -504399 -3384 755099
14055G55099P63761L04447M02787p59574l00998m67677m64706n67189o50209N04598
$$ 755099 1518860 1823307 2226094 1466520 1165522 697845 233139 -334050 -984259 -479661
14045d79661K20763J46108o35036m25563N10184L62249J100027J818473Q78142
$$ -479661 -258898 -112790 -747826 -1173389 -663205 -300956 799071 2617544 3495686
14036C495686r16773j017258j036840k13238m64153p70538K27241N06575N28039
$$ 3495686 2578913 1561655 524815 311577 -152576 -923114 -695873 -189298 338741
14027C38741m26672p88111j94534K04686k76843n03401Q1543J72677j91590j71762
$$ 338741 -87931 -876042 -1070576 -865890 -1142733 -1646134 -1564591 -1391914 -1583504 -1755266
14017a755266j93077n22336J61284O53371R25850M36694k08955M48879R8467Q9323
$$ -1755266 -1948343 -2470679 -2309395 -1656024 -730174 -293480 -502435 -53556 44911 134234
14007A34234m06302j186631p63298M79188J179173Q40437K28625n60033k96835
$$ 134234 -272068 -1458699 -2221997 -1742809 -563636 276801 505426 -54607 -351442
13998c51442J68210l45617n48454m2600K051821J202187j206567j933785j353342
$$ -351442 -183232 -528849 -1077303 -1119903 931918 2134105 927538 -1006247 -2359589
13989b359589j95673M33981K38988K21434J69287K6080j028829r51893L68205
$$ -2359589 -2555262 -2121281 -1882293 -1660859 -1491572 -1465492 -2494321 -3446214 -3078009
13980c078009L45076J004118J103692N52736r54711j334966J63635N14341P19161
$$ -3078009 -2732933 -1728815 -625123 -72387 -1027098 -2362064 -2198429 -1684088 -964927
13971i64927J069431Q48377j90385o46203L60904Q60176L43469k98173j533729
$$ -964927 104504 952881 762496 116293 477197 1337373 1680842 1382669 -151060
13962a51060j357334Q69327N88437L23427J6941m12012l48706J9469P12147L29192
$$ -151060 -1508394 -639067 -50630 272797 289738 -122274 -470980 -451511 260636 589828
13952E89828j99324J03837L01173O54884L09773m21924k46264r2311j013827p80992
$$ 589828 390504 494341 795514 1450398 1760171 1338247 1091983 999672 -14155 -795147
13942g95147q75133m7727M16114j83489p40260n1319J105605Q25971j38745J53200
$$ -795147 -1670280 -1718007 -1301893 -1485382 -2225642 -2276961 -1171356 -345385 -484130 -330930
13932c30930O81931N63670k10757j474730j645489p24897K16791O14689O79362
$$ -330930 351001 914671 703914 -770816 -2416305 -3141202 -2924411 -2309722 -1630360
13923a630360O86547J78009m92706K83805J063192Q92530k4444N3522k00128j47197
$$ -1630360 -943813 -765804 -1258510 -974705 88487 981017 956573 1010095 809967 662770
13913F62770m86365l30509J86520J9099n89481k63081L67871k61383n00449P81935
$$ 662770 176405 -154104 32416 51515 -537966 -801047 -433176 -694559 -1195008 -413073
13903d13073J580731N01534Q2406j08597j162496r41580L78481P16507O01666
$$ -413073 1167658 1669192 1751598 1643001 480505 -461075 -82594 633913 1235579
13894A235579l2120o46958k06262l7439l70261K81853N35663j47226n86251j214781
$$ 1235579 1203459 556501 350239 312800 -57461 224392 760055 612829 26578 -1188203
13884a188203k55541M63841k00675q36470J16524P37322m17544R9414O46293J098761
$$ -1188203 -1443744 -979903 -1180578 -2017048 -1900524 -1163202 -1580746 -1481332 -835039 263722
13874B63722J322959M13175j004034r72406r0060K55603K31551P54237N75341
$$ 263722 1586681 1999856 995822 23416 -66644 188959 420510 1174747 1750088
13865A750088K04595r70674j075868K81589q9398l44791o49718j65761O8757l18601
$$ 1750088 1954683 984009 -91859 189730 100332 -244459 -894177 -1059938 -991181 -1309782
13855a309782L2823O45645L83436l3060m71068n80967n21261p2945k1949M24987
$$ -1309782 -1276959 -631314 -247878 -280938 -752006 -1332973 -1854234 -1927179 -1949128 -1524141
13845a524141P87263l16196k03524O79859Q84305Q1538k27468L69297j465358
$$ -1524141 -736878 -1053074 -1256598 -576739 307566 389104 161636 530933 -934425
13836i34425j262737J07635k63981q15011j34580J689804R42413M51310K43882
$$ -934425 -2197162 -2089527 -2353508 -3168519 -3303099 -1613295 -670882 -219572 24310
13827B4310m44273k86637n9071j91093m33271p01540l19537N36294R92341O37764
$$ 24310 -419963 -706600 -765671 -956764 -1390035 -2091575 -2411112 -1874818 -882477 -244713
13817b44713N88727R72766M37133m7671O5017k8773P7015n84558j53529k93352
$$ -244713 344014 1316780 1753913 1706242 1771259 1742486 1819501 1234943 1081414 788062
13807G88062J35481R47274J62270l57266n87313m40165l65008M12764J014415
$$ 788062 923543 1870817 2033087 1675821 1088508 648343 283335 696099 1710514
13798A710514p30205q03045L19875J222156J168349r7068j204824p36278n6204
$$ 1710514 980309 177264 497139 1719295 2887644 2790576 1585752 849474 793270
13789G93270M41287l87886q52243r65236k76528P85374J62737n9391j20640k4731
$$ 793270 1234557 846671 -5572 -970808 -1247336 -461962 -299225 -358616 -479256 -503987
13779e03987P28187R75712j58929l87174l95088j67753M86068M77448l2309P04520
$$ -503987 224200 1199912 1040983 653809 258721 90968 577036 1054484 1022175 1726695
13769A726695M20706L01216k0830j87486n48947k68999N5799l46661l9249M91724
$$ 1726695 2147401 2448617 2427787 2240301 1691354 1422355 1478154 1131493 1092244 1583968
13759A583968o14352l31688k56365j081907j66486Q20801Q30294R78511Q99663
$$ 1583968 969616 637928 381563 -700344 -866830 -46029 784265 1762776 2662439
13750B662439N4037m14564p53763j233046L08016J781959Q54814m06986j127191
$$ 2662439 2716476 2301912 1548149 315103 623119 2405078 3259892 2852906 1725715
13741A725715j793141m93785P47821M29293j014559j51879n46012o02889M62679
$$ 1725715 -67426 -561211 186610 615903 -398656 -550535 -1096547 -1699436 -1236757
13732a236757N61184J320217J99486k98096j60190r82091m94352Q86812l10583
$$ -1236757 -675573 644644 844130 546034 385844 -596247 -1090599 -203787 -514370
13723e14370N5393R67317M31626l42332J90418K68853L46988P09686K78195r60817
$$ -514370 -458977 508340 939966 597634 788052 1056905 1403893 2113579 2391774 1430957
13713A430957j219832m54605K43232k07776l19185L20183K59597k48830j75993
$$ 1430957 211125 -243480 -248 -208024 -527209 -207026 52571 -196259 -372252
13704c72252K91269J075218J056595P78815P36880l28891j202854j367470m88339
$$ -372252 -80983 994235 2050830 2829645 3566525 3237634 2034780 667310 178971
13695A78971M41433K76430o35899j40899J85016j50819j75948k61863L10690R39280
$$ 178971 620404 896834 260935 120036 305052 154233 -21715 -283578 27112 966392
13685I66392j66488n44338M59384j33201n58990p60368j108N28521K85515k17557
$$ 966392 799904 255566 714950 581749 22759 -737609 -738717 -210196 75319 -142238
13675a42238l37037n19094m2965J038565R93266J05451o07457m34087O35035j73198
$$ -142238 -479275 -998369 -1041334 -2769 990497 1095948 488491 54404 689439 516241
13665E16241j339532p54108J19136o51383j295818j72724O42656R66889R52054
$$ 516241 -823291 -1577399 -1458263 -2109646 -3405464 -3578188 -2935532 -1968643 -1016589
13656a016589J107818L72462L776L88371j52154o27680j1420n37240r59869n12882
$$ -1016589 91229 463691 467467 855838 703684 76004 64584 -472656 -1432525 -1945407
13646a945407K45532J011573J016715j0306j144851q23568n22572K70710Q76993
$$ -1945407 -1699875 -688302 328413 318107 -826744 -1650312 -2172884 -1902174 -1025181
13637a025181l35229j053547m21931J115811J195430n2679p41563L84919L56366
$$ -1025181 -1360410 -2413957 -2835888 -1720077 -524647 -577326 -1318889 -933970 -577604
13628e77604K41712J34859k33906k66832M93152O26013m08510j35328M93118m78506
$$ -577604 -335892 -201033 -434939 -701771 -208619 417394 8884 -126444 366674 -111832
13618a11832l79470k44906p02500J2339M22968M22507o92435q55246j95386j68904
$$ -111832 -491302 -736208 -1438708 -1426369 -1003401 -580894 -1273329 -2128575 -2323961 -2492865
13608b492865K49066m173l65339K94856O76158Q64144Q98329l1472n61919j28187
$$ -2492865 -2243799 -2247972 -2613311 -2318455 -1642297 -778153 120176 88704 -473215 -601402
13598f01402o28775m06098O51675P41519J073970Q38356m10299k29203K57968
$$ -601402 -1230177 -1636275 -984600 -243081 830889 1669245 1258946 1029743 1287711
13589A287711l18743p63361o24859K58428L1078N7640o4382K55827P7324j66664
$$ 1287711 968968 205607 -419252 -160824 -129746 -72106 -136488 119339 196663 29999
13579B9999J185796j90475j722714j125018K34112J197088N19949m89186R8119
$$ 29999 1215795 1025320 -697394 -1822412 -1588300 -391212 128737 -360449 -262330
13570b62330N20411N76713L98484K75254K90166l5668j041956j588447l99170
$$ -262330 258081 834794 1233278 1508532 1798698 1763030 721074 -867373 -1266543
13561a266543N08281J288021J178953k46044m19738q94729p74313n07955m03021
$$ -1266543 -758262 529759 1708712 1462668 1042930 148201 -626112 -1134067 -1537088
13552a537088K22508J091777N03607O38799Q36403q966M39740K62258r50074q64778
$$ -1537088 -1314580 -222803 280804 919603 1756006 1747040 2186780 2449038 1498964 634186
13542F34186j093831j552040N69839J072378O99319R81083J96905l39694j039234
$$ 634186 -459645 -2011685 -1441846 -369468 329851 1310934 1507839 1168145 128911
13533A28911n47960l0293N9435l29025k91479L18335M50973M56525k82116j21172
$$ 128911 -419049 -449342 -389907 -718932 -1010411 -692076 -241103 215422 -66694 -187866
13523a87866j48202j69083O78628J083827k49424n27810K86312L07435k90096
$$ -187866 -336068 -505151 173477 1257304 1007880 480070 766382 1073817 783721
13514G83721n82265o82589p16720q54156q04572J00659J288297J466512J20877
$$ 783721 201456 -481133 -1197853 -2052009 -2856581 -2755922 -1467625 -1113 119764
13505A19764k55293J653p10510n92217J81487j36212j87967J62502O26105N89531
$$ 119764 -135529 -133876 -844386 -1436603 -1255116 -1391328 -1579295 -1416793 -790688 -201157
13495b01157m64944j237759r23243o9807P61856O18992R00079L27716J183446
$$ -201157 -666101 -1903860 -2827103 -2896910 -2135054 -1516062 -615983 -288267 895179
13486H95179J746651L47768j2078n5897q63906q46699q90929m64634K31320L64824
$$ 895179 2641830 2989598 2977520 2921623 2057717 1211018 320089 -144545 86775 451599
13476D51599Q53162P17631n76261j742986q30791O05099Q52314r1292J30117l42383
$$ 451599 1304761 2022392 1446131 -296855 -1127646 -522547 329767 238475 368592 26209
13466B6209p49288R0507P40718M62420L78694Q42388J68091o24367r33741p16794
$$ 26209 -723079 -632572 108146 570566 949260 1791648 1959739 1335372 401631 -315163
13456c15163k88614O9477M57409o49469j496334l51076J382504K134837J458457
$$ -315163 -603777 -534300 -76891 -726360 -2222694 -2573770 -1191266 943571 2402028
13447B402028q07346r77478L39094j09593K4170k89871o09378J36328J647340
$$ 2402028 1594682 617204 956298 846705 870875 581004 -28374 107954 1755294
13438A755294Q34142j322746j526071j987870p41057P82858J322255O62925L61297
$$ 1755294 2589436 1266690 -259381 -2247251 -2988308 -2205450 -883195 -220270 141027
13429A41027L49242O32827J419766R76669l71935p09728q30395l73018M74138
$$ 141027 490269 1123096 2542862 3519531 3147596 2437868 1607473 1234455 1708593
13420A708593K05481J58709j95035J56275L74322p5739j084251m71320L20458
$$ 1708593 1914074 2072783 1877748 2034023 2408345 2332606 1248355 777035 1097493
13411A097493r8686j337090o13021P46738O89641P71965K71641l15540J66525
$$ 1097493 998807 -338283 -951304 -204566 485075 1257040 1528681 1213141 1379666
13402A379666m74095j179305k04072p5163k21635j02632n87295q29452J60357
$$ 1379666 905571 -273734 -477806 -552969 -774604 -877236 -1464531 -2293983 -2133626
13393b133626M34323O57497O99046m4150P0809l06115p38304j89600m7675p77713
$$ -2133626 -1699303 -1041806 -342760 -386910 -316101 -622216 -1360520 -1550120 -1597795 -2375508
13383b375508j51408J338792J238503Q31157N62270o1182Q9116l73266j230436
$$ -2375508 -2526916 -1188124 50379 881536 1443806 1382624 1471740 1098474 -131962
13374a31962J78917M80298p57961n92024M10390R25400J463826J157750q91972
$$ -131962 46955 527253 -230708 -822732 -412342 513058 1976884 3134634 2242662
13365B242662j070946r22288l45951p1765o12695j122129l78360K85734l89137
$$ 2242662 1171716 249428 -96523 -168288 -780983 -1903112 -2281472 -1995738 -2384875
13356b384875l22186Q10658J065127m2526K80893Q34057k65221o76322K77253
$$ -2384875 -2707061 -1896403 -831276 -873802 -592909 241148 -24073 -700395 -423142
13347d23142P43771M59299j03818o68996r77957m07561J018245Q29938o42456
$$ -423142 320629 779928 676110 7114 -970843 -1378404 -360159 469779 -172677
13338a72677P0238L61328R2974l97744m75606K76080N29054j76822K48623R18057
$$ -172677 -102439 258889 351863 -45881 -521487 -245407 283647 106825 355448 1273505
13328A273505J98233L88953M68134J32920P23661J24759k39266l8144k62953q46079
$$ 1273505 1471738 1860691 2328825 2461745 3185406 3310165 3070899 3032755 2769802 1923723
13318A923723n81886m55412j53696l09244k66693n09950K94392O08950k21190
$$ 1923723 1341837 886425 732729 423485 156792 -353158 -58766 550184 328994
13309C28994r46160n32996O11745P9857m67124N46447Q05366L89555l92452l00790
$$ 328994 -617166 -1150162 -538417 -458560 -925684 -379237 426129 815684 423232 122442
13299A22442K9527L35442l09485j238549j268781j82638O84609O95932J238114
$$ 122442 151969 487411 177926 -1060623 -2329404 -2512042 -1827433 -1131501 106613
13290A06613O65425P76091P58118K24936j266419j382791M11258N31304n52558
$$ 106613 772038 1548129 2306247 2531183 1264764 -118027 293231 824535 271977
13281B71977j394640q72529N29924P34438N84559M56161k96710n64375K41724
$$ 271977 -1122663 -1995192 -1465268 -730830 -146271 309890 13180 -551195 -309471
13272c09471R40068M88709J153128Q5745m64753L20930L7205j186119o78386L7071
$$ -309471 630597 1119306 2272434 2358179 1893426 2214356 2251561 1065442 387056 424127
13262D24127M6307O71628J084285R03671k73144k92703j092131j494099m55143
$$ 424127 470434 1142062 2226347 3130018 2856874 2564171 1472040 -22059 -477202
13253d77202R8946o74989l41248N36122Q10493K07982L05130Q51474N03741j96060
$$ -477202 -378256 -1053245 -1394493 -858371 -47878 160104 465234 1316708 1820449 1624389
13243A624389m93677P36260J599855j5521q70386j32675k22872n53140o15050
$$ 1624389 1130712 1866972 3466827 3451306 2580920 2448245 2225373 1672233 1057183
13234A057183p01162j53581L60887J275629R82473L01566k85804q86894l97754
$$ 1057183 356021 202440 563327 1838956 2821429 3122995 2837191 1950297 1552543
13225A552543n9795K42082M42573o58759r6804O51884Q5147n44453j371974j398603
$$ 1552543 1492748 1734830 2177403 1518644 1421840 2073724 2158871 1614418 242444 -1156159
13215a156159N0093J61294m28216l41173K09680Q64244J560638J655946J741707
$$ -1156159 -1106066 -944772 -1372988 -1714161 -1504481 -640237 920401 2576347 4318054
13206D318054M42002n65308r84990j580656r09213m94438r4169O91098L55742
$$ 4318054 4760056 4194748 3209758 1629102 719889 225451 131282 822380 1178122
13197A178122L2763k61731m77970m28605j162947J07658J49638n03463j84205
$$ 1178122 1210885 949154 471184 42579 -1120368 -1012710 -863072 -1366535 -1550740
13188a550740J691027J759245K26374l81889p74225j362044p36924L26542j54305
$$ -1550740 140287 1899532 2125906 1744017 969792 -392252 -1129176 -802634 -956939
13179i56939N7565M27866r09329n74537N22534K53480R24071J102582L79045J42544
$$ -956939 -899374 -471508 -1380837 -1955374 -1432840 -1179360 -255289 847293 1226338 1368882
13169A368882J24214L15969N74886o10586j373786r68638o0677r0140l47668L87125
$$ 1368882 1493096 1809065 2383951 1773365 399579 -569059 -629736 -719876 -1067544 -680419
13159f80419M52493O94462L93443K09513J064091M55092k10680n60474j365861
$$ -680419 -227926 466536 859979 1069492 2133583 2588675 2377995 1817521 451660
13150D51660q35515J666125J706111M22579p04348j552707j339588m38490R50577
$$ 451660 -383855 1282270 2988381 3410960 2706612 1153905 -185683 -624173 326404
13141C26404K38051k91863M77433m3007o52851m9485M03037l05129o74239k85066
$$ 326404 564455 272592 750025 707018 54167 4682 407719 102590 -571649 -856715
13131h56715N67236J125632R76477k72590n55060n83875J06676N58671J18405
$$ -856715 -289479 836153 1812630 1540040 984980 401105 507781 1066452 1184857
13122A184857J30357o9514l70031r22588j96172L48801j91759k90433l21113R0615
$$ 1184857 1315214 1245700 875669 -46919 -243091 105710 -86049 -376482 -697595 -606980
13112f06980M73780O52865N46085O34306o09642q59851o51783J7600M45862J415661
$$ -606980 -133200 519665 1065750 1700056 1090414 230563 -421220 -403620 42242 1457903
13102A457903J466867j063825j097904l08002k4278j08250l6645l89061n69444
$$ 1457903 2924770 1860945 763041 455039 430761 322511 285866 -103195 -672639
13093f72639J86505L32215j78691l98370n41149j15652J746992J398464K99187
$$ -672639 -486134 -153919 -332610 -730980 -1272129 -1387781 359211 1757675 2056862
13084B056862o24680j41423j39506n81203r62818l19223n23400j046586k35101
$$ 2056862 1432182 1290759 1151253 570050 -392768 -711991 -1235391 -2281977 -2517078
13075b517078J428373P64819j50036j96621L38738J229392K3828p39202l07717
$$ -2517078 -1088705 -323886 -473922 -670543 -331805 897587 921415 182213 -125504
13066a25504k28164o26391N51729P54945o5479m34107j18365L02140j83502J96789
$$ -125504 -353668 -980059 -428330 326615 261136 -172971 -291336 10804 -172698 24091
13056B4091J430509R98823n5540j518962j316577n28970O38993R24852K46821
$$ 24091 1454600 2453423 2397883 878921 -437656 -966626 -327633 597219 844040
13047H44040R35738J024770J77587J31022o32444m71989r17958j17729J037568
$$ 844040 1779778 2804548 2982135 3113157 2480713 2008724 1090766 973037 2010605
13038B010605K46563r71726k10767m06693j321307J43245Q57752N29497J151753
$$ 2010605 2257168 1285442 1074675 667982 -653325 -510080 347672 877169 2028922
13029B028922O32783R8637k65592M33222M72677m69961p06605l96855N27305N93655
$$ 2028922 2661705 2760342 2494750 2927972 3400649 2930688 2224083 1827228 2354533 2948188
13019B948188L33783R78990l2181j403298q46052L59493n17313n27662L66829
$$ 2948188 3281971 4260961 4228780 2825482 1979430 2338923 1821610 1293948 1660777
13010A660777Q68507Q35596J44826J415083J371578R44650J30583j478696r45376
$$ 1660777 2529284 3364880 3509706 4924789 6296367 7241017 7371600 5892904 4947528
13001D947528K63467J378323J558361J647330J005630O52254P21447J647762J398260
$$ 4947528 5210995 6589318 8147679 9795009 10800639 11452893 12174340 13822102 15220362
12992A5220362J898353K582012K442099L320479N287950O505003P087519Q212248
$$ 15220362 17118715 19700727 22142826 25463305 30751255 37256258 44343777 52556025
12984E2556025J1768057J5560481J9324825K3657081K9611882L4610673L3083297
$$ 52556025 64324082 79884563 99209388 122866469 152478351 187089024 220172321
12977B20172321J7951215r523441l0012655l4898737l0341704k4695910k0651718
$$ 220172321 238123536 228600095 198587440 163688703 133346999 108651089 87999371
12970H7999371j5702659j0846299j0117569q386983n894451m142613k724355k343503
$$ 87999371 72296712 61450413 51332844 42945861 37051410 32908797 30184442 27840939
12962B7840939k957908l269562l050821k165007j575442j615088j157903n92102
$$ 27840939 24883031 21613469 18562648 16397641 14822199 13207111 12049208 11457106
12954A1457106K130n15870n21084m05224j077189j562364j475723o0775P06377
$$ 11457106 11459236 10943366 10422282 10017058 8939869 7377505 5901782 5841007 6547384
12945F547384K09338j00558K06583p76425o85859J18578J048254N15314k39366
$$ 6547384 6756722 6656164 6862747 6086322 5400463 5519041 6567295 7082609 6843243
12936F843243N5436k19251n7829j48265m62262L06846k30293k08318Q66305Q81954
$$ 6843243 6898679 6679428 6621599 6473334 6011072 6317918 6087625 5879307 6745612 7627566
12926G627566L8692m54175J53373Q55335R72726O29505K81098J070643O26294
$$ 7627566 7666258 7212083 7365456 8220791 9193517 9823022 10104120 11174763 11801057
12917A1801057o49765l07353K84587J018042J258027J127131J277499J036054
$$ 11801057 11151292 10843939 11128526 12146568 13404595 14531726 15809225 16845279
12909A6845279K19673J120098J766435J307263K004089K890880L209985K713965
$$ 16845279 17064952 18185050 19951485 21258748 23262837 26153717 29363702 32077667
12901C2077667L470086N104907O903918R464835J1783663J5507734J9701806K4893060
$$ 32077667 35547753 40652660 47556578 57021413 68805076 84312810 104014616 128907676
12893A28907676L2125875L6980598L1847401J0804630j7382347l4828044l5645717
$$ 128907676 161033551 198014149 229861550 240666180 223283833 188455789 152810072
12886A52810072k9660532k2955546j6907125j3739164j1030183q644749o853260
$$ 152810072 123149540 100193994 83286869 69547705 58517522 49872773 43019513
12879D3019513n395227m260374l486139l031468k677827k417388k903239k996507
$$ 43019513 37624286 33363912 29877773 26846305 24168478 21751090 18847851 15851344
12871A5851344j913672j137300l29391k48289l409M29468j79785j110354j274252
$$ 15851344 13937672 12800372 12470981 12222692 12219283 12648751 12468966 11358612 10084360
12862A0084360j152912j738779j249471J40298J34015j303841o24555O98703N09533
$$ 10084360 8931448 7192669 5943198 6083496 6217511 4913670 4289115 4987818 5497351
12853E497351J13729L57814M20948J3302L94045o61828k66053J96763l19729o81268
$$ 5497351 5611080 5968894 6389842 6403144 6797189 6135361 5869308 6066071 5746342 5065074
12843E065074J29646Q07294j32185q3294o88825j255055j24017N8880M20193P70054
$$ 5065074 5194720 6002014 5869829 5786535 5097710 3842655 3718638 3777518 4197711 4967765
12833D967765R26134L62355N49027Q95829K68660o2434O82170J523928N56013
$$ 4967765 5893899 6256254 6805281 7701110 7969770 7907336 8589506 10113434 10669447
12824A0669447M39933Q46039J020721Q39038K014018K955188K803153K439908
$$ 10669447 11109380 11955419 12976140 13815178 15829196 18784384 21587537 24027445
12816B4027445K268618L489268M571971O136717Q233031J0725171J3897583J6779697
$$ 24027445 26296063 29785331 34357302 40494019 48727050 59452221 73349804 90129501
12808I0129501K1195429K6523249L2184912L5827239K6466038L142643k1488460
$$ 90129501 111324930 137848179 170033091 205860330 232326368 235469011 213980551
12801B13980551l5606433l4835264k7549896k1328158j6781473j2428243r988586
$$ 213980551 178374118 143538854 115988958 94660800 77879327 65451084 55462498
12794E5462498q494668o059742m871415l853208l589963l964563k745921j574823
$$ 55462498 46967830 40908088 36036673 32183465 28593502 24628939 21883018 20308195
12786B0308195j798361j626720j547866j694836j150548n64221m96226r36164
$$ 20308195 18509834 16883114 15335248 13640412 12489864 11925643 11429417 10493253
12778A0493253j118105q39988k93924j02672l09789j099399k166304j471339J56525
$$ 10493253 9375148 8535160 8241236 8138564 7828775 6729376 4563072 3091733 3248258
12769C248258O28371O40114K81838j52885L53253L32999n01155o71935J61321
$$ 3248258 3876629 4516743 4798581 4645696 4998949 5331948 4830793 4158858 4320179
12760D320179Q26100P87706M46911J99025K99920J61240M96655L76680l57413
$$ 4320179 5146279 5933985 6380896 6579921 6879841 7041081 7537736 7914416 7557003
12751G557003j372006j518818r14472m93747j11345L52184J60962L18665k34238
$$ 7557003 6184997 4666179 3751707 3257960 3146615 3498799 3659761 3978426 3744188
12742C744188r70264N7698L89832L16148N5336m23801K36882J11778n69446j018830
$$ 3744188 2773924 2831622 3221454 3537602 3592938 3169137 3406019 3517797 2948351 1929521
12732A929521l75929K85582l12442j107342j038251l87409k20485N98837R05296
$$ 1929521 1553592 1839174 1526732 419390 -618861 -1006270 -1226755 -627918 277378
12723B77378j24115l4797L71407q9167M95198J073767O55335l67501r98473j718550
$$ 277378 153263 118466 489873 400706 895904 1969671 2625006 2257505 1259032 -459518
12713d59518l9983L38203j201642L22759J342763K05307J74967Q47952J476154
$$ -459518 -499501 -161298 -1362940 -1040181 302582 507889 682856 1530808 3006962
12704C006962K65444p19200j202940n32493J72598N50757Q18766j4616m5948l80709
$$ 3006962 3272406 2553206 1350266 817773 990371 1541128 2359894 2345278 2299330 1918621
12694A918621n56328K51507k27441m44538k15523o83535p61425J20257Q14608
$$ 1918621 1362293 1613800 1386359 941821 726298 42763 -718662 -598405 216203
12685B16203M59350J025495P79126k83014k73965j51439j72509r10839p4456P68420
$$ 216203 675553 1701048 2480174 2197160 1923195 1771756 1599247 688408 613952 1382372
12675A382372L17084J83978K25954l52111p02117n27576p76961j134910K19724
$$ 1382372 1699456 1883434 2109388 1757277 1055160 527584 -249377 -1384287 -1164563
12666a164563J731266R41261K18125K19990J90119l94676r54910o29970N24146
$$ -1164563 566703 1507964 1726089 1946079 2136198 1741522 786612 156642 680788
12657F80788P20535L94311J67897Q5591j46333l78457q90612M3097J61173r96986
$$ 680788 1401323 1795634 1963531 2049122 1902789 1524332 633720 676817 837990 -158996
12647a58996J99558Q67441j84145r827K89019k9815n07598k61914K29396m83653
$$ -158996 40562 908003 723858 714031 1003050 973235 465637 203723 433119 -50534
12637e0534o78223p5842l13203M16309Q49982K39951j13524m7226l80093m92961
$$ -50534 -728757 -804599 -1117802 -701493 148489 388440 274916 227690 -152403 -645364
12627f45364n60302K79093P19977M29992M2115L83197K62102K24534j27919r11665
$$ -645364 -1205666 -926573 -206596 223396 265511 648708 910810 1135344 1007425 95760
12617I5760n72673l25070L00156M21027R1068m97501k54861j70875o65855J09367
$$ 95760 -476913 -801983 -501827 -80800 10268 -487233 -742094 -912969 -1578824 -1469457
12607a469457N23154k8401m21375k44541M09861J286221O29570j14035N15172
$$ -1469457 -946303 -974704 -1396079 -1640620 -1230759 55462 685032 570997 1086169
12598A086169O8756p22472K57883N73275N97188N50320l25992p45387n96678m78088
$$ 1086169 1154925 432453 690336 1263611 1860799 2411119 2085127 1339740 743062 264974
12588B64974p76826j49808o19882n53572j2911R46751J718895J945963J083758
$$ 264974 -511852 -661660 -1281542 -1835114 -1848025 -901274 817621 2763584 3847342
12579C847342j09890o43674r84163n86907j045483n38784R80697O02701K32047
$$ 3847342 3737452 3093778 2109615 1522708 477225 -61559 919138 1521839 1753886
12570A753886l5153n25414J10033j14066j77020J78715n32817j92736J79349K69343
$$ 1753886 1718733 1193319 1303352 1189286 1012266 1190981 658164 465428 644777 914120
12560I14120Q16454k7074n94896o25874j18050L81780j23671J50656j34810j4322
$$ 914120 1730574 1703500 1108604 482730 364680 746460 622789 773445 638635 624313
12550F24313N33977N74592N98657N4218N9932J91556n54949j568679r31318Q2468
$$ 624313 1158290 1732882 2331539 2385757 2445689 2637245 2082296 513617 -417701 -335233
12540c35233K93473K55447K40651j240647j137426J10801k85537j92920J257799
$$ -335233 -41760 213687 454338 -786309 -1923735 -1812934 -2098471 -2291391 -1033592
12531a033592P66306R39356K89335K3231N3512k72927K90403m05911n85572j01838
$$ -1033592 -267286 672070 961405 984636 1038148 765221 1055624 649713 64141 -37697
12521c7697J35678J33087L43730K06592m21246r70730j492243k54528M50493k61144
$$ -37697 97981 231068 574798 781390 360144 -610586 -2102829 -2357357 -1906864 -2168008
12511b168008j79856l03462K67283J491119R02527Q9851p74817j423450K22958
$$ -2168008 -2347864 -2651326 -2384043 -892924 9603 99454 -675363 -2098813 -1875855
12502a875855J113024J522928R98240J07649k53879j095533k01625J123093j89225
$$ -1875855 -762831 760097 1758337 1865986 1612107 516574 314949 1438042 1248817
12493A248817p20658j239268o17395O9141L29186M74057R44864O24399o68770
$$ 1248817 528159 -711109 -1328504 -1259363 -930177 -456120 488744 1113143 444373
12484D44373j005537k15252O87788P62146K79434M78806R9394k08703J23016l16225
$$ 444373 -561164 -776416 -88628 673518 952952 1431758 1531152 1322449 1445465 1129240
12474A129240j082514J13937O86096m43828n28626m62705K59527J015153L13606
$$ 1129240 46726 160663 846759 402931 -125695 -588400 -328873 686280 999886
12465I99886m95561l04642m55554R03015J443865J64331n91824J50466k94848
$$ 999886 504325 199683 -255871 647144 2091009 2255340 1663516 1813982 1519134
12456A519134j084602J04456J96304j99114p31742j084751n70501q94733l45848
$$ 1519134 434532 538988 735292 536178 -195564 -1280315 -1850816 -2745549 -3091397
12447c091397Q11464R39627J223781P51198Q30480Q08377j39774r25666m27558
$$ -3091397 -2279933 -1340306 -116525 634673 1465153 2273530 2133756 1208090 780532
12438G80532l64291k40127n55162o36080j03214J45284M19874O67360O57614L89803
$$ 780532 416241 176114 -379048 -1015128 -1118342 -973058 -553184 114176 771790 1161593
12428A161593Q4971K29874l26064o47170k19205m64325l6793k98913p75221J59973
$$ 1161593 1246564 1476438 1150374 503204 283999 -180326 -217119 -516032 -1291253 -1131280
12418a131280L17822n43468k05422M53003J054367N75261O90230P22526k72203
$$ -1131280 -813458 -1356926 -1562348 -1109345 -54978 520283 1210513 1933039 1660836
12409A660836j510495j434496n07482O39009J21825M00817Q11988J99270K62593
$$ 1660836 150341 -1284155 -1791637 -1152628 -1030803 -629986 182002 381272 643865
12400F43865J93818N22651J16925k88182o85570p41210j308528k99011L54163
$$ 643865 837683 1360334 1477259 1189077 503507 -237703 -1546231 -1845242 -1491079
12391a491079N22029J492877J262620n61283j380552N74051J459859K25742r51658
$$ -1491079 -969050 523827 1786447 1225164 -155388 418663 1878522 2104264 1152606
12382A152606r83973n75968L53485J251224J844242J49293j741987j148278J26834
$$ 1152606 168633 -407335 -53850 1197374 3041616 3190909 1448922 300644 427478
12373D27478R73173k45641j107002r45412K61891J009234J375098J385645O08817
$$ 427478 1400651 1155010 48008 -897404 -635513 373721 1748819 3134464 3743281
12364C743281n93314j054463q3727Q49777r94827j772040o46777K40916l89168
$$ 3743281 3149967 2095504 2011777 2861554 1866727 94687 -552090 -311174 -700342
12355g00342n51943m71396j22576M64868P35997O76343M22361k43642q43241P51661
$$ -700342 -1252285 -1723681 -1846257 -1381389 -645392 30951 453312 209670 -633571 118090
12345A18090K89680k05920p14144l20913R7976k98799k15587J115090J851751
$$ 118090 407770 201850 -512294 -833207 -735231 -1034030 -1249617 -134527 1717224
12336A717224n90298j571207m40900K03764J57367k80265L53659M8920j44541
$$ 1717224 1126926 -444281 -885181 -681417 -524050 -804315 -450656 -401736 -546277
12327e46277O5211n33481K74024J059076J284196j0970q66366L99086L42427K70734
$$ -546277 -481066 -1014547 -740523 318553 1602749 1591779 725413 1124499 1466926 1737660
12317A737660n2951q02941J43590P79919m19238o99619p6287n96704q62750m03046
$$ 1737660 1684709 881768 1025358 1805277 1386039 686420 610133 13429 -849321 -1252367
12307a252367K87318M553l81094M47029M64829N52241j51262J38069p3937l78876
$$ -1252367 -965049 -960496 -1341590 -894561 -429732 122509 -28753 109316 35379 -343497
12297c43497n57707K6736P82035J340620J07017j461915n51403k86378M11406
$$ -343497 -901204 -874468 -92433 1248187 1355204 -106711 -658114 -944492 -533086
12288e33086M38366K86995P24927N54730Q9657n96640J43400O73369M42145J88482
$$ -533086 -94720 192275 917202 1471932 1561589 964949 1108349 1781718 2223863 2412345
12278B412345l30967l92294n17042j282251r13044K77751J473021J901712O37169
$$ 2412345 2081378 1689084 1172042 -110209 -1023253 -745502 727519 2629231 3266400
12269C266400l62949o73689l74434J82321J43238m26117k54111m67813J51149
$$ 3266400 2903451 2229762 1855328 2037649 2180887 1754770 1500659 1032846 1183995
12260A183995M70339k585J76052p41319o92206K42989J99080k6709J41876N41279
$$ 1183995 1654334 1651749 1827801 1086482 394276 637265 836345 809636 951512 1492791
12250A492791O57861M33491o70997q78122r01587j065011q83567m33076O76604
$$ 1492791 2150652 2584143 1913146 1035024 133437 -931574 -1815141 -2248217 -1571613
12241a571613J153556J111946n5968k31505p36538J69919M99094N59886p06231
$$ -1571613 -418057 693889 637921 406416 -330122 -160203 338891 898777 192546
12232A92546p16877N76030P66212J285071N05168P7018j90971m7397o29049j045500
$$ 192546 -524331 51699 817911 2102982 2608150 2685168 2494197 2446800 1817751 772251
12222G72251o12322j23156j83678j71245p33702l99314O88928j58391j032494
$$ 772251 159929 36773 -146905 -318150 -1051852 -1451166 -762238 -920629 -1953123
12213a953123k63948j68775o7729J67006m37188m09798M75197N86223P30610O32139
$$ -1953123 -2217071 -2385846 -2453575 -2286569 -2723757 -3133555 -2658358 -2072135 -1341525 -709386
12203g09386J21277l43405n24851n18581j26209R604N17600O60199P18787l75975
$$ -709386 -588109 -931514 -1456365 -1974946 -2101155 -2091551 -1573951 -913752 -194965 -570940
12193e70940q77364j95635M6975J051974Q18398l60691n15920J14591j69438o25374
$$ -570940 -1448304 -1643939 -1596964 -544990 273408 -87283 -603203 -488612 -658050 -1283424
12183a283424K86916M94744j39807J2668M98405q32200o69313J5335L55465o9361
$$ -1283424 -996508 -501764 -641571 -628903 -130498 -962698 -1632011 -1616676 -1261211 -1330572
12173a330572r49562l7162J008995O17575m70267L66693J081861Q44592l3553
$$ -1330572 -2280134 -2317296 -1308301 -690726 -1160993 -794300 287561 1132153 1098600
12164A098600n08045p36077r65896N24814P30392l90526r6395N65811K11455N2089
$$ 1098600 590555 -145522 -1111418 -586604 143788 -246738 -343133 222678 434133 486222
12154D86222m39045R160R72782j20176q92702k28196K19325L43890M32840p07528
$$ 486222 47177 56337 1029119 908943 16241 -211955 7370 351260 784100 76572
12144G6572o33134N87919o0800K29917M2336j375818j252416m72614J288508K45848
$$ 76572 -556562 31357 -29443 200474 242810 -1133008 -2385424 -2858038 -1569530 -1323682
12134a323682J244324L35278k20197O64203P19589Q24956Q3074o12990l98440
$$ -1323682 -79358 255920 35723 699926 1419515 2244471 2327545 1714555 1316115
12125A316115O8716m46558r62995k97162m0636q82266p92858k69673Q18692N25885
$$ 1316115 1384831 938273 -24722 -321884 -362520 -1244786 -2037644 -2307317 -1488625 -962740
12115i62740k70527j055570q05378J440563J039742M36015Q29441k61151j146223
$$ -962740 -1233267 -2288837 -3094215 -1653652 -613910 -177895 651546 390395 -755828
12106g55828k11378K34538P12836O69122K59102L90214r96512j163430q34738
$$ -755828 -967206 -732668 -19832 649290 908392 1298606 302094 -861336 -1696074
12097a696074k17634N46800k44709p58735K20100R27516Q54752n95288j077421
$$ -1696074 -1913708 -1366908 -1611617 -2370352 -2150252 -1222736 -367984 -963272 -2040693
12088b040693n3584Q7376Q8479N49226J55605J076175O75078k04858J36236K11331
$$ -2040693 -2094277 -2006901 -1918422 -1369196 -1213591 -137416 537662 332804 469040 680371
12078F80371p15462n43794N97031K55979m94869P7214j1328O5535Q51331m367
$$ 680371 -35091 -578885 18146 274125 -220744 -143530 -154858 -89323 762008 757641
12068G57641m69776p46707p92167l94340j14809j10284L60449J213872J124261
$$ 757641 287865 -458842 -1251009 -1645349 -1760158 -1870442 -1509993 -296121 828140
12059H28140M83606J45125l54670J75539O85469p04109n40739Q15236J126074
$$ 828140 1311746 1456871 1102201 1277740 1963209 1259100 718361 1533597 2659671
12050B659671m01040l78622J48552n29470j545599r89530o16424m60026O36696
$$ 2659671 2258631 1880009 2028561 1499091 -46508 -1036038 -1652462 -2112488 -1475792
12041a475792O51558Q51018P26643K95237l41630n51036M61753J105449O56080
$$ -1475792 -824234 26784 753427 1048664 707034 155998 617751 1723200 2379280
12032B379280k10551j231477n94893p32305j81797j39106j142447k65850j85833
$$ 2379280 2168729 937252 342359 -389946 -571743 -710849 -1853296 -2119146 -2304979
12023b304979P68542J010521N62878J59000n91882j025002j703200n40854J81077
$$ -2304979 -1536437 -525916 36962 195962 -395920 -1420922 -3124122 -3664976 -3483899
12014c483899M9260J13241N57033P29507J24363M55686Q19955N32213O97264k02195
$$ -3483899 -3434639 -3321398 -2764365 -2034858 -1910495 -1454809 -634854 -102641 594623 392428
12004C92428j218943j21621J94145J312501J442370o44661j155253p30989p01252
$$ 392428 -826515 -948136 -753991 558510 2000880 1356219 200966 -530023 -1231275
11995a231275M06007K72845k79704j71140j12117l81574N74632R40955L92277
$$ -1231275 -825268 -552423 -832127 -1003267 -1115384 -1496958 -922326 18629 410906
11986D10906n2436m06126K07532R32941M05753p85453o18536Q18509J239631N09565
$$ 410906 358470 -47656 159876 1092817 1498570 713117 94581 913090 2152721 2662286
11976B662286m23135j389470l03819M49722r5527l1443N11331M07224n32333R306
$$ 2662286 2239151 849681 545862 995584 900057 868614 1379945 1787169 1254836 1264142
11966A264142P92254N16626j22878j193987j447003m6703J078781P01028l05734
$$ 1264142 2056396 2573022 2450144 1256157 -190846 -237549 841232 1542260 1236526
11957A236526k76155p62176q54850p37866j179281Q9494J089226R95445Q83111
$$ 1236526 960371 198195 -656655 -1394521 -2573802 -2484308 -1395082 -399637 483474
11948D83474K30027K10327L16652N53547l09948j015213j034093o77128P66673
$$ 483474 713501 923828 1240480 1794027 1484079 468866 -565227 -1242355 -475682
11939d75682J055176L28175l03625j199417j698048k55364R83921R67978L20412
$$ -475682 579494 907669 604044 -595373 -2293421 -2548785 -1564864 -596886 -276474
11930b76474J74169o3303J18116K69447n2891Q8849M21771j86168o99857k44135
$$ -276474 -102305 -165608 -47492 221955 169064 257913 679684 493516 -206341 -450476
11920d50476n79122m43289O15133J777060J280852L90394M1993n70785l37715
$$ -450476 -1029598 -1472887 -857754 919306 2200158 2590552 2632545 2061760 1724045
11911A724045o87226o50884n12325n45692j73539j94501n5862r8489Q36396L75426
$$ 1724045 1036819 385935 -126390 -672082 -845621 -1040122 -1095984 -1194473 -358077 17349
11901A7349l92440r559r56059n69469L8345j65747L66388J302914R90877P79250
$$ 17349 -375091 -384650 -1340709 -1910178 -1871833 -2037580 -1671192 -368278 622599 1401849
11891A401849N30145l71838j921666j398928m89606K3951J56658N51412k75254
$$ 1401849 1931994 1560156 -361510 -1760438 -2250044 -2226093 -2069435 -1518023 -1793277
11882a793277K41689K78438l51783m00529K39453J128356O49102l0657o99033
$$ -1793277 -1551588 -1273150 -1624933 -2025462 -1786009 -657653 -8551 -39208 -738241
11873g38241n18061N21545O25530L92193K98076j56365j53890k51492r8991j12925
$$ -738241 -1256302 -734757 -109227 282966 581042 424677 270787 19295 -79696 -192621
11863a92621j47277J90154o5378r9452Q1931k17235J30507K9780J31417J492361
$$ -192621 -339898 -149744 -215122 -314574 -232643 -449878 -319371 -289591 -158174 1334187
11853A334187J159657j143776j528773l71543O26036Q89516L88657K48692J13008
$$ 1334187 2493844 1350068 -178705 -550248 75788 965304 1353961 1602653 1715661
11844A715661q20625n69603j68742J153213J086651R3629P77403Q5783r79019
$$ 1715661 895036 325433 156691 1309904 2396555 2490184 3267587 3353370 2374351
11835B374351r03172n34037K38624J60779o95819q73763o24788O40342R66405
$$ 2374351 1471179 937142 1175766 1336545 640726 -233037 -857825 -217483 748922
11826G48922p57485j536900k8811R12876O96642q3584p46751N7161O81791O15961
$$ 748922 -8563 -1545463 -1574274 -661398 35244 -48340 -795091 -737930 -56139 559822
11816E59822m1737q15417p16239j3474k89195o53061p2307m13017p38861L70021
$$ 559822 518085 -297332 -1013571 -1027045 -1316240 -1969301 -2041608 -2454625 -3193486 -2823465
11806b823465N65082L19772Q71908P89015K24099k21493O4055L70725M30592O84755
$$ -2823465 -2258383 -1938611 -1066703 -277688 -53589 -275082 -211027 159698 590290 1275045
11796A275045K96611m22839L9035j45048o73633L72239K28699n09881o63631n37718
$$ 1275045 1571656 1148817 1187852 1042804 369171 741410 970109 460228 -203403 -741121
11786g41121n23940K41312J644504J283023K49352o96537q61282l43215r721j02795
$$ -741121 -1265061 -1023749 620755 1903778 2153130 1456593 595311 252096 242375 139580
11776A39580K55316p15386r58974k91478K70992r3963l7046K42203J254993J124120
$$ 139580 394896 -320490 -1279464 -1570942 -1299950 -1393913 -1430959 -1188756 66237 1190357
11766A190357K6881n2934p8174n73669l98044N93916M58970j513864j210407K08893
$$ 1190357 1217238 1164304 1086130 512461 114417 708333 1167303 -346561 -1556968 -1348075
11756a348075R2199j9628l05749J178179P46848j127402p83809n7321P39739n11458
$$ -1348075 -1255876 -1275504 -1581253 -403074 343774 -783628 -1567437 -1624758 -885019 -1396477
11746a396477K578891K091710j689317j549838j44210N55241l49526o0710J80859
$$ -1396477 1182414 3274124 1584807 34969 -109241 446000 96474 35764 216623
11737B16623n29897j145549k67787K26837L70580j10685l56848L44516J170810
$$ 216623 -313274 -1458823 -1726610 -1499773 -1129193 -1239878 -1596726 -1252210 -81400
11728h1400O85016N39710P20491K17594n19363n52405j018051j203291j040672
$$ -81400 603616 1143326 1863817 2081411 1562048 1009643 -8408 -1211699 -2252371
11719b252371P70549J493699k63272L96584J272153R3564k01933m79975L77369
$$ -2252371 -1481822 11877 -251395 145189 1417342 1510906 1308973 828998 1206367
11710A206367N32818J35319l01587p13178o32887q39541l06162l75255P85800
$$ 1206367 1739185 1874504 1572917 859739 226852 -612689 -918851 -1294106 -508306
11701e08306J765118L13119m35289q40035p8028Q89949J33651r33407n02273L9992
$$ -508306 1256812 1569931 1134642 294607 216579 1106528 1240179 306772 -195501 -155509
11691a55509J90547n09444J94123J0534p64837o98878j59433J005991J401466
$$ -155509 35038 -474406 -280283 -269749 -1034586 -1733464 -1892897 -886906 514560
11682E14560L59315M42892J01820j4184P9714P19110L85484K71304K97107k95157
$$ 514560 873875 1316767 1418587 1404403 1484117 2203227 2588711 2860015 3157122 2861965
11672B861965j373488j368214L64525Q38804M21732O27927N8535j451305j036595
$$ 2861965 1488477 120263 484788 1323592 1745324 2373251 2431786 980481 -56114
11663e6114k85015K58344k8520l01545j56718l2962K42774O65153Q648p57277
$$ -56114 -341129 -82785 -111305 -412850 -569568 -602530 -359756 305397 314045 -443232
11653d43232m75126l79688j65492P34470L54650L55634K57446N70058P95286k20094
$$ -443232 -918358 -1298046 -1463538 -729068 -374418 -18784 238662 808720 1604006 1383912
11643A383912j084128j225971o18300J12358J189307J353675J007051m36803n08077
$$ 1383912 299784 -926187 -1544487 -1432129 -242822 1110853 2117904 1681101 1173024
11634A173024J78473J89032j62446m93748L9312n31469p36155j20247l18026m07294
$$ 1173024 1351497 1540529 1378083 884335 923647 392178 -343977 -464224 -782250 -1189544
11624a189544o73707K8519M39322N29756P06138k59425J70086M43032N78328Q14134
$$ -1189544 -1863251 -1834732 -1395410 -865654 -159516 -418941 -248855 194177 772505 1586639
11614A586639R37743J039013j97939p76911o39455q58175j47421M09045J089014
$$ 1586639 2524382 3563395 3365456 2588545 1949090 1090915 943494 1352539 2441553
11605B441553O50117j082941j206330l31870J6368J278703N08973q11306K20203
$$ 2441553 3091670 2008729 802399 470529 486897 1765600 2274573 1463267 1683470
11596A683470j5889m26288r26643j216023j320490m75899J200078P58923n09010
$$ 1683470 1667581 1241293 314650 -901373 -2221863 -2697762 -1497684 -738761 -1247771
11587a247771k9661P90144P37895p91400m64945O60644L32286L4344M00527J69268
$$ -1247771 -1277432 -487288 250607 -540793 -1005738 -345094 -12808 21536 422063 591331
11577E91331M81982k42965j00811N39443m99917j36950P6731O87634N95125O75500
$$ 591331 1073313 830348 729537 1268980 769063 632113 708844 1396478 1991603 2667103
11567B667103M5815j39051O1847L56574m145R794l39321O56497Q69407m63979
$$ 2667103 2712918 2573867 2635714 2992288 2988143 2997937 2658616 3315113 4184520 3720541
11557C720541m75180N2725j93277o8910N12967J457540P68504q56290p51834J74288
$$ 3720541 3245361 3298086 3104809 3035899 3548866 5006406 5774910 4918620 4166786 4341074
11547D341074r3968O5044N84599P04656O1994K72944J001378O46443M93490J95104
$$ 4341074 4247106 4312150 4896749 5601405 5663399 5936343 6937721 7584164 8077654 8272758
11537H272758K76853J043149J763664R88814J027983J500444K565002K901291
$$ 8272758 8549611 9592760 11356424 12345238 13373221 14873665 17438667 20339958
11529B0339958K812309K318261K838270L443850L524273M221203O314317P967119
$$ 20339958 23152267 25470528 28308798 31752648 35276921 39498124 45812441 53779560
11521E3779560Q566059R808099J0603500J0332776Q273519M384421k216552q621038
$$ 53779560 62345619 72153718 82757218 93089994 101363513 105747934 103531382 94910344
11513I4910344j1778003j1292428j0297428q950240p719873o787861n666143m533987
$$ 94910344 83132341 71839913 61542485 52592245 44872372 38084511 32418368 27884381
11505B7884381m726263m401956l392340k595082k204866j914250p50105m45082
$$ 27884381 23158118 18756162 15363822 12768740 10563874 8649624 7899519 7454437
11497G454437j242448j657201k73107n8577k22139l89858n7561k28248j015237
$$ 7454437 6211989 4554788 4281681 4223104 4000965 3611107 3553546 3325298 2310061
11488B310061K24224O45324n6235j0905L66281O1147o85344q8970L26637L88615
$$ 2310061 2534285 3179609 3123374 3112469 3478750 3539897 2854553 2765583 3092220 3480835
11478C480835L34722k98280j106386j486926l81936L45386J71034J74978J60835
$$ 3480835 3815557 3517277 2410891 923965 542029 887415 1058449 1233427 1394262
11469A394262r0856l42531o35236l62664k55966O93419Q2810m54897q47077j054497
$$ 1394262 1303406 960875 325639 -37025 -292991 400428 483238 28341 -818736 -1873233
11459a873233n70854p93203j555505J30585J593258Q19921n28161k138825l72188
$$ -1873233 -2444087 -3237290 -4792795 -4662210 -3068952 -2249031 -2777192 -4916017 -5288205
11450e288205n8570L259582L866861J318880J77823q7182J09392o74658j283056
$$ -5288205 -5346775 -2087193 1779668 3098548 3276371 3189189 3298581 2623923 1340867
11441A340867p49684L56330P1674M75492Q6734q81807n91919p87447j2788R87753
$$ 1340867 591183 947513 1019187 1494679 1581413 699606 107687 -679760 -692548 295205
11431B95205Q37547J499716J140469J170602J229732p13840j434294m08762k75418
$$ 295205 1132752 2632468 3772937 4943539 6173271 5459431 4025137 3616375 3340957
11422C340957L81682J52698n3250o08367j089098o63337l29865j34936k33935
$$ 3340957 3722639 3875337 3822087 3213720 2124622 1461285 1131420 996484 762549
11413G62549k22227M69199p5201k58649l52174o35399K74637J279422Q80922k12771
$$ 762549 540322 1009521 934320 675671 323497 -311902 -37265 1242157 2123079 1910308
11403A910308L38858N47832k91849n15434m32633q84378q91183J57365O97762
$$ 1910308 2249166 2796998 2505149 1989715 1557082 672704 -218479 -61114 636648
11394F36648Q11021j9037j795855r57496O16022Q53855M50501O70717K84567r8531
$$ 636648 1447669 1428632 -367223 -1324719 -708697 145158 595659 1266376 1550943 1452412
11384A452412n26031j03699J81356l11244n97512M32554Q00240l29288o57793
$$ 1452412 926381 822682 1004038 692794 95282 527836 1328076 998788 340995
11375C40995L6380n2405o33585j400144j232602k48116K98374N96989O74568Q61952
$$ 340995 377375 324970 -308615 -1708759 -2941361 -3189477 -2891103 -2294114 -1619546 -757594
11365g57594J410616L93724o42127m64836O90289Q8037q01472j37325L01265o62934
$$ -757594 653022 1046746 404619 -60217 630072 718109 -83363 -220688 80577 -582357
11355e82357L71150J35227r57796l98113N99563O36113L06374J070610P31362
$$ -582357 -211207 -75980 -1033776 -1431889 -832326 -196213 110161 1180771 1912133
11346A912133k64156J92609n7716q45401L66563N32394M22425o0140p42640o14756
$$ 1912133 1647977 1840586 1782870 937469 1304032 1836426 2258851 2198711 1456071 841315
11336H41315q78558k11693Q63896J69307M4942J05477j69631o57670l813L37592
$$ 841315 -37243 -248936 614960 784267 829209 934686 765055 107385 103572 441164
11326D41164R20836L34561J98329r4207o01548n47520m76897J64338K29923M5189
$$ 441164 1362000 1696561 1894890 1800683 1199135 651615 174718 339056 568979 614168
11316F14168N50585j09626n45365m25177k08772J80324n96530n28807j78107L2166
$$ 614168 1164753 1055127 509762 84585 -124187 56137 -540393 -1069200 -1247307 -1215141
11306a215141k83113j80115k78092J90193Q99696J298498P60071M12187J35394
$$ -1215141 -1498254 -1678369 -1956461 -1766268 -866572 431926 1191997 1604184 1739578
11297A739578m77022m1076M41411J35476N89549j87724r83674N14959P89925L05133
$$ 1739578 1262556 1221480 1662891 1798367 2387916 2200192 1216518 1731477 2521402 2826535
11287B826535l38305j160945l79670k50002j19671L0368m75550j205712n80301
$$ 2826535 2488230 1327285 947615 697613 577942 608310 132760 -1072952 -1653253
11278a653253J118541j378q72624N4846M05653p7542J68969J092922J621547R15229
$$ -1653253 -534712 -536090 -1408714 -1353868 -948215 -1025757 -856788 236134 1857681 2772910
11268B772910m69425j545053j574570j577541l83156R56745O68224r2296p2080
$$ 2772910 2303485 758432 -816138 -2393679 -2776835 -1820090 -1151866 -1244162 -1316242
11259a316242J55577J065917J95802K80707Q27701P03585L06924l66026n39795
$$ -1316242 -1160665 -94748 101054 381761 1209462 1913047 2219971 1853945 1314150
11250A314150j151000m44473M40896O46911N85349l83635L50754N04662p8451
$$ 1314150 163150 -281323 159573 806484 1391833 1008198 1358952 1863614 1785163
11241A785163n66231l68702M99615J050911j53448n29640o45865r6210M54979
$$ 1785163 1218932 850230 1349845 2400756 2247308 1717668 1071803 975593 1430572
11232A430572J121o35228N03035R37001l21248J39330J57618j242177j23488P38935
$$ 1430572 1431693 796465 1299500 2236501 1915253 2054583 2212201 970024 846536 1585471
11222A585471q6683l79863m47316o33078k34881J59713L37488M56703o2127Q35610
$$ 1585471 1498788 1118925 671609 38531 -196350 -36637 300851 757554 695427 1531037
11212A531037J61206p86902k73671n1947K62768k67743r35510n81291L65591L23764
$$ 1531037 1692243 905341 631670 579723 842491 574748 -360762 -942053 -576462 -252698
11202b52698M73666J12922L28688M79875Q1861J56527J37173N35198l90156j495979
$$ -252698 220968 333890 662578 1142453 1224314 1380841 1518014 2053212 1663056 167077
11192A67077n87632k86712O41748J158610j60095O3773m277m07511L7188J18037
$$ 167077 -420555 -707267 -65519 1093091 932996 996769 992492 584981 622169 740206
11182G40206P2143P71256N5943p86597l66122o15272l96318N63656P67427K97892
$$ 740206 812349 1583605 1639548 852951 486829 -128443 -524761 38895 806322 1104214
11172A104214l28329J72655K91581N16179r41885j468829n81713l8812N64838
$$ 1104214 775885 948540 1240121 1756300 814415 -654414 -1236127 -1274939 -710101
11163g10101P14976j25540O79359M18228L87619R37205P63347q39456j495127
$$ -710101 4875 -120665 558694 976922 1364541 2301746 3065093 2225637 730510
11154G30510q27166K23630P36946P57643j00554p51398o03970j093741L69572
$$ 730510 -96656 126974 863920 1621563 1521009 769611 165641 -928100 -558528
11145e58528J457082J347306K4054m94731p05321j146181r36283O267Q47021J38076
$$ -558528 898554 2245860 2269914 1775183 1069862 -76319 -1012602 -1006335 -159314 -21238
11135b1238k97256j39128K40357R25513R50646N76953l70520j05550j152918j438742
$$ -21238 -318494 -457622 -217265 708248 1658894 2235847 1865327 1759777 606859 -831883
11125h31883l07182O47128J271253K36721r8255M91500N44740M51890j85869o66485
$$ -831883 -1139065 -491937 779316 1016037 917782 1409282 1954022 2405912 2220043 1553558
11115A553558n33222k83733m52653J1104J63735O16098Q22508M04255P09933j8913
$$ 1553558 1020336 736603 283950 295054 458789 1074887 1897395 2301650 3011583 2992670
11105B992670j78387o33726j068909j919658p90733Q5969k48244J34691k17621
$$ 2992670 2814283 2180557 1111648 -808010 -1598743 -1512774 -1761018 -1626327 -1843948
11096a843948j126110L55953J009245M14082r9477K46609M05750L81212L68161
$$ -1843948 -2970058 -2614105 -1604860 -1190778 -1290255 -1043646 -637896 -256684 111477
11087A11477K08541l78846P7325J113799R91509J10270o38672m36811j56095n15786
$$ 111477 320018 -58828 18497 1132296 2123805 2234075 1595403 1158592 1002497 486711
11077D86711K06478P76329O63571o33577j027589k07974L65370O49246M69869
$$ 486711 693189 1469518 2133089 1499512 471923 263949 629319 1278565 1748434
11068A748434l16248p94785j155763n75055L20250J38489P2409N7049o03907n53420
$$ 1748434 1432186 637401 -518362 -1093417 -773167 -634678 -562269 -505220 -1109127 -1662547
11058a662547L17356j82852K2776J284942J553654K94615j251980j344801j082793
$$ -1662547 -1345191 -1528043 -1505267 -220325 1333329 1627944 375964 -968837 -2051630
11049b051630r17070K68453J387961J234067J4479j23125R17614L94869k95843
$$ -2051630 -2968700 -2700247 -1312286 -78219 -63740 -186865 730749 1125618 829775
11040H29775l80639j5741J43955j72602p28088p07158j63079K13214l59307o69915
$$ 829775 449136 433395 577350 404748 -323340 -1030498 -1193577 -980363 -1339670 -2009585
11030b009585M73455L70324K53400K68810K36938N64021L76676M48017j97556
$$ -2009585 -1536130 -1165806 -912406 -643596 -406658 157363 534039 982056 784500
11021G84500j168781o27387Q43783J728237K167173M06483l01491n7651n19969
$$ 784500 -384281 -1011668 -167885 1560352 3727525 4134008 3832517 3774866 3254897
11012C254897n26314r59346r24089n04333Q18931j06472o11565J29831j27341
$$ 3254897 2728583 1769237 845148 340815 1159746 1053274 441709 571540 444199
11003D44199q59328n07128K40960M35625p79332p19481J64425L60920Q33802L614
$$ 444199 -415129 -922257 -681297 -245672 -1025004 -1744485 -1580060 -1219140 -385338 -381724
10993c81724k91629K22190O93612N70016M77600l18053p85479j790426p52951
$$ -381724 -673353 -451163 242449 812465 1290065 972012 186533 -1603893 -2356844
10984b356844R18382J193354Q42428R38033J22018o55776k90319o42942q49227
$$ -2356844 -1438462 -245108 597320 1535353 1657371 1001595 711276 68334 -780893
10975g80893q41914K18037j55652k69872M24064K15246j63247r4941P82014L72738
$$ -780893 -1622807 -1404770 -1560422 -1830294 -1406230 -1190984 -1354231 -1449172 -667158 -294420
10965b94420r20746p02754m75323L37154J480073Q66441p4316j06209n58763J09126
$$ -294420 -1215166 -1917920 -2393243 -2056089 -576016 290425 216109 109900 -448863 -339737
10955c39737K93907L06714l05670r51527j030714l30301r13747n97078J098096
$$ -339737 -45830 260884 -44786 -996313 -2027027 -2357328 -3271075 -3868153 -2770057
10946b770057J784579M95385n60868P9102O27597J94808J078193J281706J0142
$$ -2770057 -985478 -490093 -1050961 -971859 -344262 -149454 928739 2210445 2220587
10937B220587q59942J58981L13563r6510m03600l47298p72120k64137j10294P84989
$$ 2220587 1360645 1519626 1833189 1736679 1333079 985781 213661 -50476 -160770 624219
10927F24219P33937n81071o96561k63145r19273j108818k49390N15052L46854
$$ 624219 1358156 777085 80524 -182621 -1101894 -2210712 -2460102 -1945050 -1598196
10918a598196M61650M06483M56142Q26718R58174p7731q63276j390549j102829
$$ -1598196 -1136546 -730063 -273921 552797 1510971 1433240 569964 -820585 -1923414
10909a923414N12461Q53795N86010j53200j88034N5329P49894J217348k55662
$$ -1923414 -1410953 -557158 28852 -124348 -312382 -257053 492841 1710189 1454527
10900A454527o62118M38002J41782k99602j81627J87730Q1954o72288m78311M30420
$$ 1454527 792409 1230411 1372193 1072591 890964 1078694 1160648 488360 10049 440469
10890D40469r6538n19004n22541N64383O83407K10159M59596Q6319J43322j08944
$$ 440469 343931 -175073 -697614 -133231 550176 760335 1219931 1306250 1449572 1340628
10880A340628j362274m18579R17757J43387o23562m11433Q3297n44333j289438
$$ 1340628 -21646 -440225 477532 620919 -2643 -414076 -330779 -875112 -2164550
10871b164550j99094M47379M81897k52321j98572O5999K21482M70915R26002L27883
$$ -2164550 -2363644 -1916265 -1434368 -1686689 -1885261 -1819262 -1597780 -1126865 -200863 127020
10861A27020K26600n12925j52507Q59640K33566p44656j374316m37053P27612
$$ 127020 353620 -159305 -311812 547828 781394 36738 -1337578 -1774631 -1047019
10852a047019J147596q0068j864083q25336J17091J87892J021032J582913Q63281
$$ -1047019 100577 20509 -1843574 -2668910 -2551819 -2363927 -1342895 240018 1103299
10843A103299r14654k19914J87797N5628J73948L78769k4236j355590j197424
$$ 1103299 188645 -31269 156528 212156 386104 764873 740637 -614953 -1812377
10834a812377K70567J329331m1501K32155M4458l21394P6197q90285L661J100095
$$ -1812377 -1541810 -212479 -253980 -21825 22633 -298761 -222564 -1112849 -1109188 -9093
10824i093M48273N47072k55698p02062l72885K11535j05242k12084P88877p0779
$$ -9093 439180 986252 730554 28492 -344393 -132858 -238100 -450184 338693 267914
10814B67914q69712Q94277J382307n9082m82741M12342j043682j366785l35777
$$ 267914 -601798 292479 1674786 1615704 1132963 1545305 501623 -865162 -1200939
10805a200939O71155R48028j55196r09257m43326M69522Q21267O43387R18984
$$ -1200939 -529784 418244 263048 -646209 -1089535 -620013 201254 844641 1763625
10796A763625O68680L62359o5591m07591p96301q74599L31177M29731K53139n94666
$$ 1763625 2432305 2794664 2729073 2321482 1525181 650582 981759 1411490 1664629 1069963
10786A069963n19161n07884k33921j84815r91609j298845o16551r2323L62510
$$ 1069963 550802 42918 -191003 -375818 -1367427 -2666272 -3282823 -3375146 -3012636
10777c012636P86978R10217N02620L08077K89593M91110J017089R69144n22876
$$ -3012636 -2225658 -1315441 -812821 -504744 -215151 275959 1293048 2262192 1739316
10768A739316j120614o4949Q68983J310577N787l13874j97485q61186L13220M79745
$$ 1739316 618702 553753 1422736 2733313 2739100 2425226 2227741 1366555 1679775 2159520
10758B159520k15128m27626J66917L24266k25772K11351M50641N8328p04811j680576
$$ 2159520 1944392 1516766 1683683 2007949 1782177 1993528 2444169 2502497 1797686 117110
10748A17110r92625K06286O47015R46189L50758R608k05268m73894j61781o4228
$$ 117110 -875515 -669229 -22214 923975 1274733 1284341 1079073 605179 443398 379170
10738C79170l13415o0813L77058j43387q41244j284795m16724J13523Q71444j37691
$$ 379170 65755 4942 382000 238613 -602631 -1887426 -2304150 -2190627 -1319183 -1456874
10728a456874m77460n70108o50672r755Q85248J685434J155945J050288J3282
$$ -1456874 -1934334 -2504442 -3155114 -3164869 -2279621 -594187 561758 1612046 1625328
10719A625328o51056k80792n17706m59465j0072o33502J71567J246658k90554
$$ 1625328 974272 693480 175774 -283691 -293763 -927265 -755698 490960 200406
10710B00406N2088k93400N0891L91074N60942K39999m03241n79046j626907k4364
$$ 200406 252494 -40906 9985 401059 962001 1202000 798759 219713 -1407194 -1431558
10700a431558J476906M82397j52558o5013j95077p57382n41379J82990Q83891
$$ -1431558 45348 527745 375187 310174 115097 -642285 -1183664 -1000674 -116783
10691a16783Q84002P48931M42098m40272j98260l53258J69069j23944q97754l47044
$$ -116783 767219 1516150 1958248 1517976 1319716 966458 1135527 1011583 113829 -233215
10681b33215j13196O68262Q79437N85915r0094j371454j272152k46826O82666
$$ -233215 -346411 321851 1201288 1787203 1697109 325655 -946497 -1193323 -510657
10672e10657K98725J74087P16147O50221l06920j200794p79550k78528L5799M15436
$$ -510657 -211932 -37845 678302 1328523 1021603 -179191 -958741 -1237269 -1201470 -786034
10662g86034K59991K66371q12243J06276P71534N69928R10207J020644O76701
$$ -786034 -526043 -259672 -1071915 -965639 -194105 375823 1286030 2306674 2983375
10653B983375p03628j323855j042911N26517Q44247K58205M3689N11101J177840
$$ 2983375 2279747 955892 -87019 439498 1283745 1541950 1585639 2096740 3274580
10644C274580J18464o95405j63417k06767k55430j222662r45079l00993k3220
$$ 3274580 3393044 2697639 2534222 2327455 2072025 849363 -95716 -396709 -419929
10635d19929L71290J75156r3953J70667j19121k00338R54978j8249l75074O63460
$$ -419929 -48639 126517 32564 203231 84110 -116228 838750 820501 445427 1108887
10625A108887J072427k41213q71904j34278q3423J28316m1395L55818J54761q76371
$$ 1108887 2181314 1940101 1068197 933919 850496 978812 937417 1293235 1447996 571625
10615E71625r2611J062065Q37261l37279m33799m64488n25877m62965j16962J8365
$$ 571625 479014 1541079 2378340 2041061 1607262 1142774 616897 153932 36970 55335
10605E5335m91505p08532J20452j02269p15603K77879J806706J065370L58298
$$ 55335 -436170 -1144702 -1024250 -1126519 -1842122 -1564243 242463 1307833 1666131
10596A666131J39810m64614p01453m37737p67210r56552l77157Q34757O92807
$$ 1666131 1805941 1341327 639874 202137 -565073 -1521625 -1898782 -1064025 -371218
10587c71218q6218K83668r0034L94659L31583j89976k76925O26352J82727K03560
$$ -371218 -457436 -173768 -263802 130857 462440 272464 -4461 621891 804618 1008178
10577A008178j56820r68187n51883p91196k36580n56698K57326R29536M25970
$$ 1008178 851358 -116829 -668712 -1459908 -1696488 -2253186 -1995860 -1066324 -640354
10568f40354m38800p5428L72605R81953O5768l29627P6206m63625K05140R74992
$$ -640354 -1079154 -1154582 -781977 199976 265744 -63883 12323 -451302 -246162 728830
10558G28830K2107j037740M79264J107742M27248M89382N4601l23483j164339
$$ 728830 750937 -286803 192461 1300203 1727451 2216833 2271434 1947951 783612
10549G83612o41588o2082O66896N16990j81661J64373Q43931J221914J459949
$$ 783612 142024 79942 746838 1263828 1082167 1246540 2090471 3312385 4772334
10540D772334J19023q59619j492333j214108P9183o5770m13843j097317j349837
$$ 4772334 4891357 4031738 2539405 1325297 1404480 1338710 924867 -172450 -1522287
10531a522287M41583J302350N77841n83833L44251P21379m54754O8008o6243j55165
$$ -1522287 -1080704 221646 799487 215654 559905 1281284 826530 894538 828295 673130
10521F73130K12247K27999j75100M8632k87995l66838O04502L24541p31675n01576
$$ 673130 885377 1113376 938276 986908 698913 332075 936577 1261118 529443 27867
10511B7867L56168R9100m97481m22681r16160p80254j083152M26635J338985N46590
$$ 27867 384035 483135 -14346 -437027 -1353187 -2133441 -3216593 -2789958 -1450973 -904383
10501i04383j74286k27409O030K79149M34643J152930P03745K02318m95969q61427
$$ -904383 -1078669 -1306078 -1300048 -1020899 -586256 566674 1270419 1472737 976768 115341
10491A15341m31480q0720J104999J141009l25032j046016K45795P70301J180653
$$ 115341 -316139 -396859 708140 1849149 1524117 478101 723896 1494197 2674850
10482B674850K97553n951r97465j606417m34185l18920l87263q31139M49262J233033
$$ 2674850 2972403 2966452 1968987 362570 -71615 -390535 -777798 -1608937 -1159675 73358
10472G3358N29645J97919p72113n43513L7905L39498L26825P7539L11801j34880
$$ 73358 603003 800922 28809 -514704 -476799 -137301 189524 267063 578864 443984
10462D43984o23527j10645l0613n42619J06257K80253m16870J58444L09281l16457
$$ 443984 -179543 -290188 -320801 -863420 -757163 -476910 -893780 -735336 -426055 -742512
10452g42512n80313j998O52109J390819N35402L9326Q26889K13933q36720p40166
$$ -742512 -1322825 -1324823 -672714 718105 1253507 1292833 2119722 2333655 1496935 756769
10442G56769L06844M60026N27518P4423o25451j114504q26182m41945j84560m8787
$$ 756769 1063613 1523639 2051157 2125580 1500129 385625 -440557 -882502 -1067062 -1115849
10432a115849M65838r8900n07108P16896J180362K393874O33431j208986o62568
$$ -1115849 -650011 -748911 -1256019 -539123 641239 3035113 3668544 2459558 1796990
10423A796990k60884o31607p48279n93070n20387M84148K04938K10914n62850
$$ 1796990 1536106 904499 156220 -436850 -957237 -473089 -268151 -57237 -620087
10414f20087j40097J052100O63314L73707J138713J94238r84666j910749p57706
$$ -620087 -760184 291916 955230 1328937 2467650 2661888 1677222 -233527 -991233
10405i91233Q40179O47553R03573P42763j85561j252649o03327O44402M55998
$$ -991233 -151054 496499 1400072 2142835 1957274 704625 101298 745700 1201698
10396A201698j25833q023l59256m9775R0587M08083O65693j65179N1449M85309
$$ 1201698 1075865 1067842 708586 658811 749398 1157481 1823174 1657995 1709444 2194753
10386B194753j88904n23936k24560k59464n68489l40580N99037M92013k20246
$$ 2194753 2005849 1481913 1257353 997889 429400 88820 687857 1179870 959624
10377I59624j57285Q37553J340175N85428j066267j011310r32041q18967j144227
$$ 959624 802339 1639892 2980067 3565495 2499228 1487918 555877 -263090 -1407317
10368a407317j7657J962455J637208Q36368M3247n92171l60533j61967l4149o92672
$$ -1407317 -1424974 537481 2174689 3011057 3054304 2462133 2101600 1939633 1905484 1212812
10358A212812j424350j226355L87238L60708p80031n04093K07664J92792R88409
$$ 1212812 -211538 -1437893 -1050655 -689947 -1469978 -1974071 -1766407 -1573615 -585206
10349e85206R06347L34981J46627j17823L28399N79284J23421K26747J20431j154765
$$ -585206 321141 656122 802749 684926 1013325 1592609 1716030 1942777 2063208 908443
10339I08443j755299m36498j27389K04904O30549O45984K86233N19600N19685
$$ 908443 -846856 -1283354 -1410743 -1205839 -575290 70694 356927 876527 1396212
10330A396212m61724j270167j208566O29326J305559J212083r7635p49405J92933
$$ 1396212 934488 -335679 -1544245 -914919 390640 1602723 1505088 755683 948616
10321I48616R8885n57689m15045J029132J040285K08088k72614n95907p41211
$$ 948616 1047501 489812 74767 1103899 2144184 2352272 2079658 1483751 742540
10312G42540J25525L19027M80493K82036J2231p91783j862852j333428l88430
$$ 742540 868065 1187092 1667585 1949621 1961852 1170069 -692783 -2026211 -2414641
10303b414641M19279P89431J282369O75831l82144k39580L41591j470M67236M94000
$$ -2414641 -1995362 -1205931 76438 752269 370125 130545 472136 470666 937902 1431902
10293A431902k83545r87374j334996j143993K40531K0084j41682l04909M62177
$$ 1431902 1148357 160983 -1174013 -2318006 -2077475 -2057391 -2199073 -2503982 -2041805
10284b041805P14572M67945L94904j68447J1315N36968P08466p2309j803892o81066
$$ -2041805 -1327233 -859288 -464384 -632831 -621516 -84548 623918 551609 -1252283 -1933349
10274a933349Q35903M44139J17732j41619R79031J339761R51590p42419r87758
$$ -1933349 -1097446 -653307 -535575 -677194 301837 1641598 2593188 1850769 863011
10265H63011o82257j385481j510903j081474P06857J567142O32122N67820J241258
$$ 863011 180754 -1204727 -2715630 -3797104 -3090247 -1523105 -890983 -323163 918095
10256I18095R43886L58520j72191K74748p00203m32168P17375o2843q17081q59089
$$ 918095 1861981 2220501 2048310 2323058 1622855 1190687 1908062 1845219 1028138 169049
10246A69049m08593P77665J11025l98826M06388l58987p6921J145089M44685k00253
$$ 169049 -239544 538121 649146 250320 656708 297721 220800 1365889 1810574 1610321
10236A610321k39607l82264m5515n68210p98641m68435k43067L53460P77065O36938
$$ 1610321 1370714 988450 942935 374725 -423916 -892351 -1135418 -781958 -4893 632045
10226F32045J96657L11815k74502j336262J42386J208402P35612L66140J9252
$$ 632045 828702 1140517 866015 -470247 -327861 880541 1616153 1982293 2001545
10217B001545j118432q37285L58539O72531O55583k11846r2978k88202o88973
$$ 2001545 883113 45828 404367 1076898 1732481 1520635 1427657 1139455 450482
10208D50482J14q076p96114J59624N62578j24637j6709n27370j7523L86935o56718
$$ 450482 450596 442520 -353594 -193970 368608 243971 227262 -300108 -317631 69304 -587414
10197e87414j169570l66550L38841Q14508L78839m06603M29036J79259j203638
$$ -587414 -1756984 -2123534 -1784693 -970185 -591346 -997949 -568913 -389654 -1593292
10188a593292q68094J42888J159061P90671k32104m77616M47917J006927M14878
$$ -1593292 -2461386 -2318498 -1159437 -368766 -600870 -1078486 -630569 376358 791236
$$ [...]
##END NTUPLES=NMR SPECTRUM
##END=
