##TITLE=C13_SR45_Et
 CDCl3, 600 sc

 28.4.2021
##JCAMPDX= 6.0         $$ Bruker NMR JCAMP-DX V2.0
##DATA TYPE= NMR SPECTRUM
##DATA CLASS= NTUPLES
##ORIGIN= UXNMR, Bruker Analytische Messtechnik GmbH
##OWNER= root
$$ XWIN-NMR		Version 3.5
$$ Wed Apr 28 14:22:53 2021 Russian Standard Time (UT+4h)  she@DPX200
##.OBSERVE FREQUENCY= 50.327896
##.OBSERVE NUCLEUS= ^13C
##.ACQUISITION MODE= SIMULTANEOUS
##.ACQUISITION SCHEME= undefined
##.AVERAGES= 600
##.DIGITISER RES= 17
##SPECTROMETER/DATA SYSTEM= spect
##.PULSE SEQUENCE= zgpg30
##.SOLVENT NAME= CDCl3
##.SHIFT REFERENCE= (INTERNAL, CDCl3, 0, 222.653)
##AUDIT TRAIL= $$ (NUMBER, WHEN, WHO, WHERE, WHAT)
$$ ##TITLE= Audit trail, XWIN-NMR		Version 3.5
$$ ##JCAMPDX= 5.01
$$ ##ORIGIN= Bruker BioSpin GmbH
$$ ##OWNER= she
$$ F:/spectra/data/she/nmr/c13/1/pdata/1/auditp.txt
$$ ##AUDIT TRAIL=  $$ (NUMBER, WHEN, WHO, WHERE, WHAT)
(   1,<2021-04-28 14:21:49.34 +0400>,<she>,<DPX200>,
      <created by zg, POWCHK disabled, PULCHK disabled
       terminated by command 'halt'
       configuration hash MD5:
       00 E9 B6 7A A2 85 ED C7 34 08 36 98 17 FE 4E 26
       data hash MD5: 32K
       8D 0B 6B 4F FE E6 B9 C3 CC 40 6E 4E 12 E2 FE 40>)
(   2,<2021-04-28 14:21:54.18 +0400>,<she>,<DPX200>,
      <Start of raw data processing
       efp BC_mod = 2 LB = 1 FT_mod = 6 PKNL = 1 PHC0 = -293.3645 PHC1 = 41.96242 SI = 32K 
       data hash MD5: 32K
       B7 91 52 9A A2 9D 4F BF 13 77 9C F3 B1 87 EE 72>)
(   3,<2021-04-28 14:21:57.60 +0400>,<she>,<DPX200>,
      <abs ABSG = 5 
       data hash MD5: 32K
       65 2E 0D B0 94 4E FB AE 56 C3 38 C6 85 0B 5A 6A>)
(   4,<2021-04-28 14:22:24.45 +0400>,<she>,<DPX200>,
      <pk PHC0 = 10.28019 PHC1 = -14 
       data hash MD5: 32K
       32 C6 1E 0A 0E FE 35 D8 81 CC A4 30 57 4A 3D 7B>)
(   5,<2021-04-28 14:22:27.67 +0400>,<she>,<DPX200>,
      <abs ABSG = 5 
       data hash MD5: 32K
       6B 78 4B 1B 12 FA BC 7B BE E1 96 7E 71 55 52 E4>)
$$ ##END=
$$ 
$$ hash MD5
$$ 92 4A 5D 11 BD 99 E2 5D B1 FE 01 FA 60 66 AD D3
##$RELAX= 
##$RELAX= 
##$RELAX= 
##$RELAX= 
##$RELAX= 
##$RELAX= 
##$RELAX= 
##$RELAX= 
$$ Bruker specific parameters
$$ --------------------------
##$DU= <F:/spectra>
##$EXPNO= 1
##$NAME= <c13>
##$PROCNO= 1
##$TYPE= <nmr>
##$USER= <she>
##$AMP= (0..31)
100 100 100 100 100 100 100 100 100 100 100 100 100 100 100 100 100 100 
100 100 100 100 100 100 100 100 100 100 100 100 100 100 
##$AQSEQ= 0
##$AQ_mod= 1
##$AUNM= <au_zg>
##$AUTOPOS= <>
##$BF1= 50.322709
##$BF2= 200.13
##$BF3= 50.322709
##$BF4= 500.13
##$BF5= 500.13
##$BF6= 500.13
##$BF7= 500.13
##$BF8= 500.13
##$BYTORDA= 1
##$CFDGTYP= 0
##$CFRGTYP= 5
##$CHEMSTR= <none>
##$CNST= (0..31)
1 1 145 1 1 1 1 1 1 1 1 1 1 1 1 1 1 1 1 1 1 1 1 1 1 1 1 1 1 1 1 1 
##$CPDPRG= <waltz16>
##$CPDPRG1= <>
##$CPDPRG2= <waltz16>
##$CPDPRG3= <>
##$CPDPRG4= <mlev>
##$CPDPRG5= <mlev>
##$CPDPRG6= <mlev>
##$CPDPRG7= <mlev>
##$CPDPRG8= <mlev>
##$CPDPRGB= <>
##$CPDPRGT= <>
##$D= (0..31)
$$ [...]
##$SUBNAM4= <"">
##$SUBNAM5= <"">
##$SUBNAM6= <"">
##$SUBNAM7= <"">
##$SUBNAM8= <"">
##$SUBNAM9= <"">
##$SW= 239.972175391363
##$SWIBOX= (0..15)
0 1 3 0 0 0 0 0 0 0 0 0 0 0 0 0 
##$SW_h= 12077.2946859903
##$TD= 32768
##$TD0= 1
##$TE= 0
##$TE2= 300
##$TE3= 300
##$TEG= 300
##$TL= (0..7)
120 120 120 120 120 120 120 120 
##$TP= (0..7)
150 150 150 150 150 150 150 150 
##$TP07= 0
##$TPNAME0= <>
##$TPNAME1= <>
##$TPNAME2= <>
##$TPNAME3= <>
##$TPNAME4= <>
##$TPNAME5= <>
##$TPNAME6= <>
##$TPNAME7= <>
##$TPOAL= (0..7)
0.5 0.5 0.5 0.5 0.5 0.5 0.5 0.5 
##$TPOFFS= (0..7)
0 0 0 0 0 0 0 0 
##$TUNHIN= 0
##$TUNHOUT= 0
##$TUNXOUT= 0
##$USERA1= <user>
##$USERA2= <user>
##$USERA3= <user>
##$USERA4= <user>
##$USERA5= <user>
##$V9= 5
##$VALIST= <valist>
##$VCLIST= <CCCCCCCCCCCCCCC>
##$VD= 0
##$VDLIST= <DDDDDDDDDDDDDDD>
##$VPLIST= <PPPPPPPPPPPPPPP>
##$VTLIST= <TTTTTTTTTTTTTTT>
##$WBST= 1024
##$WBSW= 4
##$XGAIN= (0..3)
0 0 0 0 
##$XL= 0
##$YL= 0
##$YMAX_a= 3611210
##$YMIN_a= -1980483
##$ZGOPTNS= <>
##$ZL1= 120
##$ZL2= 120
##$ZL3= 120
##$ZL4= 120
##$ABSF1= 222.6533
##$ABSF2= -17.34351
##$ABSG= 5
##$ABSL= 3
##$ALPHA= 0
##$AQORDER= 0
##$ASSFAC= 0
##$ASSFACI= 0
##$ASSFACX= 0
##$ASSWID= 0
##$AUNMP= <proc_1d>
##$AZFE= 0.1
##$AZFW= 0.5
##$BCFW= 0
##$BC_mod= 2
##$BYTORDP= 0
##$COROFFS= 0
##$CY= -3
##$DATMOD= 1
##$DC= 0
##$DFILT= <>
##$DTYPP= 0
##$F1P= 0
##$F2P= 0
##$FCOR= 0.5
##$FTSIZE= 32768
##$FT_mod= 6
##$GAMMA= 0
##$GB= 0
##$INTBC= 1
##$INTSCL= 4.134877e-10
##$ISEN= 128
##$LB= 1
##$LEV0= 0
##$LPBIN= 0
##$MAXI= 10000
##$MC2= 0
##$MEAN= 0
##$ME_mod= 0
##$MI= 0.1934396
##$NCOEF= 0
##$NC_proc= -2
##$NLEV= 6
##$NOISF1= 120.0001
##$NOISF2= 80.00006
##$NSP= 0
##$NTH_PI= 0
##$NZP= 0
##$OFFSET= 222.6533
##$PC= 1.4
##$PHC0= -283.0843
##$PHC1= 27.96242
##$PH_mod= 1
##$PKNL= yes
##$PPARMOD= 0
##$PSCAL= 0
##$PSIGN= 0
##$REVERSE= no
##$SF= 50.3227301278049
##$SI= 32768
##$SIGF1= 140
##$SIGF2= 120
##$SINO= 11.81781
##$SIOLD= 32768
##$SREGLST= <13C.CDCl3>
##$SSB= 0
##$STSI= 32768
##$STSR= 0
##$SW_p= 12077.2946859903
##$SYMM= 0
##$S_DEV= 0
##$TDeff= 32768
##$TDoff= 0
##$TI= <>
##$TILT= no
##$TM1= 0
##$TM2= 0
##$TOPLEV= 0
##$USERP1= <user>
##$USERP2= <user>
##$USERP3= <user>
##$USERP4= <user>
##$USERP5= <user>
##$WDW= 1
##$XDIM= 32768
##$YMAX_p= 306990200
##$YMIN_p= -6799204
$$ End of Bruker specific parameters
$$ ---------------------------------
##NTUPLES= NMR SPECTRUM
##VAR_NAME=  FREQUENCY,     SPECTRUM/REAL,   SPECTRUM/IMAG
##SYMBOL=    X,             R,               I
##VAR_TYPE=  INDEPENDENT,   DEPENDENT,       DEPENDENT
##VAR_FORM=  AFFN,          ASDF,            ASDF
##VAR_DIM=   32768,         32768,           32768
##UNITS=     HZ,            ARBITRARY UNITS, ARBITRARY UNITS
##FACTOR=    0.368581032318806, 1,           1
##FIRST=     11204.5221822817, 0,            0
##LAST=      -872.772503708586, 0,           0
##MIN=       -872.772503708586, -6799204,    0
##MAX=       11204.5221822817, 306990200,    0
$$ Real data points
##PAGE= N=1
##DATA TABLE= (X++(R..R)), XYDATA
$$ [...]
9382 944997 626418 198648 -364130 365640 685000 1352833 2034985 2529643 4073322 4705958
9372 4705958 4028595 3236200 2727166 2173900 1171915 243340 -964147 -1842937 -2327055
9363 -2327055 -2793075 -2303985 -1313109 -892395 -796476 -1101684 -1360205 -1229174 -639277 -612190
9353 -612190 -755204 192261 868993 757431 34967 -1058931 -938914 912151 2380090
9344 2380090 3064801 4281813 4278778 2977224 1753279 694233 -257018 -507308 -346871
9335 -346871 62583 526951 936492 419699 121669 1060480 1224899 719120 177302 -834231
9325 -834231 -1277376 -327610 -549597 -321690 498692 486552 871097 1053181 197447 -1023616
9315 -1023616 -1938429 -1831991 -1305345 -1880781 -2236316 -933900 116905 433179 389639
9306 389639 -77862 -650658 -2099740 -3369016 -3472144 -3477717 -3034353 -997947 156526
9297 156526 -227094 -863199 -762099 -846693 -1239500 -200751 -392025 -544030 42438 703574
9287 703574 411040 -11547 808838 1972569 1936510 718541 206883 449421 993871 534810
9277 534810 -551398 -599599 -1098894 -1941069 -1697194 -1252906 -2421515 -2336009 -720635 641682
9267 641682 1444204 1149750 1989439 2082091 1769100 1256957 87949 94728 571995 780019
9257 780019 1118582 1259355 536002 -164246 -766044 -1719465 -2010639 -1437942 -733653 -275506
9247 -275506 -328405 -1604512 -2951214 -3012249 -1766560 -240409 1003890 1494790 2124833
9238 2124833 2091363 2157828 2333644 2228912 1351455 1099456 1056282 590184 1669853 1686008
9228 1686008 1392324 1943704 982448 -783641 -1003627 -1812287 -1852450 -685686 -958582
9219 -958582 -1382063 -635518 -463225 -1275100 -1031569 -446949 220370 611849 607 -154196
9209 -154196 -477974 -967298 -936166 -643103 -275048 -33408 170039 172814 1324171 2790648
9199 2790648 2987407 2200480 1746081 2163082 2355084 480941 -1463714 -2126642 -1388486
9190 -1388486 -680245 243759 1300922 1440031 2429081 3201851 2116477 507577 -41977
9181 -41977 495737 1171796 1515313 2533652 2513337 1175537 592021 868668 -422901 -1855135
9171 -1855135 -1993659 -1141346 -566396 -473244 -123437 1085245 1895794 2249241 2721016 3514729
9161 3514729 3175074 2962642 3326776 3049304 2860468 1759582 415375 -367710 -248567
9152 -248567 479616 1439197 1880825 1402602 1354779 1665197 1500668 1069360 669132 594129
9142 594129 -127539 -1455965 -2529807 -2581819 -1696727 -839848 209727 862407 1511764
9133 1511764 1154685 603549 880882 2285451 3100782 2674465 1841056 897108 161408
9124 161408 368435 837277 1982801 2477482 2013184 1300148 452417 -101867 -114380 -656945
9114 -656945 -1798258 -1536028 -223037 1394007 1235496 -101753 -439063 420576 138441
9105 138441 -1013774 -1536931 -1030647 -168517 258027 -8439 58781 1158339 1801105 669882
9095 669882 -558271 -519387 203214 447694 -1074807 -2331289 -2243126 -902487 980557
9086 980557 825339 -34127 5185 174888 579247 1141480 1777906 2506222 1795617 1184434
9076 1184434 217410 -1186867 -2392982 -2524924 -1897748 -1209410 67166 222604 537414
9067 537414 1336171 1134750 863498 1105804 854339 356294 -98462 -492527 -338706 -1070282
9057 -1070282 -1023060 -410320 -71216 587753 1371248 2007811 2680583 3107970 2545546 1083323
9047 1083323 212150 474297 1030940 859054 -250817 -1012293 -981276 -298648 541295 2326719
9037 2326719 3478035 2763218 2451649 2179721 2084254 2105965 2299851 2026504 1151082 -315422
9027 -315422 -1949223 -2527178 -2070678 -866211 38683 -2363 -203634 443687 591239 56321
9017 56321 -229067 100596 627994 1253948 1260956 683770 212713 -28108 171382 879401
9007 879401 1296578 1361974 1533704 1621709 2048510 2196029 2261794 1983954 943119 -71530
8997 -71530 -795405 -83448 1369748 2120337 1719833 1526802 989679 1344656 2228994 2312010
8987 2312010 2878857 5137671 6962824 6510715 5045857 3900547 2611501 1621447 2748563
8978 2748563 4739132 5387782 4442423 3267787 3620215 4167607 4998241 5278944 3858717
8969 3858717 2791010 2501186 2790041 2459964 1995021 1892162 2103915 1624065 152247
8960 152247 -522228 882249 2775757 3054932 3350440 3872032 3340828 2808027 2732219 3040248
8950 3040248 3623579 4540124 5920424 6863520 7106319 7587626 7213642 7487821 8264836
8941 8264836 7695617 7477848 8212095 9440808 10465174 11749799 13355071 14443479 15144920
8932 15144920 15911592 16566374 17079695 18283422 19130605 21126325 23620988 25729860 28121860
8923 28121860 31599078 35612766 39549268 43057760 46555140 48596858 50166376 51852372
8915 51852372 53497155 54356054 53860788 52414826 49860116 45897038 41090192 36198766
8907 36198766 31389952 27219603 22952328 20022544 18819398 17147732 14739953 13298976
8899 13298976 12833648 12859566 12378554 11814436 10829028 9893829 9983710 9851698 8061058 7272875
8889 7272875 7106439 6176749 4995879 4735284 4752213 4923904 5114220 3921269 2531315
8880 2531315 2501229 2402599 1883340 1400343 340297 260777 968483 1300660 1774536 1611358
8870 1611358 1696772 2885388 3287346 1838441 958279 1508497 1778859 1610207 884947
8861 884947 650614 707755 -72190 -665736 -1122773 -1588262 -1775288 -629340 975722 1707005
8851 1707005 2022536 1738938 943510 -442646 -1206081 -1548337 -2027826 -1654497 -1522089
8842 -1522089 -1826339 -956378 -685309 -1234033 -1018110 35101 -310739 -469001 -244
8833 -244 990824 1542490 913404 870026 1691494 1018089 -109884 -219 210678 -372859
8823 -372859 -445162 220596 449207 883302 1591747 2301694 3550610 2963657 1058706 775712
8813 775712 790159 229721 -336982 -1126435 -1443650 -1062586 -1082688 -1852642 -2906821 -3883336
8803 -3883336 -3320173 -1979614 -1997534 -2755668 -2334155 -731544 -883797 -1943737 -1975366
8794 -1975366 -1458207 381251 1961452 2137863 2815950 2926138 1668383 915625 644981
8785 644981 346407 -607492 -1331707 -647962 732267 1978680 2742029 2994729 2778393
8776 2778393 3157698 3755947 3706144 2304424 582807 -153072 248413 1635239 2179678
8767 2179678 2300255 2796268 2002057 319499 -177524 396835 -419326 -564582 214518
8758 214518 292800 395684 1025791 1445400 1118252 -310807 -1155340 -362171 504422 778942
8748 778942 237507 793926 2321386 2873869 2180992 1087023 1446933 1146465 -567619
8739 -567619 -1175308 -329296 1035010 1853500 1807150 2301005 2725756 2022297 150638 -983572
8729 -983572 -300635 337573 557854 750740 248351 -142757 550491 1569206 2410103 2060727
8719 2060727 985121 253427 256568 1014939 890749 -303703 -1492037 -1912563 -2062110
8710 -2062110 -1274239 -848564 -1010427 -1686291 -1475746 -687918 -543590 -701447 -1462153 -1645248
8700 -1645248 -1070987 -1892028 -3475720 -3654025 -3337125 -2856462 -2248152 -1643712 -962213
8691 -962213 334219 2057100 2593455 2016613 955559 915035 990971 571165 96353 -477727
8681 -477727 -572987 -484058 -258817 -712702 -1405879 -1030018 -424880 232822 2332883 3308128
8671 3308128 2114383 102106 -390850 4290 -39259 812999 1074221 744703 405954
8662 405954 -82513 -761517 -405104 393814 480705 -7830 -591136 -568462 -89507 -915905
8652 -915905 -1555585 -1691572 -2356338 -2190137 -1409395 -1716892 -2674967 -3852637 -2793684
8643 -2793684 33973 1191350 998362 1093322 1599221 2505935 4459347 4967456 4081668
8634 4081668 3828543 3437156 2850408 2106637 110301 -1084905 -1429907 -1781539 -1229813
8625 -1229813 -1063483 -1242306 -694441 -425548 749633 1762126 1260371 -114657 -1016871
8616 -1016871 -873994 -928630 -1278976 -2209172 -1221749 831895 1362294 1634959 2277191 1770044
8606 1770044 678230 78087 988984 1341047 -194257 -709641 -435187 -548360 -390665
8597 -390665 134633 118748 -805921 -717258 549683 1933925 1837329 1262914 1628928 2430019
8587 2430019 3010759 3222427 3663897 2782593 1175465 1491794 1859002 1627000 1304980
8578 1304980 519677 -1107675 -1944523 -874216 76514 123002 -99046 381899 335870 887602
8568 887602 1423160 1475762 1577682 1675317 1353104 346278 -70690 487827 -4066 -1212470
8558 -1212470 -1378945 -428889 675533 1201616 1667959 1877916 788897 -1247867 -2811344
8549 -2811344 -3047449 -2513845 -2737643 -3663067 -2361696 144089 1823402 2452057 1985531
8540 1985531 1976819 2452714 2608438 1959880 1358304 1077355 1041480 1345147 799115 -74119
8530 -74119 -907921 -895555 -226343 -1171179 -1939453 -2329159 -2544521 -2281202 -1556427 -1644410
8520 -1644410 -1807840 -263897 1002178 1644567 1519438 1560226 1122123 632199 1994
8511 1994 -248849 -42746 295959 606359 1924555 2812890 2082810 1813715 2457889 2166735
8501 2166735 2245722 2470616 1691168 929052 287041 -46910 -126263 124283 766631 1412931
8491 1412931 1677168 1305450 1291275 721184 -372615 -1313530 -1641837 -1792292 -1434682 -1004819
8481 -1004819 -736712 -1657930 -2411715 -1873295 -904619 39180 905704 1023519 -671622
8472 -671622 -1747602 -1557192 -337075 1575174 2772286 2653121 2455176 2341434 2273415
8463 2273415 2577643 2570376 1762924 768141 441634 812341 1553053 1400371 1629169 1680764
8453 1680764 716290 -474145 -1204161 -1272103 -1429234 -1762000 -1145713 -84425 866729
8444 866729 925587 332021 -503503 -1351172 -2144806 -1334374 -167936 -424739 -379000 -399254
8434 -399254 511667 668002 593330 413988 60683 961544 1915365 1732866 1394540 1286260
8424 1286260 612250 -549171 -289491 159008 -258457 -48340 -471278 -1063830 -702368
8415 -702368 -149946 -323663 -1452519 -1417446 -528265 45606 -412199 -318542 -170046 -97177
8405 -97177 237971 -564646 -1948196 -2072964 -1501379 -996336 -274051 996149 1066802 1222969
8395 1222969 1190501 167872 -389705 -434731 -1803435 -2585784 -1896633 -709471 -23648
8386 -23648 -774812 -1651824 -2139068 -2306683 -2268502 -2341177 -1698000 -839115 -572687 -15376
8376 -15376 532044 1669847 2393507 2644364 2269618 1315415 1199388 1058972 754019 -208649
8366 -208649 -1016565 -872778 -1265256 -1571696 -1263891 -1619576 -2425413 -2798682 -2517547 -1778958
8356 -1778958 -946964 -165873 -48007 751774 1152251 1291559 678528 564384 647991 50707
8346 50707 -190301 207234 814142 367829 -581568 -1282358 -1393133 -482470 82352 834546
8336 834546 1413250 754997 -692775 -1562636 -1487973 -293118 665031 1174208 1993593 1471313
8326 1471313 1187829 467400 159131 -18172 442319 760431 -102491 204181 1358347
8317 1358347 975002 -157655 116345 493489 1171372 1553550 2015522 2877780 2653225
8308 2653225 373810 -2327819 -3188023 -2978307 -2483343 -2188254 -2008906 -1475375 -1461040
8299 -1461040 -966056 -261296 -810899 -1846292 -2066418 -604667 1627764 2738915 2520552
8290 2520552 1502308 1180336 1849491 3088869 2718502 1387685 862120 1009430 1504617
8281 1504617 2066499 2579875 2570321 2840337 2294537 624995 298855 1959948 2840950 2634291
8271 2634291 2494854 1827221 332999 -527125 -1434656 -1739938 -657085 -133708 -642596
8262 -642596 -605190 -78143 -4805 928301 1329476 101638 -1639875 -2604897 -2433245 -1796448
8252 -1796448 -1573555 -507540 -277927 -1869637 -3108499 -3224278 -2629258 -2145132 -1682501
8243 -1682501 119687 1548555 1867781 1739040 874048 -209104 -873926 -936730 -663679
8234 -663679 -87386 421916 1141129 243804 -414868 -237852 -578652 -703378 -354615 1162700
8224 1162700 768154 -386406 -472262 -859292 -1547036 -1545311 -842572 84161 1304462 2480835
8214 2480835 1417571 -1249822 -2049803 -1181391 120388 -220834 -788157 -803210 -448509
8205 -448509 1304796 4352953 5345448 4224758 3841690 4340107 3756229 2417096 1609424
8196 1609424 1399882 1187483 1384453 1450321 1568890 1024579 1364510 2220205 2239649 1068790
8186 1068790 90705 96469 -345285 -314040 -362836 -956361 -1939062 -3150894 -2959208 -1939964
8176 -1939964 -1354675 -911861 101238 1224815 2068931 1663429 -72004 -1670997 -1838635
8167 -1838635 -1378588 -769970 656235 1469728 866023 -139413 -912576 -260306 1219677
8158 1219677 2012075 1741795 474047 -658689 -1240071 -935818 -904895 -1675282 -1490968
8149 -1490968 -228255 1556879 2957997 3362021 2274488 272802 -320443 -510885 103502
8140 103502 1004849 406406 -462075 -689357 199885 431491 574502 809048 901551 409816
8130 409816 -1512173 -3415741 -3033584 -1976658 -1497248 -485234 -716326 -497087 113031
8121 113031 1077116 1435991 920234 525948 -490360 -1811412 -2801974 -3194716 -2761190
8112 -2761190 -2338521 -1998752 -1450951 -326560 1043148 1191895 1076213 835836 834942 1004093
8102 1004093 897694 92691 -245900 -689536 -848829 -842548 -263259 658268 1087392 264509
8092 264509 -302266 -443883 -626926 164242 75699 -339492 -35476 968599 2150077 3568389
8082 3568389 3762408 3362881 2916323 2241498 1816801 254315 -740543 -591977 -54625
8073 -54625 618089 246012 -926590 -1942849 -2308942 -1990501 -1105858 -34218 1794919
8064 1794919 2059149 822845 352228 489463 131220 -834096 -534210 -280906 -107203
8055 -107203 283916 548946 1259059 1571490 1530167 1313017 1053036 1000407 691210 1040954
8045 1040954 2119157 2883126 2720107 1717458 1374955 1362444 -5774 -1819088 -1917704
8036 -1917704 -1197798 -772351 576410 1696567 2551182 2596574 2054285 2223064 2112348
8027 2112348 1695767 2325712 2710999 2452650 2552032 1923641 1314093 1037218 697580 512649
8017 512649 -88405 -322002 908957 1322458 1277194 973601 152688 -507243 163957 1006976
8007 1006976 647386 29016 311269 518808 634037 595293 1171097 1657452 1672277 2515926
7997 2515926 3170621 2586515 2105664 2114915 1969293 716188 -472532 -709854 -42702 90305
7987 90305 -717043 -1642279 -2546014 -2806791 -1659310 -691055 -1134340 -1136437 -306126 523965
7977 523965 341033 192962 643779 1016465 632906 -162350 -564649 -614136 -310215 -314300
7967 -314300 -136519 346791 1099735 1491446 1673738 847918 288994 266332 963465 1052158
7957 1052158 912988 304182 -773796 -1430380 -1462562 -503569 1087907 1845271 1144561
7948 1144561 -41933 -353785 -63263 -603648 -1014116 -2008349 -2611721 -2159831 -2092964 -1933568
7938 -1933568 -1477329 -1536312 -947267 -417648 -780512 -955330 -1411248 -772058 607265 1361192
7928 1361192 2116480 1598156 119575 -138287 -416783 -564542 -535881 356802 1061080 514572
7918 514572 -365747 -316406 614823 564696 -825913 -1560119 -865783 -165835 -203557 -1372722
7908 -1372722 -2827053 -3424955 -2902545 -1329407 -252186 193957 -280283 -896350 -115500
7899 -115500 1348259 2148532 1856356 710689 38009 182704 61870 -428025 -494549 -36170
7889 -36170 -73658 -831014 -641707 89488 -1010752 -2199017 -2566671 -2303310 -1296356 -732531
7879 -732531 -947661 -2287542 -2688769 -1384938 -1234138 -1686383 -1889345 -1913229 -2009943 -1625411
7869 -1625411 -1014871 -760897 -369404 -228781 -672745 -731871 -1039654 -621200 -327745 -621929
7859 -621929 -1062135 -1430561 -1796624 -1474030 163443 1131407 964892 664393 148449 -405201
7849 -405201 -739074 -555845 -1320869 -2340114 -2255449 -1687653 -1306329 -593882 922356 1054678
7839 1054678 217872 -217918 -782256 -44004 281300 -716750 -1954547 -2202667 -2419003
7830 -2419003 -1453789 701267 1945609 1343403 577982 -189015 332316 149342 -614724
7821 -614724 -576097 -970851 -1386594 -567549 701427 185203 -189251 3885 285548 921022
7811 921022 1269595 992089 751630 -92725 -1098544 -883765 -217533 215618 341243 447330
7801 447330 -125013 281842 536784 -36004 -300976 -411633 -873747 -1777505 -1569290 -975428
7791 -975428 74775 730511 -763541 -1931299 -1518682 -607560 499127 604449 1157025
7782 1157025 1476956 24928 -653058 63771 1395130 1508094 434713 865826 582846
7773 582846 -921910 -1810902 -2357488 -3622082 -3695428 -1667012 -68074 584402 1433160
7764 1433160 1050803 -1045393 -1590420 -500504 544987 1520255 1865221 1240812 346557
7755 346557 -591523 -528142 204760 468921 -805515 -2066730 -2010131 -1740365 -2218088 -2655232
7745 -2655232 -2623500 -2232205 -1842858 -2023684 -1995921 -1815728 -728556 -169565 -720503 -1911914
7735 -1911914 -1843631 -1080505 -628561 -662409 -1062368 -1377935 -833410 284762 1753079 3858678
7725 3858678 4413058 3431318 2758616 1732010 1066993 1250607 2062251 2560135 2114799
7716 2114799 2127661 2318289 1049172 11637 -424899 -933360 -1022037 -1676672 -1634592 -1200207
7706 -1200207 -1102444 -1105545 -1089409 -391783 -220921 -365927 -430976 -839421 -1621240 -2363776
7696 -2363776 -2574935 -1186225 321773 557685 -45025 -582601 581864 2141421 2565052
7687 2565052 2757386 2599240 2783201 3342964 2518919 2488264 1521409 -282586 -1642908
7678 -1642908 -1292050 59867 37343 -4220 367929 187849 -190490 88660 1351072 1230110
7668 1230110 366272 -368216 -252162 1546941 2584666 1889275 1120523 416251 39113
7659 39113 24880 34855 387561 1117185 1720932 2220379 2468590 1288503 629921 906946
7649 906946 436782 999769 2638721 2773420 1649373 411101 -807309 -1262217 -745910
7640 -745910 210156 596985 782199 1218406 164914 -886490 -1056008 -1310861 -2025832
7631 -2025832 -2192489 -1898823 -1804341 -1355570 -534731 335717 762285 361090 -1131146 -2404251
7621 -2404251 -1997355 -909745 -1251702 -2528352 -1228050 275683 -169906 -641758 128469
7612 128469 1187245 1092784 782358 638387 -739328 -1272228 -500698 765319 903663
7603 903663 75164 -442517 -380196 -763815 -171909 326744 -505544 -1867737 -3416732 -3143370
7593 -3143370 -1194422 20537 13882 -1018957 -1070521 -379331 -620656 -837664 -1561426 -2669645
7583 -2669645 -3057271 -1921341 -358465 324886 297661 -485579 -1407328 -2169353 -2717177
7574 -2717177 -1931109 -169707 1542618 2326084 1369196 782661 1359973 1520422 969795
7565 969795 -285718 -1316448 -950912 189055 436160 135194 -113136 -157720 -1221086
7556 -1221086 -1288738 -42385 1021850 1378535 1272535 61615 -760857 -620295 -1523464
7547 -1523464 -2264308 -2151036 -2180486 -2345052 -2190610 -1791861 -1101940 -1398249 -2442038 -2653972
7537 -2653972 -1567541 689857 2368622 2538809 1550022 428 -608225 172634 918870
7528 918870 1348818 1295838 1328627 900913 1028288 424521 -81612 256509 782204 1286397
7518 1286397 1265372 1311264 460556 -931888 -739939 1356707 2618922 2549624 2570707 2518803
7508 2518803 1540128 342310 -196936 -228620 -1044513 -1227503 272601 917981 982730 1263794
7498 1263794 1072646 67545 -171949 1270596 1593803 79840 -552485 -252610 -360322
7489 -360322 -851244 -1185299 -1348115 -1619305 -1970278 -1612746 -905707 -323150 4664 -387883
7479 -387883 -747537 133712 471546 388717 1031698 1624593 2162513 1678730 968773 983071
7469 983071 2422470 2862962 1392651 637698 1317158 1282402 -121827 -1285126 -1238155
7460 -1238155 -630258 9353 456150 192611 -1000380 -1764543 -2144337 -1791308 -1492353
7451 -1492353 -1341049 -1671172 -1723268 -1199602 169912 796255 676684 889015 395796 600666
7441 600666 445317 -950985 -2086222 -2153133 -1729053 -2155205 -1537201 -349776 -118214
7432 -118214 522750 524530 -651656 -1038246 -594931 100049 735409 -271729 -1559579 -2585589
7422 -2585589 -2479721 -2321925 -2444049 -2058294 -1141529 -1067230 -1602359 -2097625 -1830713 -387968
7412 -387968 -216646 -1081470 -1862544 -3311617 -3629889 -3530572 -3759797 -2745690 -2185872 -2500563
7402 -2500563 -2461994 -2886879 -3046034 -2405655 -1758350 -1697271 -2733357 -3297151 -2966711 -3486144
7392 -3486144 -4309273 -3912406 -2949623 -2081438 -467624 1527547 3320448 4229386 5535677
7383 5535677 5638327 4829154 3696878 2909569 2349507 1553213 1139748 88633 -651752
7374 -651752 -690197 -1315121 -1369529 -1561623 -2823029 -3816109 -3653710 -2688022 -1454973 -552688
7364 -552688 -960552 -1775471 -2813515 -3272025 -3307483 -3171024 -1993399 -777917 -188246
7355 -188246 263953 -647431 -441412 675706 1360811 1805829 1406739 -175199 -1995338
7346 -1995338 -2807139 -2865454 -2393381 -1884258 -1816861 -1046693 -528909 -1211120 -1336677 -696419
7336 -696419 -1344874 -2125815 -2979949 -3047395 -3430288 -4093537 -4070963 -2653579 -1779720 -463354
7326 -463354 1162868 1163928 802529 15694 -231715 -97867 68188 581232 178802 -177920
7316 -177920 289899 1504341 2489045 1999423 926724 507193 -758921 -1841927 -665886
7307 -665886 707532 1480142 717094 440375 -328045 -2384555 -3841039 -4865673 -4061365
7298 -4061365 -3023436 -2441249 -1011235 125106 1229768 1913429 1956106 1945871 1796040
7289 1796040 1082544 -524595 -2098030 -2595758 -2345226 -695584 773703 1476378 1746588
7280 1746588 1157878 783996 555995 1147191 1599240 859155 -120934 187988 1231840
7271 1231840 1376184 296890 643011 1780296 1689990 1623146 1610992 -34238 -1383937
7262 -1383937 -456171 1303397 2490094 1669579 818429 1046761 958498 1695704 2816973
7253 2816973 3767739 4144508 3877652 3541383 3774109 3319770 2647855 2336414 2650417 2467121
7243 2467121 1312548 457050 208038 -801446 -1835661 -2435710 -2493749 -2963699 -3759631
7234 -3759631 -3434145 -2262703 -1425884 -1470520 -1192600 -1071782 -1323243 -1416030 -1199387 -36791
7224 -36791 1879238 3319689 2702021 1089054 565084 1235064 2279320 2451817 2304346
7215 2304346 1553037 87102 209486 1008000 1253506 1186010 -155678 -1050464 -1034402 -475042
7205 -475042 -425268 -1366074 -2377057 -3452317 -3187227 -3223539 -3100172 -2579321 -2291272 -2119948
7195 -2119948 -1787471 -1402821 -1735793 -2221721 -2453732 -1953880 -2411860 -2929288 -1938408 -119822
7185 -119822 -14957 -204936 686146 1917216 1784235 -103878 -2176330 -2109927 -1961499
7176 -1961499 -2675781 -2691794 -326577 1357463 1653698 1945306 1418916 747598 1497699
7167 1497699 1818106 1316142 -70264 -881551 -339399 635128 2370620 3561609 2710253
7158 2710253 2370156 2074717 1966328 2073585 533590 -827966 -87928 1109091 1260354
7149 1260354 697844 160045 -69195 1133162 1364495 531481 269420 360891 -589778 -2034637
7139 -2034637 -1932476 -520137 642623 1372003 2156562 3082016 2580127 2173922 1306886
7130 1306886 993594 670475 573964 162576 -243003 -22218 1734 -286460 -239338 659029
7120 659029 2122069 2602380 1688804 741304 -145537 437360 1403965 1753940 1529127 1612714
7110 1612714 160957 -1219142 -2175291 -2636385 -1717970 -1413491 -2280166 -2084498 -1714212
7101 -1714212 -1486002 -1444863 -1930747 -1120776 -440254 -1560128 -1656105 -1045801 -538409 -386306
7091 -386306 -1306311 -1997387 -2587151 -3135377 -2134242 -797055 -1137561 -1649213 -1956369
7082 -1956369 -2143580 -2359671 -2588520 -2174399 -1222793 120556 1112226 1103494 130544 -670413
7072 -670413 -424236 -42767 323188 -389102 -1233566 -1303973 -464069 105833 -310994 -1121922
7062 -1121922 -1356995 -1310368 -2744381 -3515102 -3392349 -2560406 -1168009 618675 1409773
7053 1409773 1584541 705235 374043 -18484 -892268 -1670283 -1190499 -53390 -152492 -886013
7043 -886013 -2051481 -1891052 -1498985 -1467841 -2032447 -1517096 -906424 -26153 718634 1081582
7033 1081582 1004175 -407961 -2145908 -3035678 -2528820 -2274268 -2506337 -1828306 -958253
7024 -958253 -1027837 -744916 -867354 -660378 336828 1240090 764752 -68079 471494 1160120
7014 1160120 908784 1410699 1557779 2297814 2050125 1138027 941344 1340233 1055447 694441
7004 694441 -367025 -1606223 -2129004 -2687546 -2803790 -1861676 -416067 928383 1426173
6995 1426173 480065 -636247 -385448 1086469 1695132 1432104 809552 -234366 -718199
6986 -718199 -988296 -1805812 -2768678 -3322582 -2715146 -1053578 142841 -467121 -1165611
6977 -1165611 -947572 332278 731569 493227 549566 -44007 -675575 -1086198 -1552692 -1283265
6967 -1283265 -1372202 -2338702 -2751028 -3931893 -4428784 -3700167 -3641427 -2760382 -2056507 -1781773
6957 -1781773 -1194297 -948497 142223 1368927 817822 72541 602023 1455305 2685962
6948 2685962 3210311 3184032 2934652 1930425 432527 -466296 66282 1287579 1620012
6939 1620012 557760 -924558 -1064805 -327225 -197577 -362786 -67964 814644 1982307
6930 1982307 1586540 -522897 -2354855 -2592069 -2273062 -2797413 -3217618 -2316373 -594097
6921 -594097 270399 609415 267764 -39743 -269396 -133351 263805 -663596 -775042 -390271
6911 -390271 192701 1526360 1852598 406964 -204489 -1129331 -2540166 -3187637 -3017537
6902 -3017537 -1897076 -1177308 -1425108 -1751313 -1953272 -3047526 -4020331 -4215854 -3546727
6893 -3546727 -2017589 -658470 -23083 -351732 -878873 -1368409 -1173192 -227619 -364158
6884 -364158 -985695 -982112 -567853 -1315717 -1931432 -1447492 -566664 -528886 -2298273 -2620269
6874 -2620269 -1166025 56182 1380760 1961237 1069217 -1816893 -4760013 -4910615 -2839377
6865 -2839377 -1891199 -2268817 -2819294 -2923771 -2474420 -3491294 -3892337 -3074311 -1888753
6856 -1888753 -1353759 -1279544 -2099762 -2129950 -190574 1031426 63654 -556344 -587086 -646203
6846 -646203 -907113 -1528169 -896619 664682 666692 19560 178525 138536 80871 -677410
6836 -677410 -2031544 -2700822 -2371961 -2481335 -2307206 -1587878 -494929 -1725410 -3624785
6827 -3624785 -3315293 -2071668 -1401733 -1231799 -854549 -349517 -291236 -1141077 -2335162
6818 -2335162 -3110386 -2266483 -783058 276656 843802 521916 -935798 -1897104 -2395465
6809 -2395465 -2664697 -2723261 -2974743 -3549837 -3893802 -3849223 -3541130 -2851950 -3125470 -3141688
6799 -3141688 -2643920 -2012414 -1150127 -33698 299986 75559 -445804 -994132 -2000926
6790 -2000926 -2640231 -2306581 -1432850 -460853 -6544 276359 550685 1293191 1714046 1638920
6780 1638920 1194388 -237266 -1104461 -548629 409731 -232131 218477 378732 224345
6771 224345 692535 148934 -1100124 -1414183 -212517 744466 -415746 -1095635 -974876
6762 -974876 -1582937 -2155661 -2357911 -1750427 -689592 587904 1341443 1352751 -449563
6753 -449563 -1526668 -1594444 -1277200 -927122 -1423408 -2475067 -1483390 638141 1214308
6744 1214308 691583 336739 515263 2048817 3078747 1334450 -350462 -921337 -51718
6735 -51718 1035354 663434 -55168 -652860 -605426 -444837 -496622 -386895 -74838 548887
6725 548887 1029333 1307293 686606 946832 1775487 2871487 2549129 648900 -270262
6716 -270262 -293739 121926 329522 641182 773855 1173548 1051741 797162 281518 -438027
6706 -438027 -682393 -640562 -130409 -142528 -1263669 -1714961 -1486898 -1972852 -1833895 -2226315
6696 -2226315 -2477744 -2266901 -1981122 -1097835 330928 1357232 1970993 1409085 724551
6687 724551 242071 561186 962282 122249 -1166273 -1203741 -949637 -1285844 -440509 152100
6677 152100 530071 197115 -162622 215889 885128 1394602 1236668 541887 274362 275525
6667 275525 722158 1532776 1548073 250231 -1498549 -2564414 -3657080 -4200170 -4020770
6658 -4020770 -4090511 -4014953 -3190700 -2319841 -1327558 -614554 -373347 -560702 -1895381 -2916957
6648 -2916957 -2773288 -2018216 -1318331 -1321444 -491791 746260 1367806 1888507 2118397 1244914
6638 1244914 172213 -1184788 -2033005 -881800 401120 248130 17149 213309 854916
6629 854916 1498036 1883026 2588208 2571036 2297012 2190341 1250627 6835 -685476 -938021
6619 -938021 -357124 735800 1095831 1476418 1774581 2239204 2451841 3180254 2719581 1646116
6609 1646116 1005129 -612589 -1881019 -1344870 506070 1759107 1896791 1359462 945494
6600 945494 375960 153726 202435 -1195716 -3295094 -3573803 -2765948 -1428933 -1427314 -1725812
6590 -1725812 -897786 62169 1177711 1537388 938358 130527 -724534 -761208 -406324 346166
6580 346166 1069813 1000921 527401 252137 -589016 -1520159 -1490248 -764764 269657 1316917
6570 1316917 1540050 940849 628746 -161599 -487827 -160431 444368 -290746 -672932 -1090
6560 -1090 78402 866789 2298045 2503218 2468575 2731997 2371139 2443484 2160055 2402975
6550 2402975 2366239 1321072 1012271 952931 1239821 1749754 1197016 821527 1283910 1811211
6540 1811211 1587732 1291286 1204630 1327854 -77868 -1395406 -1254117 -508291 18206
6531 18206 -184705 -339522 -1038162 -820057 -1688 533475 728150 1508060 2400866 1590183
6521 1590183 279146 -1292046 -1304135 -725945 -568135 -814144 -1117509 -1478027 -1777197
6512 -1777197 -1557303 -2007464 -2587596 -2566413 -1982578 -831502 -94564 -781349 -1113056 -1156537
6502 -1156537 -2131560 -3170946 -3775412 -2300311 412829 2071622 1565110 971581 -81091
6493 -81091 -654921 -868903 -1266836 -654119 27456 1362226 1766893 1975056 2849658 2552264
6483 2552264 2465357 2792137 1928475 739279 197638 674501 1738875 2556816 3461783
6474 3461783 3264812 2241480 1381715 1591805 2062777 938487 -514393 -862316 100778
6465 100778 747515 815298 646499 38339 73708 391455 177191 309831 310359 -392221 -982391
6454 -982391 -1100022 -885318 -536227 -18778 590156 369321 -482328 211947 637438 99825
6444 99825 106637 85146 442354 1165900 2484670 2856277 2130623 260781 -1307987 -320327
6434 -320327 1095380 2580667 3288115 2476642 2523091 2588467 737766 -161524 -249131 -295572
6424 -295572 307243 560343 1479212 2574852 2451476 2079276 1771974 2085154 2694841 2395596
6414 2395596 1671545 2424275 2770005 2116207 664478 624072 1520946 1822009 1063179 261883
6404 261883 -468590 -1709354 -1399106 -299122 -369345 -1077424 -1387421 -1865079 -1480633 -1577810
6394 -1577810 -1834669 -2228011 -1655982 455387 1725892 1409972 1384652 1197021 270414
6385 270414 61198 -495042 -1464967 -1979543 -2653144 -2090829 -2045946 -1701617 -1213996 -1665512
6375 -1665512 -2803890 -3512362 -2201865 -976728 -1434446 -2109930 -2158250 -623047 596119
6366 596119 1108472 1139499 -46247 -1343555 -676416 661156 2044936 3100063 3413817
6357 3413817 3250631 2907050 2639645 2508368 2607345 2857641 2607646 1570618 -178774
6348 -178774 -1303310 -1962250 -2562797 -1151483 600380 413214 -1378842 -1867481 -882077
6339 -882077 172559 697739 132582 -1537748 -2843456 -2655771 -1985805 -1184229 -833124
6330 -833124 -837572 -611156 -314800 -656782 -1438521 -1090720 -898010 -782628 201496 696255
6320 696255 -795121 -1179457 -669487 -312577 499671 684136 -189132 -997840 -754794 834681
6310 834681 2102757 2075568 333586 -1062649 -1044615 -149182 601786 368359 -60815 82111
6300 82111 257950 398477 49262 -637319 -797984 -350822 -895014 -877856 -237662 -1090311
6290 -1090311 -1341919 -1229405 -1230430 -527814 -230361 -1067201 -2224304 -3153326 -3403582 -3992738
6280 -3992738 -4422199 -3863577 -2533430 -1418943 -154793 1218317 1646500 1488502 1032240
6271 1032240 206961 720344 894644 880933 347973 -437799 343138 1714154 1580710 1069525
6261 1069525 839487 405607 287627 820736 911660 565120 621928 658151 553515 1017259
6251 1017259 1177278 2293952 2902039 1765553 341709 -1296761 -1955851 -2094507 -2592808
6242 -2592808 -2977254 -1660006 256538 1772515 1559420 749542 457808 -209364 -1280459
6233 -1280459 -1344309 -104797 645386 1171816 745964 18839 -898875 -1636758 -913355 732988
6223 732988 1887842 1477903 919159 824603 1159121 1360600 1536346 1229125 257833 276350
6213 276350 423010 -949642 -1650182 -2199427 -2266749 -2138357 -1753726 -704682 -699940 -514153
6203 -514153 280947 301349 23105 -1155607 -2244915 -2423311 -1681624 -133912 446598
6194 446598 278053 1155597 2482589 3082387 2790527 2384110 1412606 329366 -724988
6185 -724988 -2442430 -3309214 -3511815 -3525345 -2972583 -1880113 -1047484 -1202911 -2117857 -2109749
6175 -2109749 -1556563 -270027 1310537 1874408 1149267 847482 1296298 1362926 1933125
6166 1933125 1929621 1396046 1782422 1629210 735540 338433 -97036 -1671168 -2825630 -2247998
6156 -2247998 -909614 -369564 -344201 470265 1072399 859696 223687 18585 -633667 -1426661
6146 -1426661 -1732202 -1779020 -2093837 -1567371 -61762 915706 324597 -424201 -1183380 -838312
6136 -838312 102740 486047 815879 699882 571266 534687 -28252 -326444 664819 227179
6126 227179 884480 2649189 2815961 748043 -1663569 -1897209 -1280710 -1073828 -1279300
6117 -1279300 -1858256 -2248071 -4131417 -5321554 -3595203 -2381039 -2237058 -749885 827754
6108 827754 1224635 1372500 316387 -957454 -1302984 -929533 -840817 -1020420 -439904 108307
6098 108307 -713693 -671362 -249324 -391647 -695892 -1589690 -2336714 -3258314 -2927826 -1546827
6088 -1546827 304009 1438237 1940624 1797414 1666393 1674960 524671 -934864 -1402066
6079 -1402066 -1174307 -1646579 -2489836 -3086995 -3414079 -2168732 -480479 519677 832337
6070 832337 653548 30722 -409766 526557 657617 -78147 -804382 -1055306 -853838 -592835
6060 -592835 -179567 216635 561499 -439462 -2325554 -3352784 -3325926 -2513644 -2294209
6051 -2294209 -1992888 -955209 249423 426328 -362465 -633282 53921 116266 -1455450
6042 -1455450 -2999122 -3577317 -2611252 -1702243 -1936109 -2853318 -3196663 -2863580 -2191832
6033 -2191832 -519289 464760 482264 1413265 2220511 2116520 1442314 953878 443396 133251
6023 133251 319394 279839 25511 -285579 -938116 -1924912 -1821196 -972578 -1465258 -1729291
6013 -1729291 -282220 1167411 1725604 1400040 1136938 1248673 1196122 1545062 2149254
6004 2149254 2127516 2741080 3029928 2416196 1313232 134051 -117949 -41840 -460644 -1077653
5994 -1077653 -603596 598496 1324537 1455983 2517297 3430932 2560712 1303341 229156
5985 229156 38989 1378203 2713910 2501528 1065690 1362262 2926612 3881856 4050358
5976 4050358 3018496 1775797 979536 -162691 -928521 -765033 -1251653 -2470208 -3030432
5967 -3030432 -3197039 -2114651 -662935 1117943 3195621 3309195 2229272 1468729 772768
5958 772768 730863 702069 -76074 -863547 -1694249 -2424601 -1156381 452041 296182 -631639
5948 -631639 -883692 654831 2274482 2527568 1601309 643129 816029 1096435 1088744 681674
5938 681674 752198 1803340 812763 -653401 -1657811 -2700087 -2876822 -2393409 -1786866
5929 -1786866 -1620863 -2183101 -1795057 -84365 315397 -283680 -327188 -162286 213526 491312
5919 491312 1223156 2263164 2399446 1610318 334160 -1029744 -1672655 -1543191 -740462
5910 -740462 -61866 -130094 -1210301 -1242171 -508698 331073 1453530 2660052 2984866 2776871
5900 2776871 2395630 1638385 927498 -26068 -999750 -1678866 -1577695 -2636360 -3339461
5891 -3339461 -2320286 -1255328 -1088853 -1667015 -621556 683266 437499 976599 2010866
5882 2010866 1876984 756824 -1015620 -1202938 109313 1535764 1647514 630222 407
5873 407 106371 985177 993793 280436 424827 1014058 1396653 919058 1106927 1350982 884920
5862 884920 187240 -840103 -1050003 -1034485 -1250255 -1065378 -796572 -728091 -869578 26932
5852 26932 497593 169618 746658 2051775 2273252 1262815 356392 743984 910969 513603
5842 513603 1286365 2170433 2135393 930372 -187814 -441384 -28062 93395 259073 -98232
5832 -98232 -865194 -1326946 -1227123 -54967 1993221 2569846 2149281 2659327 3114013 2584106
5822 2584106 1924785 1821450 832486 400580 196303 -299414 -1301281 -1480609 -1716548
5813 -1716548 -1905015 -963464 -794254 -132561 108530 282339 460424 1101896 1834289 1701525
5803 1701525 1716360 2237832 2768638 2405937 1484977 1809231 2080411 2319041 2242616 870321
5793 870321 986870 2203068 2676671 2597812 3011530 3597919 3238255 2613637 885457 -422821
5783 -422821 -874533 -1081506 -1469980 -2570611 -2228397 -1442085 -1696249 -1993916 -2056181 -3548081
5773 -3548081 -3867676 -2529302 -1282636 -493040 -590765 -464001 -402260 208765 795231 1841201
5763 1841201 3001437 3084188 2126673 -14498 -1264972 -450779 810797 1168371 1290810
5754 1290810 2278772 2652833 1486449 1135200 1095629 995072 1178986 522306 -117069 -495779
5744 -495779 -922920 -552377 106385 -668600 -1363355 -1037045 -1257519 -1559810 -1334579 -790169
5734 -790169 -746627 292037 523301 -677598 -1890999 -1481710 -454026 -487394 -874543
5725 -874543 -1367938 -1039144 -1055235 -1838828 -1707682 262509 2604583 3363134 2438956 -391712
5715 -391712 -1774129 -1422546 -1270849 -272906 -168792 -571564 -377414 629096 623278 -493380
5705 -493380 -761521 264220 1953403 4009432 4337428 3429210 3842475 4212033 3919711
5696 3919711 3459542 2631048 1760399 1571624 1182522 300583 -436126 355396 431069 21491
5686 21491 103414 -504639 -897199 -1256894 -321560 -9732 -425059 -521868 -627314 426785
5676 426785 619568 223190 169101 -202036 -1079537 -1154401 -318307 62860 578157 1077050
5666 1077050 9037 -1826427 -1713264 -804959 363106 1772349 1578133 634758 -390536
5657 -390536 455652 2414175 1828309 -199121 -1437268 -1944626 -2071768 -1744036 -900620
5648 -900620 194766 298216 851197 1772958 2462579 1767426 1473507 1830515 1782121 2253323
5638 2253323 2742157 2035642 635842 -89260 835526 1958703 2062195 1947868 1469375
5629 1469375 1211918 1426471 813136 -20217 545665 560139 -579007 -1559566 -2201108 -2435094
5619 -2435094 -2014909 -1076734 -203089 -258888 -481164 -59445 704736 926225 317023 -171057
5609 -171057 -218717 529005 667850 1377352 794972 -1478214 -2228964 -1523437 -310818 670076
5599 670076 1082637 1725229 1905041 1823159 1442558 1792143 1822047 341343 -799555 -846809
5589 -846809 -38302 1391632 1612599 325457 -579089 -885061 -403156 67029 -135478
5580 -135478 -229863 -12506 572075 151856 -148644 295033 214225 518432 863556 849489
5570 849489 850023 878815 1174850 2416839 2985731 1423749 1195354 2466359 3202123 2259969
5560 2259969 806632 437224 873252 2212178 2723062 2067429 185651 -1647503 -2902133
5551 -2902133 -2425211 -1311978 -632978 -568814 -1721643 -2027319 -813300 4289 43596
5542 43596 -572529 64820 407185 360520 1270867 1385971 1343429 2107396 1362912 -499957
5532 -499957 -1583679 -1831638 -920187 924285 1323577 512305 504609 818330 881319 -391435
5522 -391435 -148702 725929 913057 -405431 -1695688 -2708191 -2938466 -2405377 -1391139
5513 -1391139 -800948 -869455 -1793741 -3499710 -3429127 -2305005 -853905 -212601 786722
5504 786722 683181 -125025 -280837 -128544 -126383 -815453 -1567671 -1724076 -1599088 -1327071
5494 -1327071 -1113020 -891884 -1159846 -2097751 -2709338 -2790498 -2656614 -2207692 -1404221 -1098173
5484 -1098173 -1735974 -1158638 441950 1621641 1590595 1535225 -130411 -1484227 -598461
5475 -598461 -816468 -1398022 -1762431 -2412025 -1829552 -1220190 -280760 183846 -424934 -853288
5465 -853288 -667696 -467723 -1380106 -1904982 -1417035 -290350 436097 935004 432594 55358
5455 55358 631513 623960 898165 2118258 1527426 680109 95320 -294535 -733986 -101879
5445 -101879 1437068 1127943 573159 354150 287063 1717212 2969118 2466645 1158422
5436 1158422 -733170 -2057023 -2364558 -3107719 -2661620 -1724624 -1415168 -897477 81779
5427 81779 997374 1590138 565612 -886885 -409981 250731 846938 1401168 1008617 45177
5417 45177 -545765 -283568 -108530 -133228 60852 -401926 11945 -296234 -1050138 -759921
5407 -759921 -380545 -67011 609257 1416069 1022051 235603 -78658 316108 1447084 642737
5397 642737 -950064 -1880325 -2078295 -2366637 -1757757 -1580327 -1882335 -1681278 -1026578 -624435
5387 -624435 92602 235836 -488512 -311544 785788 1361408 1904281 1892301 1531400 1488351
5377 1488351 945783 526888 -68284 -463904 -366780 -1295505 -759023 432572 622814 696580
5367 696580 1480953 2416167 2069283 1271650 955956 291335 122619 970918 1508410 1321235
5357 1321235 1871731 2369638 2521639 2407863 2268121 2076913 508604 -114053 463177
5348 463177 84721 -497432 -8164 587213 1330686 741104 -176660 472128 1674349 905358
5338 905358 -655243 -894612 -1004220 -2018827 -2975184 -2681572 -2245401 -1360710 59721
5329 59721 1090851 2081017 3533459 4285146 3604881 3203210 3367704 3585291 3251952 2511777
5319 2511777 1570094 786698 -236884 -1081983 -631261 673587 -1430 -1376891 -2491139
5310 -2491139 -1860292 -978858 -854403 -1504769 -3192878 -4635645 -4901719 -4449447 -4087651
5301 -4087651 -2776724 -2022718 -1604302 -1281278 -249393 573951 970944 516644 301987
5292 301987 296738 -287958 -148461 385536 800009 411229 719490 1844114 2920399 2494617
5282 2494617 1600057 1207232 323431 -499690 -790211 -443104 -227952 -359471 -690591 221729
5272 221729 1030924 576217 607724 353238 219649 562155 1350330 1658533 1963267 2470543
5262 2470543 3351305 2230768 240189 -681975 -1429965 -1375048 207349 952089 156769
5253 156769 315269 1227683 1471431 579035 166498 461311 1622113 2484950 1928699 266689
5243 266689 -997202 -1070093 -1873462 -2735516 -3091202 -2101436 -626755 170127 -232939 -652012
5233 -652012 -687253 -715069 -1598978 -2624213 -2397777 -1585048 -910692 -924883 -1283555 -1164700
5223 -1164700 -1494376 -1671160 -1528646 -1314107 -266620 999000 1895995 1871114 682897
5214 682897 -449375 -783334 -883226 -1108731 -996266 141469 1232258 1379577 987177
5205 987177 626678 317960 460478 1226335 1957698 1438252 933305 476845 300148 634305
5195 634305 1254868 3146114 4153610 2906544 1275830 1228980 1407821 1438960 1402352 1293408
5185 1293408 1107646 1340158 1017725 714940 526855 394523 1416764 2812769 2719323
5176 2719323 2301326 2674136 2039504 1600645 788685 76368 -411662 -106603 828290 2409518
5166 2409518 3044583 2738670 1494417 -373947 -1520560 -1652558 -1441664 -2240610 -2298002
5157 -2298002 -1783006 -884234 497421 1356854 1613332 1759927 2551287 1753792 372861
5148 372861 -138544 1073575 1388019 219064 -990438 -1343881 -1089128 -1161997 -1053215
5139 -1053215 -944485 -742980 -290844 267925 526955 374789 -101690 -278966 -630889 -1730778
5129 -1730778 -2566090 -2832011 -2741096 -1989007 -1702867 -1840995 -2106830 -1482095 143782 2119468
5119 2119468 3401481 4210438 3775274 2504117 1519919 743214 -263575 -754238 -1675518
5110 -1675518 -3077728 -3010522 -3075874 -3469317 -1843986 822027 2416524 1932281 875605
5101 875605 1020418 1610432 1686093 700837 -608980 -1260181 -893525 -415602 222875 -299516
5091 -299516 -1734540 -1470765 651047 1887754 1257575 1077695 1442202 755004 -836330
5082 -836330 -1074227 -400766 -128146 -517971 -1541111 -1040998 843645 1929383 3068791
5073 3068791 4079075 3990411 3515225 2867440 2515973 2648995 2888454 1776882 837849
5064 837849 619028 32419 -145130 -472507 -573681 -593962 -1066743 -1595679 -1176250 -559246
5054 -559246 -881549 -695917 -169992 181503 428594 148544 -498835 -280094 780325 1633274
5044 1633274 1953576 1147944 786651 1251602 1526128 1444119 997097 316952 77726 660596
5034 660596 1100633 953556 58770 -462326 -804162 -43394 514312 1191508 2457000 2513567
5024 2513567 3159710 3558872 2866321 2409477 1398279 1346349 1394067 1775990 1763739 158531
5014 158531 -301118 169164 1353393 1849479 2123601 2566051 2563046 2003467 1073141 -249262
5004 -249262 -808436 -1069431 -1843474 -1815237 -1750611 -1163845 -70447 285276 234382 -202205
4994 -202205 411198 2063548 3056540 3202612 2992141 2447853 2091443 1986329 833087
4985 833087 -92385 1047965 1764986 1345558 82627 -749688 249648 1266451 1965865
4976 1965865 1927480 225997 -1293275 -2007289 -2070751 -1350232 -430625 174408 909521 1279695
4966 1279695 1141867 1696921 2592425 3868782 4952517 3600386 2146608 2844728 2937292
4957 2937292 2682367 1279234 48357 -44676 411490 1279566 1212980 785224 241495 -147566
4947 -147566 -685550 -689311 511042 1144659 1223460 1373014 453670 -69582 -551924 -1468295
4937 -1468295 -1156559 -1082749 -1305427 -1350060 -1299266 -1592661 -1994463 -2720698 -1419661 -393276
4927 -393276 -1584784 -1984247 -326194 626923 798171 205049 -409952 119214 1315796
4918 1315796 1222358 321313 18435 121305 518528 637189 1902816 2481620 2686032 1820022
4908 1820022 -61631 -690697 -1166989 -2080836 -1557704 -538594 -833581 -1330853 -1180526
4899 -1180526 -1094789 -1515585 -2277622 -2420560 -683055 955763 1367372 1737074 956967
4890 956967 -25338 -1447652 -1061355 703578 1035800 366403 304939 -470150 -1846987
4881 -1846987 -2395866 -1291307 -176903 -177439 -219349 453186 -49691 -573410 -682466 -981098
4871 -981098 -1360374 -1361183 -959725 -1124508 -513899 1162625 2332405 1785253 1279542 374782
4861 374782 -547774 -1194875 -1769249 -2000942 -1695899 -1971237 -2498916 -2156553 -997908 -507603
4851 -507603 -585065 -514873 -938727 -702230 289737 111025 4846 364737 273117 -770399
4841 -770399 -2330273 -3390711 -3648419 -3139959 -1509082 285259 1124024 1079289 1587629
4832 1587629 2782438 2873561 2418807 1531307 361684 493099 317802 -169924 744289
4823 744289 2415401 2797680 2019544 396799 -1277662 -1278751 -898575 -358401 90202 1127041
4813 1127041 2575680 3025989 2371063 1318837 -524929 -1753553 -1270690 -663343 -468533
4804 -468533 -1430210 -1564591 -435272 654933 1929096 2988970 2910730 1633315 710374
4795 710374 784867 1232869 1918635 1731719 784300 446352 828280 1646122 1697927 1772795
4785 1772795 2001026 1756084 1067683 -848625 -1908892 -1740184 -1424409 -1064252 -1072867 -1281239
4775 -1281239 -1206474 -853712 -301081 -85819 -1347171 -2408140 -1802350 -582927 117112
4766 117112 -109200 -189216 -542834 -680596 -697426 -861652 -1158867 -831641 -1047887 -1529525
4756 -1529525 -1504644 -1828627 -1556552 -1286107 -1819877 -2114287 -2151695 -2044560 -1215892 -563717
4746 -563717 -1381244 -2703201 -2681886 -2815647 -2336116 -906589 -864626 -1329755 -1431285 -2344711
4736 -2344711 -3704345 -3821544 -2402071 -1808704 -2501913 -2501296 -1159757 -3552 223922
4727 223922 -107338 -50542 132655 -126476 -840722 -861609 -161162 257140 491585 1477435
4717 1477435 1426171 26015 -347916 -214578 -1415448 -1143397 624183 1318037 1296196
4708 1296196 1566878 1374343 1177662 1209670 1121055 1224147 1303207 1786914 1539552 1209226
4698 1209226 1891215 1444636 201684 420563 205459 180456 -170455 -1449539 -1084962
4689 -1084962 509963 1208287 1415207 1129881 -187958 -793341 -459461 -658291 -290436
4680 -290436 -142502 -765592 -788961 -111000 980180 1103292 109014 -932855 -1567630 -1560030
4670 -1560030 -1425706 -2205431 -2218681 -1536259 -1549624 -1358576 -1338596 -1125544 -551793 -938546
4660 -938546 -2140165 -1682400 24873 168287 -122618 -340673 -1363701 -2910628 -3263555
4651 -3263555 -3455958 -3024650 -2126744 -1819237 -2380252 -2095292 -1540050 -1005941 74188
4642 74188 221027 -413569 -513216 -112746 -908608 -964339 -27904 399382 347904 502855
4632 502855 488316 423298 984419 1225663 1459854 2148201 2112241 3141684 3993913 2731530
4622 2731530 2344465 2014827 1305806 1482786 1885857 394476 -1343825 -1431609 -666349
4613 -666349 80035 340499 516949 745990 -70766 -711661 -926139 -97883 1725809 2413158
4603 2413158 2053991 1609720 1157947 896278 1529237 2680976 2977735 2715547 1147601
4594 1147601 280174 344288 -870814 -1174580 -1575515 -2891832 -3264413 -2510398 -1506206
4585 -1506206 -810654 -1495189 -1629785 -1190774 -1419322 -687278 679140 172554 -1254313
4576 -1254313 -975076 459272 1134580 1672091 1905369 1078879 41005 65816 228554
4567 228554 1267443 2300089 1892436 267980 -1350133 -2166652 -1316363 -429214 421083
4558 421083 1309603 349972 -1496902 -1483081 -242221 1139713 1638406 1213860 1441027
4549 1441027 2471994 3454016 4363273 4591627 4355569 4441479 4128602 3848236 3778066 3048647
4539 3048647 1207997 166677 -121605 -537005 -120151 -148701 -653988 -642699 36024 87588
4529 87588 -977391 -1470771 -343866 1075242 1732582 715296 -154534 -562597 -1591081
4520 -1591081 -1981194 -2405200 -2445664 -2231334 -2671446 -1660344 -373056 794419 1529740
4511 1529740 2708727 4951653 5525486 5776887 5228259 3517439 1894767 911621 318093
4502 318093 -394541 -823631 -1608375 -1150642 161162 190387 -37785 -211121 2040 330831
4492 330831 538807 506729 173860 319773 380688 684177 1230095 1512694 1264225 -128457
4482 -128457 -686094 -525692 -142169 -943495 -1136779 -28414 2282272 4317498 3996709
4473 3996709 2810161 1160616 -1392405 -1932150 -1161072 -1019803 -1138561 -1395374 -1714853
4464 -1714853 -1468385 -552310 -172122 448576 386628 723993 807674 -662068 -1055912 -1552101
4454 -1552101 -2441260 -1672903 91569 1522630 3414237 3856266 3686297 3532970 2480087
4445 2480087 558980 -1651850 -1931296 -1256510 -1111235 -2375337 -2916774 -3016360 -3061965
4436 -3061965 -2910262 -2445533 -1655898 -1421641 -1011815 188889 708555 353527 753693
4427 753693 341026 -992091 -1265828 -971070 -246136 1142714 2286955 2093616 594347
4418 594347 -217065 -209463 4114 814746 1233902 1380633 1148697 1115171 1252709 1452988
4408 1452988 1301254 758981 117790 -675195 -667440 1482969 2517599 2214076 1383347 1460889
4398 1460889 2161576 2902343 4108216 4570215 4519414 3510279 3740644 5010506 5061467
4389 5061467 3216429 2558372 2856470 2631435 2372432 2600627 1486270 1005577 2542578
4380 2542578 4014919 5178964 5275482 4462890 3896180 4496964 5241954 6539670 8444627
4371 8444627 9368835 9673233 9740659 9170306 9335126 10330360 11064264 12820684 15106156
4362 15106156 17088597 19408922 22394549 25826234 29886875 34526539 41131686 49452437
4354 49452437 60114176 75618861 95356433 120224959 153342874 197822335 250987116
4347 250987116 297883873 306990200 265862188 205296702 153101315 114384543 87781760
4340 87781760 68810776 53682925 43949865 37332449 31882650 27522103 24516058 21689341
4332 21689341 18302706 15212331 14191609 13163799 11729797 10615014 8747028 7377428
4324 7377428 7710095 7466619 5626160 4347467 3635799 2657990 1660755 1739185 2038795
4315 2038795 1333660 1178270 2282371 2571732 2675288 3514632 4202521 4540318 4825393
4306 4825393 5069959 4715415 4989355 4235710 2309935 2013858 2267101 1698150 1187617
4297 1187617 1418081 650489 1462339 3282145 3952518 4651851 5275819 4367673 2718447
4288 2718447 2966043 3543487 3032582 2200248 1086069 525498 1304340 2882917 4442182
4279 4442182 4655443 2272952 1257100 1808264 1075629 577906 1011164 1122037 279733
4270 279733 -908297 -449029 1093859 1987350 2875050 4002405 4921630 4625551 4273240
4261 4273240 3657250 2686637 2104750 1191536 -949874 -2193938 -1437626 -634086 -942792
4252 -942792 -1484763 -513449 202551 158967 -515549 -1263292 -631600 -886406 -1161955 -413309
4242 -413309 -427553 -930429 -1439731 -1580463 -1266462 -1759751 -2613229 -2884298 -2227073 -1296939
4232 -1296939 -489796 -185425 -222735 178564 110405 -997957 -1884832 -2479988 -3103967 -4111377
4222 -4111377 -5021473 -4720294 -3158852 -2068388 -1462838 397458 1082697 468482 1031630
4213 1031630 1450420 259895 50311 1045941 1364284 520561 -145986 -227747 516306 1931657
4203 1931657 2147883 1558745 847475 -541016 -1107298 -1570555 -1890222 -1501608 -1474528 -1465190
4193 -1465190 -543277 -931169 -1597900 -2498703 -2975267 -2099557 -1284082 -509513 -60571 -598125
4183 -598125 -583301 55947 149917 944891 1817393 2066310 2069115 2278530 2415674 1679622
4173 1679622 542200 527874 1344051 2033214 2087925 1979106 1882527 1022878 -419787 -1747782
4163 -1747782 -2109866 -1171549 -182392 -390639 -778768 -684746 -414671 -950218 -1834180 -1680773
4153 -1680773 -1139052 -579781 -316162 549451 1246940 1635609 2240745 1885223 1279430 940704
4143 940704 870490 1792294 2659206 1943900 1196530 1028176 1322412 991424 129083 -52466
4133 -52466 742865 1160157 1090446 1396391 1295819 361224 -420138 -140408 462597 734228
4123 734228 993617 1361710 1744887 973169 -1536 -833647 -995386 -848898 -619388 -1420595
4113 -1420595 -2845848 -3298357 -1400411 28011 870756 1986710 645488 -194698 504139
4104 504139 990686 1136821 1198954 1048819 1137877 1187499 744583 -24569 -821960 -1064831
4094 -1064831 -1008390 -482684 -982750 -1405580 -1421020 -931337 172979 59450 -1191691 -1813124
4084 -1813124 -993593 -885746 -695729 -794741 -1600269 -1844042 -578595 1176249 1247943 741282
4074 741282 761872 294684 -54365 -315751 395025 538354 483861 290925 -177802 -255321
4064 -255321 1607875 2771738 1542766 894522 1654299 1505243 664589 -300502 -432314
4055 -432314 958627 2514371 3035405 2540143 1962622 1090097 66230 -1007138 -1704558
4046 -1704558 -1439988 603108 2937599 3406037 1799102 -74961 -1346355 -416929 1411692
4037 1411692 3199651 3544715 2102990 948993 230974 37865 -34023 -27714 -103568 187093
4027 187093 -245669 -961343 -1266787 -950008 -852192 -491920 663819 527597 -503764 -474745
4017 -474745 -75476 403648 2028128 3115109 3730703 3443878 2865424 2352235 1919151
4008 1919151 1201005 424563 -45974 -1168670 -2415090 -3682734 -3887508 -3318782 -2080759
3999 -2080759 -780149 306751 1686550 1551641 593688 -323329 -1506148 -2003118 -2943101
3990 -2943101 -3237541 -3587542 -3452404 -1146623 759845 549642 39425 -47933 -637219
3981 -637219 -497356 364277 848281 -221260 -892316 -1083775 -1493220 -1484691 -591526 109745
3971 109745 -508674 -668493 -82447 904399 1487804 536378 -859399 -2074441 -1751829
3962 -1751829 -933357 -573768 -1719036 -3316392 -4182727 -3987864 -1992524 -705412 -497088
3953 -497088 749356 573758 -383856 -280545 -294975 -1120760 -1736563 -1620108 -1461382 -1324508
3943 -1324508 -955045 -686416 151204 92167 -708621 -157422 -347351 433062 2051752 2815988
3933 2815988 1884971 -174046 -539446 288123 -434090 -1359935 -731251 48099 120435 556295
3923 556295 474216 528867 326605 -1218086 -3169425 -4256238 -3965099 -2153218 -1642870
3914 -1642870 -1823136 -1729949 -613256 379583 91893 -865093 -2248273 -2710095 -1857185
3905 -1857185 -288621 903217 1509453 2476466 3698853 3585704 3096602 1896895 785449
3896 785449 -53263 -1005654 -1285334 -1461699 -1258158 -2004968 -2566937 -2766470 -2899122 -1981330
3886 -1981330 -1294562 -1550456 -2014910 -2186745 -2903704 -3114415 -2699414 -978304 216271
3877 216271 -157779 -825013 -1853982 -1973002 -1210571 -802604 -360560 569867 1324639 1788784
3867 1788784 664951 -1028460 -1040572 -866853 -579350 -519097 -245851 -16573 -1552238
3858 -1552238 -2821429 -3481816 -2619720 -2288240 -1682891 -1969706 -2177852 -1366850 -1130029
3849 -1130029 -1113592 -293113 494738 1160508 1827012 1816075 599780 -145650 390429 842157
3839 842157 842177 1398946 1463782 701974 -67054 109276 1258240 1701903 1265173 397259
3829 397259 -423909 -951747 -787707 -1084766 -1756054 -2509103 -1721707 -50424 147211 343044
3819 343044 867929 1764070 2895963 3603609 4438764 4264286 3590125 3313650 2908487 2458241
3809 2458241 1671986 1267347 -750671 -1658632 -165078 171297 3210 -298663 -445415
3800 -445415 -901352 -1166958 589837 2232382 1457005 463233 81313 -52816 -709441
3791 -709441 -1222656 -1412567 -1387318 -1324566 -665573 392208 1377459 2189059 3253437 3717413
3781 3717413 3191306 2659870 1634133 1289640 1129393 -251597 -676040 -702631 -1021408
3772 -1021408 -1326308 -1201566 302984 849502 623520 826225 253113 -941153 -1215061
3763 -1215061 -830097 -205572 -118367 -244938 480459 582396 861848 1131587 233673 -994338
3753 -994338 -914009 -986472 -970603 -591321 45814 158479 312195 53816 -398389 -335809
3743 -335809 -3923 26843 -524813 -1244672 -397764 666326 220222 -817798 -1674749 -1074569
3733 -1074569 188003 872143 1333432 2341395 3429737 2716459 1139507 -191776 -498237
3724 -498237 -1132142 -2074375 -2979575 -3124504 -1725857 -586445 -136480 42303 -81903
3715 -81903 -410777 -780352 -1696956 -1811445 -1183865 -1402279 -1067598 -972268 -1789193 -1428192
3705 -1428192 420400 1221025 2171179 1804568 537095 -366648 -996965 -114623 868121
3696 868121 1894091 2903332 2718701 638553 -2201090 -3282672 -1892881 -840278 -2259843
3687 -2259843 -3040479 -1824533 -1368876 -271299 1643487 3250917 3498792 2385927 1490463
3678 1490463 794264 1243177 2842019 2563632 1031289 678766 862318 -682023 -3052979
3669 -3052979 -3638064 -3770984 -3047538 -1455547 -828545 -153958 404868 1013018 1602177
3660 1602177 932708 888496 1197414 1274899 1175196 467714 2797 -620801 -1147050 -1366704
3650 -1366704 -2041016 -2304297 -1773267 -1168844 -1047941 -899711 -489049 386544 943350 -302325
3640 -302325 -1849222 -2385202 -2101122 -987755 -275450 -36259 -392039 -1635103 -2969727
3631 -2969727 -2414457 493070 1159973 898050 1335440 1293126 -69988 -1471226 -2041670
3622 -2041670 -1425869 -850425 -636998 -740919 -1531041 -1926622 -1507432 -434286 786659
3613 786659 946184 -948815 -2032516 -2130042 -1420182 190262 1245959 1565176 1029577
3604 1029577 202075 -492443 -1418457 -2042044 -2186540 -2462501 -1973561 -1234806 -897349 -1056979
3594 -1056979 -723726 -354349 263132 364237 -433154 -765183 -437906 -356141 118545 1082016
3584 1082016 2151723 2596981 1278862 -234961 -1814562 -2322972 -1997928 -1015582 -627032
3575 -627032 -913157 -75168 884138 899845 1303584 1324270 1023397 1619811 2850115 2956768
3565 2956768 1485354 1227756 2476382 2313367 1454850 609009 547206 -24568 -2169713
3556 -2169713 -3615135 -3125594 -3125880 -3118262 -1233200 86555 -613256 -1035550 -1141790 -1948969
3546 -1948969 -2239647 -2775646 -2575705 -1739317 -347653 1123364 998079 -316723 -1630796
3537 -1630796 -1263460 -1695039 -3407755 -3963218 -3638469 -3403702 -2558845 -1395550 -446057
3528 -446057 628207 1539615 1652976 1015971 540402 -254944 -709552 -365012 -797453 -2073184
3518 -2073184 -2185560 -1201609 95827 1606361 2630430 1273952 163574 371568 128116
3509 128116 -673250 -1060987 -1859332 -2621282 -2730262 -3022272 -2633438 -885441 1120399
3500 1120399 1927333 737313 -21574 -69717 -808896 -1092675 -964224 -1194979 91942
3491 91942 1116805 1338440 2430873 3087536 1952755 439306 186122 329204 -643650
3482 -643650 -1166959 -175217 492051 227030 44079 -121610 -1056792 -1897557 -1879200 -1242511
3472 -1242511 -596730 -1085567 -1113017 -590298 -1066247 -815238 280716 731924 1163938 1151632
3462 1151632 596950 -671182 -854207 -1027913 -1389684 -512197 -402470 367861 2025708
3453 2025708 1920699 989583 250648 285055 206321 -84106 23083 -46232 197226 1034695
3443 1034695 1856615 953394 -342855 -382103 -172458 -162343 225613 -4270 -897879 -938115
3433 -938115 -312968 337791 798414 1157519 1649965 1190817 613089 49346 -934816 -394974
3423 -394974 -345851 -1472891 -2881245 -3858307 -4583675 -3961441 -3625453 -3490695 -2469102
3414 -2469102 -2309523 -1713660 -1340000 -223344 1618059 1649147 633158 434984 190929
3405 190929 -942897 -1679050 -1032453 674570 419114 -1338516 -2513056 -1367065 -387251
3396 -387251 -1425868 -1284522 -1002793 -1422667 -1238110 -1250725 -2124617 -1928034 -1299294 -816079
3386 -816079 -53733 187484 493409 1554571 2671574 3185165 3734168 2671740 1547156
3377 1547156 1125015 250633 579336 1864791 2831280 2878354 2114060 1156392 523986 455668
3367 455668 1050590 2325668 2204158 1511852 1541677 2205644 2261619 1503111 49163 -1084249
3357 -1084249 -1564352 -1901111 -1865870 -1824805 -628811 516171 606102 -561275 -1206455 -1164076
3347 -1164076 -1481208 -1615330 -9839 2647079 3249810 2887673 2126118 1283897 554198
3338 554198 -477206 529564 1593384 1602639 719992 435428 494101 378422 -156239 -115760
3328 -115760 910684 587957 -531679 -1392898 -1328148 -617190 -1167102 -2040205 -1965202 -1211880
3318 -1211880 -118885 463510 -494692 -762158 790570 2099656 1828667 1186050 1354217
3309 1354217 871101 197272 -189921 -627235 -199338 -424691 -1384860 -1371728 -352759 -36295
3299 -36295 178537 473460 643524 860574 1341497 1868630 1811329 1599405 1772843 1669575
3289 1669575 743272 366154 1297078 2447898 2523546 1544205 546940 -56278 492476 653449
3279 653449 -462011 -1216679 -3215944 -4737683 -3786483 -3498059 -2424442 -1087504 340544
3270 340544 1537218 1946432 1484503 1304210 2056469 2303062 2532635 3423963 2916550 1330922
3260 1330922 -605829 -993307 -576680 -926047 -96617 875092 1446211 1423176 1119149 -177705
3250 -177705 -1223806 -1229318 -288205 252433 -117287 -699684 -991182 -605240 372076 610220
3240 610220 -190291 -1216699 -1591706 -1448148 -1371547 -481268 320972 1017924 1503062 1616973
3230 1616973 419056 -1195165 -1006880 -195898 138062 1099386 1614591 2131804 1866515
3221 1866515 850030 411919 584914 -20916 38039 1137778 1776953 2074240 1653931
3212 1653931 1566965 2538403 3144516 3458375 4157990 4008528 4036232 4326497 3194885 1158522
3202 1158522 69290 -745442 -1175642 -1284385 -1425353 -2105528 -2904782 -3887599 -5041335
3193 -5041335 -5275420 -4817627 -3762911 -2932140 -2494888 -1980385 -1865017 -2000816 -1323924
3184 -1323924 -377621 701429 1107770 377168 80550 -506711 -63246 790797 926853
3175 926853 892278 738335 1069904 53368 -1321145 -2315917 -1162210 457630 850671
3166 850671 -267469 -2417612 -3416557 -2336717 -1595717 -2040411 -1717634 -1188453 -1315558
3157 -1315558 -1701046 -1748180 -1801630 -1330890 -1318566 -786729 -68767 251538 957080 1945078
3147 1945078 1698184 -55652 -1390997 -1599799 -1835480 -1906771 -1632310 -383753 636556
3138 636556 283199 -365220 -418227 360709 371820 267658 -240901 -783701 -226021 168595
3128 168595 -712634 -2383602 -2438398 -1218569 -693035 -375711 -837164 -1920731 -2915137
3119 -2915137 -3348405 -2856520 -2111082 -1842853 -1897916 -3144603 -3714859 -2979271 -2748917 -2238530
3109 -2238530 -1430271 -824441 -544906 261588 206104 799143 358685 -245564 -674147 -510434
3099 -510434 -104841 -215047 -525710 -699859 313787 1103088 1371737 1856466 2254767 2192235
3089 2192235 2219034 2142081 1574207 1165178 803532 133254 -125121 671378 934457 2011637
3079 2011637 3141754 2611487 1352916 1274723 1582315 1150678 1037857 998208 726591 136405
3069 136405 85961 -48944 16906 -406842 -429035 -565091 -1423924 -1263617 -1278421 -1194357 -2128529
3058 -2128529 -2645160 -2432627 -2207573 -1821038 -1387506 -554048 -1101853 -1843366 -1969968 -2176281
3048 -2176281 -2065600 -1027771 -32667 318094 1122082 2071170 1670536 286803 -1142004
3039 -1142004 -1729568 -2084589 -1836159 -1128564 -163252 517873 721975 666335 -4021 495015
3029 495015 1653883 2296038 2672425 2701483 1045452 -499705 -57623 425244 -92581
3020 -92581 -95802 -71088 1243193 2745157 2462618 2582072 2911955 1731903 834989 602480
3010 602480 1442949 2065348 2555490 2697045 1985732 1143018 969440 1588198 2116344 584958
3000 584958 -1662054 -1389191 -820470 -1711758 -2903062 -2715420 -2217238 -1829212 -2148222
2991 -2148222 -3495279 -3548906 -1282980 1161287 1497186 1112734 1183460 1084041 2070401 2095036
2981 2095036 1134265 889659 2053869 2209593 1084420 -432050 -1876386 -2737581 -2435038
2972 -2435038 -1823861 -2031350 -1946654 -1390650 680883 2895532 3401595 3145073 2175568
2963 2175568 1614895 1328721 1254119 627144 133749 -1463589 -2900292 -3000822 -1916139
2954 -1916139 44924 1086044 489786 597209 1074360 477647 -830220 -944296 -129731
2945 -129731 -693047 -1126083 -110657 502360 156736 -138722 92483 320847 650256 697037
2935 697037 551157 -214626 -1514059 -1289817 -1083657 -1689074 -1935558 -1821655 -1675758 -1985568
2925 -1985568 -2384936 -2287670 -3062164 -3168848 -1816346 -1292169 -1243544 -1401677 -670222 -48983
2915 -48983 44318 1244785 2277090 1765673 736003 -251332 -1187086 -948262 447371
2906 447371 1822474 1245654 495856 869148 2620251 3472636 3372906 2840567 2451752 2256200
2896 2256200 2088947 2573823 3768927 4045665 4249344 3916093 3532153 3934976 3665539
2887 3665539 2940518 2549971 2086343 2624194 2821894 1765231 116525 -261903 -982048
2878 -982048 -1781143 -893064 -772246 -1151989 -984833 -1255609 -1996783 -2027091 -2517952 -3514823
2868 -3514823 -3017567 -1705617 -839655 -897578 -779289 -1053742 -1658709 -2996667 -4122237
2859 -4122237 -3427959 -2098678 -1454080 -1155855 -320103 589641 -65112 -683960 -1055564
2850 -1055564 -2126559 -3147467 -3080163 -1535169 -1023116 -1121138 -997533 -1565464 -2660835
2841 -2660835 -3380541 -2855839 -2246600 -2023040 -1693490 -2218167 -2586345 -3505307 -3532758 -2097551
2831 -2097551 -579992 -420159 -122598 489613 221408 -666902 -1331349 -1286052 -1092496 -1510920
2821 -1510920 -2387503 -2365163 -1717403 -1784913 -1438401 -1253757 -966163 505812 1227956 523894
2811 523894 -412556 -1020924 -1045990 -198827 719057 205072 -580346 -1102159 -843307 715952
2801 715952 1946867 1679359 1006166 717258 649034 773103 56969 -125451 677 837859
2791 837859 2013373 2566596 2113907 1381736 117862 -1495521 -1027422 424598 911664
2782 911664 468247 -33264 -132265 -917806 -1605062 -784789 -715140 -816984 -1056049 -888713
2772 -888713 463483 1123232 731795 653518 321522 -677986 -879750 712343 1617308 1580926
2762 1580926 1039201 1452517 1737055 1620236 1804203 656846 -707671 -2011144 -1803710
2753 -1803710 -123213 806156 32624 -882204 -1344621 -2011981 -2589671 -2419726 -1102290
2744 -1102290 632912 2057286 1946820 1222374 357229 -1089200 -905500 457512 874065
2735 874065 1043990 1280490 688935 -223604 -252994 242451 -126887 -492141 290874 1659987
2725 1659987 2344168 2812769 3365416 2542822 497626 -861296 -1023621 -1419600 -1686735
2716 -1686735 -1216598 -1136395 -1591620 -855719 -333695 374300 464789 -444681 -906291 -249813
2706 -249813 530716 1370989 1653557 1114292 1718261 3169875 2947572 2434574 1624994 -286090
2696 -286090 -2028275 -1660742 19307 446156 160364 -1438827 -2522701 -2927724 -2826698
2687 -2826698 -2328253 -691958 252719 -336327 -587975 646830 1729708 2240273 2004079
2678 2004079 1251314 1052690 1006683 987820 490407 805614 741388 1455628 1550387 1171625
2668 1171625 752555 -41902 817531 1646831 1512919 -177067 -1617702 -2033067 -2622774
2659 -2622774 -1715167 -1268342 -1531346 -1406713 -836816 -408532 -907836 -1268644 -396870 984036
2649 984036 1025475 -102301 -1688456 -1749920 -662807 -683568 -823163 21191 847996 762379
2639 762379 990206 374583 135309 -281963 -676660 -1017186 -2209217 -2828377 -1192724
2630 -1192724 167683 -34075 282492 -315145 -1149804 -1500888 -1148184 252141 2447116
2621 2447116 3650097 3222652 1915216 1119964 103260 -98731 -772486 -1716976 -1729768
2612 -1729768 -1556091 -349090 1012375 1188141 1547595 1460927 581356 -1063421 -1892956
2603 -1892956 -1418834 -428317 947370 2050720 2581240 2549265 2205837 1836763 1067801
2594 1067801 284640 -680540 -1741844 -1491813 -1480692 -1834323 -2169234 -2155553 -1526427 -194983
2584 -194983 540431 762196 741270 857743 1846870 1713209 1060953 672203 554531 36681
2574 36681 -200062 1347538 3138711 3246725 3230277 3953123 4446661 4426191 3959149 2862691
2564 2862691 1972585 1379953 1240101 1958301 1385851 -201895 924188 2702111 3656030
2555 3656030 3396029 1968486 865733 1110544 408525 -771333 37266 942130 1253736
2546 1253736 1843319 1425854 895906 1059048 721039 -417452 -1300743 -1008047 -457551
2537 -457551 -608898 -1360859 -1555072 -849782 -448103 -145745 510921 997033 754796 402492
2527 402492 556465 -389951 -2320769 -2974417 -1822236 -213686 678320 415849 -175946
2518 -175946 -815417 -932728 -1701702 -2095127 -1039262 -95543 226593 -300400 -791874 -1436743
2508 -1436743 -1275706 -1021064 -1422060 -1526541 -1523449 -1298101 -1496120 -2038924 -1857981 -1056676
2498 -1056676 -1013883 -525021 282191 873146 1249547 1491219 606583 -1027391 -1260991 -1258683
2488 -1258683 -1174111 -1427165 -2567043 -3038232 -3344183 -3095950 -2443085 -1003561 -53174
2479 -53174 1001048 2364984 2134284 2038898 1797019 524858 -96399 -595491 -702726 542670
2469 542670 455276 -923301 -1484953 -551198 847488 1381861 2824153 4170305 4091285
2460 4091285 1714524 -296403 -1371326 -1387348 -1049317 -395372 220962 -716751 -638466
2451 -638466 -195496 269942 950319 1642935 2683255 3245535 3462830 2916080 1145212
2442 1145212 291415 -132953 -244359 -538266 -15937 555246 171950 -361726 451213 2000481
2432 2000481 2453951 1536491 -5002 -872905 -1890167 -1530836 -1246849 -1495277 -516073
2423 -516073 -592913 -911293 -1428545 -1719370 -1410155 -1191627 -1884301 -2875320 -2591101 -2404054
2413 -2404054 -2412814 -1586099 -532447 73516 -703349 -1158145 -1569370 -1896526 -1605599 -405562
2403 -405562 694899 1534905 506179 -927589 -574648 -323893 22011 949058 2374640
2394 2374640 3335550 3480403 3476763 3462841 2421244 1449841 1899285 1619028 143717 -389453
2384 -389453 -1065402 -1801927 -2068743 -2603593 -3292281 -2291842 -419419 811342 825947
2375 825947 156644 -1089962 -1138287 -1602267 -2103118 -1495510 -934718 114494 676951 559214
2365 559214 720838 1167526 2486243 4186488 5383357 4510935 1970801 280900 -1328911
2356 -1328911 -857829 335990 608103 -298692 372602 1808378 2080805 1512771 1007218
2347 1007218 1429946 2217008 2808033 2580023 1232394 27016 -13759 827649 1463202
2338 1463202 1793023 1580306 738663 -592296 -1058643 88461 1513751 2627988 1619916
2329 1619916 969858 688018 115271 178869 1121419 1761124 1519231 1062255 771583 1094607
2319 1094607 978266 630765 570689 637776 1254420 1591081 1284067 -233574 -936652 -1740431
2309 -1740431 -3052485 -2701562 -2111769 -911726 -248442 -634882 -334232 544229 505246
2300 505246 -500225 -978564 -564446 -39336 558069 263877 -740380 -528066 548269
2291 548269 907350 958228 1480176 1438522 1075401 1283692 1410077 652868 -684634 -1953484
2281 -1953484 -3218247 -3430538 -2538728 -2288047 -2847958 -3199927 -2872591 -2759528 -2398016
2272 -2398016 -1336532 -201768 1118765 875064 367746 1358504 1529686 1373447 1667013
2263 1667013 2578309 2870037 2335911 1544593 777011 -815069 -1545096 -2214196 -2378157
2254 -2378157 -1586472 -468280 1881266 2466203 1807320 1255053 619790 366784 -1014091
2245 -1014091 -1997461 -1886480 -1136911 555088 2080809 2902433 2808198 1879517 406310
2236 406310 -306773 -772964 -830877 -473939 -467974 -214516 413508 1357683 825172 -173227
2226 -173227 433953 1890030 1789675 1211388 1315767 937095 851404 1101190 413522 112362
2216 112362 35878 494150 834962 -286252 -1819681 -1860006 -1488650 -1480558 -981915 -111532
2206 -111532 1650031 2095951 -462593 -2810444 -3415658 -2259384 -636085 126887 370971
2197 370971 829019 963649 540469 449287 236819 60802 1031358 1144279 551251 -246406
2187 -246406 -553080 -440307 -923566 -1408014 -2133085 -1847574 -414074 899911 1922850
2178 1922850 2278557 2468075 2772312 2739067 2082450 1174431 585187 -180126 -259625 131108
2168 131108 -399223 -1019163 -626143 -1010252 -1181302 -956191 -192496 72902 -171380 -375947
2158 -375947 -348189 -497922 -1116791 -1346821 -310430 221826 320267 632031 613972 823998
2148 823998 1340320 1208320 1325656 1388035 1097335 1795949 2877775 2794334 1819986 -67324
2138 -67324 -2308255 -3070513 -2874103 -2073186 -1401870 -1201960 -1090345 -971281 -275083 633363
2128 633363 1126775 207172 -605641 -1173375 -1511789 -1003463 -913495 -1570212 -2718618 -2535780
2118 -2535780 -2130978 -2145429 -1824905 -2226752 -2143019 -1606507 -2421000 -3021060 -2073926 -1004094
2108 -1004094 771918 1646061 1204498 1449099 1265063 854814 746185 464120 -41121
2099 -41121 -962121 -1379453 -1359776 -767766 -1154170 -833940 -386164 366192 1186710 1324607
2089 1324607 97676 -907072 -177279 -49914 431131 -63309 -1150345 -1314078 26660
2080 26660 549878 -144094 -342946 129002 1086365 1348165 1856426 3075540 4382988 4775607
2070 4775607 4123747 3515035 2706201 2192393 2371147 1985425 768445 628168 573875 -674373
2060 -674373 -1431986 -1271560 -299207 476472 -174548 -1876560 -3211046 -3651461 -3484795
2051 -3484795 -2215854 -648577 84829 616846 1334200 807290 -676430 -953852 -1071100
2042 -1071100 -1122483 -895587 -971266 -1248148 -696692 124323 170264 -930261 -2040959 -1999865
2032 -1999865 -1456721 -1035102 -1256319 -976457 128213 1136677 2062437 2379070 2632610
2023 2632610 2816846 2988890 3566680 3048592 2411291 2070477 1637852 1117091 1362749 1941819
2013 1941819 1608192 623222 -592045 -547046 984545 3095596 3314994 2576095 2265266
2004 2265266 1678055 317304 -577099 -483214 -487683 -443704 -388769 110214 256082 1045700
1994 1045700 896057 535020 783521 966900 854212 1402474 1929871 2566258 3328989 3130907
1984 3130907 3546313 3698448 3680122 4314407 4536516 3502310 1513412 521797 41902
1975 41902 -1042202 -1477667 -1240940 -1113069 -72811 317947 428000 712865 242184 -1061380
1965 -1061380 -2290460 -2376476 -1834050 -1445594 259742 1915016 1204757 385686 1070790
1956 1070790 1716525 1920163 1560346 1335493 1966204 2089928 1875066 643607 -1125619
1947 -1125619 -2875560 -3126677 -2160975 -1682157 -1887883 -816601 945557 671085 -438823
1938 -438823 -730986 27717 432983 179987 -450018 -1646157 -1903088 399927 2105889
1929 2105889 1730588 1182657 290014 -1776265 -2989578 -2835445 -1921676 -815241 462000
1920 462000 1298167 437391 -852720 -1597944 -2559393 -2301629 -1307629 -281568 962365
1911 962365 1648776 1497554 497744 -1291279 -2048353 -2355588 -1552537 -866038 -1320881 -581872
1901 -581872 1012584 1129486 1108761 2076008 2203483 1308014 534068 298797 -680621 -562999
1891 -562999 455929 910344 1504129 1278411 233449 319544 912611 946829 692355 906729
1881 906729 440192 -1172885 -2214807 -1288597 -673536 -693118 -343466 -245768 -729246 -322232
1871 -322232 -791761 -2211247 -3276644 -3782638 -2828432 -1286849 -51503 38868 497278
1862 497278 940859 806929 1374152 1946174 1911101 2050345 1926760 1157346 896 -1039489
1852 -1039489 -265209 -311587 -682849 -31225 438429 1163976 1259616 -287484 -1472321 -1392189
1842 -1392189 -557758 296817 978451 274014 -77814 407478 355810 1011716 1066381 862186
1832 862186 1151388 320799 476375 847534 617960 -210445 186066 878215 1610545 1866618
1822 1866618 2010454 1886380 962276 844414 1112617 1619206 3154008 3235176 3091145 3898352
1812 3898352 4445419 3482094 1936966 979474 -330862 -1358987 -1783919 -1814473 -1468495
1803 -1468495 -816945 -60011 628053 38245 269984 1329408 122138 -783028 -959835
1794 -959835 -888556 42565 873134 2421324 2355516 706858 -168716 -324004 -41731 11590
1784 11590 642136 1367386 908384 24908 -1367165 -1660032 -580352 271321 -273881 -1548772
1774 -1548772 -2403799 -2735280 -4001057 -3869277 -3503259 -3681931 -2546659 -528792 296116
1765 296116 951217 1120429 114197 -665463 -1072881 -1230317 -262735 650040 1149506 861671
1755 861671 519030 708958 953584 313210 -411109 -797375 -1398428 -1594984 -1811572 -1796354
1745 -1796354 -2213885 -2663634 -2239671 -2153750 -2733848 -3303758 -3726743 -3543444 -3177166 -3257568
1735 -3257568 -3042359 -2394194 -2256030 -2087174 -1290757 -556314 416172 586188 125159 -969905
1725 -969905 -1921458 -1899913 -1056229 -57860 197823 976316 1619477 1090840 177944 -305850
1715 -305850 -1029272 -1650278 -1438968 -1888396 -2132849 -1188403 -291123 -502499 -231436 -108937
1705 -108937 -487960 -966706 -473132 -137749 75179 657115 -404585 -881538 -1176676 -1483909
1695 -1483909 -1093610 -1260579 -736010 100412 92909 -754085 -1003884 176105 614008 329666
1685 329666 -707607 -1443269 -1578217 -1678862 -650616 1472492 1533601 -51073 -1332081
1676 -1332081 -1332833 -1513209 -2215239 -1965185 -1520920 -1492759 -1955084 -1861003 -1201528 -1153041 -1168918
1665 -1168918 -560636 146119 1199228 1982566 2096928 1102503 342707 37500 -122229
1656 -122229 -615187 -256794 886975 1553040 2248372 3266350 3452073 3322919 2764908
1647 2764908 2242042 2113103 940648 -407234 -650066 -153031 461089 1601830 2533735
1638 2533735 2041102 883325 -548617 -468552 -136926 -349862 -217956 -674835 284434
1629 284434 392729 -1071923 -1477623 -694580 -204618 326340 4223 -934335 -555125 -1066110
1619 -1066110 -2427256 -3042864 -2856886 -1974431 -342174 380607 429853 765714 243917
1610 243917 -647966 -683621 -1040313 -1975667 -1765302 -292357 2058676 2399676 1527358 -481974
1600 -481974 -972255 -1451449 -3326883 -4062307 -3519223 -1425640 163096 625 -635849
1591 -635849 -49698 647306 -500234 -2088079 -1924740 390909 2616453 4272272 4508885
1582 4508885 4630310 3825222 2041578 1347093 1071414 226813 -347176 -263347 115657 1053496
1572 1053496 628618 -997917 -936661 467251 195233 270599 1326844 1866451 619737
1563 619737 -786786 -1203766 -1446517 -1227942 -1323876 -828339 -1186608 -1786567 -2604028 -3562482
1553 -3562482 -3068637 -2109194 -2568289 -3499017 -2784615 -1909258 -1569429 -1553456 -2084942 -1107074
1543 -1107074 242889 7752 -439534 -484065 -935456 -1068523 -419959 -187952 -750080 -1756998
1533 -1756998 -1294644 465880 780885 675649 180600 -54950 1146566 2198098 2230200
1524 2230200 59394 -1333613 -1434812 -1600306 -1326748 -288424 1106724 947441 584451
1515 584451 1334808 684533 -709089 -1901193 -1285548 -89971 325749 178833 589602
1506 589602 204531 -904107 -1402252 -351617 1428942 1405162 612621 531278 16501 -557450
1496 -557450 171506 624482 908757 1013055 1116386 517782 -320084 -691831 36641 -72681
1486 -72681 219927 1349578 1491317 1131494 1272639 1985800 3089236 3440807 2468887 1252722
1476 1252722 746303 1179139 782471 776909 1266801 1745051 1235303 572642 702200 -2614
1466 -2614 398147 1100648 917168 1545423 2018522 2790890 4038744 4386248 4223056 2889763
1456 2889763 989267 512432 1337184 1557032 1138496 252596 -104815 -475761 439593
1447 439593 906572 -464592 -741453 222987 1018546 453477 127834 560885 21910 413377
1437 413377 1735425 2874133 2208470 298359 -396325 -1085668 -2387925 -2652849 -1784380
1428 -1784380 -1349726 -1288274 -1033684 45010 1491674 3088239 3914417 3863158 2921095
1419 2921095 1082304 618871 1310051 1640708 1735264 2387394 3402300 2922769 2118201
1410 2118201 861507 -218132 -173300 270106 12708 -130482 158256 873188 1976454
1401 1976454 2154586 1376530 897403 1346329 2188367 3486199 4678693 4369193 3981053
1392 3981053 2935723 2754308 3086018 1553833 -435655 -2509206 -3491343 -3130976 -1453711
1383 -1453711 569716 1201152 1032455 1350584 1883550 1771840 2204895 2635951 2893721
1374 2893721 2077310 1372064 1021424 28776 -1849814 -2139585 -1432591 -730931 -68083
1365 -68083 382169 476994 820875 1231902 1537324 1887432 1988309 1761523 2363786 2946239
1355 2946239 2039879 1383768 346398 -1145914 -1403184 -879584 54253 655971 -286185
1346 -286185 -1813300 -1813090 -1343276 -1275244 -1300720 -990196 61924 270803 437741 535301
1336 535301 672088 822475 763067 -42365 -734361 -1207257 -1508925 -2446895 -3382538 -3543230
1326 -3543230 -2555029 -1482374 -1308314 -1593701 -1114252 62357 1302477 1376868 1063793
1317 1063793 712291 -508816 -1289115 -1174915 -1545303 -2179487 -1848299 -1040324 -694248
1308 -694248 -701891 -1773769 -3270360 -3542802 -3599751 -3172497 -2522037 -2250723 -1189314 444192
1298 444192 1683413 2665848 2222905 970265 360145 1330741 2104414 2045521 1719259 1981377
1288 1981377 1905808 1685199 891493 210843 -218246 -805306 -1259267 -2045632 -2670132 -1909097
1278 -1909097 -304356 1279651 1369454 495816 125003 -355919 92346 1103303 2133981
1269 2133981 1709701 1028220 1498895 1921006 2004208 1927814 1292559 1843845 1948571 1343487
1259 1343487 726706 440418 980022 1318013 414990 -459143 -218151 344007 282750 926387
1249 926387 924644 318750 358954 1246900 1948148 2354020 1752485 -28012 -175956 555011
1239 555011 48314 -574021 7456 1328206 1167504 12593 240299 945988 2045558
1230 2045558 2449365 1770140 1100078 -1409315 -2874326 -2317970 -1986161 -2557721 -2902578
1221 -2902578 -2493215 -1800944 -428329 1443605 2352951 1894267 764038 -227632 -1147637
1212 -1147637 -1990159 -2462458 -1939673 -886120 -840186 -1019082 -258573 -115913 -1429555
1203 -1429555 -1689455 -980355 297508 1213084 423321 -286296 -339701 -1393393 -1643344
1194 -1643344 -1563254 -782875 880228 1473406 755579 374627 623734 659941 519725 41567
1184 41567 464760 -87956 -914310 -1645846 -3062677 -3412502 -3400513 -2202798 -774004 -553357
1174 -553357 -187302 148663 -530549 -1376811 -1837043 -1217237 -967440 -1069041 -710562 195993
1164 195993 920303 1652154 1736775 1008749 901696 669602 -289468 -845657 -1281266 -2154474
1154 -2154474 -2832900 -1958028 -584963 -391948 -222968 -943390 -1409614 -930651 -460305
1145 -460305 -231831 -333217 30932 910700 1874862 1747920 1049744 1245934 1177248 1582153
1135 1582153 1366148 399987 -824666 -1599594 -1078190 -147868 407197 1164780 154471
1126 154471 -978301 -51553 194939 52217 115716 277411 739976 1351378 1025546 1420079
1116 1420079 2208903 1806310 939228 -688354 -2269608 -1750869 -949274 -1310571 -2222122
1107 -2222122 -1922313 -1440410 -785211 509445 1901408 2839762 2262168 1360915 642197
1098 642197 -33864 -145487 101929 -975842 -2255902 -2346969 -1840544 -563910 812279
1089 812279 1036460 1000905 1525191 2003171 1425289 711778 1337466 1935461 1361021 199336
1079 199336 -257258 465802 1926061 2346888 1783871 721184 431214 201530 219242 1387
1069 1387 405132 818434 -48321 -1429320 -1354739 -112941 -739143 -1687987 -2268215 -2683454
1059 -2683454 -2553206 -2154185 -1658287 -1931294 -2607203 -2588915 -3549156 -3845834 -3183331 -2921227
1049 -2921227 -1517124 1186441 1716431 1314954 62729 -1390938 -2059924 -1837750 -45308
1040 -45308 1549866 1827172 1461655 979678 121712 -591017 -87681 570011 89531 -719452
1030 -719452 -568602 -707209 -2690268 -3753021 -3402940 -3244054 -2489528 -1398032 -1486682
1021 -1486682 -2399398 -2568783 -2281299 -1090756 -724093 -901912 -1292696 -2334992 -2883455
1012 -2883455 -2869581 -2478382 -1463657 -1188860 -2024386 -1931577 -989205 -592193 -795544 79894
1002 79894 -153406 -1546797 -2403497 -2054751 -536764 1175922 1468939 351455 174431
993 174431 -88499 -936283 -1011330 -23445 530157 893418 945732 927058 1582042 1857737
983 1857737 1876408 2591254 3443808 3699243 3939677 4172261 3225548 1371681 1585656 2603993
973 2603993 2682913 698932 -879329 -968266 -635545 -599097 -713197 -1203009 -912024 100253
963 100253 1519104 2656202 2613490 2527143 2824060 2280393 1124581 416048 -158284 -164326
953 -164326 -304457 -577152 -565780 844663 2047810 2316903 1967895 1676316 2470251 3341698
943 3341698 2662031 1481721 881335 204147 -1015489 -1782836 -1258702 -1156698 -810658
934 -810658 -154320 -600519 -1177520 -1565949 -579865 984591 2001625 2877634 2990908 1867411
924 1867411 855054 864735 916499 816279 1288787 1816974 1200849 282741 -852377 -1458517
914 -1458517 -1366745 -682083 -572292 -1021712 -1084403 -311897 261659 822568 -142800 -1131010
904 -1131010 -1084131 -1267149 -950430 -407272 31063 489802 1303184 1889430 1391853 833056
894 833056 1389325 1602128 1142112 749797 -374588 -870030 -732039 -730306 -769806 -1513437
884 -1513437 -1533016 -1423084 -1391097 -214116 1142944 375277 -1650877 -2428664 -2263072 -1157133
874 -1157133 958606 1681035 1162692 729590 199251 1147053 2224678 1482601 468002
865 468002 -328454 -758768 -1754682 -2144664 -1691458 -1776304 -1016790 -417199 -1219605 -2375532
855 -2375532 -2887437 -1825672 566888 2479800 2011915 1265828 2006220 1966969 1550962
846 1550962 1551782 2241097 2090561 1856664 2292667 2034117 1686368 954451 121098 886025
836 886025 2280295 2368747 2326164 1797359 1745367 1960355 1894216 1799123 1079173 521832 -105274
825 -105274 -598225 -639181 -1398741 -1897415 -1678999 -1036676 49751 970945 947465 1191606
815 1191606 29039 -1365787 -1622642 -1697854 -1318312 -1786889 -1594103 132543 1421386
806 1421386 2202737 2253338 1411653 1128509 790883 -397113 -1838810 -1713424 -893466 5072
796 5072 77052 463306 1540921 2821432 2489875 1535956 760784 -258639 46109 916796
786 916796 1087943 1145540 1186014 1381910 2099398 1844179 934854 328648 650040 -27522
776 -27522 -1278045 -1545961 -2477710 -4156067 -4952665 -4692166 -4215339 -2866402 -888550
767 -888550 160327 601339 302291 -1063259 -1846898 -1450621 -1101264 -979069 -807822 -630924
757 -630924 -619126 1051089 2544548 2068084 1741006 1133201 -420037 -724880 71131 296697
747 296697 360048 716866 1344807 1366601 907432 1393681 2128401 1422833 -221403 -625104
737 -625104 -652376 -1002922 -1744133 -956223 -290536 36810 -352778 -1308950 -1009591 -19175
727 -19175 -39821 -764171 -1333088 -1026635 330239 689183 -7196 -111627 409894 938734
717 938734 1351385 2451525 3850044 3909881 3250427 2872685 2836339 2455063 747906 408044
707 408044 1526215 1902240 756272 -583232 -792352 -244942 93797 661864 1817955
698 1817955 1672992 934029 138189 -360776 -1485745 -1668063 -1959663 -3247747 -3838836
689 -3838836 -3575201 -3161801 -3060105 -2526434 -1550559 -689151 -70805 -133000 281602 808276
679 808276 1163919 2388941 2307494 1430185 64777 -231733 299562 1063591 1281209 448001
669 448001 -149166 -562070 -261 425030 -495706 -1574207 -2135944 -517362 1389554
660 1389554 1367155 1380093 1567514 1410247 786717 156617 251071 827320 1596268 1770642
650 1770642 1375599 1556256 2888136 3281423 2338356 1343607 900773 1041708 657702 1533979
640 1533979 2530892 1596938 -291835 -1286518 -1017479 -91636 53530 117111 -354101 -1483264
630 -1483264 -1760805 -1669494 -2574781 -2933083 -1525124 -1621312 -2570137 -3114300 -2104348 -1216241
620 -1216241 -656468 38267 665444 1265369 1145035 1189050 1152201 1442343 1141210 1684506
610 1684506 2640060 2167833 1670205 247820 -700333 -1261265 -732662 263198 879251 1316237
600 1316237 799807 311470 -72305 -503706 -862747 -760365 -717486 -660528 -531468 167180
590 167180 226634 80015 140432 1060568 1779973 1308056 -146428 -926833 -420479 -67174
580 -67174 1348392 2082732 1981396 2028905 2388428 2257372 1138635 527456 243061 -493257
570 -493257 -1851323 -1507052 -103117 -340438 -786028 -1505766 -2224909 -1520289 -382354
561 -382354 -78802 316570 1034757 -230073 -1145372 -954649 -67995 138449 329131 -355303
551 -355303 -1445218 -1543654 -1550221 -1855215 -485639 606600 622476 -406479 -1180899 -1457770
541 -1457770 -369932 667840 306447 -47342 -130611 -1238287 -1906412 -1281168 1087634
532 1087634 3822844 4449543 3268054 2699079 1910108 1145168 -631061 -2407637 -3040064
523 -3040064 -3541626 -3079315 -2343415 -807057 328984 -997 -1277770 -1561395 -1326547
514 -1326547 -618660 10847 124876 -994055 -869389 781912 1438337 1113118 -77042
505 -77042 -489531 674504 1311337 1367311 1291250 567835 -673218 -1568542 -2397388 -2016209
495 -2016209 -459114 298690 57220 43672 -573733 -844465 -935786 -1264037 -560230 -148175
485 -148175 -135063 363486 1410268 1250171 -104634 -476654 -590586 -100344 298561 535551
475 535551 995560 797094 -106 -667046 -1200978 -1384268 -865198 -440426 456697 2052314
465 2052314 3686917 4417208 5224087 5244463 2870263 26794 -612486 877435 1365972
456 1365972 1343597 1999108 2797442 3470172 4072906 3658356 2197415 1519845 951352 1046067
446 1046067 1987635 2036776 1189726 851731 560836 -486040 -1002498 -1391132 -1145545 -303229
436 -303229 591227 341296 -1085963 -1994133 -1079810 -52899 -1050064 -2026045 -1742122 -2318743
426 -2318743 -2367489 -2143978 -1570886 -576323 122231 327867 -107870 -364022 -1202086 -2281787
416 -2281787 -2741283 -2147122 -1563931 -522704 984471 647316 158937 813941 1627258
407 1627258 1710471 1791231 1987869 2566950 2568936 2437938 2631161 2654827 1774294 886409 689745
396 689745 1212071 1569528 1239587 859251 1940898 3369448 3321354 2151960 595450
387 595450 -481884 -1182227 -946831 -528290 -1211625 -1394123 -344118 98473 650898 845729
377 845729 -49336 -1237833 -1224919 -776645 -223847 530941 968482 1366218 1814589 1154539
367 1154539 236879 1728426 2919886 2175319 1116224 825921 777121 572062 891268
358 891268 1349699 1337697 1914975 2920067 3206744 3695827 3799925 3673608 2637371 1215169
348 1215169 279519 -384871 -139190 343903 -286067 -2205956 -2524728 -1438645 -1207207
339 -1207207 -1509257 -474382 1080437 2132236 1544497 43346 -373018 998461 1853920
330 1853920 1865374 1264725 57535 -592701 -1163570 -1869865 -2660845 -2720781 -1762126 -697666
320 -697666 -1043471 -1491816 -1419553 -450923 -286279 -1254901 -1922164 -1106304 359510 13157
310 13157 -1948502 -2269657 -1303016 155182 -380970 -806929 -443777 -340265 -1409555 -2424811
300 -2424811 -2235622 -1506865 -486618 -106992 -167811 -130186 -669921 -553558 -509724 -1495491
290 -1495491 -1960612 -1591618 -931800 -59594 122403 -327794 -46857 241932 273206 530485
280 530485 445832 -185093 -301983 401296 928323 1187912 1693230 1941783 1883709 950756
270 950756 435735 -492585 -1025212 -1656327 -1655260 -276964 947995 966459 1089820 1248132
260 1248132 532594 -50656 -317958 -132316 241113 466186 216343 -62455 -91996 -29788
250 -29788 514238 795825 831048 200489 -282633 -382636 730009 1922197 1793306 1497296
240 1497296 2172217 2517888 2072474 1963634 2321136 2113046 1454341 1398063 1147642 840540
230 840540 473539 150667 837957 698765 -33161 -213796 -270957 -428106 -12682 29932
220 29932 165312 927443 575491 80234 752396 2283585 2595382 1380907 -81884 -764839
210 -764839 -605306 -480210 -535043 -473239 -146933 179356 475246 445501 -400298 -667998
200 -667998 -799360 -1732497 -2229082 -2591760 -2750481 -2015015 -1663372 -1867468 -2210963 -1654642
190 -1654642 -405745 482258 649527 389305 151891 587435 668024 -202230 -1262572 -1595361
180 -1595361 -748866 -751723 -1434127 -1156190 -865 1125293 1417882 1538400 1800666 1967330
170 1967330 1618392 473042 -1180149 -2212754 -1863884 -917542 86813 397535 69770
161 69770 -309389 -767155 -910050 -1462803 -1721486 -1174871 -140739 149980 195309 998717
151 998717 1952878 2906326 3515070 3743230 3298203 1974943 537346 8061 244951 365817
141 365817 824084 1913683 2624466 2211889 1795374 1589808 1420500 738151 112002 186859
131 186859 752381 1143773 1036265 964698 1308779 1571725 1928462 2263678 2017018 1410485
121 1410485 888273 887549 506783 1147730 950629 610058 1218658 598861 -428892 -761146
111 -761146 -1457017 -1854689 -1415598 -886580 -1193071 -1451799 -851570 222747 336321 132667
101 132667 12972 -813356 -362869 359454 512270 619483 548450 263988 161624 -195323
91 -195323 -436196 -549331 -741732 -496100 -644747 -875576 -709034 -219912 407543 543231
81 543231 461813 899194 2099877 2299857 1463166 1467892 1104759 -56142 -610734 -623743
71 -623743 -89727 227048 573126 1180806 918975 558057 351672 -250214 -1163894 -1501169
61 -1501169 -1802356 -2091840 -1696742 -919197 -600851 -991703 -980619 -962147 -878904 -695907
51 -695907 -166674 544086 888820 1965171 2792009 2443412 1747716 818850 94200 1098306
41 1098306 2167014 2243204 1464523 1057440 441065 -505423 -577782 -617707 -223657 392042
31 392042 1275586 1752257 1608456 642363 100721 -721748 -740418 144502 531771 200333
21 200333 -585376 -480034 319628 516383 -131285 -1066279 -1161636 -738070 -916759 -1516010
11 -1516010 -1261037 -237130 378111 -108225 -543221 -78045 900179 1760882 1470099 1350914
1 1350914 2125458
0 2125458
$$ Imaginary data points
##PAGE= N=2
##DATA TABLE= (X++(I..I)), XYDATA
32767 3101919 4288747 4729258 4255326 3275281 2086145 2168392 2413804 2819134 2960572
32758 2960572 2781386 2551619 2785853 3668913 4854983 5514261 4795834 3504639 2876817
32749 2876817 2895875 2900196 3035173 3052494 2691363 2641398 3087203 3565850 3767552 3917614
32739 3917614 4608801 4411125 3621430 3162091 2640593 1950665 2145124 3080052 3282727
32730 3282727 3474144 3307846 2146125 1277018 1434493 1736838 1869558 2143592 2388683
32721 2388683 2199169 1659919 1362724 2045645 2694591 2749663 2842505 2258811 2358624 3187236
32711 3187236 3112472 2702600 2166227 2180385 2241354 2347400 3167860 3525909 2777521 1944015
32701 1944015 1755762 2421153 3085907 3074788 2544678 2746324 3152498 3462564 3759702 4039238
32691 4039238 4356035 3838559 3622697 3751075 3700370 3650929 3975665 4438141 4951387 5069057
32681 5069057 4445111 4392176 4482266 3863681 2608509 2096070 2390960 2248876 2396497 2765213
32671 2765213 3401253 3474172 3685352 3853492 4344503 4352378 3925225 4036142 4618350 4423705
32661 4423705 3173381 2077208 1763467 2501755 3146385 2825128 2505186 2806682 3048343
32652 3048343 3281181 3456449 3543644 3913646 4074213 3913427 3245494 2951133 3801501 4448915
32642 4448915 4936529 5031966 5529320 5610106 5675167 5984361 5425499 4991428 5634092 6052485
32632 6052485 6154781 6190720 6080718 6391534 6165174 5513703 4761115 4332503 5172878 6019006
32622 6019006 5938788 6231449 7085504 7776988 8311353 9119954 9585185 9947295 10050571 9603164
32612 9603164 8397052 7310816 6844775 6869071 6996605 6937386 6433414 5905341 4694042
32603 4694042 3687564 4188395 5521965 5549257 4220273 3249317 3563209 4140822 4089475
32594 4089475 4510123 5434508 5400011 5737908 6559516 6008703 4893506 4871699 5348744 5812104
32584 5812104 6015776 5196614 4641457 4440952 3941297 3984728 4620078 5321106 5504767 5228034
32574 5228034 4884536 4184234 3891477 4310019 4936596 4850689 4747799 4694439 4839620 4957818
32564 4957818 5761175 6369344 6063294 5417493 5251629 6039749 6951349 7581062 8399145
32555 8399145 7829923 6527661 6101573 6396871 6512162 6218297 5911766 5748293 5058524
32546 5058524 4588454 5538321 6772659 6318497 5555213 5518199 6162110 7734293 8337694
32537 8337694 8049078 7642902 7936008 7747805 6692880 6110795 6281476 6729228 6492631
32528 6492631 6104211 6572115 6828076 6406237 6813142 8187860 9227113 9739119 9348633
32519 9348633 8821706 7507551 5731474 5514221 6372340 7357414 7757071 7693085 6913770
32510 6913770 6612736 6695310 6732194 7137414 7704122 7361316 6159693 6226125 6908306 7057196
32500 7057196 8433492 10076146 10305061 10366486 10248068 9227662 7551667 6742272 7557135
32491 7557135 8507412 6886269 5483118 5538074 5958289 5932127 4780297 3221773 2728536
32482 2728536 4406734 6593572 8262813 9335504 10183480 10914845 10846700 10577245 11093584
32473 11093584 11337857 10869892 10338762 10478094 10211104 9681952 9382827 9679030 10100136
32464 10100136 9392492 8811347 8889605 8546233 7427891 7524679 8184735 8600685 9346614
32455 9346614 8838376 7790484 6577730 5715701 5655831 5874553 5973175 6366608 6688245
32446 6688245 7079728 7572232 7538384 6771359 6748777 7780322 8803349 9950314 9267325
32437 9267325 8257338 8434105 8554005 8411241 9482456 10259070 9255865 8170142 8351208
32428 8351208 9089108 9311002 8595530 7877062 8734053 8474627 7781166 8511305 8613719
32419 8613719 8287745 8097605 8117759 7337116 6201955 5811155 6039292 6662605 6704984 6954779
32409 6954779 7361057 6952427 6335323 6161755 5477553 5657310 6642972 7689940 7564745
32400 7564745 7666790 8060496 7325257 6843510 7124132 7236667 7319673 7675522 8397910 10177610
32390 10177610 10862295 9865609 8582623 8119783 7225669 6333133 6969429 8089878 8909507
32381 8909507 8747817 7225266 5305186 4889385 5269448 5519974 6435900 6954561 6928293
32372 6928293 6274533 6449510 7863701 8538647 8814691 9443293 10116331 9450986 7669875
32363 7669875 6929862 7151445 6972091 7210816 7814343 7949873 8707091 9045476 8507292
32354 8507292 8313003 8487682 8005750 7919770 8157498 8839237 8806605 8229345 8396439 9055874
32344 9055874 9334218 9209004 8502940 7224437 6402396 6437248 6046531 5552868 5449500
32335 5449500 6134460 7297803 7269332 6732035 5955243 6995058 8905666 9542933 9761639
32326 9761639 9984349 9975546 10032010 9886657 9029568 8287860 7887407 7469375 7547003 7626608
32316 7626608 8233311 8230526 8332943 8355597 7812850 8293499 9628223 10378559 10370357 11238069
32306 11238069 11499815 10512130 9621788 9635146 9615237 9658235 9938090 10212696 10340831 10593763
32296 10593763 10116391 9296048 8128319 8142753 9665323 10021153 10680463 10414029 9741764
32287 9741764 9504811 7480889 5242635 4900994 5941464 6853842 6804210 7076702 7614931
32278 7614931 8634367 8750204 7375675 5839766 5569881 6735044 9276057 11314728
32270 11314728 10276725 9086555 8477462 8117507 8731306 10210476 10203778 9734511 8626143
32261 8626143 7090556 5930055 6267949 7253764 6860466 6726641 7229714 7386121 7258335
32252 7258335 6898450 6881372 7343374 6681242 5051262 4219587 4755632 5838790 5781304
32243 5781304 5229564 5220910 4636868 3700069 3252336 3290120 4420740 5520148 6347078 6379273
32233 6379273 5909267 5878793 5369304 5494885 7305481 7923395 8191819 8654763 8242678
32224 8242678 7445563 8353664 8643732 8612303 9014993 8929353 8757734 8236917 8829246 9872312
32214 9872312 9880960 8621408 7447991 7370368 8173622 8976502 8892329 7602357 6692464 6717343
32204 6717343 6377845 6823770 7552421 8037056 8781620 8030677 7729064 8179507 8343252
32195 8343252 7595786 6684034 6044573 6633548 7058199 7660213 8056407 7275566 6477739
32186 6477739 8218849 10242223 10424246 9196415 8769615 8647213 8365964 8101431 7572657
32177 7572657 7891931 8713058 8775151 8610852 9617323 10479969 10782675 10360812 10551261
32168 10551261 11013418 11165693 9516149 7739806 7793545 8097751 7695315 7259639 8059618
32159 8059618 9029066 9526301 8581334 8814728 8941277 7876064 7041918 7116673 7794127
32150 7794127 7497620 6827302 6801879 8389148 10192830 12543436 14011773 13487220 13018405
32141 13018405 12707038 12126313 11497012 10554231 9516809 9539841 9157980 8775285 9382317
32132 9382317 10198320 9098550 7900131 7167890 6416775 6447955 5409720 4699990 4791275
32123 4791275 6616843 9891718 10787180 9609229 8305495 7247536 6941104 7170142 8152184
32114 8152184 10068360 10166747 9419344 8929244 9018677 9426969 9942468 10727724 10791826 10738752
$$ [...]
##END NTUPLES=NMR SPECTRUM
##END=
