##TITLE=C13_SR3_OMe
 CDCl3, 24150 sc

 23.12.2019
##JCAMPDX= 6.0         $$ Bruker NMR JCAMP-DX V2.0
##DATA TYPE= NMR SPECTRUM
##DATA CLASS= NTUPLES
##ORIGIN= UXNMR, Bruker Analytische Messtechnik GmbH
##OWNER= root
$$ XWIN-NMR		Version 3.5
$$ Tue Dec 24 15:34:23 2019 Russian Standard Time (UT+4h)  she@DPX200
##.OBSERVE FREQUENCY= 50.327896
##.OBSERVE NUCLEUS= ^13C
##.ACQUISITION MODE= SIMULTANEOUS
##.ACQUISITION SCHEME= undefined
##.AVERAGES= 24152
##.DIGITISER RES= 17
##SPECTROMETER/DATA SYSTEM= spect
##.PULSE SEQUENCE= zgpg30
##.SOLVENT NAME= CDCl3
##.SHIFT REFERENCE= (INTERNAL, CDCl3, 0, 222.624)
##AUDIT TRAIL= $$ (NUMBER, WHEN, WHO, WHERE, WHAT)
$$ ##TITLE= Audit trail, XWIN-NMR		Version 3.5
$$ ##JCAMPDX= 5.01
$$ ##ORIGIN= Bruker BioSpin GmbH
$$ ##OWNER= she
$$ F:/spectra/data/she/nmr/c13/1/pdata/1/auditp.txt
$$ ##AUDIT TRAIL=  $$ (NUMBER, WHEN, WHO, WHERE, WHAT)
(   1,<2019-12-24 15:31:56.96 +0400>,<she>,<DPX200>,
      <created by zg, POWCHK disabled, PULCHK disabled
       terminated by command 'halt'
       configuration hash MD5:
       00 E9 B6 7A A2 85 ED C7 34 08 36 98 17 FE 4E 26
       data hash MD5: 32K
       C2 B6 AF 4D FD 3D D2 B8 ED 4F BE 5F D0 9D 98 56>)
(   2,<2019-12-24 15:32:01.71 +0400>,<she>,<DPX200>,
      <Start of raw data processing
       efp BC_mod = 2 LB = 1 FT_mod = 6 PKNL = 1 PHC0 = -213.271 PHC1 = -0.1936188 SI = 32K 
       data hash MD5: 32K
       28 AA 6A BE F4 E9 13 E4 F3 DB 5C BF D8 3C C7 F7>)
(   3,<2019-12-24 15:32:18.45 +0400>,<she>,<DPX200>,
      <pk PHC0 = 7.345392 PHC1 = 0 
       data hash MD5: 32K
       B1 6A 81 F8 C6 25 60 77 1A 0E E1 51 5C 1F D0 CA>)
(   4,<2019-12-24 15:32:21.35 +0400>,<she>,<DPX200>,
      <abs ABSG = 5 
       data hash MD5: 32K
       86 E4 F4 99 19 0F 4D 25 BB 54 72 C6 3E 3A 04 57>)
(   5,<2019-12-24 15:32:48.89 +0400>,<she>,<DPX200>,
      <pk PHC0 = -21.95144 PHC1 = 34.2 
       data hash MD5: 32K
       5B 83 99 8A EF F7 0E 32 42 66 00 1F 31 46 76 95>)
(   6,<2019-12-24 15:32:51.93 +0400>,<she>,<DPX200>,
      <abs ABSG = 5 
       data hash MD5: 32K
       14 99 4E 9C 70 D9 74 1F A9 15 68 A0 19 F2 B1 00>)
(   7,<2019-12-24 15:33:23.45 +0400>,<she>,<DPX200>,
      <pk PHC0 = 0.9566998 PHC1 = -0.6000017 
       data hash MD5: 32K
       32 FA 3A D7 6A BD 5F 9B 1B 5E 1F 69 47 DE D3 45>)
(   8,<2019-12-24 15:33:26.95 +0400>,<she>,<DPX200>,
      <abs ABSG = 5 
       data hash MD5: 32K
       E6 45 08 0A 36 D2 1D 55 5F B7 1A 7A 04 01 74 86>)
$$ ##END=
$$ 
$$ hash MD5
$$ 35 2D 4F AA 49 66 A1 05 BE 85 C3 BB 32 CB D5 53
##$RELAX= 
##$RELAX= 
##$RELAX= 
##$RELAX= 
##$RELAX= 
##$RELAX= 
##$RELAX= 
##$RELAX= 
$$ Bruker specific parameters
$$ --------------------------
##$DU= <F:/spectra>
##$EXPNO= 1
##$NAME= <c13>
##$PROCNO= 1
##$TYPE= <nmr>
##$USER= <she>
##$AMP= (0..31)
100 100 100 100 100 100 100 100 100 100 100 100 100 100 100 100 100 100 
100 100 100 100 100 100 100 100 100 100 100 100 100 100 
##$AQSEQ= 0
##$AQ_mod= 1
##$AUNM= <au_zg>
##$AUTOPOS= <>
##$BF1= 50.322709
$$ [...]
##$SUBNAM4= <"">
##$SUBNAM5= <"">
##$SUBNAM6= <"">
##$SUBNAM7= <"">
##$SUBNAM8= <"">
##$SUBNAM9= <"">
##$SW= 239.972175391363
##$SWIBOX= (0..15)
0 1 3 0 0 0 0 0 0 0 0 0 0 0 0 0 
##$SW_h= 12077.2946859903
##$TD= 32768
##$TD0= 1
##$TE= 0
##$TE2= 300
##$TE3= 300
##$TEG= 300
##$TL= (0..7)
120 120 120 120 120 120 120 120 
##$TP= (0..7)
150 150 150 150 150 150 150 150 
##$TP07= 0
##$TPNAME0= <>
##$TPNAME1= <>
##$TPNAME2= <>
##$TPNAME3= <>
##$TPNAME4= <>
##$TPNAME5= <>
##$TPNAME6= <>
##$TPNAME7= <>
##$TPOAL= (0..7)
0.5 0.5 0.5 0.5 0.5 0.5 0.5 0.5 
##$TPOFFS= (0..7)
0 0 0 0 0 0 0 0 
##$TUNHIN= 0
##$TUNHOUT= 0
##$TUNXOUT= 0
##$USERA1= <user>
##$USERA2= <user>
##$USERA3= <user>
##$USERA4= <user>
##$USERA5= <user>
##$V9= 5
##$VALIST= <valist>
##$VCLIST= <CCCCCCCCCCCCCCC>
##$VD= 0
##$VDLIST= <DDDDDDDDDDDDDDD>
##$VPLIST= <PPPPPPPPPPPPPPP>
##$VTLIST= <TTTTTTTTTTTTTTT>
##$WBST= 1024
##$WBSW= 4
##$XGAIN= (0..3)
0 0 0 0 
##$XL= 0
##$YL= 0
##$YMAX_a= 59935582
##$YMIN_a= -165487871
##$ZGOPTNS= <>
##$ZL1= 120
##$ZL2= 120
##$ZL3= 120
##$ZL4= 120
##$ABSF1= 222.624
##$ABSF2= -17.3728
##$ABSG= 5
##$ABSL= 3
##$ALPHA= 0
##$AQORDER= 0
##$ASSFAC= 0
##$ASSFACI= 0
##$ASSFACX= 0
##$ASSWID= 0
##$AUNMP= <proc_1d>
##$AZFE= 0.1
##$AZFW= 0.5
##$BCFW= 0
##$BC_mod= 2
##$BYTORDP= 0
##$COROFFS= 0
##$CY= -3
##$DATMOD= 1
##$DC= 0
##$DFILT= <>
##$DTYPP= 0
##$F1P= 0
##$F2P= 0
##$FCOR= 0.5
##$FTSIZE= 32768
##$FT_mod= 6
##$GAMMA= 0
##$GB= 0
##$INTBC= 1
##$INTSCL= 4.134877e-10
##$ISEN= 128
##$LB= 1
##$LEV0= 0
##$LPBIN= 0
##$MAXI= 10000
##$MC2= 0
##$MEAN= 0
##$ME_mod= 0
##$MI= 0.1934396
##$NCOEF= 0
##$NC_proc= 3
##$NLEV= 6
##$NOISF1= 120.0001
##$NOISF2= 80.00006
##$NSP= 0
##$NTH_PI= 0
##$NZP= 0
##$OFFSET= 222.624
##$PC= 1.4
##$PHC0= -226.9203
##$PHC1= 33.40638
##$PH_mod= 1
##$PKNL= yes
##$PPARMOD= 0
##$PSCAL= 0
##$PSIGN= 0
##$REVERSE= no
##$SF= 50.3227315989248
##$SI= 32768
##$SIGF1= 140
##$SIGF2= 120
##$SINO= 11.81781
##$SIOLD= 32768
##$SREGLST= <13C.CDCl3>
##$SSB= 0
##$STSI= 32768
##$STSR= 0
##$SW_p= 12077.2946859903
##$SYMM= 0
##$S_DEV= 0
##$TDeff= 32768
##$TDoff= 0
##$TI= <>
##$TILT= no
##$TM1= 0
##$TM2= 0
##$TOPLEV= 0
##$USERP1= <user>
##$USERP2= <user>
##$USERP3= <user>
##$USERP4= <user>
##$USERP5= <user>
##$WDW= 1
##$XDIM= 32768
##$YMAX_p= 260350680
##$YMIN_p= -7871953
$$ End of Bruker specific parameters
$$ ---------------------------------
##NTUPLES= NMR SPECTRUM
##VAR_NAME=  FREQUENCY,     SPECTRUM/REAL,   SPECTRUM/IMAG
##SYMBOL=    X,             R,               I
##VAR_TYPE=  INDEPENDENT,   DEPENDENT,       DEPENDENT
##VAR_FORM=  AFFN,          ASDF,            ASDF
##VAR_DIM=   32768,         32768,           32768
##UNITS=     HZ,            ARBITRARY UNITS, ARBITRARY UNITS
##FACTOR=    0.368581032318806, 1,           1
##FIRST=     11203.0474431902, 0,            0
##LAST=      -874.247242800138, 0,           0
##MIN=       -874.247242800138, -7871953,    0
##MAX=       11203.0474431902, 260350680,    0
$$ Real data points
##PAGE= N=1
##DATA TABLE= (X++(R..R)), XYDATA
$$ [...]
15959h92223N3364K93285J4052r2768K5061k6575N8081J29248K05756J442k98536
$$ -892223 -838859 -545574 -531522 -624290 -599229 -625804 -567723 -438475 -232719 -231277 -529813
15948e29813r4168L13534J22683k3999k37279m15835L7653L56183M51224M70097
$$ -529813 -623981 -310447 -187764 -211763 -449042 -864877 -827224 -471041 -19817 450280
15938D50280J07819j97799j30634L056o9313j83954l2772J32907K7195P6276M22968
$$ 450280 558099 360300 229666 232722 163409 -20545 -53317 79590 106785 183061 606029
15927F06029N5319k28284n0122p6382p0917R5931O8488J04436O3166n8185o6898
$$ 606029 661348 433064 382942 306560 235643 331574 400062 504498 567664 509479 442581
15916D42581n9735l32970l50953Q8140K40378N1658j09245N3396K25993K86793
$$ 442581 382846 49876 -301077 -212937 27441 79099 -30146 23250 249243 536036
15906E36036p0442j48802M997J61612J67182m4310k90712j17464o3944Q033N8432
$$ 536036 465594 316792 321789 483401 650583 606273 315561 198097 134153 142186 200618
15895B00618J19387N8327j97499l29575k72172J04737L7163L1998J93510J29008
$$ 200618 320005 378332 180833 -148742 -420914 -316177 -279014 -247016 -53506 75502
15885G5502O5091j02623k42311j39445O4954O1889Q3980K13648K15757j18084
$$ 75502 140593 37970 -204341 -343786 -278832 -216943 -132963 80685 296442 178358
15875A78358m56170j52716J00380J8609K0197J15098Q7241j43215m5493J10572
$$ 178358 -277812 -430528 -330148 -311539 -291342 -176244 -89003 -232218 -277711 -167139
15865a67139m0035j85232q8711K02163N1531r7199J3273P3956M8221J93907K26755
$$ -167139 -207174 -392406 -481117 -278954 -227423 -324622 -311349 -237393 -189172 4735 231490
15854B31490J1094o4873J04175J52432k02810l17987q9759J0969J43320m5870
$$ 231490 242584 177711 281886 434318 231508 -86479 -176238 -165269 -21949 -67819
15844f7819k87363k58273k46933j72645J20842K28542J30085k6504q929R8967
$$ -67819 -355182 -613455 -860388 -1033033 -912191 -683649 -553564 -580068 -588997 -490030
15834d90030j02440O974J94322J13329J86530O6206K57736K89190R9444j21184
$$ -490030 -592470 -585496 -391174 -277845 -91315 -25109 232627 521817 621261 500077
15824E00077k32254k69074l5930K7582o6154l6432o5008j02219j05830Q4779K0261
$$ 500077 267823 -1251 -37181 -9599 -75753 -112185 -177193 -279412 -385242 -300463 -280202
15813b80202j02902R6422J9823j74778l592J23167N6860j19904j97253N1949K67937
$$ -280202 -383104 -286682 -266859 -441637 -445229 -322062 -265202 -385106 -582359 -530410 -262473
15802b62473l8053j95083J33748K05846L8069R4005k8325j71724L8217p2630j23128
$$ -262473 -300526 -495609 -361861 -156015 -117946 -23941 -52266 -223990 -185773 -258403 -381531
15791c81531J54583N8121M384M6917r6315p6054R9615K5290K42982J03004k18749
$$ -381531 -226948 -168827 -164443 -117526 -213841 -289895 -190280 -164990 77992 180996 -37753
15780c7753m9800k3707r4428J8009O7098J97966J48230q0244k01806q8302q6599
$$ -37753 -87553 -111260 -205688 -187679 -120581 77385 225615 145371 -56435 -144737 -231336
15769b31336L6212J577m0142J48041J15540J21866J36991j5071j38583m8303Q0587
$$ -231336 -195124 -193547 -233689 -85648 29892 151758 288749 273678 135095 86792 167379
15758A67379j49442j61349O2425m6488J3047N4127k1891l0793j49129R0209K80227
$$ 167379 17937 -143412 -80987 -127475 -114428 -60301 -82192 -112985 -262114 -171905 108322
15747A08322p4446k37146k8455L34161J35673j38561k01556J78385M19558K24066
$$ 108322 33876 -203270 -231725 102436 238109 99548 -102008 76377 495935 720001
15737G20001M1702j18270r1321j51596k25686j54811j003J81556N0678J8892J59015
$$ 720001 761703 643433 552112 400516 174830 20019 19016 200572 251250 270142 429157
15726D29157J9162k08297k85041m1515q2113q6503p1921k65779j18248Q0231M7427
$$ 429157 448319 240022 -45019 -86534 -168647 -255150 -327071 -592850 -711098 -630867 -583440
15715e83440R0063K08367K4019R8151K67086K34381J43722l1746j81019J46256
$$ -583440 -493377 -285010 -260991 -162840 104246 338627 482349 450603 269584 415840
15705D15840J60945J00011K68742K20726r1890l62861l12389l66720j32116J38431
$$ 415840 576785 676796 945538 1166264 1074374 711513 399124 32404 -99712 38719
15695C8719J04268K2692L715j45804l9872j56164o6885K44293J14130j42810R436
$$ 38719 142987 165679 169394 23590 -16282 -172446 -239331 4962 119092 -23718 -14282
15684a4282J26851N5243o0688j36734j17096J01042P2625L6443J06275R7617o6711
$$ -14282 112569 167812 107124 -29610 -146706 -45664 26961 63404 169679 267296 200585
15673B00585j87984j22961j01464k57117q0840K10784K27700K25374J29630l55985
$$ 200585 12601 -110360 -211824 -468941 -549781 -338997 -111297 114077 243707 -112278
15663a12278n05256k07855K8149J5751J72963Q5114p742j49742K642J29368K11439
$$ -112278 -617534 -825389 -797240 -781489 -608526 -523412 -531154 -680896 -678254 -548886 -337447
15652c37447q5820j15493J94857J31384q1048k71554j87913K08008K16143L447
$$ -337447 -423267 -538760 -343903 -212519 -293567 -565121 -753034 -545026 -328883 -325436
15642c25436j17142M2799J23594J31011P5788O6373J43786Q6473J75536M3620
$$ -325436 -442578 -399779 -276185 -145174 -69386 -3013 140773 227246 402782 446402
15632D46402q3080r8782n9762r9142j76441j20158j44396n324J99010K44580K8411
$$ 446402 363322 264540 204778 105636 -70805 -190963 -335359 -340683 -141673 102907 131318
15621A31318j64274k63767r7729K24293O040k24793k18734j09630Q2339K11537
$$ 131318 -32956 -296723 -394452 -170159 -164119 -388912 -607646 -717276 -634937 -423400
15611d23400J05225j58939n3848J68845J47769M4245j87367n9904M5714L6563
$$ -423400 -318175 -477114 -530962 -362117 -214348 -170103 -357470 -417374 -371660 -335097
15601c35097l2166p7537J08989K71798L38587K99382J00653k77425k74789O4150
$$ -335097 -367263 -444800 -335811 -64013 274574 573956 674609 397184 122395 186545
15591A86545J15443j12876l8502O7752j52194k46409k6515j49563l4343N7636
$$ 186545 301988 189112 150610 218362 66168 -180241 -206756 -356319 -390662 -333026
15581c33026j64502k24076P6861J08679j87075P3275l573j98840J4341J00791
$$ -333026 -497528 -721604 -644743 -536064 -723139 -649864 -653437 -852277 -837936 -737145
15571g37145p8956k1738k5623j01755k7877K88982K08578n440j593J29304O2688
$$ -737145 -816101 -837839 -863462 -965217 -993094 -704112 -495534 -500974 -502567 -373263 -310575
15560c10575K42600K30264N0346j60324j73282j73702m4956J48874K6474J07489
$$ -310575 -67975 162289 212635 52311 -120971 -294673 -339629 -190755 -164281 -56792
15550e6792L09093j61397k10393j81423o8810K898n1516j16855o4801J8027r8583
$$ -56792 252301 90904 -119489 -300912 -369722 -366824 -418340 -535195 -599996 -581969 -680552
15539f80552j22212J93323J35545L1719p3700K05832M07765K87689k7338j88595
$$ -680552 -802764 -609441 -473896 -442177 -515877 -310045 97720 385409 358071 169476
15529A69476j9024R8681l4011k08569k34084J1702L9223p949j20221k83575j29343
$$ 169476 150452 249133 215122 6553 -227531 -215829 -176606 -184555 -304776 -588351 -717694
15518g17694K99165K57593P4012J01129J32834J74805M3959k3190k07933j77274
$$ -717694 -418529 -160936 -86924 14205 147039 321844 365803 342613 134680 -42594
15508d2594o182m5288o1155M8050O9415O3646n4133j49008K3666J20123J11377
$$ -42594 -48776 -94064 -155219 -107169 -37754 25892 -28241 -177249 -153583 -33460 77917
15497G7917k4472o9637r0158J04000M903r2692J16027J06534R723L8108N5670
$$ 77917 53445 -16192 -106350 -2350 2553 -90139 25888 132422 142145 180253 235923
15486B35923k1017N72P6385j04504j36153j11491O6624J40629O8119m6720j72337
$$ 235923 214906 215478 291863 187359 51206 -60285 6339 146968 215087 168367 -3970
15475c970j8462K23007Q244o375K6368l7263j78685j32276J08720O2423J29413
$$ -3970 -22432 200575 208819 202444 228812 191549 12864 -119412 -10692 51731 181144
15464A81144M2384J2472j7766P4479m1151k00915j51078J82686L85393J63639
$$ 181144 223528 236000 218234 292713 251562 50647 -100431 82255 467648 631287
15454F31287J00778k5459k09947m11472l74123j27480r7457N4984J78316N6805
$$ 631287 732065 706606 496659 85187 -288936 -416416 -513873 -458889 -280573 -223768
15444b23768j7485k8235l3147R9751J7084K98450J75695k5786j41726L9199r9849
$$ -223768 -241253 -269488 -302635 -202884 -185800 112650 288345 262559 120833 160032 60183
15433F0183l39589j47086r3351j5384J59360J8145j64293l4697o8200K07767L20172
$$ 60183 -279406 -426492 -519843 -535227 -375867 -357722 -522015 -556712 -624912 -417145 -96973
15422i6973J48136j0193m7789P531Q7243Q4100k3196r9233O5101J10692k00749
$$ -96973 51163 40970 -6819 712 87955 172055 148859 49626 114727 225419 24670
15411B4670k99345j79602n3240J86017R7096k81968k33048J55921L92285K34239
$$ 24670 -274675 -454277 -507517 -321500 -224404 -506372 -739420 -583499 -191214 43025
15401D3025q5507k5025K89289J82025j21723j77543r1005r7629p5224o4317J35918
$$ 43025 -42482 -67507 221782 403807 282084 104541 13536 -84093 -159317 -223634 -87716
15390h7716J82242n1674r2865L82j52531j26930n2251q9168p9954K81652K28395
$$ -87716 94526 42852 -50013 -49631 -202162 -329092 -381343 -470511 -550465 -268813 -40418
15379d0418k5061k69232k52584O0111J90391K33279J39648k37906r4918J93806
$$ -40418 -65479 -334711 -587295 -527184 -336793 -103514 36134 -201772 -296690 -102884
15369a02884J84787R6845o4472N351J33k36142k07328r1127M6626K16844K70069
$$ -102884 81903 178748 114276 119627 119760 -116382 -323710 -414837 -368211 -151367 118702
15358A18702k3649k75179k75159J2416k6349m7519l876J22762K52552J00032m0010
$$ 118702 95053 -180126 -455285 -442869 -469218 -516737 -520613 -397851 -145299 -45267 -85277
15347h5277o3098j22164J77J69035L2249m4797J24596J95999L766k10160N0664
$$ -85277 -148375 -270539 -270362 -101327 -69078 -113875 10721 206720 210486 326 50990
15336E0990K36191o9399k31421K6294J35715o1429o5062r218R2141J27544O9783
$$ 50990 287181 217782 -13639 12655 148370 86941 21879 12661 104802 232346 302129
15325C02129o6708n7597K9000l3813n2027O8480M951j25687l2048O3575M6785
$$ 302129 235421 177824 206824 173011 120984 189464 194415 68728 36680 100255 147040
15314A47040J5550J7504m6800q0231j20010r2689J54211P8799j15304p9629Q086
$$ 147040 162590 180094 133294 53063 -66947 -159636 -5425 73374 -41930 -121559 -113473
15303a13473J01484N3965k37902r2282L2607k65120J6829J97916J45920R8086
$$ -113473 -11989 41976 -195926 -288208 -255601 -520721 -503892 -305976 -160056 -61970
15293f1970j03484j68321j2005K6122J63304L18890K44612J95770Q2700j28976
$$ -61970 -165454 -333775 -345780 -319658 -156354 162536 407148 602918 685618 556642
15283E56642j42524p2267K3174l00337k06431k3194j67423n3932O0771k28394
$$ 556642 414118 341851 365025 64688 -141743 -164937 -332360 -386292 -325521 -553915
15273e53915R3166L00429O7020J85798Q9847k8968l18595m71385j82750L3266
$$ -553915 -460749 -160320 -93300 92498 182345 153377 -165218 -636603 -819353 -786087
15263g86087M8041J72166L13043L52570K17106j23164m78509k55587k879P6484
$$ -786087 -738046 -565880 -252837 99733 316839 193675 -284834 -540421 -543300 -466816
15253d66816J73613O9239P5354O5770J2030j07499k6269R0653J44133J27347N94
$$ -466816 -293203 -223964 -148610 -82840 -70810 -178309 -204578 -113925 30208 157555 158149
15242A58149L4841J8148N3061r3445k87897r8453j56155j44308R0778J83155j38026
$$ 158149 192990 211138 264199 170754 -117143 -215596 -371751 -516059 -425281 -242126 -380152
15231c80152j31314K37611K43067K5202k59390k03101j61925N7135L4904P738
$$ -380152 -511466 -273855 -30788 -5586 -264976 -468077 -630002 -572867 -537963 -530225
15221e30225Q9958N8518j05412j64479j5848M4038J23866L63484J03254Q0233
$$ -530225 -440267 -381749 -487161 -651640 -667488 -623450 -499584 -136100 -32846 47387
15211D7387m2727l17858l26348k6478J64098J46815K9463m6272J20102J86028
$$ 47387 4660 -313198 -639546 -666024 -501926 -355111 -325648 -371920 -251818 -65790
15201f5790N4778P1818M1226K4645M3551Q6665j95336l99429k44624M1788L9343
$$ -65790 -11012 60806 102032 126677 170228 256893 61557 -337872 -582496 -540708 -501365
15190e01365R9489K19634J38647j05693r6898K4870j56427j93712K14460L98523
$$ -501365 -401876 -182242 -43595 -149288 -246186 -221316 -377743 -571455 -356995 41528
15180D1528J01891j2872L2510R2944K9646j89126l32598J5728L51356K36022j30804
$$ 41528 143419 130547 163057 256001 285647 96521 -236077 -220349 131007 367029 236225
15169B36225j12296M5821k32063j51010L5512j41826l61766l26603j06596R2435
$$ 236225 123929 169750 -62313 -213323 -177811 -319637 -681403 -1008006 -1114602 -1022167
15159a022167J52405J63428K56541K43675Q3146k7779Q912J11145J49138L1146
$$ -1022167 -869762 -706334 -449793 -206118 -122972 -150751 -141839 -30694 118444 149590
15149A49590r405l4720j35738K294J68907J12060O2361L1038j77408k56661j40431
$$ 149590 140185 105465 -30273 -27979 140928 252988 315349 346387 168979 -87682 -228113
15138b28113P4512J8159j48478L0947K45320L11472j98602k67682K2006M0797
$$ -228113 -153601 -135442 -283920 -252973 -7653 303819 105217 -162465 -140459 -99662
15128i9662O8135L5280j63501l34438j69472L8492O4266J10389L8777j5619O93
$$ -99662 -31527 3753 -159748 -494186 -663658 -625166 -560900 -450511 -411734 -427353 -426660
15117d26660L0269J08599K96058J00536j64346q9906J77429K6224q2695K3834
$$ -426660 -396391 -287792 8266 108802 -55544 -145450 31979 58203 -24492 -658
15107f58O9790J27960o3945j11283k10671k26388J41431J01821j12651j38740
$$ -658 69132 197092 133147 21864 -188807 -415195 -273764 -171943 -284594 -423334
15097d23334j4401K21979J73770J50564o1022o0777J92543Q2515p0635k70579
$$ -423334 -437735 -215756 -41986 108578 47556 -13221 179322 261837 191202 -79377
15087g9377m28766j34725n82r2224j0840P4347J49085L8780j72215k63215k8400
$$ -79377 -508143 -642868 -643450 -735674 -746514 -672167 -523082 -484302 -656517 -919732 -948132
15076i48132O0132K81134M05626J97028j46947j19776J33415K06787J65396J15543
$$ -948132 -888000 -606866 -201240 -4212 -151159 -270935 -137520 69267 234663 350206
15066C50206j36116j67607J5512J19040j6656j50425j38078k19000R941L4252
$$ 350206 214090 46483 61995 181035 164379 13954 -124124 -343124 -333183 -298931
15056b98931O7722J31693J4144K7412M5775m0953m7632R9466K29373j7414j53004
$$ -298931 -231209 -99516 -85372 -57960 -12185 -53138 -100770 -1304 228069 210655 57651
15045E7651k48429k21515j24315Q1655J64635Q2522J1445j57937j64057J6277
$$ 57651 -190778 -412293 -536608 -454953 -290318 -207796 -196351 -354288 -518345 -502068
15035e02068K28570L18407p2856j13463J25513k9505o1307m0391p6778J02884
$$ -502068 -273498 44909 -27947 -141410 -15897 -45402 -106709 -147100 -223878 -120994
15025a20994K62718N8153n3166j25597k93591j42942r465J9533R4895J34480r679
$$ -120994 141724 199877 146711 21114 -272477 -415419 -424884 -405351 -310456 -175976 -185655
15014a85655m2269M2548M2649N2866P8587P218Q0651J95329j51949l11110j43160
$$ -185655 -227924 -185376 -142727 -89861 -11274 -4056 76595 271924 119975 -191135 -334295
15003c34295j84780k74243k27447k1469K51222Q7615Q1923N1441K8784Q1064J05437
$$ -334295 -519075 -793318 -1020765 -1042234 -791012 -703397 -621474 -570033 -541249 -460185 -354748
14992c54748R3229J50725j7007J1777j3035l18070k44502J14130J27908j22035
$$ -354748 -261519 -110794 -127801 -116024 -129059 -447129 -691631 -577501 -449593 -571628
14982e71628O7634K71079K11755k323m9905m0570J97847M6120j51912o408j4594
$$ -571628 -503994 -232915 -21160 -23483 -73388 -113958 83889 130009 -21903 -28311 -42905
14971d2905J857k18688p2973J08722k5047r4082n688K00845J57798m33n639O181
$$ -42905 -41048 -259736 -332709 -223987 -249034 -343116 -348804 -147959 9839 9406 3767 9948
14959I948k62421k68508o5226J06527P0712J28707M1042K3388o3049j18517j8288
$$ 9948 -252473 -520981 -586207 -479680 -408968 -280261 -239219 -215831 -278880 -397397 -415685
14948d15685P9621K4350M4119J20238Q9562k8772j0634J22143J32169o0428j56348
$$ -415685 -336064 -311714 -267595 -147357 -57795 -86567 -97201 24942 157111 96683 -59665
14937e9665j39797R6840O6781n8415Q61N2796J55000K59372j05472k66835j39893
$$ -59665 -199462 -102622 -35841 -94256 -93395 -40599 114401 373773 268301 1466 -138427
14926a38427K208J49531J62243M4459j30120Q8013m2939j95493k10510R558K06133
$$ -138427 -136219 13312 175555 220014 89894 177907 134968 -60525 -271035 -261477 -55344
14915e5344O8409o0354l495q0367j41750j04380o2776O7359M2669p3964j04637
$$ -55344 13065 -47289 -50784 -131151 -272901 -377281 -440057 -372698 -330029 -403993 -508630
14904e08630J9231J31651J88895k5647q9120L3984J33789R4027L0901K9022O1215
$$ -508630 -489399 -357748 -168853 -194500 -283620 -249636 -115847 -21820 9081 38103 99318
14893I9318p655j19471k76614k94853L5542J46266N9397M3084j5795j27345q0612
$$ 99318 91663 -27808 -304422 -599275 -563733 -417467 -358070 -314986 -330781 -458126 -538738
14882e38738J48387J50062j15340J56181M01509L09686Q5617m4952j56150k07111
$$ -538738 -390351 -240289 -355629 -199448 202061 511747 597364 552412 396262 189151
14872A89151k46471j57320n9480j8013N2707K00500O8178l3101J20010O6152q1118
$$ 189151 -57320 -214640 -274120 -292133 -239426 -38926 29252 -3849 116161 182313 101195
14861A01195j17954l6116n364O1369R9503k43960j47181N1159J51339K13928Q7197
$$ 101195 -16759 -52875 -58239 3130 102633 -141327 -288508 -237349 -86010 127918 215115
14850B15115j8381l7166J33880l9993j18483k22878j51991J70475M344l4321p3308
$$ 215115 196734 159568 293448 253455 134972 -87906 -239897 -69422 -65078 -99399 -172707
14839a72707j3600l8843P7333M6223j25345j36021m2122R5978l1591L1970J90692
$$ -172707 -186307 -225150 -147817 -101594 -226939 -362960 -405082 -309104 -340695 -308725 -118033
14828a18033J85692J11457M8968j99618r6201P8350l2078j16551J39366M15429
$$ -118033 67659 179116 228084 28466 -67735 10615 -21463 -138014 1352 416781
14818D16781J73337r9584l21226l36582j11629P3815J54511L06169L1707k01429
$$ 416781 590118 490534 169308 -167274 -278903 -205088 -50577 255592 287299 85870
14808H5870p5299j83330j49325j5751J7456j0819J11991K66795K86144J58110
$$ 85870 10571 -172759 -322084 -337835 -320379 -331198 -219207 47588 333732 491842
14798D91842k9503j59621k63338r8816N2064Q3675R4990k676j9651p7983J5686
$$ 491842 462339 302718 39380 -59436 -7372 76303 171293 168617 148966 70983 86669
14787H6669m1088j52422j8958j03800j15760J2462r9406j0070P7166J17301J23327
$$ 86669 45581 -106841 -125799 -229599 -345359 -332897 -432303 -442373 -365207 -247906 -124579
14776a24579K63155N491k70602k37303q6110R7430o9136j43798j58078j29042
$$ -124579 138576 144067 -126535 -363838 -449948 -352518 -421654 -565452 -723530 -852572
14766h52572o1377K02365L46935K05589J34447O5280p4743J33400Q5975M7651
$$ -852572 -913949 -711584 -364649 -159060 -24613 40667 -34076 99324 185299 232950
14756B32950j33040j68803j54600j24844n4429O9906J17961K92899K82302J62738
$$ 232950 99910 -68893 -223493 -348337 -402766 -332860 -214899 78000 360302 523040
14746E23040P5266K18960J10543m29228n02361l95058l02721j27413J17739J45462
$$ 523040 598306 817266 927809 498581 -3780 -398838 -701559 -828972 -711233 -565771
14736e65771M2729m3790o7031j33594m9988L0039J54124K57827K07079P3027J18016
$$ -565771 -523042 -566832 -633863 -767457 -817445 -787406 -633282 -375455 -168376 -95349 22667
14725B2667k7413k06699q3765J24914K41144J83452j19927j63715k3746J06888
$$ 22667 -4746 -211445 -295210 -170296 70848 254300 134373 -29342 -53088 53800
14715E3800N4079j64094j46625Q8028J47038j2353j25647j07673j47351K8784
$$ 53800 107879 -56215 -202840 -114812 32226 19873 -105774 -213447 -360798 -332014
14705c32014J51982J25958K70272O9679j35997p6961k4463K3370p859l1140n9552
$$ -332014 -180032 -54074 216198 285877 149880 72919 48456 71826 63967 32827 -26725
14694b6725J69476J06253k25705j24937J30402J31949k00236k82006p1718O2512
$$ -26725 142751 249004 23299 -101638 28764 160713 -39523 -321529 -393247 -330735
14684c30735O2408J15628J75328K8035j56636N7243J12469L5902K45433J50000
$$ -330735 -268327 -152699 22629 50664 -105972 -48729 63740 99642 345075 495075
14674D95075o0782j59348l72861m96064l44347J0739J40666R6407J52247K63087
$$ 495075 434293 274945 -97916 -593980 -938327 -927588 -786922 -690515 -538268 -275181
14664b75181J18078j95041q6041j8304J9037K29377J41146j21627o4458J23433
$$ -275181 -157103 -352144 -438185 -456489 -437452 -208075 -66929 -188556 -253014 -129581
14654a29581j83646l11731L2984J78411J96563L4023j27111m1308K18104J97889
$$ -129581 -313227 -624958 -591974 -413563 -217000 -182977 -310088 -351396 -133292 64597
14644F4597J65593P5457j19865o5413k7948n749k5573j02141q5912o6059Q002
$$ 64597 230190 305647 185782 120369 92421 86672 61099 -41042 -126954 -193013 -185011
14633a85011N8775O2184N2100J90478J47152o7614l8390k59221k21692k1678l5937
$$ -185011 -126236 -64052 -11952 178526 325678 258064 219674 -39547 -261239 -282917 -318854
14622c18854m9877n0948r013O7910N322J11941R2601P6963j7958r7514j50317
$$ -318854 -368731 -419679 -428692 -360782 -355460 -243519 -150918 -73955 -91913 -189427 -339744
14611c39744j53290J36440J77391M7632M03k09574k26223j40820O2743K59255
$$ -339744 -493034 -356594 -179203 -131571 -131168 -340742 -566965 -707785 -645042 -385787
14601c85787J02565J85817o6124k29119k0675R6302J62877o4400n066J22584k4662
$$ -385787 -283222 -97405 -163529 -392648 -413323 -317021 -154144 -218544 -223610 -101026 -125688
14590a25688j4251j10475j21656M0585J60329J97572K7103j88571j63011m9582
$$ -125688 -139939 -250414 -372070 -331485 -171156 26416 53519 -135052 -298063 -347645
14580c47645M8477m8134j28177J46550L24792M32915L6644l96282j25626J68993
$$ -347645 -299168 -347302 -475479 -328929 -4137 428778 465422 69140 -56486 112507
14570A12507J02787o1924j16568j18297q527p4293L5260K8422q2209q7662L1423
$$ 112507 215294 153370 36802 -81495 -90022 -164315 -129055 -100633 -182842 -270504 -239081
14559b39081J30324k7256l6487J83512R5871O5749L3844m09458m31230O3464J29919
$$ -239081 -108757 -136013 -172500 11012 106883 172632 206476 -202982 -634212 -570748 -440829
14548d40829j59731k69833J72570L68363K33474M8842j68827j22406m5166j66569
$$ -440829 -600560 -870393 -697823 -329460 -95986 -47144 -215971 -338377 -383543 -550112
14538e50112r6130K75203L14922Q5871j18207l47366k54091j8048m388J17830
$$ -550112 -646242 -371039 -56117 29754 -88453 -435819 -689910 -707958 -712346 -594516
14528e94516K45828J56090N8514m168j1172j00133j18156P931p417J07276Q0195
$$ -594516 -348688 -192598 -134084 -138252 -149424 -249557 -367713 -359782 -367199 -259923 -179728
14517a79728j33421m1846K78691n8761j24859J74982J08997P2948J04493j43487
$$ -179728 -313149 -354995 -76304 -135065 -259924 -84942 24055 97003 201496 58009
14507E8009k32537m0810K21018J80133m8637l2129O2290J01667M2431K6675k1485
$$ 58009 -174528 -215338 5680 185813 137176 105047 167337 269004 311435 338110 316625
14496C16625j57412j93476j01272J02786J7749k1216j38762l25541O7331M11481
$$ 316625 159213 -34263 -135535 -32749 -15000 -36216 -174978 -500519 -433188 -21707
14486b1707J93971j94906j47909m1114k2531K05595K71160k14008l62364j6511
$$ -21707 172264 -22642 -170551 -211665 -234196 -28601 242559 28551 -333813 -350324
14476c50324p0668j20270k2408l5044j7185p906J11686K82493J86099J07997L41117
$$ -350324 -420992 -541262 -563670 -598714 -615899 -623805 -512119 -229626 -43527 64470 405587
14465D05587J97023L2948l599j15694k39893k10108p2163j8319l1139j34559r8087
$$ 405587 602610 635558 631959 516265 276372 66264 -5899 -24218 -55357 -189916 -288003
14454b88003J67431J13429j43398k06487J01859L08502L06781J16767M6729M5998
$$ -288003 -120572 -7143 -150541 -357028 -255169 53333 360114 476881 523610 569608
14444E69608j07017J79779K40373j91294j68346K6552J9510m7971p6826k99692
$$ 569608 462591 642370 882743 691449 523103 549655 569165 521194 444368 144676
14434A44676j59878J61261K7237l51882r0290L17063J87895O0348j38208j59628
$$ 144676 -15202 146059 173296 -178586 -268876 48187 236082 296430 158222 -1406
14424a406j88154o5519J37462J84894J99968j6896k61334o5935k1372k62949K1821
$$ -1406 -189560 -255079 -117617 67277 267245 250349 -10985 -76920 -98292 -361241 -339420
14413c39420J27285P9839J21077m8775R3778Q2912q4914p8224J7653J46608r4036
$$ -339420 -212135 -132296 -11219 -59994 33784 116696 31782 -46442 -28789 117819 23783
14402B3783j25640J16916O9612L559r9412k09037j87043m5520Q694o3326M737
$$ 23783 -101857 15059 84671 88230 -11182 -220219 -407262 -452782 -444088 -507414 -502677
14391e02677J34550J5261p6870k0420N0517O5849J17449L13806J28231j3145m4283
$$ -502677 -368127 -352866 -429736 -450156 -399639 -333790 -216341 97465 225696 212551 168268
14380A68268k20677j52083l1339n1682M9105J42522J03863L0253m7943q784q1841
$$ 168268 -52409 -204492 -235831 -287513 -238408 -95886 7977 38230 -9713 -18497 -100338
14369a00338r4837Q4249K83332J53271L7335Q4701n9680k77184j14195m3253l39173
$$ -100338 -195175 -110926 172406 325677 363012 447713 388033 110849 -3346 -46599 -385772
14358c85772k36064j23411o661K74248K44034o2994J42277L16861P1344j75272
$$ -385772 -621836 -745247 -751908 -477660 -233626 -296620 -154343 162518 233862 58590
14348E8590j81403r7616O4737K562n7691J4481k20067j67033q4081k2997R1961
$$ 58590 -122813 -220429 -155692 -153130 -210821 -196340 -416407 -583440 -667521 -690518 -598557
14337e98557K56648K28196N2155p952L6331j52994k1714R6683R8708o4255j55063
$$ -598557 -341909 -113713 -61558 -69510 -33179 -186173 -207887 -111204 -12496 -76751 -231814
14326b31814O317R730m5845j8258L5184J4750n9953M2921O6551K00415j7615M8490
$$ -231814 -225497 -215767 -261612 -279870 -244686 -229936 -289889 -246968 -180417 19998 2383 50873
14314E0873J66767k36482k04562J4557J29102R656q2899M8763k12253k42577L7524
$$ 50873 217640 -18842 -223404 -208847 -79745 -70089 -152988 -104225 -316478 -559055 -521531
14303e21531K32033K3110q0055K64055L07267P0675n4012J8579P2888k9478k40624
$$ -521531 -289498 -266388 -346443 -82388 224879 295554 241542 260121 333009 303531 62907
14292F2907j964J51836J78025L3211j9088o1790N8393j25779j73064Q909J1510
$$ 62907 60943 212779 390804 424015 404927 343137 401530 275751 102687 111596 123106
14281A23106K3950q0833j38357p1194N7010J0282Q4300Q6628j23603j27981k50709
$$ 123106 147056 66223 -72134 -143328 -86318 -76036 8264 94892 -28711 -156692 -407401
14270d07401k18046J27523J65501J86609J39982L37771J74230P4926O5138j53241
$$ -407401 -625447 -497924 -332423 -145814 -5832 331939 506169 581095 646233 492992
14260D92992k98912o7853J82827n9708l5421J40751J11103J4472J4594k22578
$$ 492992 194080 126227 309054 249346 213925 354676 465779 480251 494845 272267
14250B72267j74351o9822K486J86834K84725l1005k34289j99955p2590J53078
$$ 272267 97916 28094 30580 217414 502139 471134 236845 36890 -35700 117378
14240A17378k0677k62485j46063p780k705o8421k10219p2244J85140K02086P1480
$$ 117378 96701 -165784 -311847 -319627 -322332 -390753 -600972 -673216 -488076 -285990 -214510
14229b14510J22735l334P6432K46291R7773L1588j04651n780O774j99927q0390
$$ -214510 -91775 -95109 -18677 227614 325387 356975 252324 246544 253318 53391 -26999
14218b6999p698L870O1103Q6655o2298k60342k0766J04367K35981K15262L0366
$$ -26999 -34697 -30827 30276 116931 54633 -205709 -226475 -122108 113873 329135 359501
14207C59501k05579j42908j3802O450N645o863k2826j64166k0806R3282R1024
$$ 359501 153922 11014 -2788 3662 9307 2444 -20382 -184548 -205354 -112072 -21048
14196b1048p3115k24058k53668m6068J03904L958N3701J17450p7487M0069J22579
$$ -21048 -94163 -318221 -571889 -617957 -514053 -510095 -456394 -338944 -416431 -376362 -253783
14185b53783M1428K67266J15144l03218K911J81656J99642K0976j05201l3358
$$ -253783 -212355 54911 170055 -133163 -130252 51404 251046 272022 166821 133463
14175A33463p3807O4109R5933p9299r4200J02322j0038J2718M4045r3332l8389
$$ 133463 59656 123765 219698 140399 46199 148521 138483 151201 195246 101914 63525
14164F3525M4632L13041K48278j64j08728j93747j91801j49076j22564Q1287J13102
$$ 63525 108157 421198 669476 669312 560584 366837 175036 25960 -96604 -15317 97785
14153I7785k42439l40361j48810r0672P803N8337J7231K47211K99377K11661J63276
$$ 97785 -144654 -485015 -633825 -724497 -716694 -658357 -641126 -393915 -94538 117123 280399
14142B80399p7047j53022n9993R1463l4460j53924j57662k75314P599J9139K2507
$$ 280399 203352 50330 -9663 81800 47340 -106584 -264246 -539560 -531961 -512822 -490315
14131d90315J8255P3720L8681J38828L20150J05287k96582l21814l1212r694p9810
$$ -490315 -472060 -398340 -359659 -220831 99319 204606 -91976 -413790 -445002 -454696 -534506
14120e34506L7494J93377K22856K02086O9089r9878k33939j05030p9306l0441
$$ -534506 -497012 -303635 -80779 121307 190396 90518 -143421 -248451 -327757 -358198
14110c58198j09426q0885Q0955j23950L1753J84384j1884j05403j39316o9920
$$ -358198 -467624 -548509 -467554 -591504 -559751 -375367 -387251 -492654 -631970 -701890
14100g01890J56754J08217m4104J27340K87441K48321k6825k80689p3607M1649
$$ -701890 -545136 -436919 -481023 -353683 -66242 182079 155254 -125435 -199042 -157393
14090a57393L13J9149m5231j8331M9723Q6658m0788l38212k87934L4432k3883
$$ -157393 -157080 -137931 -183162 -201493 -151770 -65112 -105900 -444112 -732046 -697614 -721497
14079g21497J28395L56808M65826L40325j73233j54349j12316q2310m3735k79505
$$ -721497 -593102 -236294 229532 569857 396624 242275 129959 47649 3914 -275591
14069b75591l30692o2808K95030L83563O6885n1587J53595J4357j62884n4024
$$ -275591 -606283 -669091 -374061 9502 76387 24800 178395 192752 29868 -24156
14059b4156N1771J88965K02642p9871M1440O9883k77383l86704k48218R2841K29283
$$ -24156 27615 216580 419222 339351 380791 450674 173291 -213413 -461631 -368790 -139507
14048a39507R0346J72454K58082J91318J89608m0516j87749j35216l20852l90744
$$ -139507 -49161 123293 381375 572693 762301 721785 534036 398820 77968 -312776
14038c12776l21219j70978J09700L44814K73510p4867j29635p1977J0652J79099
$$ -312776 -633995 -804973 -695273 -350459 -76949 -151816 -281451 -353428 -342776 -163677
14028a63677m133q6332J32517K07369j48974k33134k640p9513O2797J93719m9103
$$ -163677 -167810 -254142 -121625 85744 -63230 -296364 -299004 -378517 -315720 -122001 -171104
14017a71104o2660O3311p1676p3990R9665K21691K62613K19840J6545j3330M6313
$$ -171104 -233764 -170453 -242129 -316119 -216454 5237 267850 487690 504235 490905 537218
14006E37218j58218k00386m8089p0178j71337j26615k21468j00128K21726K1037
$$ 537218 379000 178614 130525 60347 -110990 -237605 -459073 -559201 -337475 -316438
13996c16438j64878m7482Q3979J19576J47281Q5733J27771J69917J30221m2921
$$ -316438 -481316 -528798 -444819 -325243 -177962 -92229 35542 205459 335680 292759
13986B92759k14682k7333P595m0474j58973m7851Q3164r0297J39760J19979P8852
$$ 292759 78077 50744 58339 17865 -141108 -188959 -105795 -196092 -56332 63647 142499
13975A42499l7878n8123K44222K58557K4915j67063k9007Q927l80557n70133j71580
$$ 142499 104621 46498 290720 549277 574192 407129 378122 387049 6492 -563641 -735221
13964g35221K21082K86388J68761p515O8644r5589j83870j56290R8874K64511
$$ -735221 -514139 -227751 -58990 -66505 2139 -93450 -277320 -433610 -334736 -70225
13954g0225L27640R9825k45591j01199m6052J8171M3573k2209j6644j29777j29770
$$ -70225 257415 357240 111649 10450 -35602 -17431 26142 3933 -12711 -142488 -272258
13943b72258m8012q922N8519J98898J68055L1321j8066n8435k34190j38382P4092
$$ -272258 -320270 -329192 -270673 -71775 96280 127601 109535 51100 -183090 -321472 -247380
13932b47380K8186R9607r846k8209j1884r6793M2431K01895n796o9090j22210
$$ -247380 -219194 -119587 -129433 -157642 -169526 -266319 -223888 -21993 -27789 -96879 -219089
13921b19089J47439K28668J33632j12146r0459o1060p1003J02042R2943L351j75126
$$ -219089 -71650 157018 290650 178504 88045 26985 -44018 58024 150967 154318 -20808
13910b0808k14826j41796J82230J82778R0235N6421q9880K3825L77444L16128
$$ -20808 -235634 -377430 -195200 -12422 77813 134234 44354 68179 445623 761751
13900G61751R245M3939j91009k49885m9055J15087N7247j2056K7512J24431R5444
$$ 761751 770996 814935 623926 374041 324986 440073 497320 485264 512776 637207 732651
13889G32651p6610p4015J2312J23334J21219j47775k86239m8098K0233j21634
$$ 732651 656041 582026 594338 717672 838891 691116 404877 356779 377012 255378
13879B55378o308J85318J21117j94792r5953J26747j10629k03461j23401p5263
$$ 255378 249070 434388 555505 360713 264760 391507 280878 77417 -45984 -121247
13869a21247j33358N9503J95573j04489q4049O1211N2186j07458j26460J08130
$$ -121247 -254605 -195102 471 -104018 -188067 -126856 -74670 -182128 -308588 -200458
13859b00458N2999M3106M3647K74575L74403L6634o0464P1106n6000j34953l44471
$$ -200458 -147459 -104353 -60706 213869 588272 624906 564442 635548 579548 444595 100124
13848A00124j31186K46964J75704n0684j18589n7793n4500k61843k77948q446
$$ 100124 -31062 215902 391606 340922 222333 164540 110040 -151803 -429751 -438197
13838d38197K36734L93476K20553l2743j75110k27576k25632p1476J35160P1682
$$ -438197 -201463 192013 412566 379823 204713 -22863 -248495 -319971 -184811 -113129
13828a13129k7868O7946j25452k63958j61785K2591K12496J53731P3815j38793
$$ -113129 -140997 -73051 -198503 -462461 -624246 -601655 -389159 -235428 -161613 -300406
13818c00406k98390k36397J06790K65371J54790J23174L34760K41770K25592Q6803
$$ -300406 -598796 -835193 -728403 -463032 -308242 -185068 149692 391462 617054 703857
13808G03857k06027j93678r7598Q7773J60560J09710M5671m2018j19272k28385
$$ 703857 497830 304152 206554 294327 454887 564597 610268 568250 448978 220593
13798B20593l41315j47502m2425j5066R1968K68627J33874K1437P1648L09523
$$ 220593 -120722 -268224 -310649 -325715 -233747 34880 168754 190191 261839 571362
13788E71362J08608j06733q0377l1379o1000R663K1104k5982K9724o8939k16558
$$ 571362 679970 573237 492860 461481 400481 410144 431248 405266 434990 366051 149493
13777A49493k07373k28322J18720R1467k62985m5758K70929K02910M7734m9461
$$ 149493 -57880 -286202 -167482 -76015 -339000 -384758 -113829 89081 136815 87354
13767H7354O9688J83761J82045J4630j18923p8979n1283q6310j74769o8335j01003
$$ 87354 157042 340803 522848 537478 418555 339576 288293 201983 27214 -41121 -142124
13756a42124P7848J61072O5230j09710K0933K35037R5701r1835M3764R2016j39827
$$ -142124 -64276 96796 162026 52316 73249 308286 403987 312152 355916 447932 308105
13745C08105j60783N844r7494j08454n3308k8897m2754m9522J4447J51510J65382
$$ 308105 147322 153166 55672 -52782 -106090 -134987 -177741 -227263 -212816 -61306 104076
13734A04076Q3765j40803k50395Q362K0317M0921K56883J59184o1266n7898N3589
$$ 104076 187841 47038 -203357 -194995 -174678 -133757 123126 282310 221044 163146 216735
13723B16735o12m7948j34381k81131j01214J7732J62115J43232P030P8303K9919
$$ 216735 216123 168175 33794 -247337 -348551 -330819 -168704 -25472 -18442 59861 89780
13712H9780K7751j40216j10644J19117J70406M2492K0k2514J12612N587j6900
$$ 89780 117531 -22685 -133329 -14212 156194 198686 198706 176192 288804 294391 277491
13701B77491j2712k37457j67695l9619J89435J23825n8491j15779m2967j81463
$$ 277491 264779 27322 -140373 -179992 9443 133268 74777 -41002 -83969 -265432
13691b65432J5305K23440J11532J72013N8731l4439J28942J22795o8302r3921
$$ -265432 -250127 -26687 84845 256858 315589 281150 410092 532887 464585 370664
13681C70664k75708l1745R5663j7218J58486J63990q4086j18408L559M3732L0674
$$ 370664 94956 63211 158874 141656 300142 464132 380046 261638 265197 308929 339603
13670C39603o6208R1003R8704j38943k43087N311Q0814J10455J75036K84050L6579
$$ 339603 273395 364398 463102 324159 81072 86383 167197 277652 452688 736738 773317
13659G73317k87321k64447m420M2468q6397j72729j25216K19653K42438j39314
$$ 773317 485996 221549 217129 259597 173200 471 -124745 94908 337346 198032
13649A98032j13299N699J42332J30951r1207r4481O6266l8963j77705o459Q6987
$$ 198032 84733 90432 232764 363715 272508 178027 244293 205330 27625 21166 108153
13638A08153M6542J54314J3350k52825N3390L95568J55037j30025K9639K10925
$$ 108153 154695 309009 322359 69534 122924 518492 673529 543504 573143 784068
13628G84068J68484k20136l23200j58639N0129J11026J97546j3530k42621k03663
$$ 784068 952552 732416 409216 250577 300706 411732 609278 595748 353127 149464
13618A49464j75063j55804l4432J72823J5016r4446m6948J1193l5957j09190p4565
$$ 149464 -25599 -181403 -215835 -43012 -27996 -122442 -169390 -158197 -194154 -303344 -377909
13607c77909j098J66546K23288K32415K04080J99108J01212m7912k66924j05167
$$ -377909 -379007 -212461 10827 243242 447322 646430 747642 699730 432806 327639
13597C27639j33337o5163o3242j38852j94177n0147J27035q3849M96j01596N77
$$ 327639 194302 129139 65897 -72955 -267132 -317279 -190244 -274093 -273597 -375193 -374616
13586c74616O5389n8849j65406K2897J43320K60094M29546O3615j96958l67397
$$ -374616 -309227 -368076 -533482 -510585 -367265 -107171 322375 385990 189032 -178365
13576a78365l67543J7826K00746R5016J099J04510K72587L11498R1060k734k1309
$$ -178365 -545908 -528082 -327336 -232320 -231221 -126711 145876 457374 548434 545700 524391
13565E24391j12362j71553O6964J04226O7966J7009j84072j24300m5098J19729
$$ 524391 412029 240476 307440 411666 479632 496641 312569 188269 143171 262900
13555B62900K33842M2310o6154Q2830J34753L65j46806k7293L5130p6213l30032
$$ 262900 496742 539052 472898 555728 690481 690846 544040 516747 551877 475664 145632
13544A45632k15793p2287l8627K02116J11761m3189j59723M1180J22561J36340
$$ 145632 -70161 -142448 -181075 21041 132802 89613 -70110 -28930 93631 229971
13534B29971L58629K08312k51375m48227l43810p1695K32447J23234p3179n719
$$ 229971 588600 796912 545537 97310 -246500 -318195 -85748 37486 -35693 -41412
13524d1412K8992O4733K16564J44172J08690O2008k5451j16438j75223J0484n7793
$$ -41412 -12420 52313 268877 413049 521739 583747 558296 441858 266635 277119 219326
13513B19326k0611J67608P3401L2408m4480j07218O787P9751R1362j72665r5323
$$ 219326 198715 366323 439724 472132 427652 320434 327221 406972 498334 325669 230346
13502B30346K7503j28o8516r4666J66142L17345K40283L9728k38244j61489j28608
$$ 230346 257849 257721 189205 94539 260681 578026 818309 858037 619793 458304 329696
13491C29696j47537k09472j40862o4244J45124K93178J28451J41632K16182R5776
$$ 329696 182159 -27313 -168175 -232419 -87295 205883 334334 475966 692148 787924
13481G87924P736J36488J10399j08555m48343k47344P825K4308l8265j38098K9448
$$ 787924 795660 932148 1042547 933992 485649 238305 246130 270438 232173 94075 123523
13470A23523j13471q2876J26417p439j24846j01396k0903J08274J34469J50151
$$ 123523 10052 -72824 53593 46154 -78692 -180088 -200991 -92717 41752 191903
13460A91903k189q8044m8714J5330J13280J35847O1982j40171k65081k69378p6446
$$ 191903 189714 101670 52956 68286 181566 317413 379395 239224 -25857 -295235 -371681
13449c71681m541R48J85787K27438Q2391J58108J12062R8615P7800o1390j24294
$$ -371681 -376222 -375274 -189487 37951 120342 278450 390512 489127 566927 505537 381243
13438C81243r2430N6514K02719O7410j45710j83448k171j79307k32371n9926m1616
$$ 381243 288813 345327 548046 615456 469746 286298 284127 104820 -127551 -187477 -229093
13427b29093J51649K63972J37827n0196j51462J43257J87898M6950q3834J07373
$$ -229093 -77444 186528 324355 274159 122697 265954 453852 500802 416968 524341
13417E24341J14664r1626r9571q2042j77685l38729k37662Q711J38213K2237j9301
$$ 524341 639005 547379 447808 365766 188081 -150648 -388310 -379599 -241386 -219149 -238450
13406b38450Q6616J69548K57469J40075q2909j49017j56480r5731J5060J63446
$$ -238450 -151834 17714 275183 415258 332349 183332 26852 -68879 -53819 109627
13396A09627K63568J2561p2894O3821P8559L1236K8628j85303j93785J18885J81035
$$ 109627 373195 385756 312862 376683 455242 486478 515106 329803 136018 254903 435938
13385D35938J04858K31770O7787k9096j9704l8324o2345q9038m5058j12234r4721
$$ 435938 540796 772566 840353 811257 791553 753229 690884 601846 556788 444554 349833
13374C49833m7711J09135J73461R5299m4147n4847n8009k57029k52043r885Q201
$$ 349833 302122 411257 584718 680017 635870 581023 523014 265985 13942 4057 12258
13363A2258j09046R6557J86815j02550j94396O7106J10613j02480o7593K92241
$$ 12258 -96788 -231 186584 84034 -110362 -43256 67357 -35123 -102716 189525
13353A89525K87592J98732J55545o2114K1062m0578k5663k6740j85562j77631
$$ 189525 477117 675849 831394 769280 790342 749764 724101 697361 511799 334168
13343C34168l28863k30493J60164O6151k303J50647L7881l9386J1889J7090R7538
$$ 334168 5305 -225188 -65024 1127 -1176 149471 187352 147966 159855 176945 274483
13332B74483Q5644m506j73838j7408J853j26982l3540J24561j0419L5997J29855
$$ 274483 360127 355621 181783 164375 166228 39246 5706 130267 119848 155845 285700
13321B85700M7794j1589l5088j09010m6210J08140Q7159j10961m5751j69015k18680
$$ 285700 333494 321905 286817 177807 131597 239737 326896 215935 170184 1169 -217511
13310b17511K8058J14754L5876r2687J43114K93766L89432K50012K7646j90913
$$ -217511 -189453 -74699 -38823 -131510 11604 305370 694802 944814 972460 781547
13300G81547k19814j72135j66522J01041K22844K28043M4503l4332J63788M5609
$$ 781547 561733 389598 223076 324117 546961 775004 819507 785175 948963 994572
13290I94572j94758k85008R9990O3817j58348k8221q724M7308J91914J33985L9381
$$ 994572 799814 514806 614796 678613 520265 492044 483320 530628 722542 856527 895908
13279H95908q8610r0897Q975j60626J4232J22409j20426j54720k2656l8055r1228
$$ 895908 807298 716401 725376 564750 578982 701391 580965 426245 403589 365534 274306
13268B74306O6633l0290k37423j82650j9942K69728L49924J08299j23107j07069
$$ 274306 340939 310649 73226 -109424 -129366 140362 490286 598585 475478 368409
13258C68409q4977l7751K4226K39495K51493J14620p2665j00815J61887R5333
$$ 368409 283432 245681 269907 509402 760895 875515 802850 702035 863922 959255
13248I59255l4627j76753k15157j5776m2616k49405N044J36656k5317q2058p6788
$$ 959255 924628 747875 532718 516942 474326 224921 229965 366621 341304 259246 182458
13237A82458j28169j90792Q579L57067K06337L4266m0271m9883K6962j26129j38069
$$ 182458 54289 -136503 -127924 229143 435480 469746 429475 379592 406554 280425 142356
13226A42356M5854L4155P7594L05268J99837l5348l0235j8098k63371k81091m5722
$$ 142356 188210 222365 299959 605227 805064 769716 739481 721383 458012 176921 131199
13215A31199K72955J14905k03504j94359Q8677J82418Q7257L4149j01708q3835
$$ 131199 404154 519059 315555 121196 209873 392291 479548 513697 411989 328154
13205C28154l9939O9898J30080k4503M8723j6857K7869P9003J66331j15914j36251
$$ 328154 288215 358113 488193 463690 512413 495556 523425 602428 768759 652845 516594
13194E16594m1659l3599P1467J43721J23059K1200k07280k58397p7747N2858m9656
$$ 516594 474935 441336 512803 656524 779583 800783 593503 335106 257359 310217 260561
13183B60561p7007K34804K80860M4423q875j9953j02918k4807j22421O0735K8896
$$ 260561 183554 418358 699218 743641 734766 714813 611895 587088 464667 525402 554298
13172E54298J26673K54581L6609P5973K9283j49447j31661k31747j50279J5382
$$ 554298 680971 935552 972161 1048134 1077417 927970 796309 564562 414283 429665
13162D29665J67691J03385j17117j08086j04837j62721j48720p0662J36663J52860
$$ 429665 597356 700741 583624 475538 370701 207980 59260 -11402 125261 278121
13152B78121l0668P8811J84655K30173L6129J6031K1933R7942R9212K2939M6252
$$ 278121 247453 326264 510919 741092 777221 793252 815185 913127 1012339 1035278 1081530
13141A081530k79610j90635j09803k04048J99851O7828o0506L8338k4550N1684
$$ 1081530 801920 611285 501482 297434 497285 565113 504607 542945 518395 570079
13131E70079J58110K01441J22975J23272J55042J07335j02285j55044Q7754J15257
$$ 570079 728189 929630 1052605 1175877 1330919 1438254 1335969 1180925 1268679 1383936
13121A383936j10332j47436j77518M190J45563J62187m7818j46227j26897N4798
$$ 1383936 1273604 1126168 948650 952840 1098403 1260590 1212772 1066545 939648 994446
13111I94446K16369L49248J82138q6328j39456j62188j08284n6742o4264J24642
$$ 994446 1210815 1560063 1742201 1655873 1516417 1354229 1245945 1189203 1124939 1249581
13101A249581m5896J37277L86159K48511j22253k78199j74746j5817R1910N3405
$$ 1249581 1203685 1340962 1727121 1975632 1853379 1575180 1400434 1384617 1476527 1529932
13091A529932K19991O3340q8915n3147O2905L5470j89447k04554N7071J05554
$$ 1529932 1749923 1813263 1724348 1671201 1734106 1769576 1580129 1375575 1432646 1538200
13081A538200K1823R9319K2628J05781J74087J05006M34308K41155k14674j25245
$$ 1538200 1560023 1659342 1681970 1787751 1961838 2066844 2501152 2742307 2527633 2402388
13071B402388q1983q6698k1666J07449J60451j59688k09726P1244L21525K21261
$$ 2402388 2320405 2233707 2212041 2319490 2479941 2320253 2110527 2181771 2503296 2724557
13061B724557o3300j69982j72501J02849J6723k08795j14234J60499K47558K40270
$$ 2724557 2661257 2491275 2318774 2421623 2438346 2229551 2115317 2275816 2523374 2763644
13051B763644J39477K9042k25113k06440J71515K16350R2976J11677J17298j7909
$$ 2763644 2903121 2932163 2707050 2500610 2672125 2888475 2981451 3093128 3210426 3192517
13041C192517j60373j9712M558J8613K55403J17666J2431j8017N9266L8450N8024
$$ 3192517 3032144 3012432 3016990 3035603 3291006 3408672 3421103 3403086 3462352 3500802 3558826
13030C558826L5316P4931J65388J70904Q9750Q0688L44746M63405J10336K7731
$$ 3558826 3594142 3669073 3834461 4005365 4095115 4175803 4520549 4983954 5094290 5122021
13020E122021K3446L4576N8841J42907K89684K10056J52188J63360K06640R6390
$$ 5122021 5145467 5180043 5238884 5381791 5671475 5881531 6033719 6197079 6403719 6500109
13010F500109K63873L27329L41120M60771L86530K30712K75894M47210N56321
$$ 6500109 6763982 7091311 7432431 7893202 8279732 8510444 8786338 9233548 9789869
13001I789869P57305P98770J008673J192836J306419J275351J324553J656511
$$ 9789869 10547174 11345944 12354617 13547453 14853872 16129223 17453776 19110287
12993A9110287J785798K066886K440968K915590L605056M001583M386155N335817
$$ 19110287 20896085 22962971 25403939 28319529 31924585 35926168 40312323 45648140
12985D5648140O453107P904398R656116J1813971J4724936J8473050K2830023
$$ 45648140 52101247 60005645 69661761 81475732 96200668 114673718 137503741
12978A37503741K7773914L2097246L2235463K3665179M524343j7438497l1676478
$$ 137503741 165277655 197374901 229610364 253275543 257799886 240361389 208684911
12971B08684911l5172154l1794115k6065144k0787760j6396547j2644210j0031889
$$ 208684911 173512757 141718642 115653498 94865738 78469191 65824981 55793092
12964E5793092q078149o419719n061774m100314l381273k835536k441564j847283
$$ 55793092 47714943 41295224 36233450 32133136 28751863 25916327 23474763 21627480
12956B1627480j551567j403160j093598j161258j293986j040022p45525p39854
$$ 21627480 20075913 18672753 17579155 16417897 15123911 14083889 13338364 12598510
12948A2598510o18891n38012n66857k63231j07801q232o8433k73406l52569l64234
$$ 12598510 11979619 11441607 10874750 10611519 10503718 10495486 10427053 10153647 9801078 9436844
12938I436844k54095l82219l23151N9779J46296J38611J6653o6826p0641P3455
$$ 9436844 9182749 8800530 8477379 8537158 8683454 8822065 8838718 8771892 8701251 8774706
12928H774706M1432P1595j9851J76018O93973P40122N03564M90216Q28780R89081
$$ 8774706 8816138 8887733 8867882 9043900 9737873 10477995 10981559 11471775 12300555 13289636
12918A3289636R98235J016481J010590R14641N39433K03744j78470j47995M45864
$$ 13289636 14287871 15304352 16314942 17229583 17769016 17972760 17794290 17646295 18092159
12909A8092159Q40973J057522J435291J730003K028154K361516K645394L181654
$$ 18092159 18933132 19990654 21425945 23155948 25184102 27545618 30191012 33372666
12901C3372666L822555M780378N788371O773793Q187655J0065839J2498931J5618577
$$ 33372666 37195221 41975599 47763970 54537763 62725418 72791257 85290188 100908765
12893A00908765J9616377K4389782K9655810L3484994L1925525K0369427r54687
$$ 100908765 120525142 144914924 174570734 208055728 239981253 260350680 259395993
12886B59395993k2636720l4697055l5986338l1343382k5119654j9457000j4937588
$$ 259395993 236759273 202062218 166075880 134732498 109612844 90155844 75218256
12879G5218256j1699305r270384p578688o303195m973806m080375l191924k613405
$$ 75218256 63518951 54248567 46669879 40366684 35392878 31312503 28120579 25507174
12871B5507174k424838k023197j492546j291242j127384r86589j117235j020103
$$ 25507174 23082336 21059139 19566593 18275351 17147967 16161378 15044143 14024040
12863A4024040q53976p81699p10927o95723m29584k70799l76489l98494p4559
$$ 14024040 13170064 12388365 11677438 10981715 10552131 10281332 9904843 9506349 9431790
12854I431790J0425n21005l67601j97111k96653n9765J45970Q4814r3991J9203
$$ 9431790 9442215 8921210 8553609 8356498 8059845 8000080 8146050 8230864 8136873 8156076
12844H156076R9422K05648L77843J48609Q3789j4544k3463P9980K75798L17635
$$ 8156076 8255498 8461146 8838989 8987598 9071387 9056843 9033380 9113360 9389158 9706793
12834I706793O1056J08273J27757K17522L15920J07140L70997P39096Q46592Q49062
$$ 9706793 9767849 9876122 10003879 10221401 10537321 10644461 11015458 11754554 12601146 13450208
12824A3450208Q28892R52841J510984J608037J588097K005563K492787K700791
$$ 13450208 14279100 15231941 16742925 18350962 19939059 21944622 24437409 27138200
12816B7138200K824346L405905M170869N076493O007735P174837Q871673J0822492
$$ 27138200 29962546 33368451 37539320 42615813 48623548 55798385 64670058 75492550
12808G5492550J3201273J6526156K0603378K5290256K9966939L2588461K8994597
$$ 75492550 88693823 105219979 125823357 151113613 181080552 213669013 242663610
12801B42663610J5093224o608484k5916570l4903800l4557111k9433006k3516156
$$ 242663610 257756834 251148350 225231780 190327980 155770869 126337863 102821707
12794A02821707j8322001j4162939j1032674q703084o986871n839930m918487
$$ 102821707 84499706 70336767 59304093 50601009 43614138 37774208 32855721
12787C2855721m065349l312465k649908k241871k047149j788067j335700j219333
$$ 32855721 28790372 25477907 22827999 20586128 18538979 16750912 15415212 14195879
12779A4195879j152159j151600r04165n52248m44680n79528o72528o93617o06641
$$ 14195879 13043720 11892120 10987955 10435707 9991027 9411499 8738971 8045354 7438713
12770G438713m63759k75986l05455m23290m13630m40353m29768r0719J6868M306
$$ 7438713 6974954 6698968 6393513 5970223 5556593 5116240 4686472 4595753 4612621 4616927
12760D616927L6936k62152m11371k28897j60816j99248o1488k3208j05134p1152
$$ 4616927 4653863 4391711 3980340 3751443 3590627 3391379 3329891 3306683 3201549 3130397
12750C130397R5180P7141j24447o7865j04586k68677j72460l61184j26985K1706
$$ 3130397 3225577 3302718 3178271 3110406 3005820 2737143 2564683 2203499 2076514 2098220
12740B098220l1579J29073K59640K01729j89128m78415k77194j87865j31855J46714
$$ 2098220 2066641 2195714 2455354 2657083 2467955 1989540 1712346 1524481 1392626 1539340
12730A539340J99078n8523p3684k16719k1945J76691K27339N5398q4908O579Q5249
$$ 1539340 1738418 1679895 1606211 1389492 1367547 1544238 1771577 1826975 1742067 1748646 1833895
12719A833895j53899k77441j98225j91945M8452o7214j02149L3523J14516r9683
$$ 1833895 1679996 1402555 1204330 1012385 1060837 993623 891474 924997 1039513 939830
12709I39830O9887L44870J10888j12993j77815N6707J96066K49425J11060j75719
$$ 939830 1009717 1354587 1465475 1352482 1174667 1231374 1427440 1676865 1787925 1612206
12699A612206j43990k8538K2325j50666j19402O2556Q3607Q9229n3934N2425j4336
$$ 1612206 1468216 1439678 1462003 1311337 1191935 1254491 1338098 1427327 1373393 1425818 1411482
12688A411482N4185k6704j80193k44029j52760L2535R0598o828j32491J5752O2550
$$ 1411482 1465667 1438963 1258770 1014741 861981 894516 985114 978286 845795 861547 924097
12677I24097J97774L7541k42351j95552p8614J96756J68363n6347j13003j13821
$$ 924097 1121871 1159412 917061 721509 642895 839651 1008014 951667 838664 724843
12667G24843k16660j22001j38488q7419L46140L36643q7840J38391K25043m8336
$$ 724843 508183 386182 247694 160275 506415 843058 755218 893609 1118652 1070316
12657A070316l71462m14011j25305l7558Q8285R2818J19149p6480l522P1869P1935
$$ 1070316 698854 284843 159538 121980 210265 303083 422232 345752 342230 414099 486034
12646D86034k4263k16302J8705K23633P9967J05458m637q1230k11206k09655O1048
$$ 486034 461771 245469 264174 487807 567774 673232 668595 587365 376159 166504 227552
12635B27552L12355K03423N2481k01083j11989j26627j57512m3209m3116J63123
$$ 227552 539907 743330 795811 594728 482739 356112 198600 155391 112275 275398
12625B75398N3982j29681j0722K5367J55805K99377J66410k13597j67480J97465
$$ 275398 329380 199699 188977 214344 370149 669526 835936 622339 454859 652324
12615F52324R8001q1622M9753n2754k62866j40318l4302j63649j36602j24506
$$ 652324 750325 668703 718456 665702 402836 262518 228216 64567 -72035 -196541
12605a96541k04730k530K56883K53376J45395N559n9408l9768o4432k12780J17122
$$ -196541 -401271 -403801 -146918 106458 251853 257412 198004 158236 93804 -118976 -1854
12594a854K98600k7518O2634K94511m4427j56810k7747M8637J4430K9052j4232
$$ -1854 296746 269228 331862 626373 581946 425136 397389 446026 460456 489508 475276
12583D75276k01004K9513P4163J28362K9582j54123r5773O6695O5118L6418j69848
$$ 475276 274272 303785 377948 506310 535892 381769 285996 352691 417809 454227 284379
12572B84379m2249N1448J62327J33528j8022l9870k29066j94923Q8O3801m6839
$$ 284379 242130 293578 455905 589433 571411 531541 302475 107552 107640 171441 124602
12561A24602J16368P8920L6622O3580k1189k17537n1370R1007J28845J02138p9748
$$ 124602 240970 319890 356512 420092 398903 181366 129996 221003 349848 451986 372238
12550C72238k35014r912O4328K27757J06871p2071Q8756j64266k01174q8961k1987
$$ 372238 137224 127312 191640 419397 526268 454197 542953 378687 177513 88552 66565
12539F6565Q4572M8678j55790j22140m6417N7200J79621N2113l7387L8101j19378
$$ 66565 151137 199815 44025 -78115 -124532 -67332 112289 164402 127015 165116 45738
12528D5738l6211Q4332J43813J65716J2905j37260l4697K8179J00483O1464R5067
$$ 45738 9527 93859 237672 403388 416293 279033 244336 272515 372998 434462 529529
12517E29529R6140n3834J24628J01415l39916j68953J19187K08620J32046q4772
$$ 529529 625669 571835 696463 797878 457962 289009 408196 616816 748862 664090
12507F64090j94353k51369k47172O292J15171k6608o3222P6659M5075J21457Q9152
$$ 664090 469737 218368 -28804 -22512 92659 66051 2829 79488 124563 246020 335172
12496C35172p7079j26194j49337o3989q4924J41952K86856K43125J7798N2116
$$ 335172 258093 131899 -17438 -81427 -166351 -24399 262457 505582 523380 575496
12486E75496J80238J0678j37069j49078j21645j14749K6547J22273k257K223j12963
$$ 575496 755734 766412 629343 480265 358620 243871 270418 392691 390434 392657 279694
12475B79694k56223k38007q4431J24372L27008J87478N8368j23346j18023N2343
$$ 279694 23471 -214536 -298967 -174595 152413 339891 398259 274913 156890 209233
12465B09233K85471J19935j38135r251m6603P4082J28255M8214J36367R2901j16707
$$ 209233 494704 614639 476504 467253 420650 494732 622987 671201 807568 900469 783762
12454G83762j90622m8148j82340j48666R4768P4637O1944M3754j81925j67081
$$ 783762 593140 544992 362652 213986 308754 383391 445335 489089 307164 140083
12444A40083n0941r801j7320J9488Q984M6545J18759m792J08900J40785j81176
$$ 140083 89142 79341 62021 81509 90493 137038 255797 251005 359905 500690 319514
12433C19514k95704l2013J36664p6539R787J35049J54180j42281j07705P8405
$$ 319514 23810 -8203 128461 51922 61709 196758 350938 208657 100952 179357
12423A79357Q5374l2882K8532J70201M6904j78445k64416j40321k03488r8973
$$ 179357 264731 231849 260381 430582 477486 299041 34625 -105696 -309184 -408157
12413d08157O9125J71653Q7030J29049R9804j25096j4776J49489j14081P3958
$$ -408157 -339032 -167379 -80349 48700 148504 23408 8632 158121 44040 117998
12403A17998J30919j38043k79066Q9908O6009j8580O6161q7382j96447n7786J62909
$$ 117998 248917 110874 -168192 -78284 -12275 -30855 35306 -52076 -248523 -306309 -143400
12392a43400J59509m8846l7151L2908k6601l3644J14553J14347Q6858Q3298j9649
$$ -143400 16109 -32737 -69888 -36980 -63581 -97225 17328 131675 218533 301831 282182
12381B82182j53652j09657m2038j40687o6820L6648j7080j07446j29881j5038
$$ 282182 128530 18873 -23165 -163852 -230672 -194024 -211104 -318550 -448431 -463469
12371d63469J84815J56273J16335J08204J33888J45250K0700j41034j61945r995
$$ -463469 -278654 -122381 -6046 102158 236046 381296 401996 260962 99017 89022
12361H9022k0373k4749N5473j01074K3750J13593J58854l1096k92290j82961p429
$$ 89022 68649 43900 99373 -1701 22049 135642 294496 263400 -28890 -211851 -219280
12350b19280r8100J07771L09826M01754J38214k26052j97232k6150j5559J59433
$$ -219280 -317380 -209609 100217 501971 640185 414133 216901 190751 175192 334625
12340C34625J4874m1603j29023J21357K02572K624K01603Q218r5991k44752q2615
$$ 334625 349499 307896 178873 300230 502802 505426 707029 715247 619256 374504 291889
12329B91889J25247M27R1873P9236j09904j22871j17918j07148L7553j8334j66188
$$ 291889 417136 417563 509436 588672 478768 355897 237979 130831 168384 150050 -16138
12318a6138k13467M8766J92749J80911q3808l12093j08858R3956L7580j5395Q820
$$ -16138 -229605 -180839 11910 192821 109013 -203080 -311938 -217982 -180402 -195797 -186977
12307a86977j90221k43244k41380M1841K38462N8796k2771J58904J82217O1772
$$ -186977 -377198 -620442 -861822 -819981 -581519 -522723 -545494 -386590 -204373 -142601
12297a42601k27537O0982J23476k74j3222q701j5334J1332o1727j14791j48396
$$ -142601 -370138 -309156 -185680 -185954 -199176 -207877 -223211 -211879 -273606 -388397 -536793
12286e36793j1125J53862K07413J13508K3614n1838N2358R931M9073K14841O3376
$$ -536793 -547918 -394056 -186643 -73135 -49521 -101359 -49001 -39070 10003 224844 288220
12275B88220L5718r5338j89185J22242k42248l56015K09659M38151M9471j36504
$$ 288220 323938 228600 39415 161657 -80591 -436606 -226947 211204 260675 124171
12265A24171j65088j96127J3410K46881K31153o2823k07733j70874q2001K70260
$$ 124171 -40917 -237044 -223634 23247 254400 191577 -16156 -187030 -269031 1229
12255A229L07861M6949k11454j98792j67764j90148J29094M54318k251k69530
$$ 1229 309090 356039 144585 -54207 -221971 -412119 -283025 171293 169042 -100488
12245a00488R531K32428J67564j01559k14398j82989m7581L15596K79207j03841
$$ -100488 -90957 141471 309035 207476 -6922 -189911 -237492 78104 357311 253470
12235B53470j74175m0864n2985j04501r7675r3162J20238K99396J62034k009L2020
$$ 253470 79295 38431 -14554 -119055 -216730 -309892 -189654 109742 271776 269767 301787
12224C01787o4318k55133k52026O5205j69634k42193P7765J75524K12626N6268
$$ 301787 237469 -17664 -269690 -204485 -374119 -616312 -538547 -363023 -150397 -94129
12214i4129K6189O9426r874R204r7817j84142m6115o3210p6895P3620J25152K13527
$$ -94129 -67940 1486 -8388 816 -97001 -281143 -327258 -390468 -467363 -393743 -268591 -55064
12202e5064K00327k9115l9112p1621Q0725R2366j80847k15541J07452K48435J02893
$$ -55064 145263 116148 77036 5415 86140 178506 -2341 -217882 -110430 138005 240898
12191B40898J2717n2153k86722k18319P421N2359M7432j16424m8847j12J49994
$$ 240898 253615 201462 -85260 -303579 -296158 -243799 -196367 -312791 -361638 -361750 -211756
12180b11756J55131K26383J47611l7730k51367k38514M6000J93893Q1412p6500
$$ -211756 -56625 169758 317369 279639 28272 -210242 -164242 29651 111063 34563
12170C4563j7862l8558q0775l05502k11902K02433R2315K32097J99411j04089
$$ 34563 16701 -21857 -102632 -408134 -620036 -417603 -325288 -93191 106220 2131
12160B131l25200j08325j0010N9113L37809J97473j1007O2900q5533k17985j15930
$$ 2131 -323069 -431394 -441404 -382291 -44482 152991 141984 204884 119351 -98634 -214564
12149b14564Q5635n1900p2083j7116J07272K7345k8998j16235p5411k675J53716
$$ -214564 -128929 -180829 -252912 -270028 -162756 -135411 -164409 -280644 -356055 -358730 -205014
12138b05014J79810j04193q1494p2123j20499m2483K53632J26929r7875N2273
$$ -205014 -25204 -129397 -210891 -283014 -403513 -445996 -192364 -65435 -163310 -111037
12128a11037J55983L3991j91610k17471o1817L5046Q2946J84375K13814J30875
$$ -111037 44946 78937 -112673 -330144 -391961 -356915 -273969 -89594 124220 255095
12118B55095j62835j76315p6134j4554K14948K9121j56764j22201J48240K28034
$$ 255095 92260 -84055 -160189 -174743 40205 69326 -87438 -209639 -61399 166635
12108A66635M2893l5751k06783l49734o8419J34560q2226r2532J8769J68329J54893
$$ 166635 209528 173777 -33006 -382740 -451159 -316599 -398825 -491357 -472588 -304259 -149366
12097a49366o6207o3674O6527l1511j13658M7957J89413J05397J18233r1806k7445
$$ -149366 -215573 -279247 -212720 -244231 -357889 -309932 -120519 -15122 103111 11305 -16140
12086a6140O8031M6500J54214J39491l9986p7277k45005k21791J63868J60195
$$ -16140 51891 98391 252605 392096 352110 274833 29828 -191963 -28095 132100
12076A32100j35877k11008j18978k0249K11113L3664j53992J04431k4214O8600
$$ 132100 -3777 -214785 -333763 -354012 -142899 -109235 -263227 -158796 -183010 -114410
12066a14410L04522J3920j6764O5500q5785j32075j00312J8660R4736N9991N8267
$$ -114410 190112 204032 187268 252768 166983 34908 -65404 -46744 47992 107983 166250
12055A66250L4448j50533j47408r007K8309o84r434l5748p4777j3239o0694K86292
$$ 166250 200698 50165 -97243 -106250 -77941 -78625 -88059 -123807 -198584 -211823 -272517 13775
12043A3775L99969R7336j03048j81521O752K07605L2395p7743p2942j03882l6307
$$ 13775 413744 511080 408032 226511 233263 440868 473263 395520 322578 218696 182389
12032A82389o741Q587m8889J46591K90463m1905m6715j1454j36514k0517o3542
$$ 182389 175648 184235 135346 281937 572400 530495 483780 472326 335812 315295 251753
12021B51753j53991q0411r0694l8991o0102m2820J65092J33868J9753J35255m5970
$$ 251753 97762 17351 -73343 -112334 -172436 -215256 -50164 83704 103457 238712 192742
12010A92742m3426N9772r3596n8501Q4447q0962j52726J4117K32291K84401K28124
$$ 192742 149316 209088 115492 56991 141438 60476 -92250 -78133 154158 438559 666683
11999F66683p3599k98894j96592k8668K2954n855k02044l54540j18900J95490
$$ 666683 593084 294190 97598 68930 91884 86029 -116015 -470555 -589455 -393965
11989c93965L50567K75629m6729n6545J25998J15824J20341j85129k31870R240
$$ -393965 -43398 232231 185502 128957 254955 370779 491120 305991 74121 83361
11979H3361P023n6748j8254M1321K31533N0441R6947M5240j91237k41522l60098
$$ 83361 90384 33636 15382 56703 288236 338677 435624 480864 289627 48105 -311993
11968c11993j2920M0513J99077K57815L7551n8084J1963J21306L267j62104j75830
$$ -311993 -324913 -284400 -85323 172492 210043 151959 163922 285228 288495 126391 -49439
11957d9439k17725J2860L4178M8966k3700j76343o2674K24142J88348J28657q7159
$$ -49439 -267164 -254304 -220126 -171160 -194860 -371203 -433877 -209735 -21387 107270 20111
11946B0111j60671R1624Q0099N8361J88457K36798K10113J31200m8144k76683
$$ 20111 -140560 -48936 31163 89524 277981 514779 724892 856092 807948 531265
11936E31265m06042j43770O2889J78468K30772k1943n454l6973k67007j42604
$$ 531265 125223 -18547 44342 222810 453582 431639 426185 389212 122205 -20399
11926b0399j00638n2814L7944J33651J15069n9795n3404K10050K8043m8589Q3499
$$ -20399 -121037 -173851 -135907 -2256 112813 53018 -386 209664 237707 189118 272617
11915B72617j36922j55456o4139O9216K05540k0627k22109j52399J43792L42218
$$ 272617 135695 -19761 -83900 -14684 190856 170229 -51880 -204279 -60487 281731
11905B81731J65773p610k4473j6143j35561k27949J2481P3696j04451j61497k3629
$$ 281731 447504 439894 415421 399278 263717 35768 48249 121945 17494 -144003 -167632
11894a67632L2144J64128O0693j37934k4257O7083J652J20060k3588k53060k57820
$$ -167632 -135488 28640 89333 -48601 -72858 -5775 -4123 115937 92349 -160711 -418531
11883d18531k741L53224J18045r3917J69089K80447Q5148k9992P2030J56826K4980
$$ -418531 -421272 -68048 49997 -43920 125169 405616 490764 460772 532802 689628 714608
11872G14608M1273P136M4285O9933n6358j69462L4655j7118j40410p8478j20372
$$ 714608 755881 763017 807302 877235 820877 651415 686070 668952 528542 450064 329692
11861C29692n6374j49005k65028j93725J84928Q4483r0512j18890j76905m1451
$$ 329692 273318 124313 -140715 -334440 -149512 -65029 -155541 -274431 -451336 -492787
11851d92787J22151N4613J12584Q3361J03145J37504m6370N4432j12846j89138
$$ -492787 -370636 -316023 -203439 -120078 -16933 120571 74201 128633 15787 -173351
11841a73351O7687K13470m8714l68324j76246Q8323J71755K9667m4721J94301
$$ -173351 -105664 107806 59092 -309232 -485478 -397155 -225400 -195733 -240454 -46153
11831d6153K26255j13016k20338q5645r4666k2704K73992K05823Q0832j03352
$$ -46153 180102 67086 -153252 -238897 -333563 -356267 -82275 123548 204380 101028
11821A01028l1382k1053j37665L0838J56249Q6030k4462k83756l50095K920K44530
$$ 101028 69646 48593 -89072 -58234 98015 184045 159583 -124173 -474268 -471348 -226818
11810b26818N9586o2964n2830j37545j5305J97163M33054J86905j28949j53618
$$ -226818 -167232 -230196 -283026 -420571 -435876 -238713 194341 381246 252297 98679
11800I8679j59292j14479j41374J19704K84108J30339R6019N2047m0747M8431
$$ 98679 -60613 -175092 -316466 -196762 87346 217685 313704 365751 325004 373435
11790C73435j03125j93808r8468n3040n2158R1626M0770o6566J9434J45568M3007
$$ 373435 270310 76502 -21966 -75006 -127164 -35538 5232 -61334 -41900 103668 146675
11779A46675k24102q6167K39107K48623R6901J294M0558L5573Q5730J95617p2114
$$ 146675 -77427 -163594 75513 324136 421037 422331 462889 498462 584192 779809 707695
11768G07695m1843j26951j50818J03300J67304M1686K6988j68777q6205m4534
$$ 707695 665852 538901 388083 491383 658687 700373 727361 558584 472379 427845
11758D27845j67934N8984j12231k57330j21079j4815m4431j23640k3024k8312
$$ 427845 259911 318895 206664 -50666 -171745 -186560 -230991 -354631 -377655 -405967
11748d05967Q0090J55529J02679r2552j51362p7252j16781p0977O8440J64045
$$ -405967 -325877 -170348 -67669 -160221 -311583 -388835 -505616 -576593 -508153 -344108
11738c44108J14747j6167j42396J05096K77284L09705J18202j21350j83481j09609
$$ -344108 -229361 -245528 -387924 -282828 -5544 304161 422363 301013 117532 7923
11728G923J04975K9447j0680k76369j15940J07582M44121K56282K53966k2745
$$ 7923 112898 142345 131665 -144704 -260644 -153062 291059 547341 801307 778562
11718G78562m08838k00196j27388j03704k1273K10452J08737k2199o4419N6777
$$ 778562 369724 169528 42140 -61564 -82837 127615 236352 214153 149734 206511
11708B06511Q9374k7932O6957R8967j93265m29600l55669p0636O1114P7629J67359
$$ 206511 295885 267953 334910 433877 240612 -188988 -544657 -615293 -554179 -476550 -309191
11697c09191n798l2735Q1193M0537P7341K7363K71410K53600J84301q8793l50514
$$ -309191 -314989 -347724 -266531 -225994 -148653 -121290 150120 403720 588021 499228 148714
11686A48714j65016j8261j17344J04306K80100K5489k82832j53370J10749J86650
$$ 148714 -16302 -34563 -151907 -47601 232499 257988 -24844 -178214 -67465 119185
11676A19185J33377r1513J3638r78q7880j55336P0773K3481r6095l2761r162p7952
$$ 119185 252562 161049 174687 173709 85829 -69507 1266 24747 -71348 -104109 -113271 -191223
11664a91223j51375j9528J38457J1925j60180j06648O6356J84884J27135r5698
$$ -191223 -342598 -362126 -223669 -211744 -371924 -478572 -412216 -227332 -100197 -195895
11654a95895L432m7915l037R3242k6212j07128p0605p6891R4947L03834K72446
$$ -195895 -192463 -240378 -243415 -150173 -176385 -283513 -354118 -431009 -336062 -32228 240218
11643B40218P2026q1095J06464J37308j27203k40028k6395L13717L34029M7457
$$ 240218 312244 231149 337613 474921 347718 107690 81295 395012 729041 776498
11633G76498j90568m22251l06979k5991M8960j5409j26156j27532J3965N9600
$$ 776498 585930 163679 -143300 -169291 -120331 -135740 -261896 -389428 -375463 -315863
11623c15863K13726L08152J03233q916l6004j82336m7320j31406j5041J74705
$$ -315863 -102137 206015 309248 300332 264328 81992 34672 -96734 -111775 62930
11613F2930K27027J32014J19843M4052j09188j03323k46850p4853J21333J48834
$$ 62930 289957 421971 541814 585866 476678 373355 126505 51652 172985 321819
11603C21819J07876J894l6571j32392j66230k47576j39809K1353n6161O075J27345
$$ 321819 429695 431589 395018 262626 96396 -151180 -290989 -269636 -325797 -319722 -192377
11592a92377J14159m0711k8380N3667R3452R9198J18324j4413J56206j2817j17476
$$ -192377 -78218 -118929 -147309 -93642 -190 99008 217332 202919 359125 346308 228832
11581B28832j67308l01645k04566Q3474K49874L64395K46335L2323J06604P979
$$ 228832 61524 -240121 -444687 -361213 -111339 253056 499391 531714 638318 646297
11571F46297j73873j03361K10475P6267p9233K61558J77082r5421r2352j65480
$$ 646297 472424 369063 579538 655805 576572 838130 1015212 919791 827439 661959
11561F61959K0792j01619n8814K49945k7223k2805J13485K7181l3465k15942J02834
$$ 661959 682751 581132 522318 772263 745040 722235 835720 862901 829436 613494 716328
11550G16328J50206j83688j50987j4182N1288j67469n7090J53237j6684l5734
$$ 716328 866534 682846 531859 517677 568965 401496 344406 497643 480959 445225
11540D45225J62357J42845P8935q8357k15034k68587l00709J17648K49091J66500
$$ 445225 607582 750427 829362 741005 525971 257384 -43325 74323 323414 489914
11530D89914K62394L43215J54756k59280j47398K55112K54187J02935K4019n642
$$ 489914 752308 1095523 1250279 990999 843601 1098713 1352900 1455835 1479854 1474212
11520A474212J94934N25859L79288L01513L29152N02496M44250M96296N34290
$$ 1474212 1669146 2195005 2574293 2875806 3204958 3707454 4151704 4648000 5182290
11511E182290O95407J064119J455706J707255K153673K470047K935391L460124
$$ 5182290 5877697 6941816 8397522 10104777 12258450 14728497 17663888 21124012
11503B1124012L863557M583009M798389M169552J693291j998502m895298o000207
$$ 21124012 24987569 29570578 34368967 38538519 40231810 38233308 33338010 27337803
11495B7337803n267559m260700l432192k746727k073857j664218j305484q85336
$$ 27337803 22070244 17809544 14377352 11630625 9556768 7892550 6587066 5701730
11487E701730p59737p60053o53450m97960m66266l90604l00780q7164J0519P0746
$$ 5701730 4941993 4181940 3528490 3030530 2564264 2173660 1872880 1785716 1796235 1866981
11477A866981p7626l01351j27984k7902J05076o6851o8298j19652k65439n9580
$$ 1866981 1789355 1488004 1360020 1332118 1437194 1370343 1302045 1182393 916954 857374
11467H57374J53136j38494k68624k7884q3981j34129m3248J08888R4117J14753
$$ 857374 1010510 872016 603392 575508 491527 357398 314150 423038 517155 631908
11457F31908k1997j06691j73521k71061q0007K2579J30146J53505K88451K35048
$$ 631908 609911 503220 329699 58638 -21369 1210 131356 284861 573312 808360
11447H08360r8012j35450j24781k18067r5583K5482K31270j2091j37719j08740
$$ 808360 710348 574898 450117 232050 136467 161949 393219 381128 243409 134669
11437A34669J710J01466O2498o0639j68942M532J93913L5139L9862J02231J08774
$$ 134669 136379 237845 300343 239704 70762 75294 269207 304346 344208 446439 555213
11426E55213K5665k4989O7375J55787q5114j97410k03576k25955q9081j31415
$$ 555213 580878 555889 623264 779051 693937 496527 292951 66996 -22085 -153500
11416a53500J0580R7193j8033k41581l10310j76542k7516o5716J24233J63361
$$ -153500 -142920 -45727 -63760 -305341 -615651 -792193 -819709 -885425 -761192 -597831
11406e97831O2266Q2208M00205J80630l7511o4380n1139Q0839L23294J57923k84739
$$ -597831 -535565 -453357 -53152 127478 89967 25587 -25552 55287 378581 536504 251765
11395B51765m12152l08658k47670l8785j18489J01549L85296K07801m4051k24151
$$ 251765 -160387 -469045 -716715 -755500 -873989 -772440 -387144 -179343 -223394 -447545
11385d47545j27021K7245J25524L48290L15452m4823j09431K8489K80854Q4574
$$ -447545 -574566 -547321 -421797 -73507 241945 197122 87691 116180 397034 481608
11375D81608j37240j72569j49671K16338J87570j06324k6346o984J439N6173O0482
$$ 481608 344368 171799 22128 238466 426036 319712 293366 286382 287821 343994 404476
11364D04476j907O9433J16001j63225k63899l700R2489j51198j90875M9658J41946
$$ 404476 402569 472002 588003 424778 160879 157179 249668 98470 -92405 -42747 99199
11353I9199k3230p1332o7592o8902n155O9113J42030J31011J39105K24584J03029
$$ 99199 75969 4637 -62955 -131857 -137012 -67899 74131 205142 344247 568831 671860
11342F71860j74513l44253k74724q8610K1898j2040J89282K43503l4779l3829
$$ 671860 497347 153094 -121630 -210240 -188342 -200382 -11100 232403 197624 163795
11332A63795p3716l19552l04662l1386M5220J27763L12603J03848J22493Q1993
$$ 163795 90079 -229473 -534135 -565521 -520301 -392538 -79935 23913 146406 228399
11322B28399k39877l41652k87676m8335K88316L36359J68764r8719j64425q4839
$$ 228399 -11478 -353130 -640806 -689141 -400825 -64466 104298 5579 -158846 -243685
11312b43685J8836r6609j7043O1449l1464L7964J08738j4198m1016l3081K06208
$$ -243685 -224849 -321458 -338501 -277052 -308516 -270552 -161814 -176012 -217028 -250109 -43901
11301d3901K79982l6437j23860N6502J69868L4499k62736j49067J03040J7964
$$ -43901 236081 199644 75784 132286 302154 336653 73917 -75150 27890 45854
11291D5854m2435q045O4358J23235O0754j75373j04686O5538J22564J19055l169
$$ 45854 3419 -4626 59732 182967 243721 68348 -36338 29200 151764 270819 267650
11280B67650M2501L28341L63179K0419J72115L80029L27907j43163m41601l13160
$$ 267650 310151 638492 1001671 1022090 1194205 1574234 1902141 1758978 1317377 1004217
11270A004217k02206j55300p1786k1530K41035J49835q3533j34313k72132k55359
$$ 1004217 802011 646711 574925 553395 794430 944265 860732 726419 454287 198928
11260A98928j35787N5688Q293O9363m6137o0407M6105L9319q5496J1615m899m3228
$$ 198928 63141 118829 127122 196485 150348 89941 136046 175365 89869 101484 96585 53357
11248E3357J86345K78363L14708J26044r0945p5664j59967j25115j84892j5831
$$ 53357 239702 518065 832773 958817 867872 792208 632241 507126 322234 306403
11238C06403K9950j55018k10555j86686O4331N8321k15396j80094P5616J74476
$$ 306403 336353 181335 -29220 -215906 -151575 -93254 -308650 -488744 -413128 -238652
11228b38652J71982R8464j73529j32618j01004k78816N855J48712Q5256R1085
$$ -238652 -66670 31794 -141735 -274353 -375357 -654173 -648318 -499606 -414350 -323265
11218c23265k0652o6426o5677o076J20939J9400K54096M48610K42375J7149J12002
$$ -323265 -343917 -410343 -476020 -482096 -361157 -341757 -87661 360949 603324 620473 732475
11207G32475N269j92214j11002J10007j1789k85338j57750K11279J84306q5965
$$ 732475 737744 545530 434528 544535 532746 247408 89658 300937 485243 399278
11197C99278j62470j43079j43401P1727J08242Q2564K32852N419o6441r2085L7757
$$ 399278 236808 93729 -49672 22055 130297 212861 445713 451132 384691 292606 330363
11186C30363J0824k7137J34667J4948k23003p2708q4284R3291K83051J29000q916
$$ 330363 341187 314050 448717 463665 240662 167954 83670 176961 460012 589012 580096
11175E80096n2729r0185k05586k13108j45206j3386J45256J73032n9814k68249
$$ 580096 527367 437182 231596 18488 -126718 -140104 5152 178184 118370 -149879
11165a49879k39343j55665Q3669K56369L57722K93751j11812k26134j48496J3596
$$ -149879 -389222 -544887 -461218 -204849 152873 446624 334812 108678 -39818 -26222
11155b6222J45845j10696j87017j94769j86267J9801K26033R6960N445L57603
$$ -26222 119623 8927 -178090 -372859 -559126 -539325 -313292 -216332 -210887 146716
11145A46716K11082N9623J4851q7919k51647k44986J16452K02683n937j52568
$$ 146716 357798 417421 432272 344353 92706 -152280 -35828 166855 160918 8350
11135H350j82360n4193J80991L0103l9053j25192k43110j52206J38976J63576
$$ 8350 -174010 -228203 -47212 -17109 -56162 -181354 -424464 -576670 -437694 -274118
11125b74118K67388K59314L5168m1610j76411j41216n2760J48658K9908k75791
$$ -274118 -6730 252584 287752 246142 69731 -71485 -124245 24413 54321 -221470
11115b21470n8592J41789J00431J13987M3786l6648l9141j02971j65234o3710
$$ -221470 -280062 -138273 -37842 76145 119931 83283 44142 -58829 -224063 -287773
11105b87773M9590M6844j2777m8393m3016J5477R1791K00600P4800q9521R7497
$$ -287773 -238183 -191339 -204116 -252509 -295525 -280048 -188257 12343 87143 -2378 95119
11094I5119J76643K22327J58785q7034l01851l18675p8765j66647j02750M7459
$$ 95119 271762 494089 652874 565840 263989 -54686 -133451 -300098 -402848 -355389
11084c55389J74962J04763Q0209R6580j02683j91265k08060j45073L7327J62809
$$ -355389 -180427 -75664 4545 101125 -1558 -192823 -400883 -545956 -508629 -345820
11074c45820J31015J16152Q2226n0747J2992J67706p950m9597j13834j45893p0077
$$ -345820 -214805 -98653 -16427 -67174 -54182 113524 105574 55977 -57857 -203750 -273827
11063b73827J3361J85951J12664O6441N1959k4068k31695l36795M4552M59837
$$ -273827 -260466 -74515 38149 104590 156549 132481 -99214 -436009 -391457 68380
11053F8380Q9070N0887l0332m943M9672k76780k47180Q9646L69404J17038j45761
$$ 68380 157450 208337 178005 173062 222734 -54046 -301226 -211580 157824 274862 129101
11042A29101j58629r5148M2292J43764J71438K4653p4901j07116o0469q8854j37577
$$ 129101 -29528 -124676 -82384 61380 232818 257471 182570 75454 14985 -73869 -211446
11031b11446P0526l2563N8383Q8635J82081K2210l58240l60577m8808o321p2549
$$ -211446 -140920 -173483 -115100 -26465 155616 177826 -180414 -540991 -589799 -596120 -668669
11020f68669k0242k42640p2683K98415L57661K64992J82731p412J3196R8257K19451
$$ -668669 -688911 -931551 -1004234 -705819 -348158 -83166 99565 92153 105349 203606 423057
11009D23057m1615k90794j91109k81162L113J27513o2078O5877K23025k3326r7211
$$ 423057 381442 90648 -100461 -381623 -378510 -250997 -313075 -247198 -24173 -47499 -144710
10998a44710k89522k41607J88676L51489L48668Q2285j14942k165p4083k9517
$$ -144710 -434232 -675839 -487163 -135674 212994 295279 180337 178172 104089 74572
10988G4572p3057J50674J41827J1780q3243P528p2073l568J30456M2592J2509
$$ 74572 1515 152189 294016 305796 222553 230081 158008 154440 284896 327488 339997
10977C39997Q719k24757k52633k25947j27287P1831J10422J48362J05554O6694
$$ 339997 348716 123959 -128674 -354621 -481908 -410077 -299655 -151293 -45739 20955
10967B0955j72231j49843Q6933L0427k13518j2674J30803N4866R3412j468m2049
$$ 20955 -151276 -301119 -214186 -183759 -397277 -409951 -279148 -224282 -130870 -132338 -174387
10956a74387j6558K5574K0868j96188n8105K7167J28340K22995R3881l40538k82368
$$ -174387 -190945 -165371 -144503 -340691 -398796 -371629 -243289 -20294 73587 -266951 -549319
10945e49319m5726J56041M17744J42380j12556j19988r3751O7005l4278n9487
$$ -549319 -595045 -439004 -21260 121120 8564 -111424 -205175 -138170 -172448 -231935
10935b31935N2408J30810J41658J28578P189k87533m27722j49319J25436K22604
$$ -231935 -179527 -48717 92941 221519 228708 -58825 -486547 -635866 -510430 -287826
10925b87826J36938j05552N6589p1362r9605N0553J87793q1293k11696J19073
$$ -287826 -150888 -256440 -199851 -271213 -370818 -320265 -132472 -213765 -425461 -306388
10915c06388L32453Q2532M3587K09232O4924j46271j3446k1939j22019r7121m2435
$$ -306388 26065 108597 152184 361416 426340 280069 266623 244684 122665 25544 -16891
10904a6891j58975k01446M4406P7638J12090J84977J17688N4563j63795j40380
$$ -16891 -175866 -377312 -332906 -255268 -143178 41799 159487 214050 50255 -90125
10894i0125l0290m8746J80279m4236r8887J28636k1716j47481O102J33780J73327
$$ -90125 -120415 -169161 11118 -33118 -132005 -3369 -25085 -172566 -166464 -32684 140643
10883A40643L8149j85366j21220L6635n3230p228K40295L77219O9094j06779k45521
$$ 140643 178792 -6574 -127794 -91159 -144389 -151617 88678 465897 534991 428212 182691
10872A82691l38406o5066J91056J47322J14376J21937J2811j11324l4257j58996
$$ 182691 -155715 -220781 -29725 117597 231973 353910 366721 255397 221140 62144
10862F2144m40839k75290K4386m3853J5793L04167J40597O0927J54107K77688
$$ 62144 -378695 -653985 -629599 -673452 -657659 -353492 -212895 -151968 2139 279827
10852B79827J74641j63094j99719l0198P1300J82682J5767j59371p9317O2944
$$ 279827 454468 291374 91655 61457 132757 315439 331206 171835 92518 155462
10842A55462N4596L133k8362q7994k06961q0405K61172K34961J7593l18352k29860
$$ 155462 210058 213191 184829 96835 -110126 -190531 70641 305602 323195 4843 -225017
10831b25017j05915j42960J40510J67477j8733J02079K12907J42058o9238n19066
$$ -225017 -330932 -473892 -333382 -165905 -184638 -82559 130348 272406 203168 -315898
10821c15898n00509j10158J62527L87535L90526J13731j88978j23737N0824J18548
$$ -315898 -816407 -926565 -764038 -376503 14023 127754 -61224 -184961 -134137 -15589
10811a5589j2716k63933L9100L28337J18386j89970j68479r3143q9528L20893
$$ -15589 -28305 -292238 -253138 75199 193585 3615 -164864 -258007 -347535 -26642
10801b6642L69033n1250l70219k90601L171L42234K16633k83399k79470K246N4729
$$ -26642 342391 291141 -79078 -369679 -366508 -24274 192359 -91040 -370510 -368264 -313535
10790c13535P4899J9179j03906j48629J47904J5862l19220k48511k0692J16231
$$ -313535 -238636 -219457 -323363 -471992 -324088 -308226 -627446 -875957 -896649 -780418
10780g80418K3600J40305K83259K48596K08567j24012p3368K2366j26829k12037
$$ -780418 -756818 -616513 -333254 -84658 123909 -103 -73471 -51105 -177934 -389971
10770c89971j67208r27J02135N4051k1664l7291N6833J91451K32459J03211j73181
$$ -389971 -557179 -558106 -455971 -401920 -423584 -460875 -404042 -212591 19868 123079 -50102
10759e0102k46361k4646J20998J44941o7748j93176j59716j02457j9135J74020
$$ -50102 -296463 -321109 -200111 -55170 -122918 -316094 -475810 -578267 -597402 -423382
10749d23382L37788J40057J94626K13151J6215p6132Q7063R8844l9611n7398m737
$$ -423382 -85594 54463 249089 462240 478455 402323 489386 588230 548619 491221 486484
10738D86484j05324m4879j22418r9236l999j51946J00009K4081l1899q0363K58742
$$ 486484 381160 336281 213863 114627 110628 -41318 58691 82772 50873 -29490 229252
10727B29252K09617r9197j00930r6787n1757j29672k1204L4601k1292P9675K19084
$$ 229252 438869 339672 238742 141955 90198 -39474 -60678 -26077 -47369 32306 251390
10716B51390K42981L2138l798L146j68735j88756L3642Q0383m3972R491J36237
$$ 251390 494371 526509 522711 525857 357122 168366 202008 282391 238419 247910 384147
10705C84147K49056r3005m11985k87818p5286J18359J95065j45775j72401J65149
$$ 384147 633203 540198 128213 -159605 -234891 -116532 78533 -67242 -239643 -74494
10695g4494M3594r1125m6588Q2515Q1720J69100J99239R9335P2215j54203l20783
$$ -74494 -30900 -122025 -168613 -86098 -4378 164722 363961 463296 535511 381308 60525
10684F0525j97732p9081m1835n3086K56179L42660j75174m33196Q3092L71002
$$ 60525 -137207 -216288 -258123 -311209 -55030 287630 112456 -320740 -237648 133354
10674A33354K02666j60583k86256J97108K38500J4306o9334j75635j64374J24349
$$ 133354 336020 175437 -110819 86289 324789 339095 269761 94126 -70248 54101
10664E4101K75909L42239K64423m9833l86312j99308N7878O9549j47096j58158
$$ 54101 330010 672249 936672 886839 500527 301219 359097 428646 281550 123392
10654A23392k89248k58870l3714J37848K46921M0061j47054K749j01541j60658
$$ 123392 -165856 -424726 -458440 -320592 -73671 -33610 -180664 -177915 -279456 -440114
10644d40114O1273J75943O9609k5212j88151j36817N2207J95449J50960k4508
$$ -440114 -378841 -202898 -133289 -158501 -346652 -483469 -431262 -235813 -84853 -109361
10634a09361N2631O3350q2691r2033K05092L5722j12395J74390r140j24175O9820
$$ -109361 -56730 6620 -76071 -168104 36988 72710 -39685 134705 125565 1390 71210
10623G1210P3448R2221j2332r890n1330k46706m43635k33027Q3291K09792L00550
$$ 71210 144658 236879 224547 214657 163327 -83379 -527014 -760041 -676750 -466958 -166408
10612a66408K03314M9189j9106Q7285K27742j1000q8633j14479j18909j90525
$$ -166408 36906 86095 66989 154274 382016 371016 282383 167904 48995 -141530
10602a41530j67963O2495o123j60267n0411L3215j23598O1382K30818M3491m902
$$ -141530 -309493 -246998 -253121 -413388 -463799 -430584 -554182 -492800 -261982 -218491 -223393
10591b23393K527J09127K48122L84661Q0789k64197k29539p6395k88210k22452
$$ -223393 -220866 -111739 136383 521044 601833 337636 108097 31702 -256508 -478960
10581d78960K25042K91075J72733N072l62285l03130j3560l9995q8522q2050K5054
$$ -478960 -253918 37157 209890 214962 -147323 -450453 -464013 -504008 -592530 -674580 -649526
10570f49526l330J00831J80517q9770k02189N8637O7451J94881O2666j93833p3199
$$ -649526 -652856 -552025 -371508 -461278 -663467 -604830 -537379 -342498 -279832 -473665 -546864
10559e46864l1078n6522M8319L92487K55487m5477n3165K09449J60588J4250j14495
$$ -546864 -577942 -634464 -586145 -193658 61829 16352 -36813 172636 333224 347474 232979
10548B32979j48096M4215K44675K14255j41444k01430j03138l2685J32982K22503
$$ 232979 84883 129098 373773 588028 446584 245154 142016 109331 242313 464816
10538D64816m2057N4120J22264J11477j239J04909l3195j74378j71340k56638
$$ 464816 422759 476879 599143 710620 709381 814290 781095 606717 435377 178739
10528A78739k71454l09386j32937K44084M55917J79779j96146j0177p7927j12865
$$ 178739 -92715 -402101 -535038 -290954 164963 344742 148596 138419 60492 -52373
10518e2373R7587k20712k78064R9399K65116J99654J65549J07366J7617o9313
$$ -52373 45214 -175498 -453562 -354163 -89047 110607 276156 383522 401139 331826
10508C31826j98669l01583k71680R4018J20660j10188j34893P3422K59315K39792
$$ 331826 133157 -168426 -440106 -346088 -225428 -335616 -470509 -397087 -137772 102020
10498A02020k0841L1123J84722p1839j04580R3760P6107J19333p9842j69215j26866
$$ 102020 81179 112302 297024 225185 120605 214365 290472 409805 329963 160748 33882
10487C3882n0400r0344r7257J21834R4006N5687J95621j52387l53906j58040L5130
$$ 33882 -16518 -106862 -204119 -82285 11721 67408 263029 110642 -243264 -401304 -366174
10476c66174p2408j66395M1849L8195K99558L85624J44693m5119k05929k27647
$$ -366174 -438582 -604977 -563128 -524933 -225375 160249 304942 259823 53894 -173753
10466a73753l40024k23829J71389K65909R7952k382o0842M647m2847r6814l2760
$$ -173753 -513777 -737606 -566217 -300308 -202356 -204738 -265580 -260933 -303780 -400594 -433354
10455d33354K15499L18994L4026O6764m7439j34164j33251o2412K39013J28592
$$ -433354 -217855 101139 135165 201929 154490 20326 -112925 -175337 63676 192268
10445A92268k0805m5869j48984k60841l11990k4862J43043o1949k2561N3998L7738
$$ 192268 171463 125594 -23390 -284231 -596221 -621083 -478040 -539989 -562550 -508552 -470814
10434d70814J95629R7185r5386p0235J15098K33653J63336L1743R5576R6016j0848
$$ -470814 -275185 -178000 -273386 -343621 -228523 5130 168466 200209 295785 391801 380953
10423C80953j64412r6286o2258j18888k43254l16281j19481J32829J71293J97751
$$ 380953 216541 120255 57997 -60891 -304145 -620426 -739907 -607078 -435785 -238034
10413b38034K66225K53662J75699m1476q8651j40662l78058k40772R4832J79958
$$ -238034 28191 281853 457552 416076 327425 186763 -191295 -432067 -337235 -157277
10403a57277J08115J34768j90749k90200j1302J45409Q8682J03115K62112N2331
$$ -157277 -49162 85606 -105143 -395343 -406645 -261236 -172554 -69439 192673 245004
10393B45004q0760j42162r738K7212j05163l4183j0089J84114j8256l36472k47352
$$ 245004 164244 22082 12344 39556 -65607 -99790 -109879 74235 55979 -280493 -527845
10382e27845j21334J43370J10179O9788J97484K7217L2875J3598q3061j4884K6802
$$ -527845 -649179 -505809 -395630 -325842 -128358 -101141 -68266 -54668 -137729 -152613 -125811
10371a25811p5437J54228J03415O2018K1378j15742m2125l2349J35378l1136k52951
$$ -125811 -201248 -47020 56395 118413 139791 24049 -18076 -50425 84953 53817 -199134
10360a99134k12457p12J07904l2271M9306K22424J16516P2965Q1212j17355j22449
$$ -199134 -411591 -412303 -304399 -336670 -287364 -64940 51576 124541 205753 88398 -34051
10349c4051k233K4157N7605m913J05781K30243k23298l86993m1694J31908J21715
$$ -34051 -36284 -12127 45478 40565 146346 376589 153291 -233702 -275396 -143488 -21773
10338b1773J62638K05806j53403m97755l51249j36753O5466J35554K07473J52444
$$ -21773 140865 346671 193268 -304487 -655736 -792489 -727023 -591469 -383996 -231552
10328b31552K30573L77028J06097j26423k14842k55201l42786k00334J22116K04392
$$ -231552 -979 376049 482146 355723 140881 -114320 -457106 -657440 -535324 -330932
10318c30932K53109J28694M0266k8325j7128l6031k17362p5476J53857J52193
$$ -330932 -77823 50871 91137 62812 45684 9653 -207709 -283185 -129328 22865
10308B2865L2514m4516m613O4022J92204K59369J14217K97795L0872l54628l15306
$$ 22865 55379 10863 6250 70272 262476 521845 636062 933857 964729 610101 294795
10297B94795l88214l64951n6358K66461K20546m419P1141L7594l0970P2181J81592
$$ 294795 -93419 -458370 -514728 -248267 -27721 -32140 39001 76595 45625 117806 299398
10286B99398M8091M7291n0276j73172n5646J38465J52729M0838o6041k6136j66581
$$ 299398 347489 394780 344504 171332 115686 254151 406880 447718 381677 355541 188960
10275A88960p4526n9169o3306Q1337Q7663J7793n9266J72554R0909N890j66228
$$ 188960 114434 55265 -8041 73296 160959 178752 119486 292040 382949 388839 222611
10264B22611k88821j36925k28246j89764O0725j35148k88509p4237J18251K73912
$$ 222611 -66210 -203135 -431381 -621145 -560420 -695568 -984077 -1058314 -940063 -666151
10254f66151J99205N0280M3598J27219M9547n9608o7479q8992l2566M6339J71286
$$ -666151 -466946 -416666 -373068 -245849 -196302 -255910 -323389 -412381 -444947 -398608 -227322
10243b27322p1990l95868l57389L888L93426J97885j12076N0037J17827Q4353
$$ -227322 -299312 -695180 -1052569 -1048681 -655255 -457370 -569446 -519409 -401582 -317229
10233c17229q7574J8806K0409J52990K12483O7940k67228l69636j38241R758J67932
$$ -317229 -404803 -385997 -365588 -212598 -115 67825 -199403 -569039 -707280 -697522 -529590
10222e29590J38332L5681j11734j13397k24476k92365l8800K24155M14746K94269
$$ -529590 -391258 -355577 -467311 -580708 -805184 -1097549 -1136349 -912194 -497448 -203179
10212b03179J22924P4578q9149j4570J65422P064n7747J14536J05913J9604j43369
$$ -203179 -80255 -5677 -94826 -109396 56026 63090 5343 119879 225792 245396 102027
10201A02027k93595m01867k14785q5190o4377J68415K62496J00590R5902M4082
$$ 102027 -191568 -593435 -808220 -893410 -957787 -789372 -526876 -426286 -330384 -286302
10191b86302J9980l9961j13928M4811K60068J98573K0849J61032L01054J60615
$$ -286302 -266322 -306283 -420211 -375400 -115332 83241 104090 265122 566176 726791
10181G26791o6841k12273j02279j81920j49659M6966p7752m6730K9608R4571J36845
$$ 726791 659950 447677 345398 163478 13819 60785 -16967 -63697 -34089 60482 197327
10170A97327K31258q7092l29257l26596p6063j7864J74644J97058j08013j36418
$$ 197327 428585 341493 12236 -314360 -390423 -408287 -233643 -36585 -144598 -281016
10160b81016o6955j10670j42161m0745J68666L74789J82277m646K5285k4795l1090
$$ -281016 -347971 -458641 -600802 -641547 -472881 -98092 84185 79539 104824 80029 48939
10149D8939j54985k10087J40194L00740M4091k91127l04229j91963M1638K70924
$$ 48939 -106046 -316133 -175939 124801 168892 -122235 -426464 -618427 -576789 -305865
10139c05865P8559j1267K54473L17102P5008j12923q8844J578J9922L467j79481
$$ -305865 -227306 -238573 15900 333002 408010 295087 206243 207821 227743 231210 51729
10128E1729p6339j24998j64532n5756j11123M0996J21941J96314K54768M95P8226
$$ 51729 -24610 -149608 -314140 -369896 -481019 -440023 -318082 -121768 133000 133495 211721
10117B11721L16691p1549k90088k052J30525K45062L9170m91244k05105q8257
$$ 211721 528412 456863 166775 164723 295248 540310 579480 88236 -116869 -205126
10107b05126j77511k9017N4253J71j16769M339K21744J32202m4549K9220r2282
$$ -205126 -382637 -411654 -357401 -357230 -473999 -469660 -247916 -115714 -160263 -131043 -223325
10096b23325r0252O6149l997J19277L4712j00692P5255J83785L50764K47731O2091
$$ -223325 -313577 -247428 -251425 -132148 -97436 -198128 -122873 60912 411676 659407 721498
10085G21498N317j05079p4685j51994m57656m07941l1065J25698Q2853O7663P2484
$$ 721498 726815 621736 547051 395057 -62599 -470540 -501605 -375907 -293054 -225391 -152907
10074a52907R9634k7152J18893J64167j11887j34636J29529J23471J25096j21953
$$ -152907 -53273 -80425 38468 202635 90748 -43888 85641 209112 334208 212255
10064B12255k59228j47482j10722P123L17n996P078r3115L4015K75639J66514
$$ 212255 -46973 -194455 -305177 -298054 -297737 -303733 -296655 -389770 -355755 -80116 86398
10053H6398L23211J20036j01157j20824j01437L3073J19128j7514j57816j13101
$$ 86398 409609 529645 428488 307664 206227 239300 358428 340914 183098 69997
10043F9997K289n9662k01721j83245r3724j90542j49011K29047J58585K2069Q4988
$$ 69997 72286 12624 -189097 -372342 -466066 -656608 -805619 -576572 -417987 -395918 -310930
10032c10930L51399L0965k94258l04899M6246K70278O9152j01222k37239q0304
$$ -310930 40469 71434 -222824 -527723 -481477 -211199 -142047 -243269 -480508 -560812
10022e60812P3098J47652J92574J31797j06251n7418N6123L2028J52012J57609
$$ -560812 -487714 -340062 -147488 -15691 -121942 -179360 -123237 -91209 60803 218412
10012B18412J6001n2654p9125L0940p0250n0977L0775N2410j99359q1360J85277
$$ 218412 234413 181759 102634 133574 63324 12347 43122 95532 -103827 -185187 90
10001I0J70667m9685j29276L8656Q8549M8704m6874j95305k8911r3417k30785
$$ 90 170757 121072 -8204 30452 119001 167705 120831 -74474 -103385 -196802 -427587
9990d27587k9405K87446J86045k51394k77382J82061J23059j98969q0948n8720
$$ -427587 -456992 -169546 16499 -234895 -512277 -330216 -207157 -406126 -487074 -545794
9980e45794L2903J82411O0698j08359m4729K37088L1774Q7538j06664r8555J10165
$$ -545794 -512891 -330480 -269782 -378141 -422870 -185782 -154008 -66470 -173134 -271689 -161524
9969a61524M8926Q3104l9467j4109J87167J6132j68434m7263P33M5595N3158L8401
$$ -161524 -112598 -29494 -68961 -83070 104097 120229 -48205 -95468 -94735 -49140 4018 42419
9957D2419l3750q0108j58747p8437J60493K7809P5916J98746L28920J24805j93749
$$ 42419 8669 -71439 -230186 -308623 -148130 -120321 -44405 154341 483261 608066 414317
9946D14317j39326J7161R239l1119q3122k09816j99224K3088J88943Q4517J10030
$$ 414317 274991 292152 301391 270272 187150 -22666 -221890 -198802 -9859 74658 184688
9935A84688L8291J31452r3640k39419N5337J40639K3519j63910j8870L706j6740
$$ 184688 222979 354431 260791 21372 76709 217348 240867 76957 58087 61793 45053
9924D5053K5607J44666K01696j02379q8542O8522J13545m1479o8223K7352J02392
$$ 45053 70660 215326 417022 314643 226101 294623 408168 366689 298466 325818 428210
9913D28210k70119l91210j57747J25293L12536K19334P1263J06765Q0669N5551
$$ 428210 158091 -233119 -390866 -265573 46963 266297 337560 444325 524994 580545
9903E80545k88k0940P3639r2621j11832P0827R1538K13255L84619L12875M6830
$$ 580545 580257 559317 632956 540335 428503 499330 590868 804123 1188742 1501617 1548447
9892A548447j73890k9725k9036O3309L28234K32315J58815J4801j32898j0232
$$ 1548447 1374557 1344832 1315796 1379105 1707339 1939654 2098469 2113270 1980372 1970140
9882A970140j1660l11443j42952L5261P5837j58449k2605J31563J83059J62692
$$ 1970140 1958480 1647037 1504085 1539346 1615183 1456734 1434129 1565692 1748751 1911443
9872A911443j74544k50214k08834j32106j03428n7847N9626J99257j6357o5490
$$ 1911443 1736899 1486685 1277851 1145745 1042317 984470 1044096 1243353 1226996 1161506
9862A161506p6207l05810l82042k20991j38843K9540J13917o3473k57659l71682
$$ 1161506 1085299 779489 397447 176456 37613 67153 181070 117597 -140062 -511744
9852e11744O8677M79819J26103k03658J4589j04522K4790L38721O8052j79307
$$ -511744 -443067 36752 162855 -40803 -26214 -130736 -105946 232775 300827 121520
9842A21520j74448j19316K0273J59312J90674R7064K0300j56651p3551j26291
$$ 121520 -52928 -172244 -151971 7341 198015 295079 315379 158728 85177 -41114
9832d1114k53711J213K57992L34549K03016j08913k38516j84910r5919k854K15820
$$ -41114 -294825 -293612 -35620 298929 501945 393032 154516 -30394 -126313 -129167 86653
9821H6653J70095k23920j07032Q340P4484K73686R1466j85999l45838q1765J01299
$$ 86653 256748 32828 -74204 -65864 8620 282306 373772 187773 -158065 -239830 -138531
$$ [...]
##END NTUPLES=NMR SPECTRUM
##END=
