##TITLE=C13_SR167_k3
 DMSO-d6, 24300 sc

 14.3.2023
##JCAMPDX= 6.0         $$ Bruker NMR JCAMP-DX V2.0
##DATA TYPE= NMR SPECTRUM
##DATA CLASS= NTUPLES
##ORIGIN= UXNMR, Bruker Analytische Messtechnik GmbH
##OWNER= root
$$ XWIN-NMR		Version 3.5
$$ Fri Mar 17 13:46:49 2023 Russian Standard Time (UT+4h)  she@DPX200
##.OBSERVE FREQUENCY= 50.327896
##.OBSERVE NUCLEUS= ^13C
##.ACQUISITION MODE= SIMULTANEOUS
##.ACQUISITION SCHEME= undefined
##.AVERAGES= 24304
##.DIGITISER RES= 17
##SPECTROMETER/DATA SYSTEM= spect
##.PULSE SEQUENCE= zgpg30
##.SOLVENT NAME= DMSO
##.SHIFT REFERENCE= (INTERNAL, DMSO, 0, 222.624)
##AUDIT TRAIL= $$ (NUMBER, WHEN, WHO, WHERE, WHAT)
$$ ##TITLE= Audit trail, XWIN-NMR		Version 3.5
$$ ##JCAMPDX= 5.01
$$ ##ORIGIN= Bruker BioSpin GmbH
$$ ##OWNER= she
$$ F:/spectra/data/she/nmr/c13/1/pdata/1/auditp.txt
$$ ##AUDIT TRAIL=  $$ (NUMBER, WHEN, WHO, WHERE, WHAT)
(   1,<2023-03-17 13:44:35.50 +0400>,<she>,<DPX200>,
      <created by zg, POWCHK disabled, PULCHK disabled
       terminated by command 'halt'
       configuration hash MD5:
       00 E9 B6 7A A2 85 ED C7 34 08 36 98 17 FE 4E 26
       data hash MD5: 32K
       57 98 1E DD 7A DD 09 1C FE 1D DB 49 33 12 00 72>)
(   2,<2023-03-17 13:45:00.12 +0400>,<she>,<DPX200>,
      <Start of raw data processing
       efp BC_mod = 2 LB = 2 FT_mod = 6 PKNL = 1 PHC0 = -324.2905 PHC1 = 35.41809 SI = 32K 
       data hash MD5: 32K
       3E E6 43 30 84 91 C9 34 0C 42 BC 75 4F FB F3 8D>)
(   3,<2023-03-17 13:45:02.75 +0400>,<she>,<DPX200>,
      <abs ABSG = 5 
       data hash MD5: 32K
       98 79 A7 B3 42 24 0D 76 B6 DD 76 F9 20 C1 75 8D>)
(   4,<2023-03-17 13:45:25.04 +0400>,<she>,<DPX200>,
      <pk PHC0 = 7.229011 PHC1 = -6.799999 
       data hash MD5: 32K
       A7 28 55 C9 91 BD BC 07 B8 FE 14 53 54 40 2A 84>)
(   5,<2023-03-17 13:45:28.15 +0400>,<she>,<DPX200>,
      <abs ABSG = 5 
       data hash MD5: 32K
       D6 CC 72 FE EB 6F 0D E6 6D D9 84 9C F4 9B 7E 53>)
$$ ##END=
$$ 
$$ hash MD5
$$ 4E 7B E8 A3 78 23 F4 4B B6 90 79 C3 8C 78 58 50
##$RELAX= 
##$RELAX= 
##$RELAX= 
##$RELAX= 
##$RELAX= 
##$RELAX= 
##$RELAX= 
##$RELAX= 
$$ Bruker specific parameters
$$ --------------------------
##$DU= <F:/spectra>
##$EXPNO= 1
##$NAME= <c13>
##$PROCNO= 1
##$TYPE= <nmr>
##$USER= <she>
##$AMP= (0..31)
100 100 100 100 100 100 100 100 100 100 100 100 100 100 100 100 100 100 
100 100 100 100 100 100 100 100 100 100 100 100 100 100 
##$AQSEQ= 0
##$AQ_mod= 1
##$AUNM= <au_zg>
##$AUTOPOS= <>
##$BF1= 50.322709
##$BF2= 200.13
##$BF3= 50.322709
##$BF4= 500.13
##$BF5= 500.13
##$BF6= 500.13
##$BF7= 500.13
##$BF8= 500.13
##$BYTORDA= 1
##$CFDGTYP= 0
##$CFRGTYP= 5
##$CHEMSTR= <none>
##$CNST= (0..31)
1 1 145 1 1 1 1 1 1 1 1 1 1 1 1 1 1 1 1 1 1 1 1 1 1 1 1 1 1 1 1 1 
##$CPDPRG= <waltz16>
##$CPDPRG1= <>
##$CPDPRG2= <waltz16>
##$CPDPRG3= <>
##$CPDPRG4= <mlev>
##$CPDPRG5= <mlev>
##$CPDPRG6= <mlev>
##$CPDPRG7= <mlev>
##$CPDPRG8= <mlev>
##$CPDPRGB= <>
##$CPDPRGT= <>
##$D= (0..31)
$$ [...]
##$SUBNAM4= <"">
##$SUBNAM5= <"">
##$SUBNAM6= <"">
##$SUBNAM7= <"">
##$SUBNAM8= <"">
##$SUBNAM9= <"">
##$SW= 239.972175391363
##$SWIBOX= (0..15)
0 1 3 0 0 0 0 0 0 0 0 0 0 0 0 0 
##$SW_h= 12077.2946859903
##$TD= 32768
##$TD0= 1
##$TE= 0
##$TE2= 300
##$TE3= 300
##$TEG= 300
##$TL= (0..7)
120 120 120 120 120 120 120 120 
##$TP= (0..7)
150 150 150 150 150 150 150 150 
##$TP07= 0
##$TPNAME0= <>
##$TPNAME1= <>
##$TPNAME2= <>
##$TPNAME3= <>
##$TPNAME4= <>
##$TPNAME5= <>
##$TPNAME6= <>
##$TPNAME7= <>
##$TPOAL= (0..7)
0.5 0.5 0.5 0.5 0.5 0.5 0.5 0.5 
##$TPOFFS= (0..7)
0 0 0 0 0 0 0 0 
##$TUNHIN= 0
##$TUNHOUT= 0
##$TUNXOUT= 0
##$USERA1= <user>
##$USERA2= <user>
##$USERA3= <user>
##$USERA4= <user>
##$USERA5= <user>
##$V9= 5
##$VALIST= <valist>
##$VCLIST= <CCCCCCCCCCCCCCC>
##$VD= 0
##$VDLIST= <DDDDDDDDDDDDDDD>
##$VPLIST= <PPPPPPPPPPPPPPP>
##$VTLIST= <TTTTTTTTTTTTTTT>
##$WBST= 1024
##$WBSW= 4
##$XGAIN= (0..3)
0 0 0 0 
##$XL= 0
##$YL= 0
##$YMAX_a= 158961424
##$YMIN_a= -56527637
##$ZGOPTNS= <>
##$ZL1= 120
##$ZL2= 120
##$ZL3= 120
##$ZL4= 120
##$ABSF1= 222.624
##$ABSF2= -17.3728
##$ABSG= 5
##$ABSL= 3
##$ALPHA= 0
##$AQORDER= 0
##$ASSFAC= 0
##$ASSFACI= 0
##$ASSFACX= 0
##$ASSWID= 0
##$AUNMP= <proc_1d>
##$AZFE= 0.1
##$AZFW= 0.5
##$BCFW= 0
##$BC_mod= 2
##$BYTORDP= 0
##$COROFFS= 0
##$CY= -3
##$DATMOD= 1
##$DC= 0
##$DFILT= <>
##$DTYPP= 0
##$F1P= 0
##$F2P= 0
##$FCOR= 0.5
##$FTSIZE= 32768
##$FT_mod= 6
##$GAMMA= 0
##$GB= 0
##$INTBC= 1
##$INTSCL= 4.134877e-10
##$ISEN= 128
##$LB= 2
##$LEV0= 0
##$LPBIN= 0
##$MAXI= 10000
##$MC2= 0
##$MEAN= 0
##$ME_mod= 0
##$MI= 0.1934396
##$NCOEF= 0
##$NC_proc= 3
##$NLEV= 6
##$NOISF1= 120.0001
##$NOISF2= 80.00006
##$NSP= 0
##$NTH_PI= 0
##$NZP= 0
##$OFFSET= 222.624
##$PC= 1.4
##$PHC0= -317.0615
##$PHC1= 28.61809
##$PH_mod= 1
##$PKNL= yes
##$PPARMOD= 0
##$PSCAL= 0
##$PSIGN= 0
##$REVERSE= no
##$SF= 50.3227315983092
##$SI= 32768
##$SIGF1= 140
##$SIGF2= 120
##$SINO= 11.81781
##$SIOLD= 32768
##$SREGLST= <13C.CDCl3>
##$SSB= 0
##$STSI= 32768
##$STSR= 0
##$SW_p= 12077.2946859903
##$SYMM= 0
##$S_DEV= 0
##$TDeff= 32768
##$TDoff= 0
##$TI= <>
##$TILT= no
##$TM1= 0
##$TM2= 0
##$TOPLEV= 0
##$USERP1= <user>
##$USERP2= <user>
##$USERP3= <user>
##$USERP4= <user>
##$USERP5= <user>
##$WDW= 1
##$XDIM= 32768
##$YMAX_p= 506993671
##$YMIN_p= -1032713
$$ End of Bruker specific parameters
$$ ---------------------------------
##NTUPLES= NMR SPECTRUM
##VAR_NAME=  FREQUENCY,     SPECTRUM/REAL,   SPECTRUM/IMAG
##SYMBOL=    X,             R,               I
##VAR_TYPE=  INDEPENDENT,   DEPENDENT,       DEPENDENT
##VAR_FORM=  AFFN,          ASDF,            ASDF
##VAR_DIM=   32768,         32768,           32768
##UNITS=     HZ,            ARBITRARY UNITS, ARBITRARY UNITS
##FACTOR=    0.368581032318806, 1,           1
##FIRST=     11203.0474430531, 0,            0
##LAST=      -874.247242937185, 0,           0
##MIN=       -874.247242937185, -1032713,    0
##MAX=       11203.0474430531, 506993671,    0
$$ Real data points
##PAGE= N=1
##DATA TABLE= (X++(R..R)), XYDATA
$$ [...]
11135H234K348j4780q2507j29011j07203o2828k8255m656J2049K2238L3227K3465
$$ 8234 10582 -4198 -86705 -215716 -322919 -385747 -414002 -418658 -406609 -384371 -351144 -327679
11123c27679P250K3852M9975M7480K1548J1202N190k4314l1700J9698O2907L6807
$$ -327679 -320429 -296577 -246602 -199122 -177574 -166372 -161182 -185496 -217196 -197498 -134591 -97784
11111i7784j0154k4245j9316j7021k4464k4606l5146o2679p6285n7875P341Q6774
$$ -97784 -107938 -132183 -151499 -168520 -192984 -217590 -252736 -315415 -391700 -449575 -442234 -355460
11099c55460R8531M7546J6534K5223M7221P4373O6001l287o2451o1893n589N6364
$$ -355460 -256929 -209383 -192849 -167626 -120405 -46032 19969 16682 -45769 -107662 -113251 -56887
11087e6887P4781O5265M1053j0382q2567j24166q0801L5349J06078R1283O0306
$$ -56887 17894 83159 124212 113830 31263 -92903 -173704 -138355 -32277 59006 119312
11076A19312N2453K8443k3429n5062o8196o7946l7559J1194L2338J7893M443k5320
$$ 119312 171765 200208 176779 121717 53521 -14425 -51984 -40790 -8452 9441 13884 -11436
11064a1436n5390l6926L839K7189L1548J6162Q716L4370O7533O0188J4168l9108
$$ -11436 -66826 -103752 -99913 -72724 -41176 -25014 -16298 18072 85605 145793 159961 120853
11052A20853j01902j33915j18632p8036j5964M6465Q5361Q7840O0911K9592K6448
$$ 120853 18951 -114964 -233596 -311632 -327596 -281131 -195770 -107930 -47019 -17427 9021
11041I021L2474K1312K0998L7945M4453L1017K0073M5955P6256N3629j6647p5811
$$ 9021 41495 62807 83805 121750 166203 197220 217293 263248 339504 393133 376486 300675
11029C00675p2773n1506m7378n9544o7948o7009m4483J9233P8767R2672Q7745
$$ 300675 227902 176396 129018 69474 1526 -65483 -109966 -90733 -11966 80706 168451
11018A68451P3813O4717O5668O4829N6278J7948k9305m0543n2246q7286j08837
$$ 168451 242264 306981 372649 437478 493756 511704 482399 441856 389610 302324 193487
11007A93487q2879k8327j6896k6432J405K2824N489n874k8139o6372p9067n8754
$$ 193487 110608 82281 65385 38953 40358 63182 68671 62797 34658 -31714 -110781 -169535
10995a69535m1091m3669m1999j4379N994O993J6102m06l7678m1947J3770R4594
$$ -169535 -210626 -254295 -296294 -310673 -304679 -297686 -281584 -281990 -319668 -361615 -347845 -253251
10983b53251J29959Q5001O557k3792k1158j2685K5327N5641J3716m8126m8484
$$ -253251 -123292 -38291 -31734 -55526 -76684 -89369 -64042 -8401 5315 -42811 -91295
10972i1295k0485j7466j8393j8470l5928n1523m9881l5090o541K1912L0164K5444
$$ -91295 -111780 -129246 -147639 -166109 -202037 -253560 -303441 -338531 -345072 -323160 -292996 -267552
10960b67552L0448M5402P2433R1644P4115K3389k5320n2707p1426r1119p4781
$$ -267552 -237104 -191702 -119269 -27625 46490 69879 44559 -8148 -79574 -170693 -245474
10949b45474J0909J16273J64219J43784R7714K9767k9455m3015m3868n3097o9671
$$ -245474 -234565 -118292 45927 189711 287425 317192 287737 244722 200854 147757 78086
10938G8086n8481k5093k9211r4115j45558j13796n3134q87L4642L3385J8424K7574
$$ 78086 19605 -5488 -34699 -128814 -274372 -388168 -441302 -442189 -407547 -374162 -355738 -328164
10926c28164O8717J23154J57921J34042N6861n2j0130l7260r4615j39211j53589
$$ -328164 -259447 -136293 21628 155670 212531 212479 202349 165089 70474 -68737 -222326
10915b22326j45201j14140n4773J9042N9646L3168k0219m4533j9089L0022O5551
$$ -222326 -367527 -481667 -536440 -517398 -457752 -424584 -444803 -489336 -508425 -478403 -412852
10904d12852N9498M9913N8258P2105R2781R5658O8840L2414l33j2686M975L9399
$$ -412852 -353354 -303441 -245183 -173078 -80297 15361 84201 116615 116282 103596 108571 147970
10892A47970N6548K3267p950k4445p2631r9170o4484j5736K7716P8255R5741Q3415
$$ 147970 204518 227785 219835 195390 122759 23589 -40895 -56631 -28915 49340 145081 228496
10880B28496M9576j5139n9998l9721N349J7261k8401r5978j11890n4214P593N579
$$ 228496 278072 262933 202935 163214 168563 185824 157423 61445 -50445 -104659 -97066 -91487
10868i1487J623M5202J02545J19813P4211L355l1823j2616M7604P9325N7494K9140
$$ -91487 -89864 -44662 57883 177696 251907 255262 223439 210823 258427 337752 395246 424386
10856D24386R924n912k2710m9697p1340o2860l1834O806L1167K5714K587j6468
$$ 424386 434310 428398 405688 355991 284651 221791 189957 196763 227930 253644 256231 239763
10844B39763k8462l5222k9707l9563p8636j05158q3186l1005J3558M7747O5879
$$ 239763 211301 176079 146372 106809 28173 -76985 -160171 -191176 -177618 -129871 -63992
10833f3992O3765N2168M1332J8280l3383r6695j50222j63855j00115M277N8952
$$ -63992 -227 51941 93273 111553 78170 -18525 -168747 -332602 -432717 -428440 -369488
10822c69488M8720N3860Q9465J21792J37939J09218N9751M1875O3205P1352J9206
$$ -369488 -320768 -266908 -177443 -55651 82288 191506 251257 293132 356337 427689 446895
10811D46895o8787j17894q9200k9713P488j6965p1680q7569o1720l6678k8090
$$ 446895 378108 260214 171014 141301 148789 131824 60144 -27425 -89145 -125823 -153913
10800a53913j8378q335j0226k642M863k6946p2427p1545k4756L0827P9867J10733
$$ -153913 -172291 -180626 -190852 -193494 -188631 -215577 -288004 -359549 -384305 -353478 -273611 -162878
10788a62878J05585Q0263K5986k5895j5809L7972P7397P0407L4830j1462m7630
$$ -162878 -57293 22970 48956 23061 7252 45224 122621 193028 227858 216396 168766
10777A68766n7512l1726K4209O3541M3591k9625q2224o8345k9225j6658k6259
$$ 168766 111254 79528 103737 167278 210869 181244 99020 30675 1450 -15208 -41467
10766d1467l4610m9109l9649Q624M4509M5398J7561l3696n3864k9257J2056N7471
$$ -41467 -76077 -125186 -164835 -156211 -111702 -66304 -48743 -82439 -136303 -165560 -153504 -96033
10754i6033Q0649Q4800O2796K0752J0312L9299O0769M9531K917o7626j08111p8038
$$ -96033 -15384 69416 132212 152964 163276 202575 263344 312875 315792 248166 140055 62017
10742F2017j3342K6272K7051J3460o77j560J0832J7443J1290P309J6127J0999
$$ 62017 48675 74947 101998 115458 114781 113221 124053 141496 152786 160095 176222 187221
10730A87221k1074n1214o3044n1202q973L6725M2121P143l4689n6292o3002r5639
$$ 187221 166147 114933 51889 687 -8286 28439 70560 77703 43014 -13278 -76280 -171919
10718a71919j18273q4690l6738k6776k5939j3777r479P853L4181N8378P9579P7485
$$ -171919 -290192 -374882 -411620 -438396 -464335 -478112 -487591 -479738 -445557 -387179 -307600 -230115
10706b30115M3270L545N845L2692M4048M3579M1220L7117l99m6541l9002L286
$$ -230115 -186845 -183300 -177455 -144763 -100715 -57136 -15916 21201 20802 -25739 -64741 -61455
10694f1455J7588k5652p9089p8401k7161L4380P1681P2329L0095j2796k2197l974
$$ -61455 -43867 -69519 -148608 -227009 -254170 -219790 -148109 -75780 -45685 -58481 -80678 -84652
10682h4652L8553P0106N5217L9946Q6382J50237J57729J09910N7765K8326J2451
$$ -84652 -46099 24007 79224 119170 205552 355789 513518 623428 681193 709519 721970
10671G21970K156o030j7164J1148P0905J02634Q8303M4814M9205J06243J56753
$$ 721970 724126 718096 700932 712080 782985 885619 973922 1018736 1067941 1174184 1330937
10660A330937J84178J63626J10129P6201N8835O0501L6778l1912j00670j79828
$$ 1330937 1515115 1678741 1788870 1865071 1923906 1984407 2021185 1989273 1888603 1708775
10650A708775k20106j52831l6888N7940J08668J10215P2417K6708K5236N0435
$$ 1708775 1488669 1335838 1298950 1356890 1465558 1575773 1648190 1674898 1700134 1750569
10640A750569O7264P0714Q8508J18605J22579P6876Q803o8871j47275j93249j78488
$$ 1750569 1817833 1888547 1977055 2095660 2218239 2295115 2303918 2235047 2087772 1894523 1716035
10629A716035j28217p1358q321K0296L0609N2739R4062J56420J97634J46982P032
$$ 1716035 1587818 1516460 1508139 1528435 1559044 1611783 1705845 1862265 2059899 2206881 2213913
10618B213913j21420j77542j91948k00471j89891j33774o2797k9913k2595l0757
$$ 2213913 2092493 1914951 1723003 1522532 1332641 1198867 1136070 1106157 1083562 1052805
10608A052805m7157o8311p1940m5327m0994o0373n3394l3000k8292j7601j7548
$$ 1052805 1005648 937337 865397 820070 779076 718703 665309 632309 604017 586416 568868
10597E68868k9580j2587J9665N7917O5751Q347o2301r5680p9179o781O5452R2973
$$ 568868 539288 526701 546366 604283 670034 678381 616080 520400 441221 434440 499892 592865
10585E92865O3721N939k2687k6158n8943p1240l0980p61N504R039l0136j07524
$$ 592865 656586 662525 639838 613680 554737 483497 452517 451756 457260 466299 436163 328639
10573C28639j35821n8713N3535J13967Q9307K2815k643j5959l8020m2641n2584
$$ 328639 192818 134105 187640 301607 390914 413729 411086 395127 357107 314466 261882
10562B61882q3044j24153j39127j13411q6224l0499N7997J05767J08644J04086
$$ 261882 178838 54685 -84442 -197853 -284077 -314576 -256579 -150812 -42168 61918
10552F1918Q0347L8266k0398p1784q8534p9467l3184K3944M4882M2806L1812m974
$$ 61918 142265 180531 160133 88349 -185 -79652 -112836 -88892 -44010 -1204 30608 25634
10540B5634l1472k0946j4793k9487m5350o7780q3081m9842L362M01m3632n7420
$$ 25634 -5838 -26784 -41577 -71064 -116414 -184194 -267275 -317117 -313755 -313354 -356986 -414406
10528d14406k9899J1883L3922J5792j5672j7416M982J3540J0204M1471O7931L8633
$$ -414406 -444305 -432422 -398500 -382708 -398380 -415796 -410814 -397274 -387070 -345599 -277668 -239035
10516b39035k5598q3339q3415k7446K3678N1122M7782K9322J8721J7853K647l8566
$$ -239035 -264633 -347972 -431387 -458833 -435155 -384033 -336251 -306929 -288208 -270355 -267708 -306274
10504c06274m5353R690N7015L5163o610j6380n705R388K1526J3846J0704r249
$$ -306274 -351627 -341937 -284922 -249759 -256369 -272749 -278454 -269066 -247540 -233694 -222990 -232239
10492b32239n2584n0119k0040k2521m6141m0554Q736M4821L0704n261k4016j6732
$$ -232239 -284823 -334942 -354982 -377503 -423644 -464198 -455462 -410641 -379937 -385198 -409214 -425946
10480d25946j3763k3074k0988j18K9088O7788J06931J17422R6714Q8706Q4398
$$ -425946 -439709 -462783 -483771 -483889 -454801 -387013 -280082 -162660 -65946 22760 107158
10469A07158M3268o498l5237n5861n8295m9542l2448j054l79k8007k0434J4604
$$ 107158 150426 143928 108691 52830 -5465 -55007 -87455 -88509 -88888 -116895 -137329 -122725
10457a22725J1821k2521k6579k1966m3107p0395p0818n8668m4028k2617n832p97
$$ -122725 -110904 -133425 -160004 -181970 -225077 -295472 -366290 -424958 -468986 -491603 -497435 -498232
10445d98232n927j4476q302K8243Q5118J21673J09908Q7398O4918J3813l3655
$$ -498232 -504159 -518635 -526937 -498694 -413576 -291903 -181995 -94597 -29679 -15866 -49521
10434d9521n5573n1207l2297j9795K78M0808N2525K2922j8208o6000j05003j08993
$$ -49521 -105094 -156301 -188598 -208393 -208115 -167307 -114782 -91860 -110068 -176068 -281071 -390064
10422c90064o2050R676N9647P3385R0930J03039P9660M7774J9986j0124l6639
$$ -390064 -452114 -442438 -382791 -309406 -218476 -115437 -35777 11997 31983 21859 -14780
10411a4780l9337l6814n3637o3684k0789N1804P7577O5387M5874N266m1050n4373
$$ -14780 -54117 -90931 -144568 -208252 -229041 -177237 -99660 -34273 11601 16867 -24183 -78556
10399g8556m1420j9158J5939O1092Q8423J04496R0354K3650k6416j8673j0310
$$ -78556 -119976 -139134 -123195 -62103 26320 130816 221170 244820 218404 199731 189421
10388A89421n5616j08387j09846n3145m194k4383n5669j2837M6142M2731K8288
$$ 189421 133805 25418 -84428 -137573 -141767 -166150 -221819 -234656 -188514 -145783 -117495
10377a17495M3933N4338L2363k2059p8592p7056k1011J9267k656k7624k515M4655
$$ -117495 -73562 -19224 13139 -8920 -87512 -164568 -185579 -166312 -168968 -196592 -199107 -154452
10365a54452Q0813Q3574J9593o9523r3170n8732j7744K9281Q8743J12609P3292
$$ -154452 -73639 9935 29528 -39995 -133165 -191897 -209641 -180360 -91617 20992 94284
10354I4284J1334k0895j8266j5710j9421j7693k9284m5624j6932J6568m199j1335
$$ 94284 105618 84723 66457 50747 31326 13633 -15651 -61275 -78207 -61639 -65838 -77173
10342g7173K1987L7295M4146O9884Q6705N9686L90k5374k0507k4367k8953j8577
$$ -77173 -55186 -17891 26255 96139 182844 242530 242920 217546 197039 172672 143719 125142
10330A25142l0276n0590m3696j1609K7160L2212J736j9829j4039M376K3879K7578
$$ 125142 94866 44276 580 -11029 16131 48343 50079 30250 16211 20587 44466 72044
10318G2044j4804n8232n7649k9275K270K0809J8924k6394r3533r2218j8525K0565
$$ 72044 57240 -992 -58641 -87916 -85646 -64837 -45913 -72307 -165840 -258058 -276583 -256018
10306b56018j6809l8130l5395k8878m222M7376J05177Q1998p995p1475o0354k884
$$ -256018 -272827 -310957 -346352 -375230 -379452 -332076 -226899 -144901 -152896 -224371 -284725 -287609
10294b87609L3788L3008K8007M7704Q2099R0199N1305j7600p2966j05652j27962
$$ -287609 -253821 -220813 -192806 -145102 -63003 27196 78501 60901 -12065 -117717 -245679
10283b45679j07978m2807J6631N0084N1239K6984J4596K5472M0624O0824Q1285
$$ -245679 -353657 -396464 -379833 -329749 -278510 -251526 -236930 -211458 -170834 -110010 -28725
10272b8725Q0733K8987o8830j47276j54261j05215m8531l6626m5019k444M7466
$$ -28725 52008 80995 12165 -135111 -289372 -394587 -443118 -479744 -524763 -527207 -479741
10261d79741M7947J4159j4948o84K4364P608k3663r44N6375R8548J04010Q3893
$$ -479741 -431794 -417635 -432583 -433267 -408903 -401295 -424958 -425902 -369527 -270979 -166969 -83076
10249h3076N9776M7697M9957L9632O822q265p138j5472K56L3188K8063P390j7712
$$ -83076 -23300 24397 74354 113986 120808 112543 105405 89933 90189 123377 151440 158830 141118
10236A41118m9463l3423M468N088r971q548J2697M3325N2898J9029k5850l4484
$$ 141118 91655 58232 62700 67788 57817 49269 61966 105291 158189 177218 151368 116884
10224A16884l1764m2804m7749l8303r735p095m1429n8745m3959m533L9578M6472
$$ 116884 85120 42316 -5433 -43736 -53471 -60566 -101995 -160740 -204699 -209232 -169654 -123182
10212a23182J496l4033k3408R043M1771N6156M0635R332j8550k0456J4250N0394
$$ -123182 -121686 -155719 -179127 -170084 -128313 -72157 -31522 -22190 -40740 -61196 -46946 3448
10200C448P0666P5632N5848K3726L6820Q7645J15605J02222M6822j1924j1712
$$ 3448 74114 149746 205594 229320 266140 353785 469390 571612 618434 606510 594798
10189E94798J0823J3894p341l8249m8153m2775k8432j919M306k7032n4414o5106
$$ 594798 605621 619515 612174 573925 525772 482997 454565 452646 456952 429920 375506 310400
10177C10400o2601l5281J797J4097j6702n9777o7443m7503n046L7297M3405J3694
$$ 310400 247799 212518 214315 228412 211710 151933 84490 36987 31941 69238 112643 126337
10165A26337p321J5822N0054O2603J9777n8702p6536l9015j0669J6233L1172J5074
$$ 126337 119016 134838 184892 247495 267272 208570 132034 93019 82350 98583 129755 144829
10153A44829j0339j281Q432r257l691M0464N7392K0461j5519k4497l6921o4761
$$ 144829 134490 133209 141641 132384 128693 169157 226549 247010 231491 206994 170073 105312
10141A05312n6231P461P6058Q8711N1016J0122k2850m8013m9453k6684P094K3843
$$ 105312 49081 56542 132600 221311 272327 282449 259599 211586 162133 135449 142543 166386
10129A66386K0608M4574J06112J75065J97746J59547P9296J6823J661P27p539
$$ 166386 186994 231568 337680 512745 710491 870038 949334 966157 967818 968545 961006
10118I61006L406L5183N2099K7084m821p119j933j2901q941j3642o4211j16536
$$ 961006 964412 999595 1051694 1078778 1073957 1066838 1064905 1052004 1043063 1029421 965210 848674
10106H48674j29322p4483j4849j0903l3225n2901o8006r3131j21041j18954q2422
$$ 848674 719352 644869 630020 619117 585892 532991 464985 371854 250813 131859 49437
10095D9437k2088K0324L7245K6936J9907N7981Q9002O2229J8426K2255M6278N6877
$$ 49437 27349 47673 84918 111854 131761 189742 278744 340973 359399 381654 427932 484809
10083D84809N5586L3030k9782q5870q9648o9363o1700p9441j05302r8939p1616
$$ 484809 540395 573425 543643 457773 368125 298762 237062 157621 52319 -46620 -118236
10072a18236l5684K2808P2708P5576N0011J7698j5110k042N4130Q3384M4827k3633
$$ -118236 -153920 -131112 -58404 17172 67183 84881 69771 67729 121859 205243 250070 226437
10060B26437p4925p1279l4752l4750p4214q7590n0802K9191J13685J44835R9803
$$ 226437 151512 80233 45481 10731 -63483 -151073 -201875 -172684 -58999 85836 185639
10049A85639J8706k4542Q516P2215P1908p08n0248n8289n3532j8468L2681N6222
$$ 185639 204345 179803 188319 260534 332442 331734 281486 223197 169665 151197 183878 240100
10037B40100N4601L7278m791n3779p1832n1993j7771L21p647k0855j0694j6611
$$ 240100 294701 331979 327188 273409 201577 149584 131813 132134 124487 103632 92938 76327
10025G6327m3230l6785j7385j0020l991j6182l0525j6647L164j10n752L645l002
$$ 76327 33097 -3688 -21073 -31093 -35084 -51266 -81791 -98438 -95274 -95384 -101136 -97491 -100493
10012a00493p531K6948O0593N5244K3170j0164j4602K9444J23682K12185J94254
$$ -100493 -108024 -81076 -20483 34761 57931 47767 33165 62609 186291 398476 592730
10001E92730Q9593j1007p8190j07290r3254k9829O1170J26893J06883L793p0830
$$ 592730 682323 671316 593126 485836 392582 362753 423923 550816 657699 661492 590662
9990E90662n5347l680R875l1441o8956o2915l6810l5179m0250j1444J5542K3401
$$ 590662 535315 531635 541510 510069 441113 378198 341388 306209 265959 254515 270057 293458
9978B93458K3616J3459j4800p6291j21924r9404l0110J6643K5116L0836M4027
$$ 293458 317074 330533 315733 239442 117518 18114 -11996 4647 29763 60599 104626
9967A04626L7687R946m9Q80l1170p0083n1142p56K8984K6752Q639J677R917K3802
$$ 104626 142313 152259 152210 153090 121920 51837 695 -61 28923 55675 64314 65991 75908 99710
9953I9710J3571k4739n2747q0277j35956j71006j49742r4071k5783L7129P6312
$$ 99710 113281 88542 35795 -44482 -180438 -351444 -501186 -595257 -621040 -583911 -507599
9942e07599J15147J78244J91927R8838P25r50M1554N5199N1948N9192L5814k3127
$$ -507599 -392452 -214208 -22281 76557 77282 76332 117886 173085 225033 284225 320039 296912
9930B96912l3966K0930O6344L4258r672q549j0107n4337q7037r2248p5756k5224
$$ 296912 262946 283876 350220 384478 374806 366257 356150 301813 214776 122528 46772 21548
9918B1548J0788M1168P2733N5980K239k2446j303N4497Q4973P3748N5833M3145
$$ 21548 32336 73504 146237 202217 204456 182010 180707 235204 320177 393925 449758 492903
9906D92903L0405j5091o5573n9735j6352k260l1081n7533n1336m3595p0407p4541
$$ 492903 523308 508217 442644 382909 366557 364297 333216 275683 224347 180752 110345 35804
9894C5804k7545J3445K1092L952l8341r1636r2429m0880R62p519m1974n4128k9196
$$ 35804 8259 21704 42796 46748 8407 -83229 -175658 -216538 -215576 -223095 -265069 -319197 -348393
9881c48393M0044J17366J35934R9059O4316K6756j7165m2826k5705L5858J01264
$$ -348393 -308349 -190983 -55049 44010 108326 135082 117917 75091 49386 85244 186508
9870A86508R1510J9590k3098j2515J1648L3213O6635J13998J20355O8769J3387
$$ 186508 278018 297608 274510 261995 273643 306856 373491 487489 607844 676613 690000
9859F90000r261j4559k4829j3096J8025L3033M0550M1872J4515q461K3248O8239
$$ 690000 680739 666180 641351 628255 646280 679313 719863 761735 776250 767789 791037 859276
9847H59276M6947l6508r2504q9150q4715p3652m3115k9363k5599m033K2901K9123
$$ 859276 906223 869715 777211 688061 603346 529694 486579 457216 431617 427584 450485 479608
9835D79608K013n5207j13293j24910p4151K812P1157J16059J28428Q3190j0127
$$ 479608 481621 426414 313121 188211 114060 116872 188029 304088 432516 515706 505579
9824E05579r0702j17267j14182q9765j9319N5423O3955Q812m0807m5738k1161
$$ 505579 414877 297610 183428 93663 74344 129767 193722 202534 161727 115989 94828
9813I4828j0180j8959m2025q1335r1958m2127J1252L3776K8767K9271N8162Q6599
$$ 94828 84648 65689 23664 -57671 -149629 -191756 -180504 -146728 -117961 -88690 -30528 56071
9801E6071Q5644N4590K1610J1542K3734M0771M6627K674n8546r6664j31227j26542
$$ 56071 141715 196305 217915 229457 253191 293962 340589 343263 284717 188053 56826 -69716
9789f9716p6922l9742k9256q132K9302N3513K5014k133Q663P51n5266j17436j08551
$$ -69716 -146638 -186380 -215636 -223768 -194466 -140953 -115939 -118072 -109409 -108658 -163924 -281360 -389911
9776c89911j5158O4552Q0597P7876Q1736R6617R6636N6925j1379n6467n8832j4444
$$ -389911 -405069 -340517 -259920 -182044 -100308 -3691 92945 149870 138491 82024 23192 8748
9764H748O1043Q5292M3363N802j9201n3756n6974k9482q662o048N243K3212J8449
$$ 8748 69791 155083 198446 204248 185047 131291 74317 44835 36173 30125 35368 58580 77029
9751G7029j7296l3910N323M6450M5100P900j2476J2580M2739M2808K2376J0238
$$ 77029 59733 25823 31146 77596 122696 130596 118120 130700 173439 216247 238623 248861
9739B48861K171l4257n7391l7510j2389K0245M6069K4451j2225j3721J5932L4564
$$ 248861 251032 216775 159384 121874 109485 129730 175799 200250 188025 174304 190236 224800
9727B24800J3944k5763l6544l7609p4878j03364o1851J4564P5530R4661P5030
$$ 224800 238744 212981 176437 138828 63950 -39414 -101265 -86701 -11171 83490 158520
9716A58520J8207n9084j03154q7498l6279K6469O0265M1902J3466J2572L2021
$$ 158520 176727 117643 14489 -73009 -109288 -82819 -22554 19348 32814 45386 77407
9705G7407N2376N1757L4045K7493M4348M1012j918n5803q5603n9810N67L6456
$$ 77407 129783 181540 215585 243078 287426 328438 326520 270717 185114 125304 125871 162327
9693A62327K3718m351k1737k9859l2668k5046l3727p3409j05838p1448L066O0910
$$ 162327 186045 181694 159957 130098 97430 72384 38657 -34752 -140590 -212038 -208972 -148062
9681a48062R8010J33017J43957R2898O687p0330j10548j20433j19219j08263o5360
$$ -148062 -50052 82965 226922 319820 326507 256177 145629 25196 -94023 -202286 -267646
9670b67646Q778P3099J16271J46271J51650J46693J21861P5444K3321m0665q8523
$$ -267646 -258868 -185769 -69498 76773 228423 375116 496977 572421 595742 555077 466554
9659D66554p2115m2486n9356q8692q5519n6647j1296K2640J7062R937K5847N2091
$$ 466554 394439 351953 292597 203905 118386 61739 50443 73083 90145 100082 125929 178020
9647A78020O2489L1178J4073L4161N0451L9831J2654j234p615k3088o4322j02105
$$ 178020 240509 271687 285760 319921 370372 410203 422857 421623 414008 390920 326598 224493
9635B24493j03140r9245j09394r8596n9357r463L2771M7038L0453m2k4117k9846
$$ 224493 121353 22108 -87286 -185882 -245239 -254702 -221931 -174893 -144440 -144482 -168599 -198445
9623a98445j582L8794M6049J9037n180L1738Q3845Q1948N6272N3847N5022K3895
$$ -198445 -200027 -161233 -115184 -96147 -101327 -69589 14256 96204 152476 206323 261345 285240
9611B85240k0335l8207l3851j8137j2445n0922q2094l4672M8067R1805O0432k0482
$$ 285240 264905 226698 192847 174710 162265 111343 29249 -5423 42644 134449 194881 174399
9599A74399p6302q2708o9570o7087q8110j07418p6854M702P2978P6519K8211l0654
$$ 174399 98097 15389 -54181 -121268 -209378 -316796 -393650 -388948 -315970 -239451 -211240 -241894
9587b41894p1779m3401M7808J36450J77580J43689M4763l0527l5908m0665o9154
$$ -241894 -313673 -357074 -309266 -172816 4764 148453 193216 162689 126781 86116 16962
9576A6962n6614j4767N240j0300k4230o838J916O628L8575N9155M9454L4064K8059
$$ 16962 -39652 -54419 -49179 -59479 -83709 -90547 -88631 -82003 -43428 15727 65181 99245 127304
9563A27304Q707q262j327k900j5975j8884j596O183l4940j12564j63004j59967
$$ 127304 136011 127749 126422 123522 107547 88663 87067 93250 58310 -54254 -217258 -377225
9551c77225j02143m751P1675Q9258P4952N4782M1786M8648N3708J9353l7278o8833
$$ -377225 -479368 -484119 -412444 -323186 -248234 -193452 -151666 -103018 -49310 -29957 -67235 -136068
9539a36068q9399j20194j49233j36544o4662N888J2887p660j380Q161l508q303
$$ -136068 -225467 -345661 -494894 -631438 -696100 -690212 -677325 -684985 -686365 -678204 -681712 -690015
9527f90015K9093Q9498J22225R4210M0234K8965N1481M1305K0004K9023L0564
$$ -690015 -660922 -571424 -449199 -354989 -314755 -285790 -234309 -193004 -173000 -143977 -113413
9516a13413J8127J0828R786L611j7069m3782l5874K0969Q5393J22530J21700Q3754
$$ -113413 -95286 -84458 -74672 -71061 -88130 -131912 -167786 -146817 -61424 61106 182806 266560
9504B66560K1213n5193j28055j52926j06722l0289J9174K0189j1460m0508l9284
$$ 266560 287773 232580 104525 -48401 -155123 -185412 -166238 -146049 -157509 -198017 -237301
9493b37301k1051l5359p0019p7905q3335p0200J549Q6673J18377R4615P6101P9954
$$ -237301 -258352 -293711 -363730 -441635 -524970 -595170 -593621 -506948 -388571 -293956 -217855 -137901
9481a37901O9968K5296l4129m5333K5010J05824J26845R8212N8422K1281m0702
$$ -137901 -67933 -42637 -76766 -122099 -97089 8735 135580 233792 292214 313495 272793
9470B72793j09713j01537m8676k5211j3909R604M5161N1553P135k4150k6101k4428
$$ 272793 163080 61543 12867 -12344 -26253 -16649 28512 80065 87200 63050 36949 12521
9458A2521l338J4250N684j245M446P787L493j0543l7622m1014J3436N5166J0850
$$ 12521 9183 23433 29117 27872 32318 40105 43598 33055 -4567 -45581 -32145 23021 33871
9445C3871o0010q2845n5785K29L6261J9447j5438k6016O355N1222M6193L077j5989
$$ 33871 -26139 -108984 -164769 -164540 -128279 -108832 -124270 -150286 -143931 -92709 -46516 -43439 -59428
9432e9428K6321Q2589Q7101N3754o449o4125p0641j9091L7368L5532P95j4946
$$ -59428 -33107 49482 136583 190337 183888 119763 49122 30031 67399 102931 103726 88780
9420H8780N142K2287Q197j2785m8503o0314l6076k5197m0005m8018k3379K5358
$$ 88780 93922 116209 124406 111621 63118 2804 -33272 -58469 -98474 -146492 -169871 -144513
9408a44513M9981L4434K6118L3454K5360q420l9875m2606k5173k411J8101L5627
$$ -144513 -94532 -60098 -33980 -526 24834 16414 -23461 -66067 -91240 -93651 -75550 -39923
9396c9923N0246L8940k4896q2470r0433p9281n6227j7504J9777L5196N8969P9990
$$ -39923 10323 49263 24367 -58103 -148536 -227817 -284044 -301548 -281771 -246575 -187606 -107616
9384a07616L1340n4669q9425o8179j7050L7681O4190Q0682J00777Q3520K2391
$$ -107616 -76276 -130945 -220370 -288549 -305599 -267918 -203728 -123046 -22269 61251 83642
9373H3642j4509j2938p732k1644l9047m3723k5953K2278N1073K8510O548J2227
$$ 83642 69133 56195 48463 26819 -12228 -55951 -81904 -59626 -8553 19957 26505 38732
9361C8732L073l2551o9647p5385k3400M4609N5751N774n8640r3314p0988k1512
$$ 38732 41805 9254 -60393 -135778 -159178 -114569 -58818 -53044 -111684 -204998 -275986 -297498
9349b97498J2964M3318O9452N5971K3112J0534Q365K3816O4785O0199M229l2591
$$ -297498 -284534 -241216 -171764 -115793 -92681 -82147 -73782 -49966 14819 75018 79247 46656
9337D6656m6157n0648l6121l2859m1145k3733K1606L7105p971n8490o8201l2497
$$ 46656 499 -50149 -86270 -119129 -160274 -184007 -162401 -125296 -133267 -191757 -259958 -292455
9325b92455Q611L1155O2983J24078J61518J28048N3670j2373m8461m9652n5317
$$ -292455 -283844 -252689 -189706 -65628 95890 223938 277608 265235 216774 167122 111805
9314A11805p0799n5942k4830j7496l2553n7503p9883o9331l6885J114J6454K4547
$$ 111805 41006 -14936 -39766 -57262 -89815 -147318 -227201 -296532 -333417 -332303 -315849 -291302
9302b91302O0891J01503R8503M5171N027J9394M1149J8840j8599l2507l8010o9994
$$ -291302 -230411 -128908 -30405 14766 19793 39187 80336 99176 80577 48070 10060 -59934
9290e9934r4246m1686M4492M1380l0444p0911m8667K4366Q3625Q7267Q7037J03197
$$ -59934 -154180 -195866 -151374 -109994 -140438 -211349 -260016 -235650 -152025 -64758 22279 125476
9278A25476R1073M6382j7931o6524o9952m4094j5991J0530J1778l3403n5140l0713
$$ 125476 216549 262931 245000 178476 108524 64430 48439 58969 70747 37344 -17796 -48509
9266d8509j7097k7271k8511j3129q216r075J2832O3641R1761N6696k5323r6761
$$ -48509 -65606 -92877 -121388 -134517 -142733 -151808 -138976 -75335 16426 73122 47799 -48962
9254d8962r5496n3042l4734k1138J6255K9932K2580L1144J9510r355j6276K2406
$$ -48962 -144458 -197500 -232234 -253372 -237117 -207185 -184605 -153461 -133951 -143306 -159582 -137176
9242a37176P6522Q8277N7075N709m5606p1985p3101k6043P3159J35891J28678
$$ -137176 -60654 27623 84698 90407 44801 -27184 -100285 -126328 -53169 82722 211400
9231B11400R0320L8433j4166k8091l9710q1134j11012j05611o5563j6558L1336
$$ 211400 301720 340153 325987 297896 258186 177052 66040 -39571 -105134 -121692 -90356
9220i0356P7907P8494L6386r830l3175m2921n7655m1469J483J0974J1003J4957
$$ -90356 -12449 66045 102431 92601 59426 16505 -41150 -82619 -81136 -70162 -59159 -44202
9208d4202m614k8610m6966m9438l6676j2864J9967J3349k9716k8596K7823M8541
$$ -44202 -48816 -77426 -124392 -173830 -210506 -223370 -203403 -190054 -219770 -248366 -220543 -172002
9196a72002K5220K8956P0619J10119J15192P0388J1263p551q608m2670j03859
$$ -172002 -146782 -117826 -47207 62912 178104 248492 259755 252204 243596 200926 97067
9185I7067j36914j05121m3096o874J0224J7658M000R19L0142L7153K0798j034
$$ 97067 -39847 -144968 -188064 -194938 -184714 -167056 -163056 -162137 -131995 -94842 -74044 -75078
9173g5078m8698j03131r6193k7178R129O300Q088J1693K9420N8652P1934P4874
$$ -75078 -123776 -226907 -323100 -350278 -341149 -334849 -326761 -315068 -285648 -226996 -155062 -80188
9161h0188N5599N913j6247O144K8428L1032K2377J5603K2989M2435N0137L8683
$$ -80188 -24589 -18676 -34923 -28779 -351 30681 53058 68661 91650 134085 184222 222905
9149B22905J0506q477j6548j6509j297K1585L0450j6969q3737j02432p4248l4356
$$ 222905 233411 224934 208386 191877 190580 212165 242615 225646 141909 39477 -34771 -69127
9137f9127m718o323k256J1183R712q338k4312r695J5766L8430M9391M5546L3792
$$ -69127 -73845 -80168 -82424 -71241 -61529 -69867 -94179 -103874 -88108 -49678 -287 45259 79051
9124G9051J4292j4277m9168q2054p1430J0314R1924Q6331N2573L8440R036k4747
$$ 79051 93343 79066 29898 -52156 -123586 -113272 -21348 64983 117556 155996 165032 140285
9112A40285k5098p517o453j3255r158R110K4798J3023j8136m7519n5094n8947
$$ 140285 115187 107670 101217 87962 78804 87914 112712 125735 107599 60080 4986 -53961
9100e3961q2848p9442r073O9233R1684N2627m623m9147p4801n3080l1570o0494
$$ -53961 -136809 -216251 -225324 -156091 -64407 -11780 -16403 -65550 -140351 -193431 -225001 -285495
9088b85495p5882m1370l1228o1708p5648l9713N1963J37420J45576J13150R2708
$$ -285495 -361377 -402747 -433975 -495683 -571331 -611044 -559081 -421661 -276085 -162935 -70227
9077g0227J00953J21551J37348J59020J66098J45844J05066M8933m29p2348j68092
$$ -70227 30726 152277 289625 448645 614743 760587 865653 914586 914157 841809 673717
9066F73717k25866k32924j97615j23370l0827K1944J2969k131p338j5890l1573
$$ 673717 447851 214927 17312 -106058 -136885 -114941 -101972 -104103 -111441 -127331 -158904
9055a58904n6932n3890j4310J4652K2332J9788N25n949J8722L2591M2921L9972
$$ -158904 -215836 -269726 -284036 -269384 -247052 -227264 -226739 -232688 -213966 -181375 -138454 -98482
9043i8482Q600l0697n4364m7358l1432j8800j6571m756J7234K9040L9554K8962
$$ -98482 -89882 -120579 -174943 -222301 -253733 -272533 -289104 -293860 -276626 -247586 -208032 -179070
9031a79070N258K485K7946O3916Q3527N6197j9935j06102j37589r5075j5228L9367
$$ -179070 -173812 -171327 -143381 -79465 4062 60259 40324 -65778 -203367 -298442 -313670 -274303
9019b74303K0438k4917l1673J2128P7548J50045K02128J83329Q1668l0169q6906
$$ -274303 -253865 -278782 -310455 -298327 -220779 -70734 131394 314723 396391 366222 279316
9008B79316q7850n8553m8929p1300o9557l2065J7496L3315L5326N3111M8994J8741
$$ 279316 191466 132913 83984 12684 -56873 -88938 -71442 -38127 -2801 50310 99304 118045
8996A18045j9550m8442p0991n3516N104K8891J1956J205O231J0803M2832P4580
$$ 118045 98495 50053 -20938 -74454 -69350 -40459 -28503 -27298 -21067 -10264 32568 107148
8984A07148N8958R119l5824m7142j9120j1021l6815k4301K0784M3694L0443Q643
$$ 107148 166106 175225 139401 92259 73139 62118 25303 1002 21786 65480 95923 104566
8972A04566j5957o3766j00940j03552o8503p706K9203L4011K8223K7859L4173
$$ 104566 88609 24843 -76097 -179649 -248152 -255858 -226655 -192644 -164421 -136562 -102389
8961a02389L2716m683l9402l5476k9951j6027P992J8577M2338O8150N3099J2825
$$ -102389 -69673 -74356 -113758 -149234 -179185 -195212 -187220 -168643 -126305 -58155 -5056 7769
8949G769k3650n3869o6418l5478k533q035l2023k5496K3489O4609O6625L9847
$$ 7769 -15881 -69750 -136168 -171646 -174179 -182214 -214237 -239733 -216244 -151635 -85010 -45163
8937d5163J8923R602o49J3787N6183Q1922Q8381Q1046M9048j8695p4619o0206
$$ -45163 -26240 -16638 -17287 -3500 52683 134605 222986 304032 353080 334385 259766 199560
8925A99560j2673R955M03k5135j4729J4064J4369K7895O1178O9761N4794L4583
$$ 199560 186887 196842 197245 172110 157381 171445 185814 213709 274887 344648 399442 434025
8913D34025K042k1288l5858m7313j9737L3125K8920o1168j38595j21449n4080
$$ 434025 436067 414779 378921 331608 311871 344996 373916 312748 174153 52704 -1376
8902a376j2903J3144L4175L9894N4640N8549M1432J177p2188j16090r8722n4580
$$ -1376 -14279 -1135 33040 72934 127574 186123 227555 228732 156544 40454 -58268 -112848
8890a12848k0155J3577K6595Q68k8763j3259M1204P7978O4475L5210L4177L1182
$$ -112848 -133003 -119426 -92831 -91963 -120726 -133985 -92781 -14803 49672 84882 119059 150241
8878A50241m265l2312l9365m7198m8441m5600o2897p7688n1824j5612L548N380
$$ 150241 145976 113664 74299 27101 -21340 -66940 -129837 -207525 -259349 -274961 -271413 -266033
8866b66033Q446K7452M0154K1172J1371K6996M0306M2489M8903O4801M6403j4691
$$ -266033 -257587 -230135 -189981 -168809 -157438 -130442 -90136 -47647 1256 66057 112460 97769
8854I7769n5631m4733P4L7440N1720N1820L4644J8565J1723k531m378K8479P0479
$$ 97769 42138 -2595 -2521 34919 86639 138459 173103 191668 203391 200860 196482 224961 295440
8841B95440J01050J12336Q6715O1077L5058m0904j12636j27869r8132o7750n6485
$$ 295440 396490 508826 595541 656618 691676 650772 538136 410267 312135 244385 187900
8830A87900m3596j9997K3017P4642R2268P5731M9789K9887J6556k5382j14243
$$ 187900 144304 124307 147324 221966 314234 389965 439754 469641 486197 460815 346572
8819C46572j65080j37623p4820j3507J3310J3295K023k2897l7505l7329l1508
$$ 346572 181492 43869 -30951 -44458 -31148 -17853 -15830 -38727 -76232 -113561 -145069
8808a45069r313L9738R5208J02800Q1783N1561L609l5209k1587K2067M7409O3297
$$ -145069 -154382 -114644 -19436 83364 165147 216708 220317 185108 163521 185588 232997 296294
8796B96294N0578K2363J8758N5592Q5467M0484o2096j51791j73431j24364o9258
$$ 296294 346872 369235 387993 443585 529052 569536 507440 355649 182218 57854 -11404
8785a1404o2354p1794m6153J0786M3327K0720k5184m2877o597L5240J5894l2723
$$ -11404 -73758 -145552 -191705 -180919 -137592 -116872 -142056 -184933 -191530 -156290 -140396 -173119
8773a73119l9774j8881Q244K8660L5989M3486N9948N4907L3051J6032K0047M9874
$$ -173119 -212893 -231774 -223530 -194870 -158881 -115395 -55447 -540 32511 48543 68590 118464
8761A18464Q1348J09390J03190M4689k1609m4210p61L1589M406l3813o8731j03676
$$ 118464 199812 309202 412392 457081 435472 391262 390501 422090 426496 392683 323952 220276
8749B20276j19063p2617L3390J11720J09668O9671N0223O7663N6785q559m4224
$$ 220276 101213 28596 61986 173706 283374 353045 403268 470931 527716 519157 474933
8738D74933k0968M006K6270L9539K3881q420m4651q0336j01656j01507p4590j2185
$$ 474933 453965 457971 484241 523780 547661 539241 494590 414254 312598 211091 136501 124316
8726A24316N1974M1797j9621n3479n1084k3138L5020R4161J07448P1462J9348
$$ 124316 176290 218087 198466 144987 93903 70765 105785 199946 307394 378856 398204
8715C98204j3017k6256l7960k8033j0113o648k2847m1020m8889l6088N607N4456
$$ 398204 385187 358931 320971 292938 282825 276177 253330 212310 163421 127333 132940 187396
8703A87396O9189N3779N2148R1251J28513J17843P4785L0686J2313J669l4026
$$ 187396 256585 310364 362512 453763 582276 700119 774904 805590 817903 819572 785546
8692G85546o9571o4611l1883j10l538o0107r6912n8631Q818N1835O3128N6567
$$ 785546 715975 651364 619481 619371 615833 555726 458814 400183 409001 460836 523964 580531
8680E80531L3979l655k9145m0838n0151m9498o3841r7850q9979l2533J2208L3953
$$ 580531 614510 610855 581710 540872 490721 441223 377382 279532 189553 157020 169228 203181
8668B03181K4061l3002r2809p0632N960M3997J2204o3802j22112j12796l1699
$$ 203181 227242 194240 101431 30799 36759 80756 92960 29158 -92954 -205750 -237449
8657b37449N8841J11056J15420Q5730Q7676R0251L3326k563K8470O0271M6834
$$ -237449 -178608 -67552 47868 133598 221274 311525 344851 342288 370758 431029 477863
8646D77863j0028n1610l9888j9030r681N697K2012L8898K5601l5402p5026m8996
$$ 477863 467835 416225 376337 357307 347626 353323 375335 414233 439834 404432 329406 280410
8634B80410m699K0843L0103J4496j7808n4603p7920m5214K7515N1410K249n1434
$$ 280410 275711 296554 326657 341153 323345 268742 190822 145608 173123 224533 226782 175348
8622A75348o2825n9151n7567l6807j8060l2476k8683L1438Q9696Q1160L4245K8562
$$ 175348 112523 53372 -4195 -41002 -59062 -91538 -120221 -88783 913 82073 116318 144880
8610A44880L8869L8778M1431K6813j8567p2258j05381q8792m3497j9290j3512
$$ 144880 183749 222527 263958 290771 272204 199946 94565 5773 -37724 -57014 -70526
8599g0526k472O95l9190q2726o6738k6619j309K4430N6682Q8856R0768O7755K9616
$$ -70526 -72998 -72303 -111493 -194219 -260957 -287576 -288885 -264455 -207773 -118917 -28149 39606 69222
8586F9222n211O218M7328O1791M3482K5931L5039N2463M7736K3465R220P327n631
$$ 69222 64011 70229 117557 179348 222830 248761 283800 336263 383999 407464 416684 424011 418380
8573D18380r027M397Q870O690j6378n4811m4748K1350P9812J02200R3863N6638
$$ 418380 409353 413750 422620 429310 412932 358121 313373 334723 414535 516735 610598 667236
8561F67236j2149j00641j55245j14797k3134K360j9327r797J6250K7620L8075
$$ 667236 655087 554446 399201 284404 261270 263630 244303 234506 250756 278376 316451
8550C16451L8790j063m2111l8862n619J5445J4227K2383O2884J02207Q5328K9951
$$ 316451 355241 354178 312067 273205 267586 283031 297258 319641 382525 484732 570060 600011
8538F00011j7112j9999N137Q396L997K156K334J7493M1625M4893J6105l4433p0482
$$ 600011 582899 562900 568037 576433 580430 582586 584920 602413 644038 688931 705036 670603 600121
8525F00121o6784m5523j9474K1919N2043M9127L4993J3929k140q59Q524K4629
$$ 600121 533337 487814 468340 490259 542302 591429 626422 640351 638211 637352 645876 670505
8513F70505K3230k7k2603m3365q6462j12385j01038o6365K788N8684O2974M5301
$$ 670505 693735 693708 671105 627740 541278 428893 327855 261490 264278 322962 385936 431237
8501D31237J1373k9440m7155l3803J4968Q9716J05294M3275j1242j8606N343K0842
$$ 431237 442610 413170 366015 332212 347180 436896 542190 585465 574223 555617 560960 581802
8489E81802J3639k3221l4295o779O540j0270n1118q8760j24120j46284j10146
$$ 581802 595441 572220 537925 531146 537686 527416 476298 387538 263418 117134 6988
8478F988l6624J8452J5531j1912j3093N060K0230K9352M0576L1614J1140M3322
$$ 6988 -29636 -11184 4347 -7565 -20658 -15598 4632 33984 74560 106174 117314 160636
8466A60636J02013J27990J14584P2238J2675l9222o8956q3544m9169K8000Q0451
$$ 160636 262649 390639 505223 577461 590136 550914 481958 398414 349245 377245 457696
8455D57696O1975j2079r4616j16628p0421k7141l4485l6594j1725P370K2005M2852
$$ 457696 519671 507592 412976 296348 225927 198786 164301 127707 115982 123352 145357 188209
8443A88209O8081Q0531O3763M0324K5361K787L775K3717R239l0394n1997o3496
$$ 188209 256290 336821 400584 440908 466269 469056 472831 496548 505787 475393 423396 359900
8431C59900q8784j08307o7352j3321j9006m4412k5743K3696N1923P1787P3803
$$ 359900 271116 162809 95457 82136 63130 18718 -7025 16671 68594 140381 214184
8420B14184N2213M3059M0118J7879k7901o1006m2767k942O027n325k6441m7960
$$ 214184 266397 309456 349574 367453 339552 278546 235779 232837 238864 233539 207098 159138
8408A59138l4041O203M6490Q0679R5666Q3646P3461Q8231J05274R5412O4719L6778
$$ 159138 125097 131300 177790 258469 354135 437781 511242 599473 704747 800159 864878 901656
8396I01656J2725o375m1693q7474j01380o6153j4069P443l3233p7965l8524K3428
$$ 901656 914381 908006 866313 778839 677459 611306 597237 604680 571447 493482 454958 478386
8384D78386M1465N6086O9435N9273L3966j762k0696k6753k9622J441M5783N2677
$$ 478386 519851 575937 645372 704645 738611 736849 716153 689400 659778 661219 707002 759679
8372G59679M7573O6765P9198P0306M3488P167j6137j5430k6716n1344m8664l5362
$$ 759679 807252 874017 953215 1023521 1067009 1074176 1058039 1042609 1015893 964549 915885 880523
8360H80523m3472n5669m8959l9257k1705P017K8020K4215K7162M6651J8494m8745
$$ 880523 837051 781382 732423 693166 671461 678478 706498 730713 757875 804526 823020 774275
8348G74275p6549m4322k3393n3665q5879p5656l3191m715j8701l6199m0M4795
$$ 774275 697726 653404 630011 576346 490467 414811 381620 376905 358204 322005 321965 366760
8336C66760L1894j7005l0486Q452L6416L5081M7208P4653Q1592M5951J6081K1549
$$ 366760 398654 381649 351163 359615 396031 431112 478320 552973 634565 680516 696597 718146
8324G18146R55n1321o9308j283P6159Q6680O4230L4557J3548J020j0461m434n672
$$ 718146 719101 667780 598472 597189 673348 760028 824258 858815 872363 873383 862922 858488 852816
8311H52816k7343m6882l7980J9042Q3116R4543O2135L9972K6808o981m9603p9394
$$ 852816 825473 778591 740611 759653 842769 937312 999447 1039419 1066227 1059246 1009643 930249
8299I30249n5893p969J3956K4736L7918M0876K5988J028k3860m6398m0122r852
$$ 930249 874356 866387 880343 905079 942997 983873 1009861 1010889 987029 940631 900509 890657
8287H90657K8776N5296N1449K7141m391l9862o1017m5060k709M2210P4193R7814
$$ 890657 919433 974729 1026178 1053319 1048928 1009066 948049 902989 900280 942490 1016683 1114497
8275A114497R9325P8693P2004N8112L5309L3160M4456N5995L8717j8323n6642
$$ 1114497 1213822 1292515 1364519 1422631 1457940 1491100 1535556 1591551 1630268 1611945 1555303
8264A555303n3612n6464m8582r177L8875O8941N1441R664j8908k2264j5984j6841
$$ 1555303 1501691 1445227 1396645 1387468 1426343 1495284 1546725 1556389 1537481 1515217 1499233 1482392
8252A482392k1534j0254N374K6151N3438N5620K9047j5573l1961r502Q435J1602
$$ 1482392 1460858 1450604 1455978 1482129 1535567 1591187 1620234 1604661 1572700 1563198 1571633 1583235
8240A583235K3002M8759P6166R4734Q9841N7040K1736K979N553K2232J0817k3795
$$ 1583235 1606237 1654996 1731162 1825896 1915737 1972777 1994513 1997492 2003045 2025277 2036094 2012299
8228B012299p1697j24058j25939o5371q304N730P064J9742K2991L2817N4719L4352
$$ 2012299 1940602 1816544 1690605 1625234 1616930 1622660 1629724 1649466 1672457 1705274 1759993 1794345
8216A794345j0869m0695l6402M701N4743R3535J08446R4824R9595J08526R4050
$$ 1794345 1783476 1742781 1706379 1711080 1765823 1859358 1967804 2062628 2162223 2270749 2364799
8205B364799Q3974Q3554O2054K6744j7244o7859p8321l2448J2305J6556J4132
$$ 2364799 2448773 2532327 2594381 2621125 2603881 2536022 2457701 2425253 2437558 2454114 2468246
8194B468246J5907l363l6953m3842k5389p047K0608L2693O862j3506j4846q834
$$ 2468246 2484153 2480790 2443837 2399995 2374606 2367559 2388167 2420860 2427722 2414216 2399370 2390536
8182B390536Q329K7001M4727L2006j6494n7250n9171k5522J9814L6019J7155k4535
$$ 2390536 2398865 2425866 2470593 2502599 2486105 2428855 2369684 2344162 2363976 2399995 2417150 2392615
8170B392615o8286q6774p1162j8368M3597P6561R4647J03496P6203o380q9713
$$ 2392615 2324329 2237555 2166393 2148025 2191622 2268183 2362830 2466326 2542529 2536149 2446436
8159B446436j06720p2209j8235L4316P6527J12520J08364N8378j634m1925n3808
$$ 2446436 2339716 2267507 2249272 2283588 2360115 2472635 2580999 2639377 2637743 2595818 2542010
8148B542010o5492o3260k9989m690Q628N0737R4903R1041N0455K8723O0372R2570
$$ 2542010 2476518 2413258 2383269 2378579 2387207 2437944 2532847 2623888 2674343 2703066 2763438 2856008
8136B856008Q5922M9388R690k0523j5516M2560J03654J30607J18925P3934K1814
$$ 2856008 2941930 2991318 3001008 2980485 2964969 3007529 3111183 3241790 3360715 3434649 3456463
8125C456463j2325j3867K3313N1348M1619K0969O815k2547m8618j4797O6041J20419
$$ 3456463 3444138 3430271 3453584 3504932 3546551 3567520 3574335 3551788 3503170 3488373 3554414 3674833
8113C674833R9315L6022l1476q2244q2823l6091K0917P1527Q0982N8575M7813
$$ 3674833 3774148 3810170 3778694 3696450 3613627 3577536 3598453 3669980 3750962 3809537 3857350
8102C857350N8156O1520M3394L0499N713k3056k240N0262Q3225R3020Q1254N0723
$$ 3857350 3915506 3977026 4020420 4050919 4056632 4033576 4031336 4081598 4164823 4257843 4339097 4389820
8090D389820J7582J3035L2216L5740J5029l7968q9065p1571K408O2194N6541L571
$$ 4389820 4407402 4420437 4452653 4488393 4503422 4465454 4376389 4304818 4307226 4369420 4425961 4429532
8078D429532k3597K1404P5928Q4892O6552M2906K4446J8250J6768L9797R1139
$$ 4429532 4405935 4427339 4503267 4588159 4654711 4697617 4722063 4740313 4757081 4796878 4888017
8067D888017J01742Q2184R0843Q4487N8266N9513Q9450R2187N5962K7585N579
$$ 4888017 4989759 5071943 5162786 5247273 5305539 5365052 5454502 5546689 5602651 5630236 5635815
8056E635815k7101k6190J8203N5258R1734J23514J40385J40535J28973J36582
$$ 5635815 5608714 5582524 5600727 5655985 5747719 5871233 6011618 6152153 6281126 6417708
8046F417708J70179K05383K15554J85762J31367J14947J40760J58758J33795O0211
$$ 6417708 6587887 6793270 7008824 7194586 7325953 7440900 7581660 7740418 7874213 7934424
8036G934424Q146L091K5159P5051J30525J74373K09059K34626K35405K18331K17322
$$ 7934424 7942570 7945661 7970820 8045871 8176396 8350769 8559828 8794454 9029859 9248190 9465512
8025I465512K72156L46246L88013M12565M42167M44583M07596L93039M37582M89646
$$ 9465512 9737668 10083914 10471927 10884492 11326659 11771242 12178838 12571877 13009459 13499105
8015A3499105N12535N60698O83554Q51207J013491J140971J234081J306746J406332
$$ 13499105 14011640 14572338 15255892 16107099 17120590 18261561 19495642 20802388 22208720
8006B2208720J597937J870527K212450K614354L051981L526089M047051M604039
$$ 22208720 23806657 25677184 27889634 30503988 33555969 37082058 41129109 45733148
7998D5733148N125331N519365N703760N562145M978931L879055K300966M49265
$$ 45733148 50858479 56377844 62081604 67643749 72622680 76501735 78802701 79251966
7990G9251966j407076l026736m256993n020747n276567n096852m652135m089232
$$ 79251966 77844890 74818154 70561161 65540414 60263847 55166995 50514860 46425628
7982D6425628l502416k942898k434168k022520j663846j286556r35063o84135
$$ 46425628 42923212 39980314 37546146 35523626 33859780 32573224 31638161 30954026
7974C0954026n23908l80737k26609q2105M0121J12526J12697O7080Q7894K16613
$$ 30954026 30430118 30049381 29822772 29740667 29780788 29893314 30006011 30073091 30160985 30377598
7964C0377598L89400N41586O66271P93067R31187J064939J223246J431941J675768
$$ 30377598 30766998 31308584 31974855 32767922 33699109 34764048 35987294 37419235 39095003
7955C9095003J965249K323963K737991L204538L729402M308495M962868N725935
$$ 39095003 41060252 43384215 46122206 49326744 53056146 57364641 62327509 68053444
7947F8053444O646011P744701Q967703J0306839J1794359J3397389J4991844J6330817
$$ 68053444 74699455 82444156 91411859 101718698 113513057 126910446 141902290 158233107
7939A58233107J7061399J6728284J4918084J1456410O508625O42783n304306j0498020
$$ 158233107 175294506 192022790 206940874 218397284 224905909 225548692 220244386 209746366
7931B09746366j4322163j6496138j7092089j6479958j5102142j3328199j1459408
$$ 209746366 195424203 178928065 161835976 145356018 130253876 116925677 105466269
7924A05466269r700575q116577o709676n517508m559480l784415l126740k543078
$$ 105466269 95765694 87649117 80939441 75421933 70862453 67078038 63951298 61408220
7916F1408220k030571j605487j254968r41964o74895m36626j94482N3430K96372
$$ 61408220 59377649 57772162 56517194 55575230 54900335 54463709 54269227 54322657 54619029
7907E4619029N00754O76642Q91818J164950J492267J878164K308918K786909L326494
$$ 54619029 55119783 55796425 56688243 57853193 59345460 61223624 63532542 66319451 69645945
7898F9645945L921275M586432N334390O163919P119599Q245173R571797J1119530
$$ 69645945 73567220 78153652 83488042 89651961 96771560 105016733 114588530 125708060
7890A25708060J2906763J5016105J7484940K0294703K3413041K6713435K9935500
$$ 125708060 138614823 153630928 171115868 191410571 214823612 241537047 271472547
7883B71472547L2602446L3954177L3101778K9274223K2130109J2078031K85988
$$ 271472547 304074993 338029170 371130948 400405171 422535280 434613311 434899299
7876D34899299j1628563k1979358k9477831l3600023l4593697l3185187l0275590
$$ 434899299 423270736 401291378 371813547 338213524 303619827 270434640 240159050
7869B40159050k6682506k3012536j9618875j6596812j3957397j1690857r759783
$$ 240159050 213476544 190464008 170845133 154248321 140290924 128600067 118840284
7862A18840284q147507o819858n732970m829352m051412l399365k879776k468904
$$ 118840284 110692777 103872919 98139949 93310597 89259185 85859820 82980044 80511140
7854H0511140k095704j689961j255268q35161m45085o9528L02543P09720J209996
$$ 80511140 78415436 76725475 75470207 74635046 74189961 74120433 74422976 75132696 76342692
7845G6342692J795034K388238K954561L526328M158067M899363N773388O780844
$$ 76342692 78137726 80525964 83480525 87006853 91164920 96064283 101837671 108618515
7837A08618515P971932R375626J0976121J2821906J4977516J7487924K0371731
$$ 108618515 116590447 125966073 136942194 149764100 164741616 182229540 202601271
7830B02601271K3616387K7207599L1042944L4788754L7850811L9357419L8271303
$$ 202601271 226217658 253425257 284468201 319256955 357107766 396465185 434736488
7823D34736488L3691868K5235132J3330183o62506j4727389k6837304l5524735
$$ 434736488 468428356 493663488 506993671 506331165 491603776 464766472 429241737
7816D29241737m0225746m1234489l9423789l5866175l1551600k7210563k3210410
$$ 429241737 389015991 347781502 308357713 272491538 240939938 213729375 190518965
7809A90518965j9668440j6609939j4035188j1876137j0017320q397929p039928
$$ 190518965 170850525 154240586 140205398 128329261 118311941 109914012 102874084
7802A02874084n936094n032512m285577l665720l158726k714242k282076j841749
$$ 102874084 96937990 91905478 87619901 83954181 80795455 78081213 75799137 73957388
7794G3957388j397902r72487n61157j62644K25224O45945J120002J619938K158771
$$ 73957388 72559486 71586999 71025842 70863198 71088422 71734367 72854369 74474307 76633078
7785G6633078K780335L472565M178187M926498N788509O789321P926856R227285
$$ 76633078 79413413 82885978 87064165 91990663 97779172 104568493 112495349 121722634
7777A21722634J0741053J2531427J4647280J7100016J9880615K2962184K6228155
$$ 121722634 132463687 144995114 159642394 176742410 196623025 219585209 245813364
7770B45813364K9395500L1932035L3082314L1970315K7898069K0594531J0444718
$$ 245813364 275208864 307140899 340223213 372193528 400091597 420686128 431130846
7763D31130846j396964j3276163k3494295l0777451l4640926l5423229l3896915
$$ 431130846 429733882 416457719 392963424 362185973 327545047 292121818 258224903
7756B58224903l0919704k7230235k3433741j9916286j6860052j4303895j2168692
$$ 258224903 227305199 200074964 176641223 156724937 139864885 125560990 113392298
7749A13392298j0353186q804233p500020o419136n542000m830196m217353l629907
$$ 113392298 103039112 94234879 86734859 80315723 74773723 69943527 65726174 62096267
7741F2096267l086912k663823k328198k023607j708784j378995j068682p76657
$$ 62096267 59009355 56345532 54017334 51993727 50284943 48905948 47837266 47060609
7733D7060609m95039k31493M2343L30647O12589R16848J273859J670163K095449
$$ 47060609 46565570 46334077 46376420 46707067 47319656 48236504 49510363 51180526 53275975
7724E3275975K579416L139966L759058M437321N228003O168130P258841Q491753
$$ 53275975 55855391 58995357 62754415 67191736 72419739 78587869 85846710 94338463
7716I4338463R881472J1402539J2962853J4459507J5653670J6153854J5553857
$$ 94338463 104219935 115622474 128585327 143044834 158698504 174852358 190406215
7709A90406215J3478114R782855M729293j112336o984165j2063775j5688661j7580471
$$ 190406215 203884329 213667184 218396477 217284141 210299976 198236201 182547540 164967069
7701A64967069j7893250j7060591j5566071j3775808j1920260j0159171q613109
$$ 164967069 147073819 130013228 114447157 100671349 88751089 78591918 69978809
7694F9978809p330207o256330n352482m611031m000280l495130l064820k640772
$$ 69978809 62648602 56392272 51039790 46428759 42428479 38933349 35868529 33227757
7686C3227757k207398j843803j602395j471691j355924j190323r85234p52115
$$ 33227757 31020359 29176556 27574161 26102470 24746546 23556223 22570989 21818874
7678B1818874n29714l69191k45483r8195J5491O2338J18318K12791L18096M01399
$$ 21818874 21289160 20919969 20674486 20576291 20591782 20654120 20772438 20985229 21303325 21704724
7668B1704724M92162O38789Q39929J072741J320628J583902J860160K190247K622447
$$ 21704724 22196886 22835675 23675604 24748345 26068973 27652875 29513035 31703282 34325729
7659C4325729L127244L625914M098188M554593M937047N105804M941326M319518
$$ 34325729 37452973 41078887 45177075 49731668 54668715 59774519 64715845 69035363
7651F9035363L132035J466496m44793k350375m021260n254750n935907o057253
$$ 69035363 72167398 73633894 73189101 70838726 66817466 61562716 55626809 49569556
7643D9569556n734078n181449m556475l945746l428443l018880k655390k304830
$$ 49569556 43835478 38654029 34097554 30151808 26723365 23704485 21049095 18744265
7635A8744265j953215j623277j382118j245515j158753j042387r01278p74938
$$ 18744265 16791050 15167773 13785655 12540140 11381387 10339000 9437722 8662784
7627H662784o62713n46571m50156m00336l70345l52666l41253k97457k28898j59996
$$ 8662784 8000071 7453500 7003344 6603008 6232663 5879997 5538744 5241287 5012389 4852393
7617D852393j22450j40814j85923j99152j60066j08470r5559j15762j47793j79722
$$ 4852393 4729943 4589129 4403206 4204054 4043988 3935518 3839959 3724197 3576404 3396682
7607C396682j60652q9809k9252m0646r7105j55853k04860k01541j48969r8140
$$ 3396682 3236030 3146221 3116969 3076323 2979218 2823365 2618505 2416964 2267995 2169855
7597B169855n5221l4115m7118o7142p4642r4799j14393j26396j38600j41537j24192
$$ 2169855 2114634 2080519 2033401 1966259 1891617 1796818 1682425 1556029 1417429 1275892 1151700
7586A151700o2804K0362Q5036R1859O8414Q0470R1846N6452O99m7603o8513n3174
$$ 1151700 1088896 1109258 1194294 1286153 1354567 1435037 1526883 1583335 1584034 1536431 1467918 1414744
7574A414744l8293m1315k7868j0828j3393j8396l0906n5401n9564l4968J854J8948
$$ 1414744 1376451 1335136 1307268 1296440 1283047 1264651 1233745 1178344 1118780 1083812 1085666 1104614
7562A104614J7175j0871m9978m3946j8978j2720p318j0808l3889p1898j08499
$$ 1104614 1121789 1110918 1060940 1016994 998016 985296 977978 967170 933281 861383 752884
7551G52884j06026m0592M4615Q0194M1826j6860l028P7033J27244Q9212J6167
$$ 752884 646858 606266 650881 731075 772901 756041 753013 830046 957290 1046502 1062669
7540A062669j6161m4920r4309j04223n4613m541J5543J7250J653o55M1913O8312
$$ 1062669 1046508 1001588 907279 803056 748443 743902 759445 776695 778348 777693 819606 887918
7528H87918L2769J6382N0560K8753n0169q0328o2244n4487p3548p6083n6786l8159
$$ 887918 920687 937069 987629 1016382 966213 885885 823641 769154 695606 619523 562737 524578
7516E24578j1672K8717M7450m13p7362j13783j12168j11351r1761p858P5531P2135
$$ 524578 512906 541623 589073 588660 511298 397515 285347 173996 82235 74377 149908 222043
7504B22043J5661l4798n2269m2031n2395n8679j7634O260p670n647K4192K2414
$$ 222043 237704 202906 150637 108606 56211 -2468 -20102 -13842 -21512 -27159 -2967 19447
7492A9447O742K2767M0112N0994P1205P4386M9104n125n7608p3139o9246q6322
$$ 19447 26189 48956 89068 140062 211267 285653 334757 329632 272024 198885 129639 43317
7480D3317j01639p9773m2813p201k1221n0160j3508M6833O0666M9391N1768L9110
$$ 43317 -58322 -138095 -180908 -188109 -209330 -259490 -272998 -226165 -165499 -116108 -64340 -25230
7468b5230O764J5058O1244Q8964O6797J0969l3517n5446m1791k4597k6568l0865
$$ -25230 -18466 -3408 57836 146800 213597 224566 191049 135603 93812 69215 42647 11782
7456A1782k8938k3917j9836j9899l0669n1473m7736j5647J3111L0908M9202Q2571
$$ 11782 -17156 -41073 -60909 -80808 -111477 -162950 -210686 -226333 -213222 -182314 -133112 -50541
7444e0541R9890O1919K7902J6911j2541l5280k1737J4623N0397O0394m94r1343
$$ -50541 49349 111268 139170 156081 143540 108260 86523 101146 151543 211937 211443 120100
7432A20100j31977j09323n5958k5899l7813o3813o6801m1384p778K4412M4861
$$ 120100 -11877 -121200 -177158 -203057 -240870 -304683 -371484 -412868 -420646 -396234 -351373
7421c51373N6784O3059N3339L6660J7783P201K0972O5964Q5574M4090m516j6302
$$ -351373 -294589 -231530 -178191 -141531 -123748 -116547 -95575 -29611 55963 100053 95537 79235
7409G9235N519K8963L0641J1793o296j9264m2180q7901j26347j07005n9969k7590
$$ 79235 84754 113717 144358 156151 149855 130591 88411 510 -125837 -232842 -292811 -320401
7397c20401j846J3197J3731K9352O3339R5542J23984R9134L7817J3776K2265R940
$$ -320401 -322247 -309050 -295319 -265967 -202628 -107086 16898 116032 153849 167625 189890 199830
7385A99830n0019j03656r3735n5006l1116p238K9418L7750R144k6526n3042m7802
$$ 199830 149811 46155 -47580 -102586 -133702 -140940 -111522 -73772 -64628 -91154 -144196 -191998
7373a91998j0448N917j2863n0628r8368j15943o6161M885O3185R3405O3548P77
$$ -191998 -202446 -196529 -209392 -260020 -358388 -474331 -540492 -535607 -472422 -379017 -315469 -314692
7361c14692m2148l1971M848L4683N3375M1250J8390J5233K4654J5724N534J6961
$$ -314692 -356840 -388811 -383963 -349280 -295905 -254655 -236265 -221032 -196378 -180654 -175120 -158159
7349a58159J9971J0478J629o389k735J5485L1776J9544N286O31j3099j9506P169
$$ -158159 -138188 -127710 -126081 -132470 -135205 -119720 -87944 -68400 -63114 -62483 -75582 -95088 -87919
7336h7919K5643J2717J5934K6399K6132L6548J9257m1747p4986n9130m0034k7602
$$ -87919 -62276 -49559 -33625 -7226 18906 55454 74711 32964 -42022 -101152 -141186 -168788
7324a68788k8204k6739J505J1495k2158p2471p0280J7735J12203J39986J39815
$$ -168788 -196992 -223731 -222226 -210731 -232889 -305360 -375640 -357905 -245702 -105716 34099
7313C4099J17255M3662l3161m3823k0102j5422l1987n8958p2721o8135l8568k374
$$ 34099 151354 195016 161855 118032 97930 82508 50521 -8437 -81158 -149293 -187861 -190235
7301a90235J0627M346r94n195l130J192R151J8702L0959O6546J02725Q7178K4892
$$ -190235 -179608 -175262 -176256 -181451 -184581 -183389 -174238 -155536 -124577 -58031 44694 131872 156764
7288A56764j456L9236P9475P6317N2069K0168j3718l4996l3588o088P941j8242
$$ 156764 155308 194544 274019 350336 402405 422573 408855 373859 340271 334183 342124 323882
7276C23882n9225q5191q5642n3453J5586P8429Q9891O8770j76q6603j19731j31335
$$ 323882 264657 179466 93824 40371 55957 134386 224277 293047 292871 206268 86537 -44798
7264d4798j35664j08487n6571n000M5538R6241J08359P6700N2333O9911Q1554
$$ -44798 -180462 -288949 -345520 -350520 -304982 -208741 -100382 -23682 28651 98562 180116
7253A80116M5672j3123n2392m5132k7079m0108n9029n7090k4131L7023Q5789R7001
$$ 180116 225788 212665 160273 115141 88062 47954 -11075 -68165 -92296 -55273 30516 127517
7241A27517P2273R483o7499r8972o0980J647L8043J7629m4098q6047r5339j02078
$$ 127517 199790 209273 141774 42802 -18178 -16531 21512 39141 -4957 -91004 -186343 -288421
7229b88421j14686j09783q4496p1046o2576k5091K8681O3018O4687M0439L1275
$$ -288421 -403107 -512890 -597386 -668432 -731008 -756099 -727418 -664400 -599713 -559274 -527999
7218e27999N8684P8870O7164M1671R369k6375k4173L0369Q5293Q5651M5852K5184
$$ -527999 -469315 -390445 -323281 -281610 -272241 -298616 -322789 -292420 -207127 -121476 -75624 -50440
7206e0440K6465L8750K2261l7265j01361j27010r3266o2444n9581n5304l2054
$$ -50440 -23975 14775 37036 -229 -101590 -228600 -321866 -384310 -443891 -499195 -531249
7195e31249k9671m3568k8485l920J1043K7062N3122Q6961R4330P0450O4526N5522
$$ -531249 -560920 -604488 -632973 -636893 -625850 -598788 -545666 -458705 -364375 -293925 -229399 -173877
7183a73877K1489o436k9646n2978p4958j01540p3316J2029N5789M1491R566j7592
$$ -173877 -152388 -158824 -188470 -241448 -316406 -417946 -491262 -479233 -423444 -381953 -372387 -389979
7171c89979k8629k0718j6214k4933l5031m5048l1658O167M2108M0560K1276L5865
$$ -389979 -418608 -439326 -455540 -480473 -515504 -560552 -592210 -586043 -543935 -503375 -482099 -446234
7159d46234R2087J03898L4504k7531n7996o1161k5876K01j584J9342N0183O6206
$$ -446234 -354147 -250249 -215745 -243276 -301272 -362433 -388309 -388108 -389692 -370350 -320167 -253961
7147b53961N0445R647l1936l8403k0635k6747l3777K7049J02283J08249O9438
$$ -253961 -203516 -193869 -225805 -264208 -284843 -311590 -345367 -318318 -216035 -107786 -38348
7136c8348L0316p492m3398o7749p4326l8313K8257P2340P8440M3406M277j9151
$$ -38348 -8032 -15524 -58922 -126671 -200997 -239310 -211053 -138713 -60273 -16867 -12590 -31741
7124c1741m0731n1524n2581m6039o3155p2812k7149L4354Q3412R5287M7327n450
$$ -31741 -72472 -123996 -176577 -222616 -285771 -358583 -385732 -351378 -267966 -172679 -125352 -130802
7112a30802j0418J4603K8545L2665K3045j8195o4028q2149p0542m9748j8685K0331
$$ -130802 -141220 -126617 -98072 -65407 -42362 -60557 -124585 -206734 -277276 -327024 -345709 -325378
7100c25378M6111M6079K4766j927k4274k2350M84m622k3847o859L7638O3638M4305
$$ -325378 -279267 -233188 -208422 -210349 -234623 -256973 -256489 -261111 -284958 -291817 -254179 -190541 -146236
7087a46236J2588J0127J8088L3274L4134L959k7778n5593q5071j02130r7129o0768
$$ -146236 -133648 -123521 -105433 -72159 -38025 -34066 -61844 -117437 -202508 -304638 -401767 -462535
7075d62535k0740K4834P7236Q2828N0476J7520J1921K7927J1339l6700n2416l3070
$$ -462535 -483275 -458441 -381205 -298377 -247901 -230381 -218460 -190533 -179194 -215894 -268310 -301380
7063c01380Q194N4033O0713L2278K9317O2898R6769J00671O8834K9876l0374q0830
$$ -301380 -293186 -239153 -178440 -146162 -116845 -53947 42822 143493 212327 242203 211829 130999
7051A30999q1079n8691k7705l6232o8119n5021l8316r0496j29943r5393n2905
$$ 130999 49920 -8771 -36476 -72708 -140827 -195848 -234164 -324660 -454603 -549996 -602901
7040f02901j9167K7546P4467R3376R9280J01825Q5937N9546L2749j6293o5661
$$ -602901 -622068 -594522 -520055 -426679 -327399 -225574 -139637 -80091 -47342 -63635 -129296
7029a29296p7740o2004k4839L0185O8252M1233j8419l4597k8582m5769q5832j16093
$$ -129296 -207036 -269040 -293879 -263694 -195442 -154209 -172628 -207225 -235807 -281576 -367408 -483501
7017d83501r5148n4968l515O0379J17794J53357J45279Q2426L238k6930j5846
$$ -483501 -578649 -633617 -637132 -576753 -458959 -305602 -160323 -77897 -74659 -101589 -117435
7006a17435l478J3827J2777n5912j39950j75138j65805j30392n7866K9181R6305
$$ -117435 -120913 -107086 -94309 -150221 -290171 -465309 -631114 -761506 -819372 -790191 -693886
6995f93886J28512J11897P9257O0825N9155P4560Q5475Q8913J00608Q9289L6107
$$ -693886 -565374 -453477 -374220 -313395 -254240 -179680 -94205 -5292 95316 184605 220712
6984B20712p895m871r858n4206q0057p3208q1474r1080o3985j1692J7457K2764
$$ 220712 212817 207946 198088 143882 63825 -9383 -90857 -181937 -245922 -257614 -240157 -217393
6972b17393L9634N7647O6662P6205O9205R407p1396m9672M6495P7619N6066N6261
$$ -217393 -177759 -120112 -53450 22755 91960 101367 29971 -19701 26794 104413 160479 216740
6960B16740N7444J5956o3239j10176q3180m1193n4099r8951j04196p2755k4799
$$ 216740 274184 290140 226901 116725 33545 -7648 -61747 -160698 -264894 -337649 -362448
6949c62448J4583J9097M942k396J5894L3996K8959L6733N0158K0027n3456j19329
$$ -362448 -347865 -328768 -323826 -326222 -310328 -276332 -247373 -210640 -160482 -140455 -193911 -313240
6937c13240j29001p6391q24M7303O7403N3092Q327k539L9765R7015J22479J14874
$$ -313240 -442241 -518632 -519456 -472153 -404750 -351658 -343331 -345870 -306105 -209090 -86611 28263
6925B8263R2258P5538Q5916J08234J03225N4530j934l8610o4527o0073k6048j8197
$$ 28263 120521 196059 281975 390209 493434 547964 546030 507420 442893 382820 356772 338575
6913C38575k6503j7548M958L3869L0186J2090J0895j1451n8728j05659j02719
$$ 338575 312072 294524 299482 333351 363537 375627 386522 375071 316343 210684 107965
6902A07965m4054R545M3286Q2750J06959O6161j0007n9941o7799n2724l1085J686
$$ 107965 63911 73456 116742 199492 306451 372612 362605 302664 234865 182141 151056 152742
6890A52742L6891L6868L0971O5289R2947P9933L9572o881l5638o2932p9041o0780
$$ 152742 189633 226501 257472 322761 415708 495641 535213 528332 492694 429762 350721 289941
6878B89941k9509j2539q763J1260M1060M3016J7752q682j3101N555J5700K6069
$$ 289941 260432 247893 239130 250390 291450 334466 352218 343536 330435 335990 351690 377759
6866C77759O0709J16093J64608J88128J93687J92284J52717O8083j2524m8777
$$ 377759 438468 554561 719169 907297 1100984 1293268 1445985 1514068 1501544 1452767
6856A452767l8905k9094p2701j22110r4020j7884K3243K3607N845l0323n4707
$$ 1452767 1413862 1384768 1312067 1189957 1095937 1078053 1101296 1124903 1130748 1100425 1045718
6845A045718j9420N6968J18730J46939J34390R2996N1669L4486M0871Q2354J39308
$$ 1045718 1026298 1083266 1201996 1348935 1483325 1576321 1627990 1662476 1703347 1785701 1925009
6834A925009J77418J90270J81311J55632J10245N6099K7200N5726J37167K26387
$$ 1925009 2102427 2292697 2474008 2629640 2739885 2795984 2823184 2878910 3016077 3242464
6824C242464K76375K92863L00355L58619M62343N05678M89189M69146M85967N77635
$$ 3242464 3518839 3811702 4112057 4470676 4933019 5438697 5927886 6397032 6882999 7460634
6814G460634P04900P80700P98480Q35978R61640J139904J278295J357963J415692
$$ 7460634 8165534 8946234 9744714 10580692 11542332 12682236 13960531 15318494 16734186
6805A6734186J449738J415294J296529J088731P66781L18443j98537o96470j136445
$$ 16734186 18183924 19599218 20895747 21984478 22751259 23069702 22871165 22174695 21038250
6796B1038250j501648j718191j765084j718167j630162j481804j298017j123398
$$ 21038250 19536602 17818411 16053327 14335160 12704998 11223194 9925177 8801779
6788H801779r63947q40593p40114o38881n60917n14407m59521l87075l15301k61618
$$ 8801779 7837832 6997239 6257125 5618244 5057327 4542920 4083399 3696324 3381023 3119405
6778C119405k42959k53850k69035k60844k09851j38526j05464j06121j05653j04786
$$ 3119405 2876446 2622596 2353561 2092717 1882866 1744340 1638876 1532755 1427102 1322316
6768A322316j04105r8188p0964m9118n6887p3411p6561k9934M2800P1213M2738
$$ 1322316 1218211 1120023 1049059 999941 943054 869643 793082 763148 805948 877161 919899
6757I19899R61k8491m1473m4766l4002k1368l9351p2998p3936l0329K7285O4370
$$ 919899 920860 892369 850896 806130 772128 750760 711409 638411 564475 534146 561431 625801
6745F25801N0756j1369o8790p5549m3306k0960m9287r0250r1257p9655q6240o6145
$$ 625801 676557 665188 596398 520849 477543 456583 407296 317046 225789 146134 59894 -6251
6733f251K198N0022L3820j5892o1748p7859n9263j5860J7559K6718K0182o972
$$ -6251 -4053 45969 79789 63897 2149 -75710 -134973 -150833 -133274 -106556 -86374 -93346
6721i3346k1601J2171M7870N9838N0153K2114K0658P4322J19905R6962K8884l6828
$$ -93346 -114947 -102776 -54906 4932 55085 77199 97857 172179 292084 389046 417930 381102
6709C81102q2127r3868p3878m1914k1236k8070n0260m9804l1124j7714K4206P1244
$$ 381102 298975 205107 131229 89315 68079 40009 -10251 -60055 -91179 -108893 -84687 -13443
6697a3443P4129M1073P310m948k0252o0424r9445j24179j32980j29672j09234
$$ -13443 60686 101759 109069 104121 83869 23445 -76000 -200179 -333159 -462831 -572065
6686e72065n5475J4904L4535j024l1571j1101M8634Q3783J03492J13922Q7354
$$ -572065 -627540 -612636 -578101 -579125 -610696 -621797 -573163 -489380 -385888 -271966 -184612
6675a84612L8281Q743J2098K0627J9033j573l8116m5852r883K7720L0834J2187
$$ -184612 -146331 -137588 -125490 -104863 -85830 -87403 -125519 -171371 -181254 -153534 -122700 -110513
6663a10513J8009K9061J1425p343k2527m3149n6240o5450n7052k6238l378L375
$$ -110513 -92504 -63443 -52018 -59361 -81888 -125037 -181277 -246727 -303779 -330017 -333395 -330020
6651c30020J321J3648J9889J0487j1893l9746m1231j7987J9104N2790M8054J0189
$$ -330020 -328699 -315051 -295162 -284675 -296568 -336314 -377545 -395532 -376428 -323638 -275584 -265395
6639b65395k1276n3044o3950k7975J9016L4000L1589M0990N1223M8417N2163N0214
$$ -265395 -286671 -339715 -403665 -431640 -412624 -378624 -347035 -306045 -254822 -206405 -154242 -104028
6627a04028L9836M1415N7588N7917N5761O8214P2356O1376K3577l6106p7573o3160
$$ -104028 -64192 -22777 34811 92728 148489 216703 289059 350435 374012 337906 260333 197173
6615A97173l0550n623M2913Q6380R6530P4895J3619m7618q1835r1952r1955q7183
$$ 197173 166623 161000 203913 290293 386823 461718 475337 427719 345884 253932 161977 74794
6603G4794p0886m1722K862M2911O0150P0086O8980M3026R687R482K5203O018n2655
$$ 74794 3908 -37814 -34952 7959 68109 138195 207175 250201 259888 269370 294573 300591 247936
6590B47936r7578o8291N669O1886O3759J3639n6168j00150r4933l7408L0150O3808
$$ 247936 150358 82067 87736 149622 213381 227020 170852 70702 -24231 -61639 -31489 32319
6578C2319Q4304P3206L2571K5173N1955M9970R998m5340j00480j07103o4325k4657
$$ 32319 116623 189829 222400 247573 299528 349498 359496 314156 213676 106573 42248 17591
6566A7591r744J812L4006Q1224J01383O6968M865m5010m3263j4821p643j7208
$$ 17591 7847 9659 43665 124889 226272 293240 298105 253095 209832 195011 187368 170160
6554A70160k0735j3915O857L4726N8539N5663K2144j0135k4390n384N6084J15590
$$ 170160 149425 135510 142367 177093 235632 291295 313439 303304 278914 273530 329614 445204
6542D45204R4704J0323n0344o0830n4411n5311o2005p0472o7370n3823k9376j4265
$$ 445204 539908 550231 499887 439057 384646 329335 267330 196858 129488 75665 46289 32024
6530C2024J1572Q0463J24345P8507j9389q4206r8598r3454q8810p6884l6078R299
$$ 32024 43596 124059 248404 326911 307522 223316 124718 31264 -57546 -134430 -170508 -161209
6518a61209M1571O4604P2626N4829K8974L4687N1291N4656O3063P5748P7399O3411
$$ -161209 -119638 -55034 17592 72421 101395 136082 187373 242029 305092 380840 458239 521650
6506E21650M2824P533l5469o2965n4630l4264j3115J9744M1916L1152J6031J618
$$ 521650 564474 572007 536538 473573 418943 384679 371564 391308 433224 464376 480407 482025
6494D82025n796L5483J02913J04384J9271p1555j14495j20204j09862j03162r6171
$$ 482025 476229 511712 614625 719009 738280 666725 552230 432026 322164 219002 122831
6483A22831o6288k6526J9878M8960L4147J9284J8029o099k5923l913K6651Q920
$$ 122831 56543 30017 49895 98855 133002 152286 170315 164216 138293 134380 161031 169951
6471A69951m8712j02615j18074n7366L8054R9532J12126R3563M6813m696l1494
$$ 169951 121239 18624 -99450 -156816 -118762 -19230 92896 186459 233272 228576 197082
6460A97082l1528r276L8093J02506J31872J21067J11965J21901R4118K2190n0638
$$ 197082 165554 156278 194371 296877 428749 549816 661781 783682 877800 899990 849352
6449H49352p4812n7727l5216l3061l5961Q184O1465K9673o6325j30395j40505
$$ 849352 774540 716813 681597 648536 612575 620759 682224 711897 645572 515177 374672
6438C74672j27321j19146j00137p3289n4250k2475J4377L4876L4087J9078J9543
$$ 374672 247351 128205 28068 -45221 -99471 -121946 -107569 -72693 -38606 -19528 15
6427A5M1171N7986N6712M1016K4113j209l5314l7691q451K4066N6110O7757O4599
$$ 15 41186 99172 155884 196900 221013 219804 184490 146799 138348 162414 218524 286281 350880
6414C50880N6843N3299M7710M1777L4491K8172L142p7209j61248j72067r9706
$$ 350880 407723 461022 508732 550509 585000 613172 616314 539105 377857 205790 106084
6403A06084j0031O1228J11181J18672J27719J76838J95648J44677P3754J8109
$$ 106084 96053 157281 268462 387134 514853 691691 887339 1032016 1105770 1123879
6393A123879j5875m8275o7554l5818L357R070p271j9872k0962m1359q2858r4534
$$ 1123879 1108004 1059729 992175 956357 959714 968784 961513 941641 920679 879320 796462 701928
6381G01928m6714K3672N8704L1137l0161n9222p3625q8976p7034l3301P182M725
$$ 701928 655214 678886 737590 768727 738566 679344 605719 516743 439709 406408 413590 418315
6369D18315k0594k8410o6555j30186j31789p7372q963N5610R0633R9355J17428
$$ 418315 397721 369311 302756 172570 40781 -36591 -45554 10056 100689 200044 317472
6358C17472J55200J87061J50989P0844L1093L4487K3902k4843q2406r2530o6465
$$ 317472 472672 659733 810722 881566 912659 947146 971048 946205 863799 771269 704804
6347G04804n3103l6373J8794O0933L2827j4536k9442l3261m2980l4962j6789q863
$$ 704804 651701 615328 634122 695055 727882 713346 683904 650643 607663 572701 555912 547049
6335E47049J8581N0182L7469Q104J6945K3758j254l9144r2589j14973j00732j02583
$$ 547049 565630 615812 653281 661385 678330 702088 700834 661690 569101 454128 353396 250813
6323B50813j00167o1710j0166Q583Q167R335N430n485k3507m4631n7573n9589
$$ 250813 150646 88936 78770 87353 95520 104855 110285 104800 81293 36662 -20911 -80500
6311h0500k5954N4186J09752J10111P4261K1008k3173k7295J334J6297R600K3436
$$ -80500 -106454 -52268 57484 167595 241856 262864 239691 212396 213730 230027 239627 263063
6299B63063O1964Q0871M0667j7664m6348o4179n7527L55N5902K8321m1217n2899
$$ 263063 325027 405898 446565 428901 382553 318374 260847 261202 317104 345425 304208 251309
6287B51309N168N0756N1197K8377j1141l7810l8112l6101m6387l9290k1312K522
$$ 251309 256477 307233 358430 386807 375666 337856 299744 263643 217256 177966 156654 159176
6275A59176L3838L4540K2729K4258K5591K0074L5163O6336O3052J6465k2296j3565
$$ 159176 193014 227554 250283 274541 300132 320206 355369 421705 484757 501222 478926 465361
6263D65361J3018K4676J4189j3326l7700j7702L3591O3518O5357P6752J24491
$$ 465361 478379 503055 517244 503918 466218 448516 482107 545625 610982 687734 812225
6252H12225J59737J54359J38852J07693N7579L4148L8249L8412L3491J6873n057
$$ 812225 971962 1126321 1265173 1372866 1430445 1464593 1502842 1541254 1574745 1591618 1586561
6241A586561J4396P5954R2854P8786P8073P9564R9665J24110J17790R1986O8029
$$ 1586561 1600957 1676911 1769765 1848551 1926624 2006188 2105853 2229963 2347753 2439739 2507768
6230B507768N6098M4351o99o8502j20245j30162j06994p0978l6601K661K3655
$$ 2507768 2563866 2608217 2607518 2539016 2418771 2288609 2181615 2110637 2074036 2076697 2100352
6219B100352N553m7788j00950j19267j00839m7828j9335l3762n7151o1182l8427
$$ 2100352 2105905 2058117 1957167 1837900 1737061 1689233 1669898 1636136 1578985 1517803 1479376
6208A479376j7104o130P186N747l6757r6561j27316j46650j68740j73020j72820
$$ 1479376 1462272 1456142 1463328 1469075 1432318 1335757 1208441 1061791 893051 720031 547211
6197E47211j53836j14422q8090o5566m754P7685J32785J46607J30078Q1356r386
$$ 547211 393375 278953 190863 125297 120543 198228 331013 477620 607698 689054 679668
6186F79668r0560j00943p2365l2103L458M942k3669m0963k7610k3200m0616n3240
$$ 679668 589108 488165 415800 383697 387155 392097 368428 327465 299855 276655 236039 182799
6174A82799l7141m170j4332o7924r1383m6554M8727J34098J36428N4970l3888
$$ 182799 145658 141488 127156 59232 -32151 -78705 -29978 104120 240548 295518 261630
6163B61630n5994o957N5088R4277J08513Q6613M1540J3974j2811l8739n2111n5791
$$ 261630 205636 198679 253767 348044 456557 543170 584710 598684 585873 547134 495023 439232
6151D39232m4501l8183m2051k7892r852j3729k004M0805Q7788J17012J04995N4881
$$ 439232 394731 356548 314497 286605 276753 263024 261020 301825 389613 506625 611620 666501
6139F66501j8143o8531q7551r5983q5123n6906l8106n0935n4309k9378k8877n1703
$$ 666501 648358 579827 492276 396293 311170 254264 216158 165223 110914 81536 52659 956
6127I56m9029j4777L2766N1673L1179O243k9136o0433n5323l6715k4995K8805
$$ 956 -48073 -62850 -30084 21589 52768 59011 29875 -30558 -85881 -122596 -147591 -118786
6115a18786R5374Q4691R704l5035j0005N6664J26584J43130R1317M5669M0049
$$ -118786 -23412 61279 70983 35948 25943 82607 209191 352321 443638 489307 529356
6104E29356M3747M2394L5805P461m4201q9337j10544q8080m7796l8085n5335o8671
$$ 529356 573103 615497 651302 658763 614562 525225 414681 326601 278805 240720 185385 116714
6092A16714n0998j8241k1792m4747m8591l0016n09O531k7783o3265o6685m7210
$$ 116714 65716 47475 25683 -19064 -67655 -97671 -98180 -91649 -119432 -182697 -249382 -296592
6080b96592m32N7515P9929Q7716J06330J23034J36438J08882M2336k1756o4170
$$ -296592 -297024 -239509 -159580 -71864 34466 157500 293938 402820 445156 423400 359230
6069C59230o8905l3468j0496m808J9721O5396Q8362P7003N1689L0475K0289M053
$$ 359230 290325 256857 246361 241553 261274 326670 415032 492035 543724 574199 594488 598541
6057E98541k3830o4763q6852p7161n5691l5076l6133n2194m8205l6685l6618k6802
$$ 598541 574711 509948 423096 345935 290244 255168 219035 166841 118636 81951 45333 18531
6045A8531J7151R2280J52617J54062R4079p5o5060o8344m7812l9754n5448r4242
$$ 18531 35682 127962 280579 434641 528720 528645 463585 395241 347429 307675 252227 157985
6033A57985j31951j24939n5773K5676P3358R6776J00084P7666M7857J9840k6037
$$ 157985 26034 -98905 -154678 -129002 -55644 41132 141216 218882 266739 286579 260542
6022B60542p8571j02732j01204n7631N703N0709P5368O2636L6449P946n347K5191
$$ 260542 181971 79239 -21965 -79596 -73893 -23184 52184 114820 151269 159215 153868 179059
6010A79059M1472K4717n437m2791n9353n1159m5139m9798n1241l1065j0630k655
$$ 179059 220531 245248 239811 197020 137667 86508 41369 -8429 -59670 -90735 -101365 -104020
5998a04020K873J9626N9938P3469L3094P985M7582R2778J01719O6134n660l6246
$$ -104020 -101147 -81521 -21583 51886 84980 92965 140547 233325 335044 401178 395518 359272
5986C59272k7966l5932m8930n9089p1469p5869m9377j031L3379O3033R8619J01562
$$ 359272 331306 295374 246444 187355 115886 40017 -9360 -10391 22988 86021 184640 286202
5974B86202L3609l9964p0215o6976m9477l8776k4056L1244J05952J40036R5118
$$ 286202 319811 279847 209632 142656 93179 54403 30347 61591 167543 307579 402697
5963D02697J9128k5637n6790p8234q4417p8494o1318o0554q1854o5142l4306n4089
$$ 402697 421825 396188 339398 261164 176747 98253 36935 -23619 -105473 -170615 -204921 -259010
5951b59010p3556n8810m9044n1880j9604K6051L1449J856j0674K2096Q5862J36030
$$ -259010 -332566 -391376 -440420 -492300 -511904 -485853 -454404 -452548 -463222 -441126 -355264 -219234
5939b19234J24920J12344J08967N9871r41m5171p6525q5066q1975p2763m7367
$$ -219234 -94314 18030 126997 186868 185927 140756 64231 -20835 -102810 -175573 -222940
5928b22940q084L8307N4594O673p1742j05381o4807l888L1816L0432O494j2296
$$ -222940 -231024 -192717 -138123 -131450 -203192 -308573 -373380 -377268 -345452 -315020 -308526 -320822
5916c20822o202M8382J21650J32691Q0893K6116m582j3439j5143l7858p0178j07135
$$ -320822 -327024 -278642 -156992 -24301 56592 82708 78126 64687 49544 11686 -58492 -165627
5904a65627j33247j21495n4593M4040J03065J08660R3551L4282l0774k2466J6008
$$ -165627 -298874 -420369 -474962 -430922 -327857 -219197 -125646 -91364 -122138 -144604 -128596
5893a28596L7832L8635m1m5886k5780K9125N0312K5153j4638l2362k1023r463
$$ -128596 -90764 -52129 -52170 -98056 -123836 -94711 -44399 -19246 -33884 -66246 -87269 -96732
5881i6732l8176r1947j19770j07964q1971m3447J9467R4629J55841J70548J17941
$$ -96732 -134908 -226855 -346625 -454589 -536560 -580007 -560540 -465911 -310070 -139522 -21581
5870b1581L6913k8545q2014q4350j1329R4759J43637J02158K9232j5565j6644
$$ -21581 15332 -13213 -95227 -179577 -190906 -96147 47490 149648 178880 163315 146671
5859A46671j5272m0690p3232p8632n1976j3928J5880J3958P650K4870L8259L3254
$$ 146671 131399 90709 17477 -61155 -113131 -127059 -111179 -97221 -89571 -64701 -26442 6812
5847F812J5463N21j714Q92p610k9726n9160m8748J1502L2621k055j7116l584k504
$$ 6812 22275 22796 21082 21974 14364 -15362 -74522 -123270 -111768 -79147 -81202 -98318 -101902 -104406
5833a04406j8273m2276p1179o0470J2811R3026J26682J21558Q4318K8759k3258
$$ -104406 -122679 -164955 -236134 -296604 -283793 -190767 -64085 57473 141791 170550 147292
5822A47292p1113j02753j17291j25783j29520j19979o5606J1107O0315J05250
$$ 147292 76179 -26574 -143865 -269648 -399168 -519147 -584753 -573646 -513331 -408081
5812d08081J65732K06797J87825J05988K8952k012k6400m8160m8403n5040o0753
$$ -408081 -242349 -35552 152273 258261 287213 285201 258801 210641 162238 107198 46445
5801D6445m1901l0024l5922k4936J2521O9095J17537J10914O7856K7050R322M377
$$ 46445 4544 -25480 -61402 -86338 -73817 -4722 112815 223729 291585 318635 327957 332334
5789C32334l8502j10478j40143j14837p5736l3782j4211k9733k8633m844K0019
$$ 332334 293832 183354 43211 -71626 -147362 -181144 -195355 -225088 -253721 -258565 -238546
5778b38546L8463K9421M115j5341l1052n2078n3955l0501j2430J2577K4072J9404
$$ -238546 -200083 -170662 -166547 -181888 -212940 -265018 -318973 -349474 -361904 -349327 -325255 -305851
5766c05851L6442P5583P1321J3500k8996k5618j5579k3874l0719m2074n0219k7942
$$ -305851 -269409 -193826 -122505 -109005 -138001 -163619 -179198 -203072 -233791 -275865 -326084 -354026
5754c54026J971K1480N2697Q0739Q3126O2974M8507P1873J00815P4510O660l8042
$$ -354026 -352055 -330575 -277878 -197139 -114013 -51039 -2532 69341 170156 244666 251326 213284
5742B13284p0481r5916q0881o3908o8996o0898j6493M2916P1855N4632M7665P7548
$$ 213284 142803 46887 -33994 -97902 -166898 -227796 -244289 -201373 -129518 -74886 -27221 50327
5730E0327Q6572M2620k3447q5240j24786j34693j21801q6212m1215O827N2867
$$ 50327 136899 179519 156072 70832 -53954 -188647 -310448 -396660 -437875 -431048 -378181
5719c78181Q8018J03834Q0883N5882M4996J0720l9809p6491q5319p6437r0575
$$ -378181 -290163 -186329 -105446 -49564 -4568 6152 -33657 -110148 -195467 -271904 -362479
5708c62479j02819o5074J7135P7144N9317L601l3246l9982r636K3846J7504k5209
$$ -362479 -465298 -530372 -513237 -436093 -376776 -373175 -406421 -446403 -456039 -432193 -414689 -439898
5696d39898m1148j2179P043K822J3219N1601Q1803P6359L6006q726m9243q6265
$$ -439898 -481046 -493225 -486182 -483360 -470141 -418540 -336737 -260378 -224372 -233098 -282341 -368606
5684c68606q8345n1969J304O4114J00918P6518J2807k7856k9448k1419l2052l6911
$$ -368606 -456951 -508920 -507616 -443502 -342584 -266066 -253259 -281115 -310563 -331982 -364034 -400945
5672d00945n933L5372O2804P0644O9065M2953l517r606J7836J4728j7596k2867
$$ -400945 -406878 -371506 -308702 -238058 -168993 -126040 -129557 -139163 -121327 -106599 -124195 -147062
5660a47062k4252k6619j6438k2379n8524r5144q7865m3242M829L1586M8091P9946
$$ -147062 -171314 -197933 -214371 -236750 -295274 -390418 -478283 -521525 -516696 -485110 -437019 -357073
5648c57073R6059L3903p8810j55477j77455j46222r0883k8056L3639O5510P5721
$$ -357073 -261014 -227111 -305921 -461398 -638853 -785075 -875958 -904014 -870375 -804865 -729144
5637g29144P5231P1040M4340m323l8868o0405q4330o3806Q843P2490J09320J28646
$$ -729144 -653913 -582873 -538533 -542856 -581724 -642129 -726459 -790265 -781422 -708932 -599612 -470966
5625d70966J11927O2384M4063O7757Q7953O9363Q286j9793q130j3827l2993k5496
$$ -470966 -359039 -296655 -252592 -184835 -96882 -27519 -19233 -39026 -47156 -60983 -93976 -119472
5613a19472J5054N2479M0725J4659K6858K1044l3362o6664o2325o1096k7830K2470
$$ -119472 -104418 -51939 -11214 3445 30303 51347 17985 -48679 -111004 -172100 -199930 -177460
5601a77460M2086N7204O6155L1315l2307o3069m7442j7950j0370j5520k2604l3818
$$ -177460 -135374 -78170 -12015 19300 -13007 -76076 -123518 -141468 -151838 -167358 -189962 -223780
5589b23780l6634j2584L2379Q6258J06312Q2756P6375P8899O3433K9121j4397
$$ -223780 -260414 -272998 -240619 -154361 -48049 34707 111082 189981 253414 282535 268138
5578B68138m3146l7462q56K9075J3854k4327n2474o4750m5929p12M0810N9145
$$ 268138 224992 187530 186674 215749 229603 205276 152802 88052 42123 41411 82221 141366
5566A41366M2884j140q881J0786J3391J1426J6m0430q3404r2695p8844m8961k28
$$ 141366 184250 183110 174229 185015 198406 209832 209848 169418 86014 -6681 -85525 -134486 -134714
5553a34714K5600r36l8995m3228k3709M728K9037O218l5907n2486m8862j3468
$$ -134714 -109114 -110050 -149045 -192273 -215982 -211254 -182217 -175999 -211906 -264392 -313254 -326722
5541c26722M9191J09060J35462J01235K7107k949L3164N2745J7890l2694n8287
$$ -326722 -277531 -168471 -33009 68226 95333 92384 125548 178293 196183 163489 105202
5530A05202l5763L159J9625P106j9570m4642n7975k5166L1867M8496N1221P0679
$$ 105202 69439 72598 92223 99329 79759 35117 -22858 -48024 -16157 32339 83560 154239
5518A54239P3984N1228J3084j0448K0629O5598N1982m851n9268q0728m5269K9801
$$ 154239 228223 279451 292535 282087 302716 368314 420296 415445 356177 275449 230180 259981
5506B59981O8075N7947K9047O79p33P305J6398P0847J41886J64648J22650M5181
$$ 259981 328056 386003 415050 415729 414996 422301 438699 509546 651432 816080 938730 983911
5494I83911l5613q6054q2527m2606j1298L15p697k5667m6478n5898o9180j18597
$$ 983911 948298 862244 779717 737111 725813 726128 718431 692764 646286 590388 521208 402611
5482D02611j76344j66657q8624k3870k0714o0205q3988m7246K3960O3604M5146
$$ 402611 226267 59610 -29014 -52884 -73598 -133803 -217791 -265037 -241077 -177473 -132327
5471a32327n919k2007O930J6428o512j4425J088M1077P7435O6517J5516k9008
$$ -132327 -138246 -160253 -153323 -136895 -143407 -157832 -156744 -115667 -38232 28285 43801 14793
5459A4793l1341m743K4119K1379j3480m0396l0668R550K7507N173k2166k0665
$$ 14793 -16548 -21291 2828 24207 10727 -29669 -60337 -50787 -23280 -18107 -40273 -60938
5447f0938o543j0258l7534l9402O4l20l6124m4286k8142j7954l7431p4867q0303
$$ -60938 -67481 -77739 -115273 -154675 -154611 -154931 -191055 -235341 -263483 -281437 -318868 -393735 -474038
5434d74038k6138L6561O8618R9110J00545N3949N198l0673n4506n3068j5794L4562
$$ -474038 -500176 -463615 -394997 -295887 -195342 -141393 -136195 -166868 -221374 -274442 -290236 -255674
5422b55674L7707R0j0166N366J3342K2147M1899K8300k2089o8507r2035q1411
$$ -255674 -217967 -217877 -228043 -222677 -209335 -187188 -145289 -116989 -139078 -207585 -299620 -381031
5410c81031l7331L791J5199L3846O5481P8309Q5186R7490R1591N0771k4860p4899
$$ -381031 -418362 -414571 -399372 -365526 -300045 -221736 -136550 -39060 52531 103302 78442 3543
5398C543n2058p524K1568M3628O4371P5077M0728k5174q2667j05609p1994j5220
$$ 3543 -48515 -56039 -34471 9157 73528 148605 189333 164159 81492 -24117 -96111 -111331
5386a11331N845j0525j8462k6422o1275q8269r6392r0831m8459L606L2578K6887
$$ -111331 -105486 -116011 -134473 -160895 -222170 -310439 -406831 -497662 -546121 -542515 -509937 -483050
5374d83050p145k8200k8690p12N5161J00808J09424Q7020P9379J02681J14744
$$ -483050 -490195 -518395 -547085 -547797 -492636 -391828 -282404 -195384 -116005 -13324 101420
5363A01420R0966P0588Q6554J13809J05813O9154J7046l9939q3945j19918j46484
$$ 101420 192386 262974 349528 463337 569150 638304 655350 615411 531466 411548 265064
5352B65064j25778p3256o2090q5422p4801l6405n153L5306O9340M6512j5116n4060
$$ 265064 139286 66030 3940 -81482 -156283 -192688 -197841 -162535 -93195 -46683 -61799 -115859
5340a15859l7145M2254J26695J38789P8949K0366K446j1150n0887r1685r9477
$$ -115859 -153004 -110750 15945 154734 233683 254049 256495 245345 194458 102773 3296
5329C296o3517j055J4265l2546m3613m319O612k5317l7996L3727J44479J84189
$$ 3296 -60221 -61276 -47011 -79557 -123170 -127489 -120877 -146194 -184190 -150463 -5984 178205
5317A78205J48997R1834L8710L4479Q4674J32504J53754J61129J89463K25216
$$ 178205 327202 419036 457746 492225 576899 709403 863157 1024286 1213749 1438965
5307A438965K12438J27626k1886j70129k33627k19001j89137j55808j04787n7816
$$ 1438965 1651403 1779029 1757143 1587014 1353387 1134386 945249 789441 684654 626838
5297F26838m7612n6926m5224p015M9708Q8470P1435M5271K7663R177r813l9831
$$ 626838 579226 522300 477076 470061 519769 608239 679674 724945 752608 761785 751972 712141
5285G12141l6324J7869N8176M7438J605l9492m7635m5849k4321K8337P2017N2973
$$ 712141 675817 693686 751862 799300 800905 761413 713778 667929 643608 671945 743962 796935
5273G96935j7652k0945M4631Q3177R0152Q5301O9270K1398m5761r0482r1571o1208
$$ 796935 779283 758338 802969 886146 976298 1061599 1130869 1152267 1106506 1016024 924453 863245
5261H63245J605R6220J86268K21033J62641M7052m7112o2011k9080P723M1440
$$ 863245 864850 961070 1147338 1368371 1531012 1578064 1530952 1468941 1439861 1447584 1489024
5250A489024N6082O2514N7205K9224M874k948n083R995L7775O1932Q5494J06841
$$ 1489024 1545106 1607620 1664825 1694049 1698923 1695975 1690892 1700887 1738662 1800594 1886088 1992929
5238A992929J03772O2825J3959k0294l0263k7063j0785J7257L8475M4468J0830
$$ 1992929 2096701 2159526 2173485 2153191 2122928 2095865 2085080 2102337 2140812 2185280 2196110
5227B196110k3073K481M7326Q4245J06592J00522O2992r677r9561j56807j46721
$$ 2196110 2173037 2175518 2222844 2307089 2413681 2514203 2577195 2567518 2467957 2311150 2164429
5216B164429j20271j22991j43354j75751j99038j96465j80248j45557r7506o6983
$$ 2164429 2044158 1921167 1777813 1602062 1403024 1206559 1026311 880754 783248 716265
5206G16265o5820n7766j312M0491K287p2084j02903q5053m5721L253M0598M0744
$$ 716265 650445 592679 591367 631858 634145 562061 459158 374105 328384 331637 372235 412979
5194D12979j0547r0249j33208j13312q0286n8513l3438J9662Q7585J23016J36044
$$ 412979 402432 312183 178975 65663 -14623 -73136 -106574 -86912 673 123689 259733
5183B59733J38135R2045N185o0034r9273j22901j02008n0867j8860l407K7495
$$ 259733 397868 489913 495098 435064 335791 212890 110882 60015 41155 37748 65243
5172F5243R2944J47332J31404N8156k3943q0673r8662r2828r1456q7733o8981
$$ 65243 158187 305519 436923 495079 471136 390463 291801 198973 107517 19784 -49197
5161d9197k8761K8867O9202O2400L4422L9873P7893Q6492M9612N694m821J4412
$$ -49197 -77958 -49091 20111 82511 116933 156806 234699 321191 370803 376497 371676 386088
5149C86088L8432N4819M7627J9167J5028M4931O6301N4055J9320j1645l5170k5457
$$ 386088 424520 479339 526966 546133 561161 606092 672393 726448 745768 734123 698953 673496
5137F73496J2961L0204M7850P9655P7129P997p5249j14059j29609j23188q9360
$$ 673496 686457 716661 764511 844166 921295 929292 854043 739984 610375 487187 397827
5126C97827r0508j46189j67006r9065R56P3635R4682P4623L8806M831l870k55
$$ 397827 307319 161130 -5876 -104941 -103985 -30350 64332 138955 177761 182592 178722 178467
5114A78467p258j7247m0973o8037p1512n4221j9426K3115N6910O8549K3135o2846
$$ 178467 171209 153962 112989 44952 -26560 -80781 -100207 -77092 -20182 48367 71502 8656
5102H656j01353o5320j3727N2266J41258J79033J43175Q1982J4342m2153o8228
$$ 8656 -92697 -158017 -171744 -119478 21780 200813 343988 425970 440312 398159 329931
5091C29931o0970m6449m6409n8690q4868j20575j40230j12133n8754j7779J1206
$$ 329931 268961 222512 176103 117413 32545 -88030 -228260 -340393 -399147 -416926 -405720
5080d05720K7430M2496Q5285J50682J89576J57726P6000k662n4136n7668k2032
$$ -405720 -378290 -335794 -250509 -99827 89749 247475 323475 320813 266677 209009 186977
5069A86977J8990K1282l7347r0298o5429P306N3362N3720O8340R0409M4712l2730
$$ 186977 205967 227249 189902 99604 34175 41481 94843 148563 216903 307312 352024 319294
5057C19294o7597p2815n3696o944L3053L7181J7600N175J5931L6241N3137O3371
$$ 319294 251697 178882 125186 118242 151295 188476 206076 211251 227182 263423 316560 379931
5045C79931N4454J4465k0360j6129j1166l9349p3440m6740M2860J07102J06680
$$ 379931 434385 448850 428490 412361 401195 361846 288406 241666 284526 391628 498308
5034D98308P9705N9558L7268J525k6004k5054K1552Q5066J26125J30275J07101
$$ 498308 578013 637571 674839 676364 650360 625306 646858 731924 858049 988324 1095425
5023A095425Q5710P5913P2644O4487M1409N782k0257l7968m3649j547P2861J44269
$$ 1095425 1181135 1257048 1329692 1394179 1435588 1441370 1421113 1383145 1339496 1337949 1410810 1555079
5011A555079J84699J83551J51564J06410P5184M4685J0978l778l793r361l4789
$$ 1555079 1739778 1923329 2074893 2181303 2256487 2301172 2312150 2308372 2304579 2295218 2260429
5000B260429m4906k2483J3919N8787J01304Q8326M3849M4484P2279R4471J26718
$$ 2260429 2215523 2193040 2206959 2265746 2367050 2455376 2499225 2543709 2615988 2710459 2837177
4989B837177J34264R0695N0861L2783L101l4544n2526l9589j910O6441J21716
$$ 2837177 2971441 3062136 3112997 3145780 3148881 3114337 3061811 3022222 3020312 3086753 3208469
4978C208469J51824K02285K72454L34028L64373L70193L85128M35286M81927M75798
$$ 3208469 3360293 3562578 3835032 4169060 4533433 4903626 5288754 5724040 6205967 6681765
4968F681765M31500L98820M09466M40375M38461M37051N11409O56726Q50397J064596
$$ 6681765 7113265 7512085 7921551 8361926 8800387 9237438 9748847 10405573 11255970 12320566
4958A2320566J257639J440674J614396J787834K013499K317223K696723L179014
$$ 12320566 13578205 15018879 16633275 18421109 20434608 22751831 25448554 28627568
4950B8627568L770994M459028N217943N961685O505924O443790N227339K570974
$$ 28627568 32398562 36857590 42075533 48037218 54543142 60986932 66214271 68785245
4942F8785245j058181m471620o602522p254183o907987o083769n117688m216594
$$ 68785245 67727064 63255444 56652922 49398739 42490752 36406983 31289295 27072701
4934B7072701l481688k916697k495012k162967j862318j614706j397220j170066
$$ 27072701 23591013 20674316 18179304 16016337 14154019 12539313 11142093 9972027
4926I972027r76856q42410p34909o38127n66038n34725n37374n23127m60954l67601
$$ 9972027 8995171 8152761 7417852 6779725 6213687 5678962 5141588 4618461 4157507 3789906
4916C789906k90912k37742j87939j59105j36441q5848k8060Q622J5516r451n2924
$$ 3789906 3498994 3261252 3073313 2914208 2777767 2691919 2663859 2672481 2687997 2678546 2625622
4905B625622q5766r1393r3863j08875j05267r6917p9209n2712n4574o2748m0882
$$ 2625622 2539856 2448463 2354600 2245725 2140458 2043541 1964332 1911620 1857046 1794298 1753416
4894A753416j1054j3067n5825j37501k20647k30169j43106l6922L7726O3416J7181
$$ 1753416 1742362 1729295 1673470 1535969 1315322 1085153 942047 905125 942851 1006267 1023448
4883A023448l5786n4872o8187n2773r181J506l1122n0584m6851m7486o4989j00556
$$ 1023448 987662 932790 864603 811830 802649 804155 773033 722449 675598 628112 563123 462567
4871D62567j12623n8611M3427J18263J19098O5891J587k6082k2983j7641j0278
$$ 462567 349944 291333 334760 453023 572121 638012 639599 613517 590534 572893 562615
4860E62615o802q460j4598l1622n2777p2886p6207p7970p1430k4150L4656O8106
$$ 562615 555813 547353 532755 501133 448356 375470 299263 221293 149863 125713 160369 228475
4848B28475Q0558R0567R3401N0824m8275j34617j46035q8586l754M7858O2323
$$ 228475 309033 399600 493001 543825 495550 360933 214898 126312 122558 170416 232739
4837B32739N0926J446m8056m8338k2211P128K4588K8211L5357K4709P89M632M0340
$$ 232739 283665 285111 237055 188717 166506 173634 198222 226433 261790 286499 287288 291920 332260
4824C32260R0780J12215Q2232L0325j4960m9489p3290q4451q3368p1153p0726
$$ 332260 423040 535255 617487 647812 632852 583363 510073 425622 342254 271101 200375
4813B00375p8697o0431k5037N945K2363J7160k1578p2376q4770o2968k8152K2331
$$ 200375 121678 61247 36210 42155 64518 81678 60100 -12276 -97046 -160014 -188166 -165835
4801a65835P8068R9120N3951K5393O2829P6136L6468k720k5917m4712p0606q8149
$$ -165835 -87767 11353 65304 90697 153526 229662 266130 263410 237493 192781 122175 34026
4789C4026o3554m2719o4019r4185r3038p8369q0834o5186j6164L7742Q2685J09071
$$ 34026 -29528 -72247 -136266 -230451 -323489 -401858 -482692 -547878 -564042 -526300 -443615 -334544
4777c34544Q3722M1524L5961M5530O4782N6055K0693K262j4724m1466n4422m1667
$$ -334544 -250822 -209298 -173337 -127807 -63025 -6970 13723 15985 1261 -40205 -94627 -136294
4765a36294l4960m8094l0801J4950L6132J6800l4813r1562q5268o149O9807O9530
$$ -136294 -171254 -219348 -250149 -235199 -199067 -182267 -217080 -308642 -393910 -400059 -330252 -260722
4753b60722J5353j6573k6666m5047l1825J7977O5346Q4194Q4030R9215J04572
$$ -260722 -245369 -261942 -288608 -333655 -365480 -347503 -282157 -197963 -113933 -14718 89854
4742H9854O6412K790n8885r2605q1427m3025J7683R0591J28000J28006Q9326m26
$$ 89854 156266 159056 100171 7566 -73861 -116886 -99203 -8612 119388 247394 336720 336294
4730C36294q6391j04366q1180p4032o5335l5121j8733l4560l7296k9046m7961
$$ 336294 249903 145537 64357 -9675 -75010 -110131 -128864 -163424 -200720 -229766 -277727
4719b77727p5629m5805J7602M3492L7093L4826R336q952K6456O5149N6877K5669
$$ -277727 -353356 -399161 -381559 -338067 -300974 -266148 -256812 -265764 -239308 -174159 -117282 -91613
$$ [...]
##END NTUPLES=NMR SPECTRUM
##END=
