##TITLE=C13_SR167_k2Omg
 DMSO-d6, 19600 sc

 21.2.2023
##JCAMPDX= 6.0         $$ Bruker NMR JCAMP-DX V2.0
##DATA TYPE= NMR SPECTRUM
##DATA CLASS= NTUPLES
##ORIGIN= UXNMR, Bruker Analytische Messtechnik GmbH
##OWNER= root
$$ XWIN-NMR		Version 3.5
$$ Wed Feb 22 13:46:50 2023 Russian Standard Time (UT+4h)  she@DPX200
##.OBSERVE FREQUENCY= 50.327896
##.OBSERVE NUCLEUS= ^13C
##.ACQUISITION MODE= SIMULTANEOUS
##.ACQUISITION SCHEME= undefined
##.AVERAGES= 19601
##.DIGITISER RES= 17
##SPECTROMETER/DATA SYSTEM= spect
##.PULSE SEQUENCE= zgpg30
##.SOLVENT NAME= CDCl3
##.SHIFT REFERENCE= (INTERNAL, CDCl3, 0, 222.624)
##AUDIT TRAIL= $$ (NUMBER, WHEN, WHO, WHERE, WHAT)
$$ ##TITLE= Audit trail, XWIN-NMR		Version 3.5
$$ ##JCAMPDX= 5.01
$$ ##ORIGIN= Bruker BioSpin GmbH
$$ ##OWNER= she
$$ F:/spectra/data/she/nmr/c13/1/pdata/1/auditp.txt
$$ ##AUDIT TRAIL=  $$ (NUMBER, WHEN, WHO, WHERE, WHAT)
(   1,<2023-02-22 13:45:13.54 +0400>,<she>,<DPX200>,
      <created by zg, POWCHK disabled, PULCHK disabled
       terminated by command 'halt'
       configuration hash MD5:
       00 E9 B6 7A A2 85 ED C7 34 08 36 98 17 FE 4E 26
       data hash MD5: 32K
       91 52 86 8E 99 57 35 8A 12 C5 C4 54 B6 7E E0 8F>)
(   2,<2023-02-22 13:45:17.73 +0400>,<she>,<DPX200>,
      <Start of raw data processing
       efp BC_mod = 2 LB = 2 FT_mod = 6 PKNL = 1 PHC0 = -316.4565 PHC1 = 37.98447 SI = 32K 
       data hash MD5: 32K
       E4 7A 85 E9 D1 A6 05 09 CB 1F D8 76 6D C3 30 0D>)
(   3,<2023-02-22 13:45:20.42 +0400>,<she>,<DPX200>,
      <abs ABSG = 5 
       data hash MD5: 32K
       A8 CD 82 AE AC 4C CF 6F F8 A7 D0 F2 A3 97 1D C2>)
(   4,<2023-02-22 13:45:51.46 +0400>,<she>,<DPX200>,
      <pk PHC0 = 4.22038 PHC1 = -16.4 
       data hash MD5: 32K
       14 8E C0 C4 13 94 A4 33 28 6C 69 A1 E4 9B 1A 94>)
(   5,<2023-02-22 13:45:55.01 +0400>,<she>,<DPX200>,
      <abs ABSG = 5 
       data hash MD5: 32K
       9F 45 20 2C E6 93 5D FF 97 64 E0 94 57 0B B4 A6>)
$$ ##END=
$$ 
$$ hash MD5
$$ 77 EE DD 14 62 67 62 DE DE 7D 12 4F 40 3E C5 8D
##$RELAX= 
##$RELAX= 
##$RELAX= 
##$RELAX= 
##$RELAX= 
##$RELAX= 
##$RELAX= 
##$RELAX= 
$$ Bruker specific parameters
$$ --------------------------
##$DU= <F:/spectra>
##$EXPNO= 1
##$NAME= <c13>
##$PROCNO= 1
##$TYPE= <nmr>
##$USER= <she>
##$AMP= (0..31)
100 100 100 100 100 100 100 100 100 100 100 100 100 100 100 100 100 100 
100 100 100 100 100 100 100 100 100 100 100 100 100 100 
##$AQSEQ= 0
##$AQ_mod= 1
##$AUNM= <au_zg>
##$AUTOPOS= <>
##$BF1= 50.322709
##$BF2= 200.13
##$BF3= 50.322709
##$BF4= 500.13
##$BF5= 500.13
##$BF6= 500.13
##$BF7= 500.13
##$BF8= 500.13
##$BYTORDA= 1
##$CFDGTYP= 0
##$CFRGTYP= 5
##$CHEMSTR= <none>
##$CNST= (0..31)
1 1 145 1 1 1 1 1 1 1 1 1 1 1 1 1 1 1 1 1 1 1 1 1 1 1 1 1 1 1 1 1 
##$CPDPRG= <waltz16>
##$CPDPRG1= <>
##$CPDPRG2= <waltz16>
##$CPDPRG3= <>
##$CPDPRG4= <mlev>
##$CPDPRG5= <mlev>
##$CPDPRG6= <mlev>
##$CPDPRG7= <mlev>
##$CPDPRG8= <mlev>
##$CPDPRGB= <>
##$CPDPRGT= <>
##$D= (0..31)
$$ [...]
##$SUBNAM4= <"">
##$SUBNAM5= <"">
##$SUBNAM6= <"">
##$SUBNAM7= <"">
##$SUBNAM8= <"">
##$SUBNAM9= <"">
##$SW= 239.972175391363
##$SWIBOX= (0..15)
0 1 3 0 0 0 0 0 0 0 0 0 0 0 0 0 
##$SW_h= 12077.2946859903
##$TD= 32768
##$TD0= 1
##$TE= 0
##$TE2= 300
##$TE3= 300
##$TEG= 300
##$TL= (0..7)
120 120 120 120 120 120 120 120 
##$TP= (0..7)
150 150 150 150 150 150 150 150 
##$TP07= 0
##$TPNAME0= <>
##$TPNAME1= <>
##$TPNAME2= <>
##$TPNAME3= <>
##$TPNAME4= <>
##$TPNAME5= <>
##$TPNAME6= <>
##$TPNAME7= <>
##$TPOAL= (0..7)
0.5 0.5 0.5 0.5 0.5 0.5 0.5 0.5 
##$TPOFFS= (0..7)
0 0 0 0 0 0 0 0 
##$TUNHIN= 0
##$TUNHOUT= 0
##$TUNXOUT= 0
##$USERA1= <user>
##$USERA2= <user>
##$USERA3= <user>
##$USERA4= <user>
##$USERA5= <user>
##$V9= 5
##$VALIST= <valist>
##$VCLIST= <CCCCCCCCCCCCCCC>
##$VD= 0
##$VDLIST= <DDDDDDDDDDDDDDD>
##$VPLIST= <PPPPPPPPPPPPPPP>
##$VTLIST= <TTTTTTTTTTTTTTT>
##$WBST= 1024
##$WBSW= 4
##$XGAIN= (0..3)
0 0 0 0 
##$XL= 0
##$YL= 0
##$YMAX_a= 111305882
##$YMIN_a= -41784785
##$ZGOPTNS= <>
##$ZL1= 120
##$ZL2= 120
##$ZL3= 120
##$ZL4= 120
##$ABSF1= 222.624
##$ABSF2= -17.3728
##$ABSG= 5
##$ABSL= 3
##$ALPHA= 0
##$AQORDER= 0
##$ASSFAC= 0
##$ASSFACI= 0
##$ASSFACX= 0
##$ASSWID= 0
##$AUNMP= <proc_1d>
##$AZFE= 0.1
##$AZFW= 0.5
##$BCFW= 0
##$BC_mod= 2
##$BYTORDP= 0
##$COROFFS= 0
##$CY= -3
##$DATMOD= 1
##$DC= 0
##$DFILT= <>
##$DTYPP= 0
##$F1P= 0
##$F2P= 0
##$FCOR= 0.5
##$FTSIZE= 32768
##$FT_mod= 6
##$GAMMA= 0
##$GB= 0
##$INTBC= 1
##$INTSCL= 4.134877e-10
##$ISEN= 128
##$LB= 2
##$LEV0= 0
##$LPBIN= 0
##$MAXI= 10000
##$MC2= 0
##$MEAN= 0
##$ME_mod= 0
##$MI= 0.1934396
##$NCOEF= 0
##$NC_proc= 3
##$NLEV= 6
##$NOISF1= 120.0001
##$NOISF2= 80.00006
##$NSP= 0
##$NTH_PI= 0
##$NZP= 0
##$OFFSET= 222.624
##$PC= 1.4
##$PHC0= -312.2361
##$PHC1= 21.58447
##$PH_mod= 1
##$PKNL= yes
##$PPARMOD= 0
##$PSCAL= 0
##$PSIGN= 0
##$REVERSE= no
##$SF= 50.3227315983092
##$SI= 32768
##$SIGF1= 140
##$SIGF2= 120
##$SINO= 11.81781
##$SIOLD= 32768
##$SREGLST= <13C.CDCl3>
##$SSB= 0
##$STSI= 32768
##$STSR= 0
##$SW_p= 12077.2946859903
##$SYMM= 0
##$S_DEV= 0
##$TDeff= 32768
##$TDoff= 0
##$TI= <>
##$TILT= no
##$TM1= 0
##$TM2= 0
##$TOPLEV= 0
##$USERP1= <user>
##$USERP2= <user>
##$USERP3= <user>
##$USERP4= <user>
##$USERP5= <user>
##$WDW= 1
##$XDIM= 32768
##$YMAX_p= 418666552
##$YMIN_p= -894207
$$ End of Bruker specific parameters
$$ ---------------------------------
##NTUPLES= NMR SPECTRUM
##VAR_NAME=  FREQUENCY,     SPECTRUM/REAL,   SPECTRUM/IMAG
##SYMBOL=    X,             R,               I
##VAR_TYPE=  INDEPENDENT,   DEPENDENT,       DEPENDENT
##VAR_FORM=  AFFN,          ASDF,            ASDF
##VAR_DIM=   32768,         32768,           32768
##UNITS=     HZ,            ARBITRARY UNITS, ARBITRARY UNITS
##FACTOR=    0.368581032318806, 1,           1
##FIRST=     11203.0474430531, 0,            0
##LAST=      -874.247242937185, 0,           0
##MIN=       -874.247242937185, -894207,     0
##MAX=       11203.0474430531, 418666552,    0
$$ Real data points
##PAGE= N=1
##DATA TABLE= (X++(R..R)), XYDATA
$$ [...]
11098H9300r0801p0894m5164k127K6443Q654k3090l7152j5121M1777P8298M5869
$$ 89300 -1501 -72395 -117559 -119686 -93243 -84589 -107679 -144831 -159952 -118175 -39877 5992
11086E992j4656l0821Q655M5466L8153N776l0839l6209l0803m0693m8947l3412
$$ 5992 -8664 -39485 -30830 14636 52789 58565 27726 -8483 -39286 -79979 -128926 -162338
11074a62338K047L5050M6888K4442o410j7041j5082j0992j3925l2549n3324l3803
$$ -162338 -160291 -125241 -78353 -53911 -60321 -77362 -92444 -103436 -117361 -149910 -203234 -237037
11062b37037J6872K2160j6405m4537l7404M666P4488J21789J43619J35380O5798
$$ -237037 -220165 -198005 -214410 -258947 -296351 -291685 -217197 -95408 48211 183591 249389
11051B49389k9702q3868n3429K8344O9056M8279J5964J552r243l0221m4751l4221
$$ 249389 219687 135819 82390 110734 179790 228069 244033 245585 236342 206121 161370 127149
11039A27149n895n189m3861p4539n8359P64N0758M4651M573m3614p0460o4779
$$ 127149 121254 116065 72204 -2335 -60694 -59930 -9172 35479 40052 -3562 -74022 -138801
11027a38801m1534j1171M305J0949L5014P6534Q7430M2161j2441l7663n6739q0129
$$ -138801 -180335 -191506 -187201 -176252 -141238 -64704 22726 64887 52446 14783 -41956 -122085
11015a22085o2412M099O4301P9199Q3496R3073N7358Q823q643q266j3535l8246
$$ -122085 -184497 -180398 -116097 -36898 46598 139671 197029 205852 197209 188943 175408 137162
11003A37162o5929q0362q5255q5526o8497l5994O655M0329M6682M2244M8922N5994
$$ 137162 71233 -9129 -94384 -179910 -248407 -284401 -277746 -237417 -190735 -148491 -99569 -43575
10991d3575M6060J9695O641Q602J632k3770n0283m9758l5499j5646P595M2864
$$ -43575 2485 22180 28821 37423 39055 15285 -34998 -84756 -120255 -135901 -128306 -85442
10979h5442R0060J06354Q5167M0549J3076K6022L8195M5817M6606J6139k3658
$$ -85442 4618 110972 196139 236688 249764 275786 313981 359798 406404 422543 398885
10968C98885o0659q9724q7446o4576m7975n6164o6858l5956Q870K0761R678J3469
$$ 398885 338226 248502 161056 96480 48505 -7659 -74517 -110473 -101603 -80842 -71164 -57695
10956e7695L3423K4318k6111o6765n7372l4601m2063o6416o9324m3953j6365p956
$$ -57695 -24272 46 -26065 -92830 -150202 -184803 -226866 -293282 -362606 -406559 -422924 -430880
10944d30880j5412j2563K2813Q7448J45839J39590P3529J6850j647J1770K0534
$$ -430880 -446292 -458855 -436042 -348594 -202755 -63165 10364 27214 25567 37337 57871
10933E7871j9927p2594p8699m6098o672L7626P7794Q0303M3429Q748Q57K0462
$$ 57871 37944 -34650 -113349 -159447 -166119 -128493 -50699 29604 73033 81781 82638 103100
10921A03100M6583L8031j932l7278n6996o0966n0005l1753q512J8340K9231J4243
$$ 103100 149683 187714 185782 148504 91508 30542 -19463 -51216 -59728 -41388 -12157 2086
10909B086j2013p572L3726N7044M3053O412l9603n1812l1233k7706n8947q8304
$$ 2086 -9927 -17499 16227 73271 116324 122736 83133 31321 88 -27618 -86565 -174869
10897a74869p3321o835M9830N7819M0803Q939m839L0187P8812P8075J7437l7934
$$ -174869 -248190 -255025 -205195 -147376 -106573 -97634 -102473 -72286 6526 84601 102038 64104
10885F4104m4446k7404j4296j5307j9786m022M0379Q6024O3663R482q964j1566
$$ 64104 19658 -7746 -22042 -37349 -57135 -61157 -20778 65246 128909 138391 129427 117861
10873A17861j1769k2232n0234o3767l5056L0145R6279J03262N6150J5333l1403
$$ 117861 106092 83860 33626 -30141 -65197 -35052 61227 164489 220639 235972 204569
10862B04569r3215j27760j21716p0117j1420N79l9510p4310o8473n0210j2289
$$ 204569 111354 -16406 -138122 -208239 -219659 -219080 -258590 -332900 -401373 -451583 -463872
10851d63872L3164M7323N0498N6913K9642m891R606N8727Q7213Q2811N3014J434
$$ -463872 -430708 -383385 -332887 -275974 -246332 -251223 -241617 -182890 -95677 -12866 40148 41582
10839D1582k7735j3020j0269m7559o5529m5729m270M3481O2452P2866P4312M6359
$$ 41582 13847 827 -9442 -57001 -122530 -168259 -172529 -129048 -66596 6270 80582 126941
10827A26941M745q276L651p099n2391r2452p8962j6233M3611O9544O7937N6816
$$ 126941 131686 123410 127061 119962 67571 -24881 -103843 -120076 -76465 -6921 61016 117832
10815A17832N6484K6907n6554j06534o6226O188J9946k6666p7713j16602j28833
$$ 117832 174316 201223 144669 38135 -28091 -21903 -1957 -28623 -106336 -222938 -351771
10804c51771j12646p6786j5339M1089L7333J3556L2194N8399N5572K7247p720
$$ -351771 -464417 -541203 -556542 -515453 -478120 -464564 -432370 -373971 -318399 -291152 -298872
10793b98872k2281j4482l291o484l9665o4662l1096K6578M1842K8025J6882J0387
$$ -298872 -321153 -335635 -338926 -345410 -385075 -449737 -480833 -454255 -412413 -384388 -367506 -357119
10781c57119K3176P2300J18371J07823P0194K8983p268k1849l0436l4275l0213
$$ -357119 -333943 -261643 -143272 -35449 34745 63728 56460 34611 4175 -30100 -60313
10770f0313j5418p062p345M170J3662R915l987j6331l4398n7641p7627p3404n3181
$$ -60313 -75731 -82793 -90138 -85968 -72306 -62391 -66378 -82709 -117107 -174748 -252375 -325779 -378960
10757c78960l9891n739L5349N2128O0480O0303N1448K4802L559K193J1072J8841
$$ -378960 -418851 -424590 -389241 -337113 -276633 -216330 -164882 -140080 -136521 -134328 -123256 -104415
10745a04415J9438L4453O0600N1554M296l1528k1382J4106N0348O2014K8961k0421
$$ -104415 -84977 -50524 10076 61630 65926 34398 13016 27122 77470 139484 168445 148024
10733A48024m4182l5330K347M9774O9760N6038L5425L1497J8335k0628m3891k3612
$$ 148024 103842 68512 70859 120633 190393 246431 281856 313353 331688 311060 267169 243557
10721B43557J5905M7980N6970L3551r997n3828p2548m6723j8168k6475l6527j2025
$$ 243557 259462 307442 364412 397963 387966 334138 261590 214867 196699 170224 133697 121672
10709A21672J6648J0833j1872k2797j6895J53M317J826K6190N3429K8418k5049
$$ 121672 138320 149153 137281 114484 97589 97742 102059 103885 130075 183504 211922 186873
10697A86873m2528k8027r009J0264K3535J3368j4539m4413n5266j9769K2736J9245
$$ 186873 144345 116318 107309 117573 141108 154476 139937 95524 40258 20489 43225 62470
10685F2470M074q994k3300k5946j3823J1615J4635m838J5740P5875J09307J22767
$$ 62470 66544 57550 34250 8304 -5519 6096 20731 15893 31633 107508 216815 339582
10673C39582J26240R8997N1188l012m6125m2760J950J9341j2740m3833n9010p5877
$$ 339582 465822 564819 616007 612995 566870 524110 526060 545401 532661 488828 429818 353941
10661C53941o4222l943N7764Q3728P0296L9712K2144L4096P7637J06503Q5800
$$ 353941 289719 285776 343540 427268 497564 537276 559420 593516 671153 777656 863456
10650H63456L6005r705l8955o6761r0695q8304p3477n0994k9496p019L2825Q7177
$$ 863456 899461 889756 850801 784040 693345 605041 531564 480570 451074 444055 476880 564057
10638E64057J29927J24682J04223J02235N5900l9117r4681r2394n9062j7285j3585
$$ 564057 693984 818666 922889 1025124 1081024 1041907 947226 854832 795770 778485 764900
10627G64900k5427m992K5411L7429J3218k1008k7388j7342r860R762K6276k032
$$ 764900 739473 734481 759892 797321 810539 789531 762143 744801 734941 744703 770979 768947
10615G68947m0476m1766k4007k0554o0119j12575j19872r6167p8959r0284q5813
$$ 768947 728471 686705 662698 642144 582025 469450 349578 253411 174452 84168 -1645
10604a645m727J08977J68027J27715J7683q3960j16205p2833l1787k5302k536
$$ -1645 -6372 102605 270632 398347 416030 332070 215865 143032 111245 85943 83407
10593H3407N4950Q6566M8736k111k7709m0083k4193J1281J4351J2618N3649Q6844
$$ 83407 138357 224923 273659 271548 243839 203756 179563 190844 205195 217813 271462 358306
10581C58306M6279l2993p6093p2941n7974l2592j3689l5541n0935j2355K9747
$$ 358306 404585 371592 295499 222558 164584 131992 118303 82762 31827 19472 49219
10570D9219K7922O815J0817K4147J783l7327n8300o3367p1019o6729n7934o6932
$$ 49219 77141 83956 94773 118920 120703 83376 25076 -38291 -109310 -176039 -233973 -300905
10558c00905p3453n9944j8963K7710M8729M5627L8886K7471l348k5610O19M6092
$$ -300905 -374358 -434302 -453265 -425555 -376826 -331199 -292313 -264842 -268190 -293800 -293181 -247089
10546b47089O4018K7719k7738n1158l5349Q580M8229N2186M5889N3347M5103M893
$$ -247089 -183071 -155352 -183090 -234248 -269597 -261017 -212788 -160602 -114713 -61366 -16263 -11370
10534a1370l6081l6207j2836J5606N3593P3506K4654m3787r4189j28553r8683
$$ -11370 -47451 -83658 -96494 -80888 -27295 46211 70865 27078 -67111 -195664 -294347
10523b94347l2242J7729L6995J2614j8513j8865l763L4050R0378J09551P0840
$$ -294347 -326589 -308860 -271865 -259251 -277764 -296629 -300392 -266342 -175964 -66413 4427
10512D427K9945L0934M3982L2042M617j4269J2565N5681N7199K7670m100k3341
$$ 4427 34372 65306 109288 141330 145947 131678 144243 199924 257123 284793 280693 257352
10500B57352k8462k4568j0922l682k4959l8710k9050j0938O632N843K729p689
$$ 257352 228890 204322 193400 189718 164759 126049 96999 86061 92693 98536 101265 93576
10488I3576m4105q4080q8827n4718j0651K1340L6051K9378O792m160p490j8760
$$ 93576 49471 -34609 -123436 -178154 -188805 -167465 -131414 -102036 -95244 -99404 -106894 -125654
10476a25654j2752J5771L9188O5654R5577Q0207M520o4954o6833k1901M135l478
$$ -125654 -138406 -122635 -83447 -17793 77784 157991 162511 97557 30724 8823 12958 9480
10464I480k3295m9321o5846o5086l7216l112O72j0789p722J2486M5929P0657O4177
$$ 9480 -13815 -63136 -128982 -194068 -231284 -234396 -233724 -244513 -252235 -239749 -193820 -123163 -58986
10451e8986M5624K1817k672q184m714k1440n2922r1472j10921o9149m90K7996
$$ -58986 -13362 8455 5783 -2401 -7115 -28555 -81477 -172949 -283870 -353019 -353509 -325513
10439c25513J3362K7P463J9456K7140L5493K9761J5225L1379N0324L1988j2756
$$ -325513 -312151 -312124 -304661 -285205 -258065 -222572 -192811 -177586 -146207 -95883 -63895 -76651
10427g6651n1709l9690N268L7081M1635J6216k2762m4779l6301j4027R401L0460
$$ -76651 -128360 -168050 -162782 -125701 -84066 -67850 -90612 -135391 -171692 -185719 -176318 -145858
10415a45858N9762J09133J29433Q5523J5380l4982n7677n9595k7397J122q634
$$ -145858 -86096 23037 152470 237993 253373 218391 160714 101119 73722 74844 66210
10404F6210j4273K6034O8949N0904l341l4302k4891P036K0953Q915M436P664M665
$$ 66210 51937 77971 146920 197824 194483 160181 135290 142326 163279 172194 176630 184294 188959
10391A88959j3490m6368n4418j3933N4483J14717J29826Q2373j2p0379j15909
$$ 188959 175469 129101 74683 60750 115233 229950 359776 442149 442137 371758 255849
10380B55849j44990j35870o5889j163n366k3226k4059j2577J6690L8336L6326
$$ 255849 110859 -25011 -90900 -92063 -97429 -120655 -144714 -157291 -140601 -102265 -65939
10369f5939K8772M7723P6296P9277L9792j0910n0120o6177n8419m1678l9010n3773
$$ -65939 -37167 10556 86852 166129 205921 195011 144891 78714 20295 -21383 -60393 -114166
10357a14166m9625j3922M8650R5218Q0004M1453L2156M0667M3835K6791o206m326
$$ -114166 -163791 -177713 -129063 -33845 46159 87612 119768 160435 204270 231061 224855 220529
10345B20529L1535L8219M963k0850l085M6825P0086M4842P401l3095p0757p0532
$$ 220529 252064 290283 295246 274396 271311 318136 388222 433064 440465 407370 336613 266081
10333B66081N46P3383O4955K085m8186n5121n6129o4839p2628p9973p5579m3232
$$ 266081 266627 340010 404965 407050 358864 303743 247614 182775 110147 30174 -45405 -88637
10321h8637O829M1212K5404j6627k1101K5673P2956P7500N2251L3081R508k7962
$$ -88637 -81808 -40596 -15192 -31819 -52920 -27247 45709 123209 175460 208541 218049 190087
10309A90087o0621p9790p4909l3068m631k8100p3343r2394p6250m4730r009K2493
$$ 190087 129466 49676 -25233 -58301 -62932 -91032 -164375 -256769 -333019 -377749 -386758 -364265
10297c64265M5659N9700Q4802J12068J00176P2025M8791K9624K5594K5114J6312
$$ -364265 -318606 -258906 -174104 -62036 38140 110165 158956 188580 214174 239288 255600
10286B55600J425l1677p2316q9155p5745m3639k8949m0432n2311n8909o8711m3430
$$ 255600 257025 225348 153032 63877 -11868 -55507 -84456 -124888 -177199 -236108 -304819 -348249
10274c48249J0652N2846O5061M1175R036J2935M4568N2137L5750K0302R440j3558
$$ -348249 -337597 -284751 -219690 -178515 -169479 -156544 -111976 -59839 -24089 -3787 5653 -7905
10262g905m8484n1799L369Q0772J23934J31244J24701R3378M8634J7123j239k8561
$$ -7905 -56389 -108188 -104819 -24047 99887 231131 355832 449210 497844 514967 513728 485167
10250D85167r2590j42441j34467q8078m9271l3500k1671L602L1147L5118K3993
$$ 485167 392577 250136 115669 27591 -21680 -55180 -76851 -73249 -42102 -6984 17009
10239A7009J310j9731o0444j18775j30918q8902l9984n501M4248J19912J50113
$$ 17009 18319 -1412 -61856 -180631 -311549 -400451 -440435 -445936 -401688 -281776 -131663
10228a31663R8727J6948m9776o3455l5654o596J060r077k4192m2276m5879l717
$$ -131663 -32936 -15988 -65764 -129219 -164873 -171469 -170409 -179486 -203678 -245954 -291833 -295550
10216b95550L7079J8077k2289l3650j4450L0337O8667N8898n355p0965r0511n9925
$$ -295550 -258471 -240394 -262683 -296333 -310783 -280446 -211779 -152881 -158236 -229201 -319712 -379637
10204c79637o308J0829k522Q477M6373O4764N0474J0961m0899p3277n1288J8107
$$ -379637 -385945 -375116 -377638 -369161 -322788 -258024 -207550 -196589 -237488 -310765 -362053 -343946
10192c43946N3104M0232L1381J4130p295j337K167k1855l1568O218N0646N2318
$$ -343946 -290842 -250610 -219229 -205099 -212394 -213731 -211564 -233419 -264987 -258769 -208123 -155805
10180a55805K6611K2594L5725K7189J7497K2217J6690q487j4880K3471O3416O8288
$$ -155805 -129194 -106600 -70875 -43686 -26189 -3972 12718 4231 -10649 12822 76238 144526
10168A44526K8316n329J3552N3358P1714L2776m5671q5272o1021k3691j9581j5346
$$ 144526 172842 167513 181065 234423 306137 338913 293242 207970 146949 123258 103677 88331
10156H8331M27J6325M0901N2740L6060Q66l3313l9667m8113p2552p2586l7762
$$ 88331 88758 105083 145984 198724 234784 235650 202337 162670 114557 42005 -30581 -68343
10144f8343J1542N1884N9155L9168K7489K4623n41l2602k5937K7617Q0346Q4385
$$ -68343 -56801 -4917 54238 93406 120895 145518 144977 112375 86438 114055 194401 278786
10132B78786M4749K644k4157l3846l2708l5527m9801p4760p9724l2753K6702N7101
$$ 278786 323535 326179 302022 268176 235468 199941 150140 75380 -4344 -37097 -10395 46706
10120D6706O4240O5063M3336J4880J0994R901J81k0889n6658q1806o9368l1518
$$ 46706 110946 176009 219345 234225 245219 255120 255301 234412 177754 95948 26580 -4938
10108d938M633J1314J9554N0438M7906J3545j8073o5295r4473o7068m5193o7944
$$ -4938 -305 11009 30563 81001 128907 142452 124379 59084 -35389 -102457 -147650 -215594
10096b15594o3346j6312L0538P6970J17486J20917P4729J1206j5885m594q536
$$ -215594 -278940 -295252 -264714 -187744 -70258 50659 125388 136594 120709 116115 107579
10085A07579l8157n4213m6274l6472k0020J2331L2411L1459K2762J9308Q847n544
$$ 107579 69422 15209 -31065 -67537 -87557 -75226 -42815 -11356 11406 30714 39561 34017
10073C4017k3472m2472m7317m0842l3167p636J8386K0282J9909N0975Q6917R1629
$$ 34017 10545 -31927 -79244 -120086 -153253 -160889 -142503 -122221 -102312 -51337 35580 127209
10061A27209O8292L6386N754l344Q595L131k6032m4655k9491K0596Q4111J29616
$$ 127209 195501 231887 237641 234297 242892 246023 219991 175336 145845 166441 250552 380168
10049C80168J29912R4662L9925p603p504K4277K3417j6744m8753n1407k7434l148
$$ 380168 510080 604742 644667 637064 629560 653837 677254 660510 611757 560350 532916 529768
10037E29768L184J61q798l0396n8074l7540J9299M3280L7194J7123k9248j04559
$$ 529768 532952 533113 524315 493919 435845 398305 417604 460884 498078 515201 485953 381394
10025C81394j29369q7709m3804l0504l0522l2467l0849j4737Q368L1333M8831
$$ 381394 252025 164316 120512 90008 59486 27019 -3830 -18567 -10199 21134 69965
10014F9965M4554L3067L8707M5509L1203J3951K7720N3228M4511K2606L4714N3732
$$ 69965 114519 147586 186293 231802 263005 276956 304676 357904 402415 425021 459735 513467
10002E13467L8343o377m6920o1038p1326p4602n1600l4903m5242n2563m9521l1831
$$ 513467 551810 545433 498513 437475 366149 291547 239947 205044 159802 107239 57718 25887
9990B5887K6104Q3224Q8786N2257O129m4791q5442r1985p8391m4015J928K4277
$$ 25887 51991 135215 224001 276258 282387 237596 152154 60169 -18222 -62237 -60309 -36032
9978c6032J2229j8408m2024n4143n7395l6073J84K8507L7208R707j8908k2470
$$ -36032 -23803 -42211 -84235 -138378 -195773 -231846 -231662 -203155 -165947 -156240 -175148 -197618
9966a97618q115J6229J1596p100J2809L4541J6722r675j9364k1929l7620k1396
$$ -197618 -205733 -189504 -177908 -185008 -172199 -137658 -120936 -130611 -149975 -171904 -209524 -230920
9954b30920M8842J04154Q2696L8570L9766N4556K8990k4841l9553j0692p335k0529
$$ -230920 -182078 -77924 4772 43342 83108 137664 166654 141813 102260 91568 84233 63704
9942F3704R630M7505L4619N28k2844l3091j7780K4666O2179N1296K7459K8478
$$ 63704 73334 120839 155458 155986 133142 100051 82271 106937 169116 220412 247871 276349
9930B76349L3894M0026O0688O4129K4194l1219p5034j01521j17890j05282p0167
$$ 276349 310243 350269 410957 475086 499280 468061 393027 291506 173616 68334 -1833
9919a833k8409L8745R4053P5969J7916j5115j5035P535M5036N7267K0902j6324
$$ -1833 -30242 8503 102556 178525 196441 181326 166291 173826 218862 276129 297031 280707
9907B80707k0208k0000l2334l7120j6689J3949M5639P2896Q0771O1865L0617r442
$$ 280707 260499 240499 208165 171045 154356 168305 213944 286840 367611 429476 460093 450651
9895D50651q3911j66070j67503q3504m65M3572K9102k3850n3216m4181m1215p8366
$$ 450651 366740 200670 33167 -50337 -50802 -7230 21872 -1978 -55194 -99375 -140590 -218956
9883b18956j29723j49001j09652k2625Q1767J68478K22441K03833J31616O4434
$$ -218956 -348679 -497680 -607332 -629957 -548190 -379712 -157271 46562 178178 242612
9873B42612J4850j1848r338K0745J9904l0174n8950m5466m0205l6020k5451j5333
$$ 242612 257462 245614 236276 257021 276925 246751 187801 142335 102130 66110 40659 25326
9861B5326n356J7280N9731Q3436P7560P4804Q3367Q7088R2467J06165R8396M7688
$$ 25326 19970 37250 96981 180417 257977 332781 416148 503236 595703 701868 800264 847952
9849H47952k1917l0566K9232P1691O5428M5098J9380j3037k1106j4373m7672j18710
$$ 847952 826035 795469 824701 896392 961820 1006918 1026298 1013261 992155 977782 930110 811400
9837H11400j72611j46156n6197Q073M0734N2098M3782K9733r378o8423q7041o6039
$$ 811400 638789 492633 436436 444509 485243 537341 581123 610856 601478 533055 446014 379975
9825C79975k1506L2967L2871J105m971J0086J123k4855n2973q5381r0454o1413
$$ 379975 358469 391436 424307 425412 420441 430527 431650 406795 353822 268441 177987 116574
9813A16574l1693j3680m473N51J3091J7222k045k1913j2237J7445J9223L385L6386
$$ 116574 84881 71201 66728 67279 80370 97592 95547 73634 61397 78842 98065 101450 137836
9800A37836Q4491R8823J07143J15705Q4348j3448j47006k28686j98749j20189
$$ 137836 222327 321150 428293 543998 628346 614898 467892 239206 40457 -79732
9790g9732o2702j3018M0079P0741O0006K5111j2037j9448O173J8783j5270p0867
$$ -79732 -142434 -155452 -115373 -44632 15374 40485 28448 9000 15173 33956 18686 -52181
9778e2181r6992o0439J3321O4922R1824R1354N2101o235l4950m5661p0325n8330
$$ -52181 -149173 -209612 -196291 -131369 -39545 51809 103910 97675 62725 17064 -53261 -111591
9766a11591L80K9476J0532k892Q639L8065M6259J6901m50L0753O6502M6567J1885
$$ -111591 -111211 -81735 -71203 -74095 -65456 -27391 18868 35769 35319 66072 132574 179141 191026
9753A91026J3737K583m2349p7107r8286r0377m6261j291K9302L9901L4125K7570
$$ 191026 204763 207346 164997 87890 -10396 -100773 -147034 -148325 -119023 -79122 -44997 -17427
9741a7427L0921L9047K9086j6273o3649o2980j5463L1465M8331K2202k0884k8594
$$ -17427 13494 52541 81627 65354 1705 -61275 -76738 -45273 3058 25260 4376 -24218
9729b4218k5233m6083n4879k3881M641k6183p1020n9590l3890l2160j4720M3534
$$ -24218 -49451 -95534 -150413 -174294 -169653 -195836 -266856 -326446 -360336 -392496 -407216 -363682
9717c63682Q6943Q4976Q5171J32581J66452J18919L0385j9784m2005p4076r4300
$$ -363682 -276739 -191763 -106592 25989 192441 311360 341745 321961 279956 205880 111580
9706A11580q0965n3621n4081q9050j11215q1927m2045l3081m6025n4077m2854
$$ 111580 30615 -23006 -77087 -166137 -277352 -359279 -401324 -434405 -480430 -534507 -577361
9695e77361j2564J6017J3235J666J5988O3219J16503J28476J05720P4047M9874
$$ -577361 -589925 -573908 -560673 -559007 -543019 -479800 -363297 -234821 -129101 -55054 -5180
9684e180L8130K1662o21k2187l2024k3687J1770N9101N3752j5915r5311j24004
$$ -5180 32950 54612 53991 31804 -220 -23907 -12137 46964 100716 84801 -10510 -134514
9672a34514q9515l7987j3319l697Q006M609q396j1980M334M0484O9212P0751N9153
$$ -134514 -224029 -262016 -275335 -279032 -271026 -266417 -274813 -286793 -282459 -241975 -172763 -102012 -42859
9659d2859M1223P778k4310m5335n4634o1210m8492M311R5182J69548J84524J64751
$$ -42859 -1636 6142 -18168 -63503 -118137 -179347 -227839 -223528 -128346 41202 225726 390477
9647C90477J16749M4847r664l5568o9664j06228j12562o6832n71L3876K4893q778
$$ 390477 507226 552073 542409 506841 437177 330949 218387 151555 150984 184860 209753 200975
9635B00975k1387k6097m8656o5188o3398l7250N459M9267P0562M4944J6492K8001
$$ 200975 179588 153491 104835 39647 -23751 -61001 -55542 -6275 64287 109231 125723 153724
9623A53724N4423N0345R30n3388q4436r9306j06782p9052k3078R756K2045L6945
$$ 153724 208147 258492 259422 206034 121598 22292 -84490 -163542 -186620 -176864 -154819 -117874
9611a17874K6007j2017l7490k1402J4809J7987J369M616J9618K9478J2227j8803
$$ -117874 -91867 -103884 -141374 -162776 -147967 -129980 -128611 -123995 -104377 -74899 -62672 -81475
9599h1475l8557k8622l78M921K3058O1499P0100M5664N705l1097k4305J4592M8822
$$ -81475 -120032 -148654 -149032 -144111 -121053 -59554 10546 56210 61915 30818 6513 21105 69927
9586F9927N7996M6355J8760j7281l7138k8108j0206J4726L6573L4354K5653J9061
$$ 69927 127923 174278 193038 175757 138619 110511 100305 115031 151604 185958 211611 230672
9574B30672K3161L0437r718o5368p8911m4693l677p563n8446j02390r1944k3962
$$ 230672 253833 284270 274552 209184 130273 85580 81903 74340 15894 -86496 -178440 -202402
9562b02402M1217N6876M9970O0423P4122O7553L6274o542l6209n2234m4920L456
$$ -202402 -161185 -104309 -54339 6084 80206 147759 184033 177491 141282 89048 44128 47584
9550D7584O6621Q9488M4926k7324n2782j6965K8903L7200N050j4854k179l890
$$ 47584 114205 203693 248619 221295 168513 151548 180451 217651 222701 207847 205668 201778
9538B01778k4078k2572J089J9116J7372o641m9320q3332p9477l9162P56R996R410
$$ 201778 177700 155128 156217 175333 192705 186064 136744 53412 -26065 -65227 -64471 -54475 -45065
9525d5065K1720L6966K5122R476J9506K4825j7498o5876n1239R706O0472Q0090
$$ -45065 -23345 13621 38743 48219 67725 92550 75052 9176 -42063 -32357 28115 108205
9513A08205P8013O2119L2175m77k5291m8023q2686j09097p7721j7792J2912M917
$$ 108205 186218 248337 280512 280035 254744 206721 124035 14938 -62783 -80575 -67663 -62746
9501f2746j6837m762K7935K8648k819j3182J6642J8952k5469m9875m2127k4932
$$ -62746 -79583 -84345 -56410 -27762 -30581 -43763 -27121 -8169 -33638 -83513 -125640 -150572
9489a50572k2596k0340P846L3945L7364J6137m177j5395k5197j0346L1373P0776
$$ -150572 -173168 -193508 -185662 -151717 -114353 -98216 -102393 -117788 -142985 -153331 -121958 -51182
9477e1182P6336M4825M360l0999p0892q7472m1605J1889J2447k0871n4735o2791
$$ -51182 25154 69979 74339 43340 -27552 -115024 -156629 -144740 -132293 -153164 -207899 -270690
9465b70690n6676k8555R362J8179K2464N2318O3883K6595k0839n2277o2896n3587
$$ -270690 -327366 -355921 -346559 -328380 -305916 -253598 -189715 -163120 -183959 -236236 -299132 -352719
9453c52719m5724l6893m5246o4423n1705l656O8565J40702J67723J26980M5262
$$ -352719 -398443 -435336 -480582 -545005 -596710 -600366 -531801 -391099 -223376 -96396 -51134
9442e1134j1159l060J7572K2656J0437j5968k9364j1458L0930N4940M7311L0616
$$ -51134 -62293 -65353 -47781 -25125 -14688 -30656 -60020 -71478 -40548 14392 61703 92319
9430I2319J3521j162k4314n8399p0539l9450J4136L3415J5741j3785l5204k1451
$$ 92319 105840 104678 80364 21965 -48574 -88024 -73888 -40473 -24732 -38517 -73721 -95172
9418i5172l912l942o4L1839O2043O4153N2453L0373J6590Q469l698p312Q084K2663
$$ -95172 -99084 -103026 -103090 -71251 -9208 54945 107398 137771 154361 162830 159132 151820 159904 182567
9404A82567J6635M106L034O332r628m7046p0905m3406J4229L4143O189k4344k6153
$$ 182567 199202 203308 206342 212674 203046 156000 85095 41689 55918 90061 96250 71906 45753
9391D5753J0517L6013K6994M350n140Q074R131j4105m6007l5040P862M591l3002
$$ 45753 56270 92283 119277 123627 118487 126561 135692 121587 75580 40540 48402 52993 19991
9378A9991l0902j8868k7777k7587l734K8356O5581Q5273L7743m6795q1971l0374
$$ 19991 -10911 -29779 -57556 -85143 -88877 -60521 5060 90333 128076 81281 -690 -31064
9366c1064L0139L0884M0511O9982M8677m753k8077l6884m4230l4448m7123p5695
$$ -31064 -925 29959 70470 140452 189129 184376 156299 119415 75185 40737 -6386 -82081
9354h2081p2236l7967M151L6239O0361O8090M0128j7127n7317o3399l8446o01
$$ -82081 -154317 -192284 -188133 -151894 -91533 -23443 16685 -442 -57759 -121158 -159604 -160205
9342a60205J3371N8404J30635J45434R4791L7636J967k2825m4164o3742q2195
$$ -160205 -146834 -88430 42205 187639 282430 320066 322033 299208 255044 191302 109107
9331A09107r7045q7299l2202K5876N3059P7585Q7028M6924k909j3077j4639l8040
$$ 109107 12062 -75237 -107439 -81563 -28504 49081 136109 183033 180124 167047 152408 114368
9319A14368n2613n2741m0545l5481n5232p5940q7068o0392j2988P389R992J065
$$ 114368 61755 9014 -31531 -67012 -122244 -198184 -285252 -345644 -358632 -351243 -341251 -340186
9307c40186j4691j181M6165Q9512J13194J05535N8774r483n4241q4045j17361
$$ -340186 -354877 -356058 -309893 -220381 -107187 -1652 57122 47639 -6602 -90647 -208008
9296b08008j18010p2375j2146K9597O7113R7428R7440N3962j161k1292j0823J0639
$$ -208008 -326018 -398393 -410539 -380942 -313829 -216401 -118961 -64999 -66160 -87452 -98275 -87636
9284h7636K1990L3573M4907K5763m892l034K2871K8193L5623O1511O5370K2019
$$ -87636 -65646 -32073 12834 38597 33705 30671 53542 81735 117358 178869 244239 266258
9272B66258m9927q1345k7881N4571P9086M8132Q939l284Q143K6689L8558K0219
$$ 266258 216331 134986 107105 161676 240762 288894 297833 294549 302692 329381 367939 388158
9260C88158j3062k9044l2578l0091j5265j0696j9008k6030l1270k8103k0832N604
$$ 388158 375096 346052 313474 283383 268118 257422 238414 212384 181114 153011 132179 137783
9248A37783M4230M7602L0309J1074l2315p9056r3487o6643k8885k365J8286J3857
$$ 137783 182013 229615 259924 270998 238683 159627 66140 -503 -29388 -31753 -13467 390
9236C90j6477n1653o7086m1303o646J2074K5673L2527M7580M5417L510k9961m3033
$$ 390 -16087 -67740 -134826 -176129 -182775 -170701 -145028 -112501 -64921 -19504 -15994 -45955 -88988
9223h8988n5843m9435j3475M0300Q4527O3735q828o9427p4370j5516M8064P2669
$$ -88988 -144831 -194266 -207741 -167441 -82914 -19179 -28007 -97434 -171804 -187320 -139256 -66587
9211f6587O1083L3179l054n0635m6708N231J3583k980k078l354J3041M4088L8991
$$ -66587 -5504 27675 24621 -26014 -72722 -67491 -53908 -56888 -58966 -62320 -49279 -5191 33800
9198C3800N214k3246l9650m3768k1382L2925P9453P8801L7625m455k4396l5356
$$ 33800 39014 15768 -23882 -67650 -89032 -56107 23346 102147 139772 135317 110921 75565
9186G5565n5891o8167n3168m6777p1589p8378l4159J0895K1128M1367Q5321J15801
$$ 75565 19674 -48493 -101661 -148438 -220027 -298405 -332564 -321669 -300541 -259174 -173853 -58052
9174e8052R0151J4716l9418k5730K3978L9733M061j7114l674J1439J1535N764
$$ -58052 32099 46815 7397 -18333 5645 45378 49439 32325 28651 40090 51625 57389
9162E7389o52l029j5346j5276J3040K7311K0033K3402L5349N0410P6451J06252
$$ 57389 56737 53708 38362 23086 36126 63437 83470 106872 142221 192631 269082 375334
9150C75334J25481J12238O2679n603o6070p6365l7051j0128k4746n8772p0663
$$ 375334 500815 613053 675732 670129 604059 527694 490643 480515 455769 396997 326334
9139C26334p1492r4547j26705j42265j21394r7618q2549m1936P177K5569J2716
$$ 326334 254842 160295 33590 -108675 -230069 -327687 -410236 -452172 -444995 -419426 -406710
9128d06710J4612M1527O0754N1836L5687L0752K8044K5819J2368j7215k7153j6673
$$ -406710 -392098 -350571 -289817 -237981 -202294 -171542 -143498 -117679 -105311 -122526 -149679 -166352
9116a66352J2026N6061R8939J10961P7951N184q0257j12316o3415J4338O6744
$$ -166352 -154326 -98265 674 111635 189586 194770 114513 2197 -61218 -46880 19864
9105A9864Q4601P4616O1767M9190J0791k9188m4170m7810n6172p0668o9170n0881
$$ 19864 104465 179081 240848 290038 300829 271641 227471 179661 123489 52821 -16349 -67230
9093f7230l7734l5641j9577R696K2592L4868M9513N3420M6837K3920k4097n1756
$$ -67230 -104964 -140605 -160182 -150486 -127894 -93026 -43513 9907 56744 80664 56567 4811
9081D811m4757l0670j6825j7748l8454m0076j2326K2921N2781Q0936J14443J30836
$$ 4811 -39946 -70616 -87441 -105189 -143643 -183719 -196045 -173124 -120343 -39407 75036 205872
9069B05872R5445O130p8470j00976p0511k3168K3959M2935K7934J9531K2231q920
$$ 205872 301317 307447 228977 128001 57490 34322 58281 101216 129150 148681 170912 161992
9057A61992n8567p7703n1007M481L9583K1681p937m293R588J1179J1850j737j2824
$$ 161992 103425 25722 -25285 -20804 18779 40460 32523 28230 37818 48997 60847 59110 46286
9044D6286J1386N4233R8708J22734J01017M7175j546j7103r481K3946M3262K7842
$$ 46286 57672 111905 210613 333347 434364 481539 479993 462890 453409 477355 520617 548459
9032E48459J1484j0310l5875l8265k6287j0030J0749K321k2113k1612n062j5326
$$ 548459 559943 549633 513758 475493 449206 439176 449925 452246 430133 408521 403459 388133
9020C88133o0760q7560o4016j0536K8517K0631k2022o3518o1905l2001j6617k5365
$$ 388133 327373 239813 175797 165261 193778 214409 192387 128869 66964 34963 18346 -7019
9008g019l6886k0484K8008O7460O7029K9832k9456o5988o1813k7366K1073M6740
$$ -7019 -43905 -64389 -36381 31079 98108 127940 98484 32496 -29317 -56683 -35610 11130
8996A1130L8961R128k7761m5764m8653m1524j2922J6087P774k0366l4610k2961
$$ 11130 50091 59219 31458 -14306 -62959 -104483 -117405 -101318 -93544 -113910 -148520 -171481
8984a71481J885K267k8817m1502k1482R965N5881R1046P6787K9733m355R66L0615
$$ -171481 -169596 -167329 -196146 -237648 -259130 -249165 -193284 -102238 -25451 4282 -73 893 31508
8971C1508O3660Q0484P3308M8851k885m8106n7913l8299k5691l1982k6120k7747
$$ 31508 95168 175652 248960 297811 294926 246820 188907 150608 124917 92935 66815 39068
8959C9068o9890j14066j08873p2261m4740m2845l8240J0366Q1527J27157J35248
$$ 39068 -30822 -144888 -253761 -326022 -370762 -413607 -451847 -441481 -359954 -232797 -97549
8948i7549J03551M3217r738m3933m5684o169K0286L5524N5092M1722M647l5565
$$ -97549 6002 49219 39481 -4452 -50136 -56305 -36019 -495 54597 96319 100966 65401
8936F5401n0442p358M5365N5619M5292K8103J3180K3219L4535J1616l6013o9814
$$ 65401 14959 7601 52966 108585 153877 181980 195160 218379 252914 264530 228517 158703
8924A58703o2353k0323L6935R3441J30411J02925K9417j6642k3755k7277j5821
$$ 158703 96350 76027 112962 206403 336814 439739 469156 452514 428759 401482 385661
8913C85661n73j3343l6980m6155l7798k2244j7920m6335p3046n0959J0947O2437
$$ 385661 385088 371745 334765 288610 250812 228568 210648 164313 91267 40308 51255 113692
8901A13692O9334O0372M3479L189m2874n9696n4240l7090k6820o1845j08951j26070
$$ 113692 183026 243398 286877 290066 247192 187496 133256 96166 69346 7501 -101450 -227520
8889b27520j06347l5174O5778J32428J24818Q7381P2208N5548M2757L0911P280
$$ -227520 -333867 -369041 -303263 -170835 -46017 41364 113572 169120 211877 242788 250068
8878B50068q821j5830m733M651j2177m0222n0191p941M3232O5113P1137N8672
$$ 250068 241247 225417 220684 225335 213158 172936 122745 114804 158036 223149 294286 352958
8866C52958K4038l2069q6532j18077j03270n2282j7885m326o635l2771n1775l8256
$$ 352958 376996 344927 258395 140318 37048 -15234 -33119 -37445 -44080 -76851 -128626 -166882
8854a66882l990M685k1659m8604m7513n138N3109O1832K4940k565p611q840j7593
$$ -166882 -170872 -166187 -187846 -236450 -283963 -289101 -235992 -174160 -149220 -151785 -159396 -168236 -185829
8841a85829j4765n491j877J493J3625L5741M3956J7025k8923m8184m2147m7205
$$ -185829 -200594 -206085 -207962 -206469 -192844 -157103 -113147 -96122 -125045 -173229 -215376 -262581
8829b62581n0752k2208K5106N8718L8156j9656k1055L8229N5174J8579J4300M7188
$$ -262581 -313333 -335541 -310435 -251717 -213561 -233217 -254272 -216043 -160869 -142290 -127990 -80802
8817h0802N7461N5511N7765M4452J2953k1557m7424n5973m4626l1961m1889n0958
$$ -80802 -23341 32170 89935 134387 147340 125783 78359 22386 -22240 -54201 -96090 -147048
8805a47048j8263L3388P0504R7849J08003O7563Q35m1026n2966m8117m5320l0145
$$ -147048 -165311 -131923 -61419 36430 144433 211996 212831 171805 118839 70722 25402 -4743
8793d743J2865M9696M8505L1473L1142J5347k3189m1505l1564k502K2917M0800
$$ -4743 8122 57818 106323 137796 168938 184285 161096 119591 88027 85525 108442 149242
8781A49242M7960K6469O433m07o690j0319J0436L5712L7331R439r012l940K2147
$$ 149242 197202 223671 230104 229697 223007 212688 223124 258836 296167 305606 296594 292654 314801
8768C14801L6209j8351p5467o7404l0767q614j6139n6489j01100j06425n1119
$$ 314801 351010 332659 257192 189788 159021 150407 134268 77779 -23321 -129746 -180865
8757a80865K8194P6271P0618K1217j1425j2464Q10P880k4818o6198o9692k1806
$$ -180865 -152671 -76400 -5782 15435 4010 -8454 -7644 236 -24582 -90780 -160472 -182278
8745a82278N1085Q4949P8539O4273M2598K4885M480J482K8265L1334k107l7546
$$ -182278 -131193 -46244 32295 96568 139166 164051 168531 170013 198278 229612 227505 189959
8733A89959m8142k9315J1321L5657L5574L5603N2862Q1875Q4130N0306P977l4648
$$ 189959 141817 112502 123823 159480 195054 230657 283519 365394 449524 499830 507807 473159
8721D73159r0728j24193q0911k273L5362J7538n6636j18274r7447m3678k8015
$$ 473159 382431 258238 177327 175054 210416 227954 171318 53044 -44403 -88081 -116096
8710a16096n8995q6569n2352J1890N6542Q0509Q7535R2849R9456P8108L9344J6140
$$ -116096 -175091 -261660 -314012 -302122 -245580 -165071 -77536 15313 114769 192877 232221 248361
8698B48361p075k5893k3805j2637j1527l5143m9877j8999M4020P7664L8848k5702
$$ 248361 241286 215393 191588 178951 167424 132281 82404 63405 107425 185089 223937 198235
8686A98235o1786n9331l0464J0999M4075O3795P9138O7967J9748k5768l5542K66
$$ 198235 136449 77118 46654 57653 101728 165523 244661 312628 332376 306608 271066 271332
8674B71332L3282K0844n779k3870p2360j35501j43054r4080j4849M0984M4633
$$ 271332 304614 325458 319679 295809 223449 87948 -55106 -149186 -164035 -123051 -78418
8663g8418L1286M1105N3297N1454L9311Q059j1150m66J8369K5806j456n0551r0092
$$ -78418 -47132 -6027 47270 98724 138035 146094 134944 134478 152847 178653 177197 126646 36554
8650C6554j31840j60192j45910j06924n0962O753M8016Q3910J03225R4287O9401
$$ 36554 -95286 -255478 -401388 -508312 -559274 -552521 -504505 -420595 -317370 -223083 -153682
8639a53682M7119M6705N6470O5859O0646K2607k0353m1521o6635r3815q2917m4278
$$ -153682 -106563 -59858 -3388 62471 123117 145724 125371 83850 17215 -76600 -159517 -203795
8627b03795l258j774l6740m1801j3138j107J9183N6727M8510J7628K5711N4089
$$ -203795 -207053 -208827 -245567 -287368 -300506 -301613 -282430 -225703 -177193 -159565 -133854 -79765
8615g9765O3725M7494J9592l634k4339l0325j1893M839K2692N6027Q1347P3449
$$ -79765 -16040 31454 51046 47412 23073 -7252 -19145 -14306 8386 64413 145760 219209
8603B19209M3484J7888q155n7376j10785j32529j09165n1022J4622O0017Q6532
$$ 219209 262693 280581 272426 215050 104265 -28264 -137429 -188451 -173829 -113812 -27280
8592b7280J00802Q0747L3446k517j067K9912O8429R6190Q9251M6386N571j8063
$$ -27280 73522 154269 187715 185198 184131 214043 282472 378662 467913 514299 519870 501807
8580E01807m7426q1596q4590n1294j6725n850k423J4968L2273J6987k3823m6029
$$ 501807 454381 372785 288195 236901 220176 214326 211903 226871 259144 276131 252308 206279
8568B06279m2905m1723l4317k9145k4793o15K1651M4991P7040J02171J30879J57415
$$ 206279 163374 121651 87334 58189 33396 32781 54432 99423 176463 278634 409513 566928
8556E66928J36821M9237l9141n1652l6539n5662q9065r8457q6689q2688p8563
$$ 566928 703749 752986 713845 662193 625654 569992 480927 382470 295781 213093 134530
8545A34530l5185J5847K0376m847j8318j0478J2794N0219P3296O6837M5015R827
$$ 134530 99345 115192 135568 130721 112403 101925 114719 164938 238234 305071 350086 359913
8533C59913j7894j3960j4485l5452n3661l7968J533L9431P3205J00604J01978
$$ 359913 342019 328059 313574 278122 224461 186493 188026 227457 300662 401266 503244
8522E03244P1478K9466r065m1868o6500q5482j03867q6782m2617q804j7881n0689
$$ 503244 574722 604188 595123 553255 486755 401273 297406 210624 168007 159203 141322 90633
8510I0633p1527q8889p8305L35J16598J85021J76673J23337P5470K6389k6766
$$ 90633 19106 -69783 -148088 -147753 -31155 153866 330539 453876 529346 555735 528969
8499E28969k3929J3487J5787j6004m2787l2138J0270M5954M5479o338q3959r6036
$$ 528969 505040 518527 534314 518310 475523 443385 453655 499609 545088 538750 454791 358755
8487C58755l5731O237M639j3385k3057k0412L956M2081P1383P8365N1022J6557
$$ 358755 323024 329261 333900 320515 297458 277046 281002 323083 394466 472831 523853 540410
8475E40410M813O751o343m2330q1093p5290k9494J5435M5756M4137J9999m329
$$ 540410 545223 551974 545631 503301 422208 346918 317424 332859 378615 422752 442751 438422
8463D38422k5451j1962J006k2742n1146o9296q3911p0329J154P9777J07034O6773
$$ 438422 412971 401009 402015 379273 328127 258831 174920 104591 105745 185522 292556 359329
8451C59329j6322n6782j8338K8775N3176R2040J11573N1085m5487j04724j03943
$$ 359329 343007 286225 267887 296662 349838 441878 553451 604536 559049 454325 350382
8440C50382p7262p6458q7783n7387n697J2998K232r993M763L6841K9490k317O929
$$ 350382 273120 196662 108879 51492 45795 58793 61025 51032 55795 92636 122126 119809 126738
8427A26738L6181K7030k1293p6667j05221r9980o6100k7067K8855R4266J14028
$$ 126738 162919 189949 168656 91989 -13232 -113212 -179312 -206379 -177524 -83258 30770
8416C0770P2800J6769n209j6345l8006l5789l5069l7511k7927l2682m2351l5322
$$ 30770 103570 120339 115130 98785 60779 24990 -10079 -47590 -75517 -108199 -150550 -185872
8404a85872k2403J642K9901L3670J2534L722L2864N0382M3005M5735N2166L4781
$$ -185872 -208275 -206633 -176732 -143062 -130528 -126806 -93942 -43560 -555 45180 97346 132127
8392A32127l944l6469l8537k0925j6502k7135j5959K5010K7121l5052o5345l1480
$$ 132127 128183 91714 53177 32252 15750 -11385 -27344 -2334 24787 -10265 -75610 -107090
8380a07090k610J0634K1065K2725J5517K954P271L7449Q3814J11939Q1621K9081
$$ -107090 -109700 -99066 -78001 -55276 -39759 -36805 -29534 7915 91729 203668 285289 314370
8368C14370J8010O256m7644p4381o0648m5484m1144m3387k3931K5876O2217O4332
$$ 314370 332380 338636 290992 216611 155963 110479 69335 25948 2017 27893 90110 154442
8356A54442P1974P9898O7672L9395K0762J1725J2537J4512j5730n4603n1622l0369
$$ 154442 226416 306314 373986 413381 434143 445868 458405 472917 457187 402584 350962 320593
8344C20593k6486m3617o2182m7036J2826N5410L6361J1135L6157P1856M6785l4235
$$ 320593 294107 250490 188308 141272 154098 209508 245869 257004 293161 365017 411802 377567
8332C77567r2596p2857j6545M804K4037J08858J68180J25988M1294l5494p7919
$$ 377567 284971 212114 195569 200373 224410 333268 501448 627436 668730 633236 555317
8321E55317p4327n7272l7901j8152k0476m8233p3588n4058K489L1629M3916N7928
$$ 555317 480990 423718 385817 367665 347189 298956 225368 171310 173799 205428 249344 307272
8309C07272M7752L1830M3190O6629N0229p099o4903p4848m5483j5118K2162O2742
$$ 307272 355024 386854 430044 496673 546902 539803 474900 400052 354569 339451 361613 424355
8297D24355O3179J9937p473R961K7960K6100K6372J9542m220j3664J5830L9312
$$ 424355 487534 507471 499998 509959 537919 564019 590391 609933 605713 592049 607879 647191
8285F47191K6097K7638L8463Q635l2381m3295k7641n224J2930J6237O188J6109
$$ 647191 673288 700926 739389 748024 715643 672348 644707 639483 652413 668650 674838 690947
8273F90947N4983N8996K0797k273M251J6354M0348O6314M9165k704n3139q2994
$$ 690947 745930 804926 825723 823450 827701 844055 884403 950717 999882 997178 944039 861045
8261H61045p4071l9924j5117J3155N1037N7864M2010M0337M2324P240m3074m7031
$$ 861045 786974 747050 731933 745088 796125 853989 895999 936336 978660 985900 942826 895795
8249H95795j3195J0104m35k2451m623L7626L5729n932j7186J8578M4568M0097
$$ 895795 882600 892704 892269 869818 865195 902821 938550 932618 915432 934010 978578 1018675
8237A018675K7969L0276M7036N8409M2940J2416M8p26r129j0196J7474M6116J5704
$$ 1018675 1046644 1076920 1123956 1182365 1225305 1237721 1237769 1237043 1227914 1217718 1235192 1281308 1297012
8224A297012p8193j63901j47197o2147N478L6551M7775M1599K1068L653M605P419
$$ 1297012 1218819 1054918 907721 845574 851052 887603 935378 976977 998045 1001698 1006303 1013722
8212A013722n198l2299k8621L4916Q3475N8479L952j6228j614K4262M4677M2103
$$ 1013722 1008524 976225 947604 982520 1065995 1124474 1128426 1112198 1110584 1134846 1179523 1221626
8200A221626P817k7898m8826l0211L4009Q0523O8878K4300N422K1916K5338P775
$$ 1221626 1229443 1201545 1152719 1122508 1156517 1237040 1305918 1330218 1335640 1357556 1382894 1390669
8188A390669Q925K8581K8507L46m1907m7679n973K5328J8081j4488m2484n6570
$$ 1390669 1399594 1428175 1456682 1457028 1415121 1367442 1361469 1386797 1404878 1390390 1347906 1291336
8176A291336o3798n2233k3471O12L1056O2077Q5817N9487j6310m6392l3309k2178
$$ 1291336 1227538 1175305 1151834 1152446 1183502 1245579 1331396 1390883 1374573 1328181 1294872 1272694
8164A272694j0583J8217N4278N4920L4399O0055R2235O4680K3462l812k4343j5658
$$ 1272694 1262111 1280328 1334606 1389526 1423925 1483980 1576215 1640895 1664357 1660545 1636202 1620544
8152A620544M4701R9125J12373R9112O2944L0794K7446M9417N8825K0233l6935
$$ 1620544 1665245 1764370 1876743 1975855 2038799 2069593 2097039 2146456 2205281 2225514 2188579
8141B188579m4372j990K4662J4084o709k4130l6693m6462l8565k2104k5275m0163
$$ 2188579 2144207 2142217 2166879 2180963 2174254 2150124 2113431 2066969 2028404 2006300 1981025 1940862
8129A940862l2445k3280m6605r1110j10318p3582L2782J36304J59959J21188Q1458
$$ 1940862 1908417 1885137 1838532 1747422 1637104 1563522 1596304 1732608 1892567 2013755 2095213
8118B095213Q3072J02429R2760N4360K8249J6939R210K935k6918o6420n6284O465
$$ 2095213 2178285 2280714 2373474 2427834 2456083 2473022 2482232 2485167 2458249 2391829 2335545 2342010
8106B342010N7128N6714K7355R873J2721j8714o5647l9723L4086P4642O9711M3730
$$ 2342010 2399138 2455852 2483207 2493080 2505801 2487087 2421440 2381717 2415803 2490445 2560156 2603886
8094B603886P771k8764m1194k2961K2304P4149R9990R6765P2095L9287n789m5723
$$ 2603886 2611657 2582893 2541699 2518738 2541042 2615191 2715181 2811946 2884041 2923328 2917539 2871816
8082B871816n5121l9077m560O0715J13737J07678N0187L472P485L6823N4223M5026
$$ 2871816 2816695 2777618 2773058 2833773 2947510 3055188 3105375 3108847 3116332 3153155 3207378 3252404
8070C252404M9599M4268N042k8651m1608l4035p818K7904P0390J02914J04976
$$ 3252404 3302003 3346271 3351313 3322662 3281054 3247019 3239201 3267105 3337495 3440409 3545385
8059C545385R2461P4490M9232L1958L2428M0897M2436M1197M1660M2646M9275
$$ 3545385 3637846 3712336 3761568 3793526 3825954 3866851 3909287 3950484 3992144 4034790 4084065
8048D084065O2220N9002M8813N0126N8872P0082P4648O4915O3357P3595P1874
$$ 4084065 4146285 4205287 4254100 4304226 4363098 4433180 4507828 4572743 4636100 4709695 4781569
8037D781569P7891J22502J63503J54945J19622J18073J61244J94656K01935J94260
$$ 4781569 4859460 4981962 5145465 5300410 5420032 5538105 5699349 5894005 6095940 6290200
8027F290200J81147J62671J40273J51897K02104K58065L16491L67594M07117M55650
$$ 6290200 6471347 6634018 6774291 6926188 7128292 7386357 7702848 8070442 8477559 8933209
8017H933209M97915N22950N57811O34230P38461Q59141J018445J199047J361629
$$ 8933209 9431124 9954074 10511885 11146115 11884576 12743717 13762162 14961209 16322838
8008A6322838J508730J706336J989966K357037K808295L314776L838121M372033
$$ 16322838 17831568 19537904 21527870 23884907 26693202 30007978 33846099 38218132
8000C8218132M826616N055923M946554M399099L381724J937690K43393j439273
$$ 38218132 43044748 48100671 53047225 57446324 60828048 62765738 63009131 61569858
7992F1569858k899695l975563m574091m699803m435466l952170l410414k911161
$$ 61569858 58670163 54694600 50120509 45420706 40985240 37033070 33622656 30711495
7984C0711495k477607k097196j746909j397528j065405p73529n38170l60119k35249
$$ 30711495 28233888 26136692 24389783 22992255 21926850 21153321 20615151 20255032 20019783
7975B0019783j45709q8416n5528m0649n2045l2872N8054J43271J98467K78522
$$ 20019783 19874074 19785658 19730130 19689481 19637436 19604564 19662618 19805889 20004356 20282878
7965B0282878L91190N22902O72300P99114R14877J049905J217978J485091J828010
$$ 20282878 20674068 21196970 21869270 22668384 23583261 24633166 25851144 27336235 29164245
7956B9164245K156236K456765K791516L227480L768686M409244N171202O078328
$$ 29164245 31320481 33777246 36568762 39796242 43564928 47974172 53145374 59223702
7948E9223702P160961Q463187R994714J1665526J3283505J4613868J5347029J5030072
$$ 59223702 66384663 74847850 84842564 96508090 109791595 124405463 139752492 154782564
7940A54782564J3296548J0056639N525000K12029n125204r732045j3042299j4781581
$$ 154782564 168079112 178135751 183660751 183872780 178747576 169015531 155973232 141191651
7932A41191651j5071927j4276174j2820471j1110284r421959p899703o554535
$$ 141191651 126119724 111843550 99023079 87912795 78490836 70591133 64036598
7925F4036598n369346m372693l589026k964463k419367j919403j467832j116437
$$ 64036598 58667252 54294559 50705533 47741070 45321703 43402300 41934468 40818031
7917D0818031r00765p82060o92419n69461l91170k02939k3606J64087L80886O15579
$$ 40818031 39917266 39135206 38442787 37873326 37482156 37279217 37255611 37419698 37800584 38416163
7907C8416163Q52544J100603J389306J715710K043615K395466K817821L318246
$$ 38416163 39268707 40369310 41758616 43474326 45517941 47913407 50731228 54049474
7899E4049474L908339M630778N473827O404049P472560Q750613J0269091J2080341
$$ 54049474 57957813 62588591 68062418 74466467 81939027 90689640 100958731 113039072
7891A13039072J4255054J6827897J9776811K2964649K6116823K8775930L0230749
$$ 113039072 127294126 144122023 163898834 186863483 212980306 241756236 271986985
7884B71986985K9628789K6237586J9740616J0535333k26999j0986672k0203642
$$ 271986985 301615774 327853360 347593976 358129309 357902310 346915638 326711996
7877C26711996k6696118k9988021l0402934k8717312k5792993k2401024j9090581
$$ 326711996 300015878 270027857 239624923 210907611 185114618 162713594 143623013
7870A43623013j6104316j3492356j1246334r325871p692113o324743n198169m254066
$$ 143623013 127518697 114026341 102780007 93454136 85762023 79437280 74239111 69985045
7862F9985045l467091k834431k342319j989058j770954j641819j522841j332327
$$ 69985045 66517954 63683523 61341204 59352146 57581192 55939373 54416532 53084205
7854E3084205j028463o64024k98653O9656M52992Q64133J278271J661590K039726
$$ 53084205 52055742 51391718 51093065 51162721 51615713 52479846 53758117 55419707 57459433
7845E7459433K463095L012609L712966M492686N337763O273826P324842Q571242
$$ 57459433 59922528 62935137 66648103 71140789 76478552 82752378 90077220 98648462
7837I8648462J0057232J1822931J3966309J6574550J9642864K3084702K6776971
$$ 98648462 108705694 120528625 134494934 151069484 170712348 193797050 220574021
7830B20574021L0462407L3586272L5270246L4468418L0317887K2491784J1495517
$$ 220574021 251036428 284622700 319892946 354361364 384679251 407171035 418666552
7823D18666552j298178j3981070k4666131l2067628l5759564l6126596l4059451
$$ 418666552 417368374 403387304 378721173 346653545 310893981 274767385 240707934
7816B40707934l0567471k6509454k2491802j8858014j5742979j3146918j0965842
$$ 240707934 210140463 183631009 161139207 142281193 126538214 113391296 102425454
7809A02425454r119360p614866o390476n368919m532271l843057l249934k724322
$$ 102425454 93306094 85691228 79300752 73931833 69399562 65556505 62306571 59582249
7801E9582249k309857k013938j754367j484643j205208r16729o08300k67865J00353
$$ 59582249 57272392 55258454 53504087 52019444 50814236 49897507 49289207 49021342 49121695
7792D9121695M68383Q23841J192192J562657J955341K451865L049659L684954
$$ 49121695 49590078 50413919 51606111 53168768 55124109 57575974 60625633 64310587
7784F4310587M383759N204825O156543P248106Q535162J0094089J1976240J4184797
$$ 64310587 68694346 73899171 80055714 87303820 95838982 105933071 117909311 132094108
7776A32094108J6728101J9614678K2759019K5884115K8467696K9740750K8846533
$$ 132094108 148822209 168436887 191195906 217080021 245547717 275288467 304135000
7769C04135000K5130112J8380118R029116j821203j2549150k1529482k7711198
$$ 304135000 329265112 347645230 356674346 354853143 342303993 320774511 293063313
7762B93063313l0773641l1025307k9209334k6200595k2726323j9303164j6234344
$$ 293063313 262289672 231264365 202055031 175854436 153128113 133824949 117590605
7755A17590605j3615807j1404757r537975p997502o746859n731246m910218m211369
$$ 117590605 103974798 92570041 83032066 75034564 68287705 62556459 57646241 53434872
7747E3434872l594639l065473k620465k248442j952569j718749j497486j274837
$$ 53434872 49840233 46774760 44154295 41905853 39953284 38234535 36737049 35462212
7739C5462212j058853q40791o12568l78691j38230Q1624K59962M31366O38204
$$ 35462212 34403359 33562568 32950000 32571309 32433079 32514703 32774665 33206031 33844235
7730C3844235R14727J245746J600075J993337K441148K943304L535341M221063
$$ 33844235 34758962 36004708 37604783 39598120 42039268 44982572 48517913 52738976
7722E2738976M967052N835587O897434Q154324R595932J1166169J2723863J4002799
$$ 52738976 57706028 63541615 70439049 78593373 88189305 99355474 112079337 126082136
7714A26082136J4631580J4175310J2284430Q849958M113919j319996o645467j1092055
$$ 126082136 140713716 154889026 167173456 176023414 180137333 178817337 172171870 161079815
7706A61079815j4118130j5571767j5658633j4719744j3183822j1442108r735204
$$ 161079815 146961685 131389918 115731285 101011541 87827719 76385611 66650407
7699F6650407q209132o901212n773546m806286m003099l365254k873785k492584
$$ 66650407 58441275 51540063 45766517 40960231 36957132 33591878 30718093 28225509
7691B8225509k198539j955141j693135j422630j210666j084946r91595q94343
$$ 28225509 26026970 24071829 22378694 20956064 19745398 18660452 17668857 16774514
7683A6774514p88546o54982n25491m22659l13340k00232j13191l1238Q2597K06201
$$ 16774514 15985968 15330986 14805495 14382836 14069496 13869264 13756073 13724835 13807432 14013633
7673A4013633L26960M48633N46166O27199P25652Q73969J082205J335423J621161
$$ 14013633 14340593 14789226 15335392 15962591 16688243 17562212 18644417 19979840 21601001
7664B1601001J915883K225008K594249L058821L580365M085018M467294M595934
$$ 21601001 23516884 25741892 28336141 31394962 34975327 39060345 43527639 48123573
7656D8123573M369285L721825K637498J169466n29183k226797l652808m610292
$$ 48123573 52492858 56214683 58852181 60021647 59492464 57265667 53612859 49002567
7648D9002567n073820n109572m813295m300746l741850l244174k793721k368956
$$ 49002567 43928747 38819175 34005880 29705134 25963284 22719110 19925389 17556433
7640A7556433j995028j675403j421562j228896j061848r02769p58072o64914o23919
$$ 17556433 15561405 13886002 12464440 11235544 10173696 9270927 8512855 7847941 7224022
7631G224022n72070m87704m34772m31606m16304l61549k98959k21269j43767j18415
$$ 7224022 6651952 6164248 5729476 5297870 4881566 4520017 4221058 3999789 3856022 3737607
7621C737607j06908q6585j08425j45949j54394j40180j19080j24075j42030j46165
$$ 3737607 3630699 3544114 3435689 3289740 3135346 2995166 2876086 2752011 2609981 2463816
7611B463816j52542j61533j62611j35460p4365r705R724q960k4242j9610l058
$$ 2463816 2311274 2149741 1987130 1851670 1777305 1767600 1777324 1768364 1744122 1724512 1721454
7600A721454J3045J4863j4611o0094p9862p8271o2716k5668K636K9847N3077L9046
$$ 1721454 1734499 1749362 1734751 1674657 1594795 1516524 1453808 1428140 1430776 1460623 1513700 1552746
7588A552746P372K730o321m2319o9364n7717j4218M7809P4622J6833q6820j56164
$$ 1552746 1560118 1562848 1556527 1514208 1444844 1387127 1372909 1420718 1495340 1512173 1425353 1269189
7576A269189j43202r1550n1991k4833n046J6696K5803j7673p7827p0549k3674
$$ 1269189 1125987 1034437 982446 957613 952567 969263 995066 977393 899566 829017 805343
7565H05343o100k3836m6856m8810k7583K66R20n194K6069O8157P9551P1918O4367
$$ 805343 799243 775407 728551 679741 652158 652424 653344 648150 674219 742376 821927 893845 958212
7552I58212N3944L8424J4697M751j8492p4818j02717q2730n6513m7296m1438m5696
$$ 958212 1012156 1050580 1065277 1070028 1051536 976718 874001 791271 734758 687462 646024 600328
7540F00328o3371n4174l868K0465j3035m5605j0830P5236J29233J03195L4104
$$ 600328 536957 482783 478915 499380 486345 440740 429910 505146 634379 737574 771678
7529G71678j5838j5131J0378K2988L1703M6227O5422N7257j3392j08106j57969
$$ 771678 755840 740709 751087 774075 805778 852005 917427 974684 961292 853186 695217
7518F95217j55922j48034j32797p3267j2831j0613k6646k2853p846M514K1587
$$ 695217 539295 391261 258464 185197 172366 161753 135107 112254 104408 108922 130509
7507A30509M9829O9466N8109O669k8861qK9608R641k2941k3496p59K2065K1339
$$ 130509 180338 249804 307913 314582 285721 285713 315321 324962 302021 278525 277766 299831 321170
7494C21170p624l2467j6720K0954M5142N1842M8324J7548j9339j0018L1102N0931
$$ 321170 313546 281079 264359 285313 330455 382297 430621 448169 428830 418812 449914 500845
7482E00845K2083k4366m4769m8547n7884o8290o3135m9100k1557J6021K7521J2311
$$ 500845 522928 498562 453793 405246 347362 279072 215937 166837 145280 161301 188822 201133
7470B01133K936N004o017n1391q5036n1945Q208K7255P167j3004J96L7064L5657
$$ 201133 204069 209073 203056 151665 66629 14684 22892 50147 57314 44310 44506 81570 117227
7457A17227j0887n4989n8644l6425j8493o662j4323k5457q399L5434Q0172P7997
$$ 117227 106340 51351 -7293 -43718 -62211 -68873 -83196 -108653 -117052 -81618 -1446 76551
7445G6551L7398l296k5741k2192k5104m8248m4441r43K3997N257k5032l3828j7148
$$ 76551 113949 110653 84912 62720 37616 -10632 -55073 -56016 -32019 -26762 -51794 -85622 -102770
7432a02770K756R959P335k8875q9952j20431r8601m7061j1487q649K90L7502P0845
$$ -102770 -100014 -90055 -82720 -111595 -201547 -321978 -420579 -467640 -479127 -487776 -487486 -449984 -379139
7419c79139O2654J3044l5569l8238j6104J7035O9068J31613J66635J39316P3657
$$ -379139 -316485 -303441 -339010 -377248 -393352 -376317 -307249 -175636 -9001 130315 203972
7408B03972J3442k2900k1564m969o475j2290p091Q691O032k6199m4011l6788l2361
$$ 203972 217414 194514 172950 167981 161506 149216 142125 150816 156848 130649 86638 49850 17489
7395A7489l3588k8917j2324j8566k7793K2435O8813M4064Q361J7977M8681O9075
$$ 17489 -16099 -45016 -57340 -75906 -103699 -81264 -12451 31613 39974 57951 106632 175707
7383A75707O2206J0549n3865n0256J3633M3913L5283L2441L0194O471k0944l0772
$$ 175707 237913 248462 194597 144341 157974 201887 237170 269611 299805 306276 285332 254560
7371B54560j4159L3772N7331R931l2017j7305n921k6067m3532n5251q1860r8722
$$ 254560 240401 274173 331504 341435 309418 292113 286192 260125 216593 161342 79482 -19240
7359a9240p7538k3392J0317K2898M9435N9829L4066j964j7511k5047k1686j554
$$ -19240 -96778 -120170 -109853 -86955 -37520 22309 56375 54411 36900 11853 -9833 -11387
7347a1387K2295M0355M9402K8824m222q683R366M4439P0204O0028J6461l5811
$$ -11387 10908 51263 100665 129489 125267 116584 125950 170389 240593 300621 317082 281271
7335B81271n0908m9958o1163o5299n9847l9104j003L3920M1232L1277L9911L5345
$$ 281271 230363 180405 119242 53943 -5904 -45008 -46011 -12091 29141 60418 100329 135674
7323A35674j9268p0980p3380m9218j3574K4049O3594R0595Q1385L8306L797J9328
$$ 135674 116406 45426 -27954 -77172 -90746 -66697 -3103 87492 168877 207183 210980 230308
7311B30308M3387J5761l7417o8916o8149l4937J8824P2997R0706N2758j1822o7719
$$ 230308 273695 289456 252039 183123 114974 80037 98861 171858 262564 315322 303500 235781
7299B35781r6918p8251m3488k8496k3525m2247q2029j07119r9836n6088J2771
$$ 235781 138863 60612 17124 -11372 -34897 -77144 -159173 -266292 -366128 -422216 -409445
7288d09445O0429O8725M4551K4233M89l0777l5996q633L7170N6151M1023N2990
$$ -409445 -349016 -280291 -235740 -211507 -211018 -241795 -277791 -286424 -249254 -193103 -152080 -99090
7276i9090R6441J00753M2193l2647o6734o0159k4753L5606P5733N5761L316m1276
$$ -99090 -2649 98104 140297 107650 40916 -19243 -43996 -8390 67343 123104 126420 85144
7264H5144p8302j10964r6013k6421M8101Q1454O9909L3575o501k6995k2460o603
$$ 85144 6842 -104122 -200135 -226556 -178455 -97001 -27092 6483 -18 -27013 -49473 -56076
7252e6076Q664K0902J4954j1234l3403n3366o5403n6562j5361K6129K1713q206
$$ -56076 -47412 -26510 -11556 -22790 -56193 -109559 -174962 -231524 -246885 -220756 -199043 -207249
7240b07249m4119p3077p3675n3362l3213n882L6740O9178M0494j8646m2539k2654
$$ -207249 -251368 -324445 -398120 -451482 -484695 -490577 -453837 -384659 -344165 -362811 -405350 -428004
7228d28004J1577N2895Q7086R1167O6233K2260J2300L2652M0138M1309K4089J875
$$ -428004 -416427 -363532 -276446 -185279 -119046 -96786 -84486 -51834 -11696 29613 53702 55577
7216E5577J5433N7794P6346L6830k2799n3568p0829p5152l9012J9210P2679P0696
$$ 55577 71010 128804 205150 241980 219181 165613 94784 19632 -19380 -170 72509 143205
7204A43205K013o8339q8526n8658o087L8843N8625L5984j2170m5815n7403n3206
$$ 143205 145218 76879 -11647 -70305 -76392 -37549 21076 57060 44890 -925 -58328 -111534
7192a11534k9431j9665p933M5212R1075P9018K6694m852L818L5300N9799O2720
$$ -111534 -140965 -160630 -168563 -123351 -32276 46742 73436 68584 72402 107702 167501 230221
7180B30221M6671J189m9581p0643n8912n1748o8418p4094n8346o5693o8701l0371
$$ 230221 276892 278081 228500 157857 98945 47197 -21221 -95315 -153661 -219354 -288055 -318426
7168c18426P919L7157O0758M9884K3954L9026Q1688J03902Q2642M5156Q976l0570
$$ -318426 -310507 -273350 -212592 -162708 -138754 -99728 -18040 85862 168504 213660 222636 192066
7156A92066m4773r244M8338M1770j9929m8849m4774l7064k6567j547K8954K3439
$$ 192066 147293 138049 186387 228157 208228 159379 114605 77541 50974 49427 78381 101820
7144A01820K505p509l3930p5619j13163j10744o9471j9191L2613P4165R1510P7017
$$ 101820 104325 96816 62886 -12733 -125896 -236640 -306111 -325302 -292689 -218524 -127014 -49997
7132d9997N9252N5494N5688N5650O2103N5613K2334N690Q949L092K806L074k1481
$$ -49997 9255 64749 120437 176087 238190 293803 316137 321827 330776 333868 336674 339748 318267
7119C18267m9734n1845k7243j3310l7911n9417m3571j2562J7284M2554N3311L9176
$$ 318267 268533 216688 189445 176135 138224 78807 35236 22674 39958 82512 135823 174999
7107A74999J6850j297k4109m0908k8566l1565n1830l2860j969J6784K8780J3340
$$ 174999 191849 190552 166443 125535 96969 65404 13574 -19286 -21255 -4471 24309 37649
7095C7649k6778n4519n5823m2977j4011L2193P6679P7461K5876j7145j4209J2239
$$ 37649 10871 -43648 -99471 -142448 -156459 -124266 -47587 29874 55750 38605 24396 36635
7083C6635K2462O814k1017m2056l0017j3311p938J387J2632L6372Q3134J07407
$$ 36635 59097 65911 44894 2838 -27179 -40490 -48428 -47041 -34409 1963 85097 192504
7071A92504P6209J3555p3731j66870j78542j04936k1973L8971P3510Q5884P8390
$$ 192504 268713 282268 208537 41667 -136875 -241811 -263784 -224813 -151303 -65419 12971
7060A2971L8521j2115l7267j9122K8319M8725K7332K135j7954l5481m6297l9161
$$ 12971 51492 39377 2110 -17012 11307 60032 87364 89499 71545 36064 -10233 -49394
7048d9394j6102j888r07j880k643J0060M0522N5817N3023L0091k6338n8759k6638
$$ -49394 -65496 -67384 -68291 -70171 -72814 -62754 -22232 33585 86608 116699 90361 31602 4964
7035D964K1562M8396P5349J00113Q2069Q263p3513j03835p3851m1769l6419j5306
$$ 4964 26526 74922 150271 250384 332453 340716 267203 163368 89517 47748 11329 -3977
7023c977J9487L1805K800l2140l2735k3475k1691k702J7520o970n5562o1915m5754
$$ -3977 15510 47315 50115 17975 -14760 -38235 -59926 -62628 -45108 -52078 -107640 -169555 -215309
7010b15309j7941L9191Q1306Q9945N8635l296k9206M36K7893J9113Q021K775P250
$$ -215309 -233250 -194059 -112753 -22808 35827 32531 3325 3761 31654 50767 58788 61563 68813
6997F8813J2768k4585p7802r1907o7033l8962k3566q020J0370K4426K6697K0957
$$ 68813 81581 56996 -20806 -112713 -179746 -218708 -242274 -250294 -239924 -215498 -188801 -167844
6985a67844L0120N4954N2910Q717l8744n0148n4593n4182m0382l4856l0703k2874
$$ -167844 -137724 -82770 -29860 -21143 -59887 -110035 -164628 -218810 -259192 -294048 -324751 -347625
6973c47625k5080k1754J3108P8185J12697R1391M2989k4451l8354Q742L9155J9722
$$ -347625 -372705 -394459 -381351 -303166 -190469 -99078 -56089 -80540 -118894 -110152 -70997 -51275
6961e1275j3277j5059m833J689J2961J7580J6406L2458N3094L8439r376k3758
$$ -51275 -64552 -79611 -84444 -82755 -69794 -52214 -35808 -3350 49744 88183 78807 55049
6949E5049O117K8129K0380j0416k9405k7731k0440k1809j9009P491L1015L0930
$$ 55049 61166 89295 109675 99259 69854 42123 21683 -126 -19135 -11644 19371 50301
6937E0301J8918M741j2143k2260k5210q981K3249L2845J4066j2662m1569m6499
$$ 50301 69219 73960 61817 39557 14347 5366 28615 61460 75526 62864 21295 -25204
6925b5204n277M2698L8182K89m4079p5213o3697l6445k7992k1964j5559l218M4211
$$ -25204 -30481 12217 50399 50688 6609 -68604 -132301 -168746 -196738 -218702 -234261 -237479 -193268
6912a93268Q2637O7580N9921P9175P9342O2481K1670m3819p6720p6018r3356j09280
$$ -193268 -110631 -43051 16870 96045 175387 237868 259538 215719 138999 62981 -30375 -139655
6900a39655o6236J3283O7480O5947K5562l323n380J819k403j4512j6014L19K0173
$$ -139655 -205891 -192608 -125128 -59181 -33619 -36942 -42322 -40503 -42906 -57418 -73432 -73113 -52940
6887e2940K6516K7186J4414j8626l1732O638L3115P549R257N9776Q6859P7508
$$ -52940 -26424 762 15176 -3450 -35182 -28544 4571 12120 21377 81153 168012 245520
6875B45520Q1076J02245J05133P1012m693p6626j01820q9243m2469P144L1768
$$ 245520 326596 428841 533974 604986 600293 523667 421847 332604 290135 297279 329047
6864C29047J5209l4464q0677j13469j24111q3098j8802K0280O3162J12883J20637
$$ 329047 344256 309792 229115 115646 -8465 -91563 -110365 -90085 -26923 85960 206597
6853B06597Q5577K4163l4647m2598J2207R3331J34427J10371M9028N510J2429
$$ 206597 292174 316337 281690 239092 251299 344630 479057 589428 638456 643966 656395
6842F56395L4868J2481l7057m2476q408K7079L2903J7853J2890K2810K2336J8203
$$ 656395 691263 703744 666687 624211 615803 642882 675785 693638 706528 729338 751674 769877
6830G69877L8553O6278Q5235R3372R1956R5037J09896J31581J39761J17177P2079
$$ 769877 808430 874708 959943 1053315 1145271 1240308 1350204 1481785 1621546 1738723 1810802
6819A810802M7070N3464P9558J39035K27072K84799K67141K34398K68142L51635
$$ 1810802 1857872 1911336 1990894 2129929 2357001 2641800 2908941 3143339 3411481 3763116
6809C763116M27605M64328M53064M74847N37935N77346O14518O49848O03045M72479
$$ 3763116 4190721 4655049 5108113 5582960 6120895 6698241 7312759 7962607 8565652 9038131
6799I038131L08103J09245q1079k31121m05404o01992p40596p72843p14238o21061
$$ 9038131 9346234 9455479 9374400 9143279 8737875 8135883 7395287 6622444 5908206 5287145
6789E287145n43355m85662m34349l91817l28018k46473j65505j33517j52924j63697
$$ 5287145 4743790 4258128 3823779 3431962 3103944 2857471 2691966 2558449 2405525 2241828
6779B241828j74002j95919j96450j74481j60669j52992j16928m9505q44P078r503
$$ 2241828 2067826 1871907 1675457 1500976 1340307 1187315 1070387 1020882 1020038 1027116 1017613
6768A017613m0250q6496j25055j14923o4452j1682J0354k080l7084p9050r5646
$$ 1017613 977363 890867 765812 650889 586437 574755 585109 583029 545945 466895 371249
6757C71249p0820l1388o035o782k1628k6184l4656l6574L653M8022O1378N4423
$$ 371249 300429 269041 263006 256224 234596 208412 173756 137182 140835 188857 250235 304658
6745C04658M6715K2639j6104l8452m6660j4439O1193O7458k7826j14113j27387
$$ 304658 351373 374012 357908 319456 272796 258357 319550 387008 359182 245069 117682
6734A17682r2690m0691q90R784J8411L6386J5935m1010n4610j8935n83k9000o2868
$$ 117682 24992 -15699 -16589 -6805 11606 47992 63927 22917 -31693 -50628 -51211 -80211 -143079
6721a43079o4366k3580K7209L3446K5196N1764P3828O5885M8864K1114k5400o2967
$$ -143079 -207445 -231025 -203816 -170370 -145174 -93410 -19582 46303 95167 116281 90881 27914
6709B7914o8319p5129p6952l2331K7703M8850K1143M141R886p393k8193l6138
$$ 27914 -40405 -115534 -192486 -224817 -197114 -148264 -127121 -122980 -113094 -120487 -148680 -184818
6697a84818m1408n6181n4619j5125L6580R2860J34082J31023J00199O9095L3345
$$ -184818 -226226 -282407 -337026 -352151 -315571 -222711 -88629 42394 142593 211688 245033
6686B45033j039j2698N340L6452O8713R8055O7871m0509j55293k04530j68633
$$ 245033 243994 231296 236636 273088 341801 439856 507727 467218 311925 107395 -61238
6675f1238r9228o0431l7880q596K4023N0180M5568L7065M9364O9208N5120j645
$$ -61238 -160466 -220897 -258777 -267373 -243350 -193170 -147602 -110537 -61173 8035 63155 61510
6663F1510m0691m8663k4925L0374P9292P3370L5208K1014K6856J8224L067o380
$$ 61510 20819 -27844 -52769 -22395 56897 130267 165475 186489 213345 231569 234636 228256
6651B28256l9809r1717j11365p4103r936K6455J855m9847n5590R10Q5470J35152
$$ 228256 188447 96730 -14635 -88738 -98674 -72219 -70364 -120211 -175801 -174891 -89421 45731
6639D5731J07538N4421K4469K405j9679m3385p0638o8365l3199j4733r042M589
$$ 45731 153269 207690 232159 234564 214885 171500 100862 32497 -702 -15435 -24477 -19888
6627a9888j00k3710k6718q296M113K2749N3962O0049K5938k1000m8003l7454P94
$$ -19888 -19988 -43698 -70416 -78712 -74599 -51850 2112 62161 88099 67099 19096 -18358 -17564
6614a7564K3041M040k946K5261O6896Q9503O2516K7648K8384L8216Q937k5273
$$ -17564 5477 9517 6571 31832 98728 188231 250747 278395 306779 344995 353932 328659
6602C28659l0988j7118Q567J0388j0122m6251q5325p9214k2916R184j8337n4375
$$ 328659 297671 280553 289120 299508 289386 243135 157810 78596 55680 64864 46527 -7848
6590g848m7208M446N1554L9651J4522J3937P167j1234k8279l7854l3648j7957
$$ -7848 -55056 -50610 944 40595 55117 69054 76221 64987 36708 -1146 -34794 -52751
6578e2751j658K4381M4648L5041K9993M4719M9584J3732l3864k9457L792J6878
$$ -52751 -54409 -30028 14620 49661 79654 124373 173957 187689 153825 124368 128160 145038
6566A45038J9198J5637p875k8412m9904r2298j24070j08181l7268K4453L8658
$$ 145038 164236 179873 171998 143586 93682 1384 -122686 -230867 -268135 -243682 -205024
6555b05024J3270l5271o5010l4256K4618N3484L2090Q82K818j546k374L8358P6168
$$ -205024 -191754 -227025 -292035 -326291 -301673 -248189 -216099 -215217 -212399 -213945 -216319 -177961 -101793
6542a01793O0681J4698J658K2873J7494k1191m3989j2226L6447N6884O2137N5932
$$ -101793 -41112 -26414 -24756 -1883 15611 -5580 -49569 -61795 -25348 31536 93673 149605
6530A49605K5061j2056j5853m932n734P542K7805J6883k3599p2476q8592n7156
$$ 149605 174666 162610 146757 141825 136091 143633 171438 188321 164722 92246 3654 -53502
6518e3502o270K4732L1704L4834M8758L8212l668j1435K8108N6908L2665k3649
$$ -53502 -59772 -35040 -3336 31498 80256 118468 114800 103365 131473 188381 221046 197397
6506A97397m7460l340P2266R4732K8965l5159j3128M1994L7474j731l1832n4903
$$ 197397 149937 146597 218863 313595 342560 307401 294273 336267 373741 372010 340178 285275
6494B85275o5163m6700k7420l7099n5299o7467p1087l4890L4517N5433J7299k3978
$$ 285275 220112 173412 145992 108893 53594 -13873 -84960 -119850 -85333 -29900 -12601 -36579
6482c6579l9434l5687l7787j6016L8468Q5521R9875P1191L4219L3619J9789k6132
$$ -36579 -76013 -111700 -149487 -165503 -127035 -41514 58361 129552 163771 197390 217179 191047
6470A91047n7878p1778r1827q5104m5871q847P39n648M334J3367Q232j6092l1189
$$ 191047 133169 61391 -30436 -115540 -161411 -170258 -169519 -175167 -170833 -157466 -149234 -165326 -196515
6457a96515k2730r282Q69L0217O1402P6051P3987L6822j8567o0798o7247m2264
$$ -196515 -219245 -228527 -227658 -197441 -136039 -59988 13999 50821 32254 -28544 -95791 -138055
6445a38055k7027j1320M0962R6067J18396R6064M7988J9833K3658M1385P0923
$$ -138055 -165082 -176402 -135440 -39373 79023 175087 223075 242908 266566 307951 378874
6434C78874Q7160N8235J7933r815n2486r1953q8507m6578r607P143J5728J4092
$$ 378874 466034 524269 542202 532387 479901 387948 299441 252863 243256 250399 266127 280219
6422B80219l896j6171j1492N548K1195K2309L0211K9928J0510k093r83L737j24
$$ 280219 276323 260152 248660 254208 275403 297712 327923 357851 368361 366268 365285 369022 368898
6409C68898j3040k09J9860o728m7323m1565o841K4208K9435R580k0279m6740o9019
$$ 368898 355858 355649 375509 368781 321458 279893 273052 297260 326695 336275 315996 269256 200237
6396B00237p8431n7764l0870r786k637m597K2122N0504N9014O8317O7982K2601
$$ 200237 121806 64042 33172 23386 20749 16152 38274 88778 147792 216109 284091 306692
6384C06692n0765r9444r6983o7999k2887J8614K8496L357l4139l6793P836O8754
$$ 306692 255927 156483 59500 -8499 -31386 -12772 15724 19081 -15058 -51851 -44015 24739
6372B4739J07506R9315N9667K5838M483j3480l5198n8419o4845l1245K1864M4514
$$ 24739 132245 231560 291227 317065 321548 308068 272870 214451 149606 118361 140225 184739
6360A84739K3670Q893j336k1459m8999q0029j02887q7041k7808K1325J7841j8503
$$ 184739 208409 217302 215966 194507 145508 65479 -37408 -124449 -152257 -130932 -113091 -131594
6348a31594l1356q036L4290N1733J0942l1703m9138m9934k3808Q202K4804M9190
$$ -131594 -162950 -170986 -136696 -84963 -74021 -105724 -154862 -204796 -228604 -220402 -195598 -146408
6336a46408J02487J18076O0618j755l7741l5968j5292j2094k189R979n622j1423
$$ -146408 -43921 74155 134773 133018 95277 59309 44017 31923 29734 39713 34091 22668
6324B2668o620k8470o9557o9739j5248K2501J8116J1375K1950L1698J0812l1367
$$ 22668 16048 -12422 -81979 -151718 -166966 -144465 -126349 -114974 -93024 -61326 -50514 -81881
6312h1881m8080k4643L977K5865K8421o433j0187L1103L8101J0605p084K124K8341
$$ -81881 -129961 -154604 -150627 -124762 -96341 -102774 -112961 -81858 -43757 -33152 -40236 -38112 -9771
6299i771M1246J6422k5371m8942m8866m225O9289R2600N1535o622n2624n9654
$$ -9771 31475 47897 22526 -26416 -75282 -79507 -10218 82382 133917 127295 74671 15017
6287A5017j8305J8578M394j0103J068k978J0761N7970Q4849Q4513O9484O9156
$$ 15017 -3288 15290 19684 9581 10649 7671 18432 76402 161251 245764 315248 384404
6275C84404R6244J01111N2452L17q752j0217k2142l6604n8910q4549p0463k4340
$$ 384404 480648 581759 634211 634528 625776 615559 593417 556813 497903 413354 342891 318551
6263C18551J2918L6721M7743O0418N3373N2459Q0059Q8542O4930K3618l7168o9111
$$ 318551 331469 368190 415933 476351 529724 582183 662242 750784 815714 839332 802164 733053
6251G33053m4166J0503N2722L7397k3353n0076j6731L776l223j2707j4268M32
$$ 733053 688887 699390 752112 789509 766156 716080 699349 703125 699902 687195 672927 673359
6239F73359k61p978J4648M3988O4697R0068J03995Q6431M0724p781n875K8108
$$ 673359 673098 665120 679768 723756 788453 878521 982516 1068947 1109671 1101890 1096015 1124123
6227A124123K8235r547l4589k0438m563R143Q933j8050n0773p2961p6290n6007
$$ 1124123 1152358 1142811 1108222 1087784 1083221 1092364 1101297 1083247 1032474 959513 883223 827216
6215H27216l7525n3767p8155r2283j06095j19416j33690j35748j05658o3764l6650
$$ 827216 789691 735924 657769 565486 459391 339975 206285 70537 -35121 -98885 -135535
6204a35535m896L9446N0887K9442K1200O198k4688k6581J1054M5277N1025K9228
$$ -135535 -140431 -100985 -50098 -20656 544 6742 -17946 -44527 -33473 11804 62829 92057
6192I2057R662K6547O8067Q8851O0448O80m0648l3095L961M9147Q9171J14530
$$ 92057 101719 128266 196333 285184 345632 346312 305664 272569 276530 325677 414848 529378
6180E29378R0972L0486j2159l9038m7995l1298l2615m3800m8429m5440k9420n813
$$ 529378 620350 650836 638677 599639 551644 520346 487731 443931 395502 350062 320642 314829
6168C14829k966k8473n4153m8798k1526j1333l2525m9330j9061K9623N0971L4725
$$ 314829 311863 283390 229237 180439 158913 147580 115055 65725 46664 76287 127258 161983
6156A61983J3927J0708Q695J0077K2840L6729J8555k2567n3786o6856o2118l6134
$$ 161983 175910 186618 195313 205390 228230 264959 283514 260947 207161 140305 78187 42053
6144D2053L048M4569N5610J1434m5058p6307q0776l9611J5575L3188K4356K0509
$$ 42053 45101 89670 145280 156714 111656 35349 -45427 -85038 -69463 -36275 -11919 8590
6132H590L6801M9074M4848N0125M8703O781l5824l7779k8910k4512k063O148j0258
$$ 8590 45391 94465 139313 189438 238141 244922 209098 171319 142409 117897 115834 121982 111724
6119A11724l0170m2377l8893j7799o011j886L195j0211l4307p838N7449Q5455
$$ 111724 81554 39177 284 -17515 -23526 -25412 -22217 -32428 -66735 -74573 -17124 68331
6107F8331O6553K1297n172Q675K8591L8346K5639L537j2281m1896n1469l9592
$$ 68331 134884 156181 151009 159684 188275 226621 252260 255797 243516 201620 150151 110559
6095A10559k7669n651J5902L2782J9086r187l443R591k370k7096o2905r3902p6941
$$ 110559 82890 77239 93141 125923 145009 135822 132379 141970 139600 112504 49599 -44303 -121244
6082a21244n4848p4084q9175o5719j6159K4713M0893L2533K1433L2189N1990L5082
$$ -121244 -176092 -250176 -339351 -405070 -421229 -396516 -355623 -323090 -301657 -269468 -217478 -182396
6070a82396k6410o8043n8895M981Q8024J08172P0650L2769J3334J5150J2463k4745
$$ -182396 -208806 -276849 -335744 -330763 -242739 -134567 -63917 -31148 -17814 -2664 9799 -14946
6058a4946n7779m7264k882K2585P000k6523l4907j3157Q12R583J6247K8955L3184
$$ -14946 -72725 -119989 -122871 -100286 -93286 -119809 -154716 -167873 -167061 -157478 -141231 -112276 -79092
6045g9092N115j3683J7466Q3233J02581O1968K6081K4653J0226k9768m5438l4224
$$ -79092 -73977 -87660 -70194 13039 115620 177588 203669 228322 238548 208780 163342 129118
6033A29118k0968K26K7438M0185K9243R471k6135p9623j13591j19195j01575n0622
$$ 129118 108150 108376 135814 175999 205242 214713 188578 108955 -4636 -123831 -225406 -276028
6021b76028K4520P1385O7902K8538k5225l7848L313M6603M8686J9058l702P285
$$ -276028 -251508 -180123 -112221 -83683 -108908 -146756 -143443 -96840 -48154 -29096 -32798 -25513
6009b5513J4840r683j6951m879j620J418Q538R608L0574P5431Q6262M0282k4218
$$ -25513 -10673 -20356 -37307 -42186 -43806 -42388 -33850 -24242 6332 81763 168025 208307 184089
5996A84089n0959j1584M3924O0273M0722P330l4017n2323l3197O271M4941N9961
$$ 184089 133130 121546 165470 225743 266465 273795 239778 187455 154258 160529 205470 265431
5984B65431M5319J3092k1686n4947o7071n1497k7062j5910O83J9646Q939j8080
$$ 265431 310750 323842 302156 247209 180138 128641 101579 85669 86352 105998 114937 96857
5972I6857l2982l1251r485L7029O1678O7646R0948P4918L0059J1073O467R457
$$ 96857 63875 32624 23139 60168 121846 189492 280440 355358 385417 396490 402957 412414
5960D12414L8529O3559K3626n3255q9264p8483m6397j5275j0827K339L7508M7591
$$ 412414 450943 514502 538128 484873 395609 317126 270729 255454 244627 246966 284474 332065
5948C32065L3289J2115j6221j9215n257j8910n0237n8423n9826p1619o2410l0596
$$ 332065 365354 377469 361248 342033 336776 317866 267629 209206 149380 77761 15351 -15245
5936a5245r975j3646o134J9215L3724L7928K4116m5395j00390q8484m9543k2388
$$ -15245 -25220 -38866 -45000 -25785 7939 45867 69983 24588 -75802 -164286 -213829 -236217
5924b36217j8886R83M0538M4791J2120J9167N9788Q7114R7320J02934P1142M853
$$ -236217 -255103 -254120 -213582 -168791 -156671 -137504 -77716 9398 106718 209652 280794 285647
5912B85647m3410m6592k4605k114o994l3315o5018q3544p5710n8865l4126j7126
$$ 285647 242237 195645 171040 168926 161932 128617 63599 -19945 -95655 -154520 -188646 -205772
5900b05772j3516p020J2504L8561L7397J5118J8562M1241L2274j1785m8714n6881
$$ -205772 -219288 -226308 -213804 -175243 -137846 -122728 -104166 -62925 -30651 -42436 -91150 -148031
5888a48031l9081j4591p321k901L1767Q2158Q9828N4701K3860J6037o725m9631
$$ -148031 -187112 -201703 -209024 -211925 -180158 -98000 -8172 46529 70389 86426 79701 30070
5876C0070o4587m7166l7296m7370m7563k6850K358K8675K9634J7209K6165L3227
$$ 30070 -34517 -81683 -118979 -166349 -213912 -240762 -238404 -209729 -180095 -162886 -136721 -103494
5864a03494L516m6074q8247j19440j23190p6106k2994J2915O5211J07240Q9843
$$ -103494 -99978 -146052 -234299 -353739 -476929 -553035 -576029 -563114 -497903 -390663 -300820
5853c00820L4667m856j0390M777K4057J8160j8586m9180l5550L679R000j8842
$$ -300820 -266153 -271009 -281399 -276622 -252565 -234405 -252991 -302171 -337721 -334042 -325042 -343884
5841c43884l2240j7772K1491P1253R8373P5452K6129K026r770j9505j4068o324
$$ -343884 -376124 -393896 -372405 -301152 -202779 -127327 -101198 -99172 -108942 -128447 -142515 -148839
5829a48839k5220k7175K2510N9471K9836j5015k4643m1904p7690q6574n1815O381
$$ -148839 -174059 -201234 -178724 -119253 -89417 -104432 -129075 -170979 -248669 -335243 -387058 -380677
5817c80677O3264R1363R4443O7475R644k4338j7491m850R12k1905m2825j3537
$$ -380677 -317413 -226050 -131607 -64132 -54488 -78826 -96317 -101167 -100255 -122160 -164985 -178522
5805a78522L5820P0454R3436R4714O6112L8551J0262l1429q4686j14602r2401
$$ -178522 -142702 -72248 21188 115902 182014 220565 230827 199398 114712 110 -92291
5794i2291l5611J1920L1065K9865K7625K4450K0345K9873K9936K359j4854K57
$$ -92291 -127902 -115982 -84917 -55052 -27427 -2977 17368 47241 77177 79536 64682 64939
5782F4939o531m4461o3753n2872l0774N965L5609Q065m5773n8837j3526L6332
$$ 64939 58408 13947 -49806 -102678 -133452 -127487 -91878 -83813 -129586 -188423 -201949 -165617
5770a65617K0492l6630m8959J6811Q7184R1177M3640J3918M5978Q3844O3666K332
$$ -165617 -145125 -181755 -230714 -213903 -126719 -35542 8098 22016 67994 151838 215504 217836
5758B17836n4703p4629l2197J9438L0022K0244J5671J9424J3760j5212l7315l2295
$$ 217836 163133 88504 56307 75745 105767 126011 141682 161106 174866 159654 122339 90044
5746I0044j6820j5482k1790j2441J0742K0529J371l9787j03122j68051j77861
$$ 90044 73224 57742 35952 23511 34253 54782 56153 16366 -86756 -254807 -432668
5735d32668j16835j9214O8247J18114J15138P4951L1196n146j2157J219K1524
$$ -432668 -549503 -568717 -500470 -382356 -267218 -192267 -161071 -166217 -178374 -177155 -155631
5724a55631K0321k2451m8424m2840m5516n8418m4723R802O1568P7942O2283K6648
$$ -155631 -135310 -157761 -206185 -249025 -294541 -352959 -397682 -387880 -326312 -248370 -186087 -159439
5712a59439p873l6186m5914l4751k7706k4222m09L48p3562j54960j72799j26356
$$ -159439 -167312 -203498 -249412 -284163 -311869 -336091 -336500 -336152 -409714 -564674 -737473 -863829
5700h63829l0378P1476J23268J06029O0650L1822J8478K3712M8069P6712O6437
$$ -863829 -894207 -822731 -699463 -593434 -532784 -500962 -482484 -458772 -410703 -333991 -267554
5689b67554K5968j1974l7762l1956j940K7930L8066J1456l0729m8316l9758j6289
$$ -267554 -241586 -253560 -291322 -323278 -325218 -297288 -259222 -247766 -278495 -326811 -366569 -382858
5677c82858J6802J8432r328L626M6314N3684J0677m4683o2763k6698J301q633
$$ -382858 -366056 -347624 -356952 -353326 -307012 -253328 -242651 -287334 -350097 -376795 -375494 -384127
5665c84127o441J3234M422m4433r1469q7292l2034L1698O7054P3376R6685J42396
$$ -384127 -390568 -377334 -372912 -417345 -508814 -596106 -628140 -596442 -529388 -456012 -359327 -216931
5653b16931J58883J14196K5709n6856j11900j33869j14911k1973R7986J57882
$$ -216931 -58048 56148 81857 25001 -86899 -220768 -335679 -357652 -259666 -101784
5643a01784J38518O4230k6533r7047j12047o8273l3118k0991j4018q321J5255
$$ -101784 36734 100964 74431 -22616 -134663 -202936 -236054 -257045 -271063 -279384 -264129
5632b64129K4032O414l111r547j9417l6826m5420o907O4224J06729R6836O6969
$$ -264129 -240097 -233683 -236794 -246341 -265758 -302584 -348004 -354911 -290687 -183958 -87122 -20153
5620b0153O3227Q7549O4552q829o4377q6326r7572j03012j00105p9911m0269j656
$$ -20153 43074 130623 195175 186346 121969 35643 -61929 -164941 -265046 -344957 -385226 -386882
5608c86882K9153O3550P4718P5486P8372P3310P6939Q3865P4793L6347p17j280
$$ -386882 -357729 -294179 -219461 -143975 -65603 7707 84646 168511 243304 279651 278934 277654
5596B77654J8225J0194k8650m1990m0514m8606p8981j06503r4240o8102l1576
$$ 277654 295879 306073 277423 235433 194919 146313 67332 -39171 -133411 -201513 -233089
5585b33089J0022J8364l938r959R513K7186L4943M5913P3295Q6609N3252J0243
$$ -233089 -223067 -204703 -208641 -218600 -209087 -181901 -146958 -101045 -27750 58859 112111 122354
5573A22354J0287K1375J2305j399k8467p2160p0657o528N7457N3783N746j8702
$$ 122354 132641 154016 166321 164922 136455 64295 -6362 -12890 44567 98350 104096 85394
5561H5394k4393k2637r471j8258o0981j05579j19216p0755Q649M8511M9351O2574
$$ 85394 61001 38364 28893 10635 -50346 -155925 -275141 -345896 -337247 -288736 -239385 -176811
5549a76811Q1251O9546J1208o1782q5959n4703l5143m9922n0783J2516R4433R7945
$$ -176811 -95560 -26014 -14806 -76588 -162547 -217250 -252393 -302315 -353098 -340582 -246149 -148204
5537a48204M8158K1569K2622J7747r321n4618r3602r8388o4758k738M5053K1095
$$ -148204 -100046 -78477 -55855 -38108 -47429 -102047 -195649 -294037 -358795 -361533 -316480 -295385
5525b95385k8039l9134j4086K943j6458m4486k6443K4872P0246Q9058P3046K0765
$$ -295385 -323424 -362558 -376644 -373701 -390159 -434645 -461088 -436216 -365970 -276912 -203866 -183101
5513a83101l8605m2689p9L6860L9533K3807K1916J0665k3729o6107r6181p2440
$$ -183101 -221706 -264395 -264474 -227614 -188081 -164274 -142358 -131693 -155422 -221529 -317710 -390150
5501c90150p621M2482N7957O3147O5476O2775N6069M0654K9402K8591N748l4022
$$ -390150 -397771 -355289 -297332 -234185 -168709 -105934 -49865 -9211 20191 48782 54530 20508
5489B0508m9215k6716J1047M1534N4089N8910N5255K635p7737j11154p5960p442
$$ 20508 -28707 -55423 -44376 -2842 51247 110157 165412 168047 90310 -20844 -96804 -104246
5477a04246L3425L6394L4787M7474P3198Q9159P5802K6660m9838j10479j15372
$$ -104246 -70821 -34427 360 47834 121032 210191 285993 312653 262815 152336 36964
5466C6964j01229r9095r2684o0702l0956k7033l3059l7074k5528n220M1717Q7769
$$ 36964 -64265 -163360 -256044 -316746 -347702 -374735 -407794 -444868 -470396 -475616 -433899 -346130
5454c46130P7469K4463j2222n370K9484N2711L8342K4251L8329M8216L9133R430
$$ -346130 -268661 -244198 -256420 -261790 -232306 -179595 -141253 -117002 -78673 -30457 8676 18106
5442A8106j8897m8457q5520q5779m6504o096L703N617L1043M7623M5650M0101
$$ 18106 -791 -49248 -134768 -220547 -267051 -273147 -269444 -263827 -232784 -185161 -139511 -99410
5430i9410M648n1033o8850l8060m118p496k6832k6166K856N7593J05818J20517
$$ -99410 -94762 -145795 -214645 -252705 -256823 -264319 -291151 -317317 -314461 -256868 -151050 -30533
5418c0533Q2842K3717r897L276N3553R3549Q8895M9981J0097j6725l3780n1235
$$ -30533 52309 76026 66129 69405 122958 216507 305402 355383 365480 348755 314975 263740
5406B63740q2022j17991j16681p2428k8255k2577k7110j0938J6004L4011L0126
$$ 263740 181718 63727 -52954 -125382 -153637 -176214 -203324 -214262 -198258 -164247 -134121
5395a34121L2914L2272l952n2896p0226m0586q16M547P77L052q397m553J7740
$$ -134121 -101207 -68935 -72887 -125783 -196009 -236595 -237411 -232864 -232087 -229035 -237432 -241985 -224245
5382b24245L2042L6221K5844j0900m1636k4952K3722N8933M9679J5588l8249r4177
$$ -224245 -192203 -155982 -130138 -141038 -182674 -207626 -183904 -124971 -75292 -59704 -97953 -192130
5370a92130j05353n0729J0358K5265K1957K0327J4693m473j7466j2331K506N902
$$ -192130 -297483 -348212 -337854 -312589 -290632 -270305 -255612 -260085 -277551 -289882 -287376 -281474
5358b81474k6359n1424k0552M5836R3143J00872Q8365O9772L6501K2177M4405
$$ -281474 -307833 -359257 -379809 -333973 -240830 -139958 -51593 18179 54680 76857 121262
5347A21262P4632R1219O7444R263o0082q4681n1882l9968r7824j58767j49112
$$ 121262 195894 287113 354557 363820 303738 219057 167175 127207 29383 -129384 -278496
5336b78496p1257K8629Q9601R0182Q7531J01663J00144O2247J243m7617n5284
$$ -278496 -349753 -321124 -231523 -141341 -53810 47853 147997 210244 211487 163870 108586
5325A08586r435M7833O5685O0341M4350K0567q211m1362j9441O5307J16238J11683
$$ 108586 99151 146984 212669 273010 317360 337927 329716 288354 268913 334220 450458 562141
5313E62141P0381J7243Q270L1963N2948N0221J1368n8818j27228j65241j75420
$$ 562141 632522 649765 658035 689998 742946 793167 804535 745717 618489 453248 277828
5302B77828j35646q006R6065O2927l1190o3244m1382l9068m9513k5816O274R571
$$ 277828 142182 134176 230241 293168 261978 198734 157352 118284 68771 42955 49229 58800
5290E8800R462K5609K7412n595k2952M18K3246L9395N0813L0482j4548k7845k2507
$$ 58800 68262 93871 121283 115688 92736 93154 116400 155795 206608 237090 222542 194697 172190
5277A72190k3254j1628P956K3514J8506n140j5207K311L2548O9365R8327O7382
$$ 172190 148936 137308 145264 168778 187284 182144 166937 169248 201796 271161 369488 436870
5265D36870j4250m9965m5933k9664J5998O7333Q7752P7971N4068L1151Q863k3895
$$ 436870 422620 372655 326722 297058 313056 380389 468141 546112 600180 631331 640194 616299
5253F16299n2777o0126n4724l7865p407J8044K8047L1870M5875N2539K5267p468
$$ 616299 563522 503396 448672 410807 403400 421444 449491 481361 527236 579775 605042 597574
5241E97574m0974r8294j37149j00286j8911L8761M7890L3271K9485L4037L1205
$$ 597574 556600 458306 321157 220871 201960 240721 288611 321882 351367 385404 416609
5230D16609K1738J0127R44K1945O2645O2124L6335M0930M6889N1315P2705O1766
$$ 416609 438347 448474 449418 471363 534008 596132 632467 673397 720286 771601 844306 906072
5218I06072R215j8071k6666n0783r9070j50144j52208j13933p8695n0093l7738
$$ 906072 915287 897216 870550 819767 720697 570553 418345 304412 225717 175624 137886
5207A37886n6857o3091k7651R072P520j5985l8399m9468m3839l649N4463P2306
$$ 137886 81029 17938 -9713 -641 6879 -9106 -47505 -96973 -140812 -144461 -89998 -17692
5195a7692K9694k5009m3060l6489k1179j0638m557P645N948j998k3313o0350m7156
$$ -17692 12002 -13007 -56067 -92556 -113735 -124373 -128930 -121285 -115337 -117335 -140648 -200998 -248154
5182b48154J1919L0143J2567p33j5995k6150q413J886j7821j9856J8898M8365
$$ -248154 -236235 -206092 -193525 -194258 -210253 -236403 -244816 -242930 -260751 -280607 -261709 -213344
5170b13344M9017M8279M4698M4123O8202Q5671N3095J2881K619l587r681L807
$$ -213344 -164327 -116048 -71350 -27227 40975 126646 179741 192622 195241 191654 181973 185780
5158A85780K7388L0044j2201n0556n7527o1496n4912n0074n4640l6666J5191O2551
$$ 185780 213168 243212 231011 180455 122928 61432 6520 -43554 -98194 -134860 -119669 -57118
5146e7118P3693M9681L4147K9349k3935j05362j24222o9058j6494K1489P5500
$$ -57118 16575 66256 100403 129752 105817 455 -123767 -192825 -209319 -187830 -112330
5135a12330J22593J15820M8827j09J7404O5225P9002L1836k0866m3723n9211p9779
$$ -112330 10263 126083 174910 174801 192205 257430 336432 368268 347402 303679 244468 164689
5123A64689q9531o7023k4948o118q075r78K9294O3084P6148O3722O6766Q4684
$$ 164689 75158 8135 -16813 -22931 -31006 -31984 -2690 60394 136542 200264 267030 351714
5111C51714O8546J7165m2384q0819r7514j03639q9116n6869l1926j3404K791J1035
$$ 351714 420260 437425 395041 314222 216708 113069 23953 -32916 -64842 -78246 -75455 -64420
5099f4420J7503J7767L4380N9161P6571P4307M0571j1884m8760n0371m2614m5823
$$ -64420 -46917 -29150 5230 64391 140962 215269 255840 243956 195196 144825 102211 56388
5087E6388m1857k7922k4075k8791q253L2043L9087Q504j7282j0752J5479K6127
$$ 56388 14531 -13391 -37466 -66257 -74510 -42467 -3380 5124 -12158 -22910 -7431 18696
5075A8696J9738L2459O7073P5998K8825m0927r4620j06975p0103j1782K4122R577
$$ 18696 38434 70893 137966 213964 242789 201862 107242 267 -69836 -81618 -57496 -47919
5063d7919m514j2906n5551p4375m7857j5517K4945O8393O8455K4543j3300r442
$$ -47919 -52433 -65339 -120890 -195265 -243122 -258639 -233694 -165301 -96846 -72303 -85603 -95045
5051i5045J0760K2577O1336J17841J26483P8464L8099L8922N9599O3740L3140
$$ -95045 -84285 -61708 -372 117469 243952 322416 360515 399437 459036 522776 555916
5040E55916j2481m4784p6279j30494j60589j32952o4448N398K7742M415j4444
$$ 555916 543435 498651 422372 291878 131289 -1663 -66111 -60713 -32971 -28556 -43000
5029d3000j7107J0684N0433O0511N0181M4044M2920K0951p029O797N5051Q6088
$$ -43000 -60107 -49423 1010 61521 111702 155746 198666 219617 212588 219385 274436 360524
5017C60524R7249J12591J06908M7971k6903n7676m2722o726K4571J7240j4710
$$ 360524 457773 570364 677272 725243 698340 640664 597942 591216 615787 633027 618317
5006F18317k6670j2696J212k997k7831l7826k8178j2404J1809L0641K8582o506
$$ 618317 591647 578951 580163 577166 549335 511509 483331 470927 482736 513377 541959 535453
4994E35453n1924o3005l6234J5103O3839R5692J24473J62094J69935J31403P8784
$$ 535453 483529 420524 384290 399393 463232 558924 683397 845491 1015426 1146829 1225613
4983A225613L6340r136o5004r9634r0184n9360j6039M4168J06631J58803J91127
$$ 1225613 1261953 1252817 1187813 1088179 997995 938635 922596 966764 1073395 1232198 1423325
4972A423325K08048K09481K09772K14712K16156J99790J63966J30620J09410J07762
$$ 1423325 1631373 1840854 2050626 2265338 2481494 2681284 2845250 2975870 3085280 3193042
4962C193042J47440K17861K90736L84240N02153N94098O57249P21720Q20394R55580
$$ 3193042 3340482 3558343 3849079 4233319 4735472 5329570 5986819 6708539 7528933 8484513
4952H484513J127720J348607J615999J927353K274858K618782K844848K787757
$$ 8484513 9612233 10960840 12576839 14504192 16779050 19397832 22242680 25030437
4944B5030437K238004J049481n59618k021277k911910l168142k984872k611451
$$ 25030437 27268441 28317922 27758304 25737027 22825117 19656975 16672103 14060652
4936A4060652k188123j787902j433466j127126q84460p18555o14179n58258n27772
$$ 14060652 11872529 10084627 8651161 7524035 6639575 5921020 5306841 4748583 4220811
4927D220811m80196l98365k99662k24478k01805k12251k15256j87312j54885j63173
$$ 4220811 3740615 3342250 3042588 2818110 2616305 2404054 2188798 2001486 1846601 1683428
4917A683428j92308j81214j23732q2525q2551r1446r6622q5588o7570q1907j03122
$$ 1683428 1491120 1309906 1186174 1103649 1021098 929652 833030 747442 679872 597965 494843
4906D94843j01031q8870o9984k7161K8921N3926O2878P9307Q5363P5872O5851
$$ 494843 393812 304942 234958 207797 236718 290644 353522 432829 518192 594064 659915
4895F59915M3823J9482J8159L4283M1331K5180n375m2688r3127j37536j38910
$$ 659915 703738 723220 741379 775662 816993 842173 836798 794110 700983 563447 424537
4884D24537r3471l5872p442j7102k5867j1753O256J6450Q180P805K7857K4999
$$ 424537 331066 295194 287752 270650 244783 233030 239286 255736 263916 271721 299578 324577
4872C24577m202m5281q1480q8578p1604n9057m5559k2505O714M3191P4911P0285
$$ 324577 320375 275094 193614 105036 33432 -25625 -71184 -93689 -86975 -43784 31127 101412
4860A01412K7650j6454l6729m1015m7568o0052p8123p0486m5804k3487K509J3206
$$ 101412 129062 112608 75879 34864 -12704 -72756 -150879 -221365 -267169 -290656 -288147 -274941
4848b74941P707K465j731O754L6464N2349L8483o501n2737n8265l4872L1336P9895
$$ -274941 -267234 -264769 -266500 -259746 -223282 -170933 -132450 -138951 -191688 -249953 -284825 -253489 -173594
4835a73594M7725K6286M7020M8752J7854j8745m2645n1177m7512l9554j3876J1963
$$ -173594 -125869 -99583 -52563 -3811 14043 -4702 -47347 -98524 -146036 -185590 -199466 -187503
4823a87503J3321J1489J5643L1144M3650K3483j9197n0081n5628m2687l8542m5330
$$ -187503 -174182 -162693 -147050 -115906 -72256 -48773 -67970 -118051 -173679 -216366 -254908 -300238
4811c00238l4914N564K9953j41m1063l9224j2748q36J9780O4149J02538J07209
$$ -300238 -335152 -329588 -299635 -299776 -340839 -380063 -392811 -393647 -373867 -309718 -207180 -99971
4799i9971Q5057P8075P2384M8919K8261M982j8238j1227P79k8984n6575m2667
$$ -99971 -14914 63161 135545 184464 212725 217707 199469 188242 189021 160037 103462 60795
4787F0795m1466n3021m1213k2300j90L9385O3577K2038l6763l7065O802L6333
$$ 60795 19329 -33692 -74905 -97205 -97395 -58010 5567 27605 -9158 -46223 -39421 -3088
4775c088K2160j5949m4468l0068K5847N1457J8344k9765n0342l2440p456J0446
$$ -3088 19072 3123 -41345 -71413 -45566 5891 24235 -5530 -55872 -88312 -95768 -85322
4763h5322N5560R8565Q1575J8625l5936m9188j1332M5711P7786O6736K1827l3416
$$ -85322 -29762 68803 150378 169003 133067 83879 72547 118258 196044 262780 284607 251191
4751B51191n4901n0955o4128q8687p9819l5627J0285M6086N9246L4303L424p531
$$ 251191 196290 145335 81207 -7480 -87299 -122926 -112641 -66555 -7309 26994 30418 22887
4739B2887j0344j5273K305L5114M0424K7544K5577L7107L3790K0601m392m7317
$$ 22887 12543 -2730 -425 34689 75113 102657 128234 165341 199131 219732 215340 168023
4727A68023o8959n9592l9657l0242m1078l8690k7653j7237R60R592P535l354J0216
$$ 168023 99064 39472 -185 -30427 -71505 -110195 -137848 -155085 -154125 -144533 -136998 -140352 -130136
4714a30136P4919J14592P5250J990m9603n6222l9815j8144k5335n3389n7382l1004
$$ -130136 -55217 59375 134625 136615 87012 30790 -9025 -27169 -52504 -105893 -163275 -194279
4702a94279J9220N1756O1803N4560P875n0243n0214K0433R7460J30510J21977
$$ -194279 -175059 -123303 -61500 -6940 935 -49308 -99522 -79089 18371 148881 270858
4691B70858J06368Q8935N7470l166n0007l6097l470J2570L9746Q9485J30417J26714
$$ 270858 377226 466161 523631 520465 470458 434361 430891 443461 483207 572692 703109 829823
4679H29823O1489k8733r8970j41630j40803q8340j1295M4081M4250L2880O1650
$$ 829823 891312 862579 763609 621979 481176 392836 381541 425622 469872 502752 564402
4668E64402R2925P1725k44p6211j11402p8491k8913j9010j5392K0215P4633Q8045
$$ 564402 657327 729052 728808 652597 541195 462704 433791 414781 399389 419604 494237 582282
4656E82282M9584j0162o2296p1063k4069K6498K3124O276J9607L8507O6593Q3582
$$ 582282 631866 621704 559408 488345 464276 490774 513898 520174 539781 578288 644881 728463
4644G28463O7712M4293r758r0437j68981k15600j88678r2030J8746Q7731J05120
$$ 728463 796175 840468 830710 740273 571292 355692 167014 74984 93730 181461 286581
4633B86581Q4514M6732R343k8914p7097j24539j42872j03079l5274R486M5947
$$ 286581 371095 417827 427170 398256 321159 196620 53748 -49331 -84605 -75119 -29172
4622b9172P9493R1210Q0755M1399j0370m0892l8972l9356m5227k5649J4600L7168
$$ -29172 50321 141531 222286 263685 253315 212423 173451 134095 88868 63219 77819 114987
4610A14987K6032j49l7984o2990l0438L1489O7986O1104J9071l6434o0678k4764
$$ 114987 141019 140870 102886 39896 9458 40947 108933 170037 189108 152674 91996 67232
4598F7232K626K862K2937K5456j2418m1904o4324p4873l6639J6763K9151J6208
$$ 67232 69858 72720 95657 121113 108695 66791 2467 -72406 -109045 -92282 -63131 -46923
4586d6923q36l7532r5430q9017N792P5405N8154N121k0584j6561j0185j6556m2592
$$ -46923 -47759 -85291 -180721 -269738 -263946 -188541 -130387 -125266 -145850 -162411 -172596 -189152 -231744
4573b31744n2506n636O4348R4917P8526M8356o982q6082j35275j38040j11671
$$ -231744 -284250 -289886 -225538 -130621 -52095 -3739 -10721 -96803 -232078 -370118 -481789
4562d81789n6945q580K4186N3163M5428L0099M2168N3669O9815Q7893Q0164M9544
$$ -481789 -538734 -547314 -523128 -469965 -424537 -394438 -352270 -298601 -228786 -140893 -60729 -11185
4550a1185K2493K5884K4612K056j0011j9379m1702p9514r0395m7207j0573j1028
$$ -11185 11308 37192 61804 63860 53849 34470 -7232 -86746 -177141 -224348 -234921 -245949
$$ [...]
##END NTUPLES=NMR SPECTRUM
##END=
