##TITLE=C13_SR167_30
 CDCl3, 22200 sc

 17.5.2023
##JCAMPDX= 6.0         $$ Bruker NMR JCAMP-DX V2.0
##DATA TYPE= NMR SPECTRUM
##DATA CLASS= NTUPLES
##ORIGIN= UXNMR, Bruker Analytische Messtechnik GmbH
##OWNER= root
$$ XWIN-NMR		Version 3.5
$$ Thu May 18 13:36:27 2023 Russian Standard Time (UT+4h)  she@DPX200
##.OBSERVE FREQUENCY= 50.327896
##.OBSERVE NUCLEUS= ^13C
##.ACQUISITION MODE= SIMULTANEOUS
##.ACQUISITION SCHEME= undefined
##.AVERAGES= 17180
##.DIGITISER RES= 17
##SPECTROMETER/DATA SYSTEM= spect
##.PULSE SEQUENCE= zgpg30
##.SOLVENT NAME= CDCl3
##.SHIFT REFERENCE= (INTERNAL, CDCl3, 0, 222.624)
##AUDIT TRAIL= $$ (NUMBER, WHEN, WHO, WHERE, WHAT)
$$ ##TITLE= Audit trail, XWIN-NMR		Version 3.5
$$ ##JCAMPDX= 5.01
$$ ##ORIGIN= Bruker BioSpin GmbH
$$ ##OWNER= she
$$ F:/spectra/data/she/nmr/c13/1/pdata/1/auditp.txt
$$ ##AUDIT TRAIL=  $$ (NUMBER, WHEN, WHO, WHERE, WHAT)
(   1,<2023-05-18 08:30:09.75 +0400>,<she>,<DPX200>,
      <created by zg, POWCHK disabled, PULCHK disabled
       terminated by command 'halt'
       configuration hash MD5:
       00 E9 B6 7A A2 85 ED C7 34 08 36 98 17 FE 4E 26
       data hash MD5: 32K
       B1 90 20 DA 7C C8 09 90 1C F8 7D 7F 89 3C E1 8E>)
(   2,<2023-05-18 13:34:41.54 +0400>,<she>,<DPX200>,
      <Start of raw data processing
       efp BC_mod = 2 LB = 2 FT_mod = 6 PKNL = 1 PHC0 = -371.5889 PHC1 = 26.16414 SI = 32K 
       data hash MD5: 32K
       91 A0 B3 72 FE CB 54 6B 38 A0 B3 90 66 28 97 F3>)
(   3,<2023-05-18 13:34:44.59 +0400>,<she>,<DPX200>,
      <abs ABSG = 5 
       data hash MD5: 32K
       CA 16 D3 08 84 97 C5 94 35 B1 77 8E 1E EF 18 74>)
(   4,<2023-05-18 13:35:09.75 +0400>,<she>,<DPX200>,
      <pk PHC0 = -10.05672 PHC1 = 15.8 
       data hash MD5: 32K
       9A 75 42 B3 9D 38 41 3E 32 2A 3C 38 1A DB 23 58>)
(   5,<2023-05-18 13:35:13.35 +0400>,<she>,<DPX200>,
      <abs ABSG = 5 
       data hash MD5: 32K
       6F A9 4B 07 8D 47 C6 CF CC A6 E0 53 C9 D9 3A 61>)
(   6,<2023-05-18 13:35:41.76 +0400>,<she>,<DPX200>,
      <pk PHC0 = 10.18543 PHC1 = -17.2 
       data hash MD5: 32K
       08 91 FD 44 5C EF 9A 51 20 ED 1F BE 98 6D 9A 2D>)
(   7,<2023-05-18 13:35:45.21 +0400>,<she>,<DPX200>,
      <abs ABSG = 5 
       data hash MD5: 32K
       94 55 27 B3 00 11 60 5F 81 60 94 4B B9 2B 22 58>)
$$ ##END=
$$ 
$$ hash MD5
$$ 53 A6 76 AA B8 83 80 E2 D3 C0 FA D8 3E 16 4E 4D
##$RELAX= 
##$RELAX= 
##$RELAX= 
##$RELAX= 
##$RELAX= 
##$RELAX= 
##$RELAX= 
##$RELAX= 
$$ Bruker specific parameters
$$ --------------------------
##$DU= <F:/spectra>
##$EXPNO= 1
##$NAME= <c13>
##$PROCNO= 1
##$TYPE= <nmr>
##$USER= <she>
##$AMP= (0..31)
100 100 100 100 100 100 100 100 100 100 100 100 100 100 100 100 100 100 
100 100 100 100 100 100 100 100 100 100 100 100 100 100 
##$AQSEQ= 0
##$AQ_mod= 1
##$AUNM= <au_zg>
##$AUTOPOS= <>
##$BF1= 50.322709
##$BF2= 200.13
##$BF3= 50.322709
##$BF4= 500.13
##$BF5= 500.13
##$BF6= 500.13
##$BF7= 500.13
##$BF8= 500.13
##$BYTORDA= 1
##$CFDGTYP= 0
##$CFRGTYP= 5
##$CHEMSTR= <none>
$$ [...]
##$SUBNAM4= <"">
##$SUBNAM5= <"">
##$SUBNAM6= <"">
##$SUBNAM7= <"">
##$SUBNAM8= <"">
##$SUBNAM9= <"">
##$SW= 239.972175391363
##$SWIBOX= (0..15)
0 1 3 0 0 0 0 0 0 0 0 0 0 0 0 0 
##$SW_h= 12077.2946859903
##$TD= 32768
##$TD0= 1
##$TE= 0
##$TE2= 300
##$TE3= 300
##$TEG= 300
##$TL= (0..7)
120 120 120 120 120 120 120 120 
##$TP= (0..7)
150 150 150 150 150 150 150 150 
##$TP07= 0
##$TPNAME0= <>
##$TPNAME1= <>
##$TPNAME2= <>
##$TPNAME3= <>
##$TPNAME4= <>
##$TPNAME5= <>
##$TPNAME6= <>
##$TPNAME7= <>
##$TPOAL= (0..7)
0.5 0.5 0.5 0.5 0.5 0.5 0.5 0.5 
##$TPOFFS= (0..7)
0 0 0 0 0 0 0 0 
##$TUNHIN= 0
##$TUNHOUT= 0
##$TUNXOUT= 0
##$USERA1= <user>
##$USERA2= <user>
##$USERA3= <user>
##$USERA4= <user>
##$USERA5= <user>
##$V9= 5
##$VALIST= <valist>
##$VCLIST= <CCCCCCCCCCCCCCC>
##$VD= 0
##$VDLIST= <DDDDDDDDDDDDDDD>
##$VPLIST= <PPPPPPPPPPPPPPP>
##$VTLIST= <TTTTTTTTTTTTTTT>
##$WBST= 1024
##$WBSW= 4
##$XGAIN= (0..3)
0 0 0 0 
##$XL= 0
##$YL= 0
##$YMAX_a= 97130571
##$YMIN_a= -23287682
##$ZGOPTNS= <>
##$ZL1= 120
##$ZL2= 120
##$ZL3= 120
##$ZL4= 120
##$ABSF1= 222.624
##$ABSF2= -17.3728
##$ABSG= 5
##$ABSL= 3
##$ALPHA= 0
##$AQORDER= 0
##$ASSFAC= 0
##$ASSFACI= 0
##$ASSFACX= 0
##$ASSWID= 0
##$AUNMP= <proc_1d>
##$AZFE= 0.1
##$AZFW= 0.5
##$BCFW= 0
##$BC_mod= 2
##$BYTORDP= 0
##$COROFFS= 0
##$CY= -3
##$DATMOD= 1
##$DC= 0
##$DFILT= <>
##$DTYPP= 0
##$F1P= 0
##$F2P= 0
##$FCOR= 0.5
##$FTSIZE= 32768
##$FT_mod= 6
##$GAMMA= 0
##$GB= 0
##$INTBC= 1
##$INTSCL= 4.134877e-10
##$ISEN= 128
##$LB= 2
##$LEV0= 0
##$LPBIN= 0
##$MAXI= 10000
##$MC2= 0
##$MEAN= 0
##$ME_mod= 0
##$MI= 0.1934396
##$NCOEF= 0
##$NC_proc= 1
##$NLEV= 6
##$NOISF1= 120.0001
##$NOISF2= 80.00006
##$NSP= 0
##$NTH_PI= 0
##$NZP= 0
##$OFFSET= 222.624
##$PC= 1.4
##$PHC0= -371.4602
##$PHC1= 24.76414
##$PH_mod= 1
##$PKNL= yes
##$PPARMOD= 0
##$PSCAL= 0
##$PSIGN= 0
##$REVERSE= no
##$SF= 50.3227315983092
##$SI= 32768
##$SIGF1= 140
##$SIGF2= 120
##$SINO= 11.81781
##$SIOLD= 32768
##$SREGLST= <13C.CDCl3>
##$SSB= 0
##$STSI= 32768
##$STSR= 0
##$SW_p= 12077.2946859903
##$SYMM= 0
##$S_DEV= 0
##$TDeff= 32768
##$TDoff= 0
##$TI= <>
##$TILT= no
##$TM1= 0
##$TM2= 0
##$TOPLEV= 0
##$USERP1= <user>
##$USERP2= <user>
##$USERP3= <user>
##$USERP4= <user>
##$USERP5= <user>
##$WDW= 1
##$XDIM= 32768
##$YMAX_p= 442576760
##$YMIN_p= -3131032
$$ End of Bruker specific parameters
$$ ---------------------------------
##NTUPLES= NMR SPECTRUM
##VAR_NAME=  FREQUENCY,     SPECTRUM/REAL,   SPECTRUM/IMAG
##SYMBOL=    X,             R,               I
##VAR_TYPE=  INDEPENDENT,   DEPENDENT,       DEPENDENT
##VAR_FORM=  AFFN,          ASDF,            ASDF
##VAR_DIM=   32768,         32768,           32768
##UNITS=     HZ,            ARBITRARY UNITS, ARBITRARY UNITS
##FACTOR=    0.368581032318806, 1,           1
##FIRST=     11203.0474430531, 0,            0
##LAST=      -874.247242937185, 0,           0
##MIN=       -874.247242937185, -3131032,    0
##MAX=       11203.0474430531, 442576760,    0
$$ Real data points
##PAGE= N=1
##DATA TABLE= (X++(R..R)), XYDATA
$$ [...]
15725a271706q9788J83035L71441L24470J73329j5729j63407j92909j7927K33203
15715d65988L10488K31399J04299m3513j27985r4635J7400J26393J33209P4523
15705B65590k4538p0831p300R9974J27923J3707j02425j34378j34765p8684k2007
15694f7734o1442q9188L5811K42485K35299L8019j8128J44115K36801K2083l36708
15683C81413m95572m13382k93181k10645j35261J795J18290J06628K2993q3470
15673a000392j24969m6998J20775K46699J66565L208j23242k25182j57527R0834
15663a050229L78457N39217M78993K70917l85k15930k16742m9137O0541P222j09708
15652I3216k21488l24617k96300j37672L2533R9752m737j01179k4466K3758n6721
$$ y = [-1271706, -1361494, -1178459, -807018, -482548, -309219, -324948, -488355, -681264, -699191, -465988, -155500, 75899, 180198, 136685, 8700, -85935, -68535, 57858, 191067, 265590, 241052, 170221, 162921, 262895, 390818, 404525, 302100, 167722, 32957, -45727, -67734, -129176, -218364, -182553, 59932, 295231, 333250, 315122, 459237, 696038, 718121, 381413, -114159, -527541, -820722, -1031367, -1166628, -1164833, -1046543, -939915, -916922, -1000392, -1125361, -1172359, -1051584, -804885, -638320, -635112, -758354, -983536, -1141063, -1050229, -671772, -132555, 346438, 617355, 616970, 401040, 184298, 135161, 195702, 202924, 93216, -128272, -452889, -749189, -886861, -854328, -754576, -759313, -860492, -884958, -861200, -917921]
15641i17921k06807k97145j69796Q5615J63040J34179K12668K68175J74564M5345
15631e08083K314J32103L25158L58040K23173K6718q8343m0435J1305j3988o9480
15620C58482j02728j14835k08400l34096l32651k47163j79865j08187j7845j857
15610a289145p2355p1658R288K6734n1335p6223L4548J06636R4951R9960L7865
15599a150734m800J84220M57417N31384L03956j4126j64858q1100J38841L07634
15589E07834L89808L45321J65571k4724j44753j88232k24246l02975l81880l47152
15579b05428j29925J47279L14049L23192K18636J06937J7091l5357p1224p5715
15569F09535l3795o2918j25341j28871j01418o5956n1062k3639R9386K82704L43239
$$ y = [-917921, -1124728, -1421873, -1591669, -1506054, -1343014, -1208835, -996167, -727992, -553428, -508083, -505769, -373666, -48508, 309532, 532705, 559423, 471080, 430645, 441950, 427962, 358482, 255754, 140919, -67481, -401577, -734228, -981391, -1161256, -1269443, -1287288, -1289145, -1361500, -1433158, -1423870, -1397136, -1448471, -1524694, -1490146, -1383510, -1288559, -1188599, -1150734, -1155534, -971314, -513897, 17487, 321443, 307317, 142459, 61359, 200200, 507834, 897642, 1242963, 1408534, 1383810, 1239057, 1050825, 826579, 523604, 141724, -205428, -335353, -188074, 125975, 449167, 667803, 774740, 791831, 756474, 685250, 609535, 575740, 512822, 387481, 258610, 157192, 91236, 40174, 16535, 115921, 398625, 741864]
15558G41864J58901j45954l61104m21649l31560j56376j3517O9430P5693N0325
15548c33947R6190K01667J95810m055k20190k10719m6597L4553J02838K85197
15538A00747L45438J66091j5143l1797N9855J77268K54370K09401M9857q2837
15528A233250p9193m25n8893k47361l60224l29749k19366j11567l5211M9671J67596
15517H528J56250O4617J13899J55068Q3255P4806R3662P6819M8701M7356R3651
15506A016612Q2620N9518O3581l027j52108k67959l63243l83658j88934P4694
15496f1904K16553K14637J26601l0234j32354q3775M4951M4360j01057j44461
15486I3317m0048R3069J56691J70014J42846K2888j25859k12462k10639r3170
$$ y = [741864, 900765, 754811, 393707, -27942, -359502, -515878, -529395, -459965, -384272, -333947, -237757, -36090, 159720, 155665, -64525, -275244, -321841, -287288, -184450, 100747, 446185, 612276, 597133, 565336, 625191, 802459, 1056829, 1266230, 1316087, 1233250, 1154057, 1153632, 1094739, 847378, 487154, 157405, -61961, -173528, -208739, -159068, 8528, 164778, 229395, 343294, 498362, 581617, 656423, 750085, 826904, 875605, 922961, 1016612, 1099232, 1158750, 1222331, 1219304, 1067196, 799237, 435994, 52336, -136598, -61904, 154649, 369286, 495887, 465653, 333299, 249524, 294475, 338835, 237778, 93317, 53269, 146338, 303029, 473043, 615889, 638777, 512918, 300456, 89817, -3353]
15476c353O4903K08279K50657K38788K04748J13676l8093j55274j48691j20723
15466F14917j35919j77174k15042l02859m01078l42020j78653k7279J23636K35224
15456h06247K57894K19561J33252N3586J2405m5975j62323k65974k93237k84996
15446a182054j94343n2485Q0010J30680L2050o0701J7179J65426K06233Q1422
15436g76583n6606N78J21912K04479K93982K71381R3338n8646j03412j17971r1006
15425b18554O432P6575K9798j34829k72101k65992j69022n8206M7998R3337J23054
15414g41510J94919K90161L37678K32456L0605r3913j09755j57173k50351k31802
15404d98685p2881M8540O602j21184k46817l09483k29809m7051J64929L52632
$$ y = [-3353, 61550, 269829, 520486, 759274, 964022, 1077698, 1039605, 884331, 735640, 614917, 478998, 301824, 86782, -216077, -617155, -959175, -1137828, -1165107, -1041471, -806247, -548353, -328792, -195540, -141954, -129549, -175524, -337847, -603821, -897058, -1182054, -1376397, -1428882, -1348872, -1218192, -1186142, -1246843, -1229664, -1064238, -858005, -776583, -833189, -832611, -710699, -506220, -212238, 59143, 152481, 93835, -9577, -127548, -218554, -212122, -135547, -105749, -240578, -512679, -778671, -947693, -1005899, -957901, -864564, -741510, -546591, -256430, 81248, 313704, 344309, 250396, 140641, -16532, -266883, -498685, -571566, -523026, -516424, -637608, -884425, -1193908, -1423717, -1470768, -1305839, -953207]
15394i53207L99101J99094k05629n31629n37135l78489k40174m3630J97220L99150
15384a695328N68007O64127N58243L11248O2655k27749m25979l98785k33208n1045
15374h67814K4303L784q498k8778k7542M4608O3963N921r847m7335j67080k12031
15362a226346j22738L6683J70762K39482J97050P096j81708k09040p4412R9474
15352a063697J62739J11572J16096J71359K00667J29194p0287j89395j56797p3685
15342f62234l6970n9546j8295O8823O3641p487k7588R086R0544J98351L87130
15331E455N10158M07689J73058n4855j01113m6126q4238j44511j74895k09210
15321B81412j77529j25957j57220j80728j02725K2432J90421L69853M06632K45112
$$ y = [-953207, -554106, -355012, -560641, -1092270, -1629405, -2007894, -2248068, -2291698, -2094478, -1695328, -1127321, -463194, 95049, 406297, 468952, 241203, -184776, -583561, -816769, -867814, -843511, -839727, -848225, -877003, -904545, -859937, -795974, -790053, -799900, -847235, -1014315, -1226346, -1349084, -1312401, -1141639, -902157, -705107, -698011, -879719, -1088759, -1163171, -1063697, -900958, -789386, -673290, -501931, -301264, -172070, -242357, -431752, -588549, -662234, -699204, -758750, -777045, -708222, -644581, -652068, -679656, -670570, -580026, -381675, 5455, 515613, 923302, 1096360, 1041505, 940392, 894266, 810028, 665517, 490622, 281412, 103883, -22074, -179294, -360022, -462747, -440315, -249894, 119959, 526591, 771703]
15311G71703J0056k25116l51338l57783l55507m08678m04474k23288J5986J27045
15301a401394J95525L12192L93292M31568L70648K39752J57786N7594k4974K1066
15291G53055K9450j40153l85965n02450m12921k42286j40375o2848k4719l2025
15281a161237N6118J86239J34334j808J8994J51150K43133K50029J72587J11685
15271A61224J41436K48667L26505K26429J4634j28346k50635l74928l26341j84184
15261a45539j40595j00996R901J36099J68373J09769N2574M733k5410M7701J85856
15250C02466K40055J74466J11877J18444R5012N0685P493J9323j3331j19893j17256
15239H69341n9985r4134j48137j93434l25983m29925l49267p6896K02523K18560
$$ y = [771703, 781759, 556643, 205305, -152478, -507985, -916663, -1321137, -1544425, -1528439, -1401394, -1205869, -893677, -500385, -68817, 301831, 541583, 699369, 756963, 731989, 753055, 782505, 642352, 256387, -246063, -658984, -901270, -1041645, -1104493, -1129212, -1161237, -1105119, -918880, -784546, -786354, -767360, -616210, -373077, -123048, 49539, 161224, 302660, 551327, 877832, 1104261, 1118895, 990549, 739914, 364986, 38645, -145539, -286134, -387130, -377229, -241130, -72757, 37012, 89586, 94319, 68909, 116610, 302466, 542521, 716987, 828864, 947308, 1042320, 1093005, 1100498, 1119821, 1106490, 986597, 869341, 809356, 715222, 567085, 373651, 47668, -382257, -731524, -808420, -605897, -387337]
15229c87337N6779j7770j8290l9932j14847k12562j55716k16J8035l3822r9001
15218a004679j78809k04712k03957k32856k50773k14655j09387K0460Q4287O4515
15208b230566J17986K94274L33632J75809J44417K70738K41187O6216J6183P3779
15198d96345J05430J25378J43428J68745K46212K53555Q8082j54802k93141k26088
15188c9546q7359J6698M8842J9960l6242n4651j909L9335m794j06800j34651j0288
15176c51405J06814L8753j69259k68661k38213k28117k77916l46511k79363j39143
15166b153021q7379l8530J33429K82642L17609K55113J51247O0963j4436m3920
15156a136283n7327j07433j18566J4378K24490K94010J90564P0074k7263j27793
$$ y = [-387337, -330558, -348328, -366618, -406550, -521397, -733959, -889675, -889891, -871856, -905678, -1004679, -1183488, -1388200, -1592157, -1825013, -2075786, -2290441, -2399828, -2379368, -2295081, -2230566, -2112580, -1818306, -1484674, -1308865, -1164448, -893710, -652523, -586307, -570124, -496345, -390915, -265537, -122109, 46636, 292848, 546403, 634485, 479683, 186542, -39546, -126905, -110207, -61365, -41405, -77647, -132298, -134207, -94872, -99666, -206466, -341117, -351405, -244591, -205838, -375097, -643758, -881971, -1110088, -1388004, -1734515, -2013878, -2153021, -2240400, -2278930, -2145501, -1862859, -1545250, -1290137, -1138890, -1077927, -1092363, -1136283, -1193610, -1301043, -1419609, -1405231, -1180741, -886731, -696167, -626093, -653356, -781149]
15146g81149k08398k01822q1588K7734R4313K05487K09098K7768q6214o4142l2285
15135h91198k3486K3110O4855N0826J8553m9258j35666k45835l22880k69306j20394
15124a900679J0675J72159L61162M48213M12851K79739P8148j17808k81690m07688
15114i44918m74754m35223k70227O031K29359J93738J39758K68504L35960J34510
15104h17262j01037j59525j70415j47100K7627J69705J32800K5631r4057j62371
15094a296004j01493m1525j03918j15009L3764J49344K15313L26195L79653L33577
15084b20103K43307O3792j05964j03215l8753r381M277L2704M2307j4998j13593
15073b19620j76039j69576m3050R5423N3718k9459L3564J08489R8249M7086l2989
$$ y = [-781149, -989547, -1191369, -1272957, -1245223, -1150910, -945423, -736325, -708557, -794771, -858913, -891198, -914684, -891574, -826719, -775893, -757340, -806598, -942264, -1188099, -1510979, -1780285, -1900679, -1890004, -1717845, -1356683, -908470, -495619, -215880, -137732, -255540, -537230, -944918, -1419672, -1854895, -2125122, -2119091, -1889732, -1695994, -1556236, -1287732, -951772, -817262, -918299, -1077824, -1248239, -1395339, -1367712, -1198007, -1065207, -1039576, -1133633, -1296004, -1397497, -1439022, -1542940, -1657949, -1624185, -1474841, -1259528, -933333, -553680, -220103, 23204, 86996, -18968, -122183, -160936, -170317, -166040, -133336, -91029, -106027, -219620, -395659, -565235, -608285, -512862, -459144, -488603, -455039, -346550, -248301, -201215, -234204]
15062b34204j01868j37245j46315j20041n8482L5942O6651J1598J9978R7434J16019
15051d50533M034j78860l02390k86209j45385L6836J98349K42112J37559N0254
15041f94233P2134M4020j13822j03067J37315K45926J74586J08717P9033P7236
15031B7845R9459R7264N8835k8290k13786l26163k39526o2513k2957r1015m849
15020g05696K05826K58033N5598j67750k15279j22596l313N7236P8203R5478J10618
15009c53642J47446J41273N651j65290j61090r9676j44846j55380n1556L182k7353
14998h61281n3074n523R6961K49029L79812M41039L93521K13474K0555j41782
14988G32731k64501l19374k63812j56257p183J76604K82364L32591L05163J42815
$$ y = [-234204, -336072, -473317, -619632, -739673, -798155, -762213, -695562, -683964, -663986, -566552, -450533, -446499, -625359, -927749, -1213958, -1359343, -1322507, -1124158, -882046, -744487, -694233, -622099, -578079, -691901, -794968, -657653, -411727, -237141, -128424, -49391, 27845, 127304, 224568, 283403, 255113, 41327, -284836, -524362, -586875, -609832, -700847, -705696, -499870, -241837, -186239, -353989, -569268, -691864, -695177, -637941, -559738, -464260, -353642, -206196, -64923, -59272, -224562, -385652, -485328, -630174, -785554, -837110, -833928, -861281, -914355, -919878, -822917, -573888, -194076, 246963, 640484, 853958, 874513, 732731, 468230, 148856, -114956, -271213, -278396, -101792, 180572, 513163, 818326, 961141]
14978I61141j03482l28324m29703l22121p6051J74960L59227L93156L55330K74115
14968A258248Q9940q4460j94218k42079j88396q8694p8371j40827j88335k05438
14958f2630j54776n756J14387K09292L50376L84376K60550Q6633p5370j18765
14948I88317j27071k67641l94456l27730j46523j14428l03213l75498j87067J01416
14938a153894K47913K10171J45909J88143K41379K09124Q7116m4289r1646j57355
14928a17429k40969k64718k74291k92197k68103j52015J4643J13320P8479n7607
14918a460887j07300l2109P1816R2261Q789k3845N2896J45491J56775J21675J50965
14907h23473K49379K75207K67096K67978J48906Q183L336Q7163L6956j81721l30255
$$ y = [961141, 857659, 529335, 99632, -222489, -298540, -123580, 235647, 628803, 984133, 1258248, 1348188, 1263728, 1069510, 827431, 639035, 550341, 471970, 331143, 142808, -62630, -217406, -223162, -108775, 100517, 450893, 835269, 1095819, 1182452, 1107082, 988317, 861246, 593605, 199149, -128581, -275104, -389532, -692745, -1068243, -1255310, -1153894, -905981, -695810, -549901, -361758, -120379, 88745, 175861, 131572, 39926, -117429, -358398, -623116, -897407, -1189604, -1457707, -1609722, -1595079, -1481759, -1403280, -1460887, -1568187, -1600296, -1528480, -1436219, -1427430, -1451275, -1398379, -1252888, -1096113, -974438, -823473, -574094, -298887, -31791, 236187, 385093, 393276, 396612, 483775, 520731, 339010, 8755]
14896H755l92151m11302k69530L6673K47884J33805j32216k56169k07443p6674
14886a318368N8612P4137k0665p5625n1939j4703J3858R7290K46216L49141K74425
14875c67621L5454j38970j44190r1798n9678l6276j0619j37271l52697l32572
14865a636238o1824K30038L58445L39682K66867K17779K23455K25063J70863P5210
14855D09340k6086K2197K17332K77514P2655k29424l85093m11116m10534k87959
14845g51174p6543O1511J00680J76213L10729L53406J75966r2312k40821k68526
14835b50871k75324k07847r4158l6076j0249R442m9760j11358p5319l1346J5637
14824a117229P3787J0780j38324j00332J45783L52574L48205K96074L78476M68992
$$ y = [8755, -383396, -794698, -1064228, -1027555, -779671, -645866, -778082, -1034251, -1241694, -1318368, -1259756, -1185619, -1206284, -1281909, -1333848, -1348551, -1334693, -1237403, -991187, -642046, -367621, -332167, -471137, -615327, -707125, -766803, -803079, -813698, -950969, -1303666, -1636238, -1698062, -1468024, -1109579, -769897, -503030, -285251, -61796, 163267, 334130, 409340, 383254, 405451, 622783, 900297, 972952, 743528, 358435, -52681, -463215, -751174, -827717, -766206, -665526, -489313, -178584, 174822, 350788, 258476, 17655, -250871, -526195, -734042, -828200, -864276, -874525, -865083, -914843, -1026201, -1101520, -1132866, -1117229, -1043442, -1032662, -1170986, -1271318, -1125535, -772961, -424756, -128682, 249794, 718786]
14814G18786L09893j24106m64863m22803k08478l3598J65403K41174O5546j34713
14804A12241k50345k82861j26678O8485P2254n9521j07451J5664J62618K69238
14794a26356M22219N34064M44702K40121J1847k42307l93863l21995j43955k1866
14784D02611k3091j84681k68970j89091q6202o9842j51686j58655p5610M70P7174
14773g27573J74325J87332P0370p3834j70977j58391q4148l2296l2872j07031
14763i55095j20760L7446J87530K38828J93339M9870l1804N6265J50968J34945
14753e8468P0058O8794R0349M2875j10875k91149l85294m02918l23204r1148J76532
14742a214448L03539K39454r357k27977k96173k86959k99825k93466k04734j34804
$$ y = [718786, 1028679, 904573, 439710, 16907, -191571, -225169, -59766, 181408, 246954, 112241, -138104, -420965, -547643, -479158, -406904, -466425, -573876, -558212, -395594, -126356, 295863, 829927, 1274629, 1514750, 1526597, 1284290, 890427, 568432, 424477, 402611, 379520, 194839, -74131, -263222, -349424, -419266, -570952, -729607, -805217, -804747, -727573, -553248, -365916, -295546, -369380, -540357, -698748, -782896, -815192, -848064, -955095, -1075855, -1038409, -850879, -612051, -418712, -368842, -400646, -344381, -193413, -58468, 11590, 80384, 170733, 213608, 102733, -188416, -573710, -976628, -1299832, -1390980, -1214448, -910909, -671455, -680812, -908789, -1204962, -1491921, -1791746, -2085212, -2289946, -2424750]
14732b424750r1360m7472J4011J05773K21536K77179K53145K83570M08920N12013
14722d87435M22192K59996J69106J62032K84233L89448L27132K06101J33132J7461
14712A883398j92934l03296j77099j7264n3089j28263j25226j88350k73290k50417
14702A74170j15715J7812M1987l0619q8747r0428r2851j1535J44559J74601N8759
14691A81993q5709j24881j5632J70105K45294J47804k8824k22482k59527m9395
14681d1254J95090K62179J25033m9692o1584m5006j05456q6153L5134J14344L0925
14670C73560j06509j05576P076J00071J20704K4958j62407k82638k31559j04240
14660c66560L1946J86477K33728J58861M7175q0467j66017j53637j25889r8945
$$ y = [-2424750, -2516110, -2563582, -2549571, -2443798, -2222262, -1945083, -1691938, -1408368, -999448, -487435, -65243, 194753, 363859, 525891, 810124, 1199572, 1526704, 1732805, 1865937, 1883398, 1690464, 1387168, 1210069, 1192805, 1139716, 1011453, 886227, 697877, 424587, 174170, 58455, 76267, 118254, 87635, -1112, -91540, -184391, -195926, -51367, 123234, 181993, 96284, -28597, -44229, 125876, 371170, 518974, 490150, 267668, 8141, -41254, 153836, 416015, 541048, 491356, 429772, 384766, 279310, 193157, 228291, 342635, 373560, 267051, 161475, 168551, 268622, 389326, 414284, 251877, -30761, -262320, -366560, -334614, -148137, 85591, 244452, 291627, 211160, 45143, -108494, -234383, -333328]
14650c33328o5335m9362R197O9881J07550J91672L03997M22818N05178L86517
14640A548785J3652l01733l37861k65785j94282j23373j29205k04158k63233k22686
14630d79879p8959R2359J34577M5506j00516k08582j59021L3621J80186J30357
14620d10351N571l6764P1491K36877L23561K46772p0364l75570m02905j80555
14610e92237Q9344J73503J00997O4392R8337J20337O7916J1428m149m6651j25742
14599d2525j64592j76241j19517K1799J3298r2382n9505Q7906J92028J55628N5466
14588a28637r246l6586n4267j23554j40375k7186J52034K63889K07469P6749j6037
14577A64253m3635o7607j47750k39523l14015l53013l33843k33715o0111P8949
$$ y = [-333328, -398663, -448025, -438828, -368947, -261397, -69725, 234272, 657090, 1162268, 1548785, 1562437, 1260704, 922843, 657058, 462776, 339403, 210198, 6040, -257193, -479879, -558838, -466479, -331902, -286396, -386912, -595494, -754515, -720894, -540708, -410351, -404780, -441544, -370053, -133176, 190385, 437157, 366793, -8777, -411682, -592237, -502893, -329390, -228393, -164001, -65664, 54673, 122589, 134017, 129868, 83217, -42525, -207117, -383358, -502875, -481076, -467778, -560160, -619665, -531759, -339731, -184103, -128637, -137883, -174469, -228736, -352290, -492665, -519851, -367817, -103928, 103541, 180290, 164253, 120618, 53011, -94739, -334262, -648277, -1001290, -1335133, -1568848, -1628959, -1550010]
14567a550010J27073J06359Q4075J03915J02356O6664R8148J93935L16350L58054
14557F919K58027K10643K12983R7903q7098j89223j42213P943J12641M9423r0128
14546D47820j59883j75404k21119k25557j13524P0101J52453P9566L3915M0742
14536g0890N4203M7202J2655L2754J24479J56695Q1784l7669j67289k15151j10712
14525i1939J3032P8686P3239o434j5408P923j07531l14843m47375m24637k02837
14514a438124J25646L25735L94313M32735M08846K66683M7700q9891p7631j4993
14504C81019m3737o7718j0759L1794J14158J37698n5021k88534m26820m23750
14494f51670k17890M3359J93621K35038K20761J35649k4751j81866k28993j83237
$$ y = [-1550010, -1422937, -1316578, -1232503, -1128588, -1026232, -959568, -861420, -667485, -351135, 6919, 264946, 475589, 688572, 786475, 699377, 510154, 367941, 375884, 488525, 537948, 447820, 287937, 112533, -108586, -334143, -447667, -377566, -225113, -145547, -111632, -70890, -16687, 30515, 43170, 75924, 200403, 357098, 438882, 401213, 233924, 18773, -91939, -78907, -221, 73018, 66584, 51176, 59099, -48432, -363275, -810650, -1235287, -1438124, -1312478, -986743, -592430, -159695, 249151, 515834, 563534, 473643, 396012, 381019, 337282, 269564, 258805, 290599, 404757, 542455, 487434, 198900, -227920, -651670, -869560, -826201, -632580, -397542, -176781, -41132, -65883, -247749, -476742, -659979]
14484f59979q6661J6619M2052L3209O1517J20444K14650K95989L15622K51557
14474F05019J26584R0679N4981j27046k87938k98991k69041k61854k11948j46461
14464g26016j67170j36310M736J54165K55865L08953K72814J52456J02034P7594
14454B99121N8747N6782q9892l33627m15834k30711L9120P5650q4515j85782j94813
14443a005754j56215p9499Q986J43229K80085L19050L24206L13917J65102n8698
14433B54409j36301q8646k4396j6766J9527J32636J92007J28625J6699L1083J27713
14422F36590J85670J22150k0764p7656j13297k64187m56769n28520m46922k79894
14412a243599j10883M5458J75225J74524J09886M2608j172Q648L6220P1942J56648
$$ y = [-659979, -746640, -730021, -687969, -654760, -593243, -472799, -258149, 37840, 353462, 605019, 731603, 822282, 877263, 750217, 462279, 163288, -105753, -367607, -579555, -726016, -893186, -1029496, -1024760, -870595, -614730, -305777, -32963, 119493, 221527, 299121, 357868, 414650, 324758, -8869, -424703, -655414, -616294, -540644, -625159, -810941, -1005754, -1161969, -1241468, -1232482, -1089253, -809168, -490118, -165912, 148005, 313107, 254409, 118108, 29462, 5066, -11700, 7827, 140463, 332470, 461095, 477794, 508877, 636590, 822260, 944410, 923646, 845990, 732693, 468506, 11737, -516783, -963705, -1243599, -1354482, -1309024, -1133799, -959275, -849389, -806781, -807953, -799305, -763085, -691143, -534495]
14401e34495K78375L20540J78285o7296k46442l18229k74681j56062j0913J47089
14391f83829K25871J80109J13138J59725K84610L66494L33939K23142M8776j53242
14381A098733l12683l22869j74008p9763r9030k13465l20024k44757o6967M981
14371g29852k186J0352O135l5790r3291j73802j73914j9939J40031K00565K36869
14360f34822L33768L85468K89131J82765J41505K4024j45663j88611p339K60572
14350F40798L30177K40600J53702R6696k7602j77056k22747k09385k30379j83426
14340D11378m9325l2973j05101j61585j26372N2075J68101Q8591p1772r5399l6818
14329D0800k7251p3933j37772r0067L3511J1846j23275j55520j23968p1436O038
$$ y = [-534495, -256120, 64420, 242705, 175409, -71033, -389262, -663943, -820005, -830918, -683829, -457958, -277849, -164711, -4986, 279624, 646118, 980057, 1203199, 1251975, 1098733, 786050, 463181, 289173, 209410, 110380, -103085, -423109, -667866, -734833, -729852, -732038, -721686, -715551, -751341, -844632, -1018434, -1192348, -1212287, -1072256, -871691, -634822, -301054, 84414, 373545, 556310, 697815, 721839, 576176, 387565, 380226, 640798, 970975, 1211575, 1365277, 1461973, 1434371, 1257315, 1034568, 825183, 594804, 411378, 362053, 329080, 223979, 62394, -63978, -11903, 156198, 244789, 173017, 77618, 40800, 13549, -60384, -198156, -288223, -254712, -242866, -366141, -521661, -645629, -717065, -711027]
14318g11027N6957Q1538J32260J39538L4031r1463j15737n4494m7519r1005j03581
14307g70502n7156N6978J31297J14251L415l7899K8655P9910P7678l341j56359
14296e33073k84711k37521q7382j6745N1212J24092Q5435n5101j91889k43234
14286a388917j42657Q1203K42811K58734K42798L31084K78707k7477k66479l37371
14276g27564l44934l64350l90080l54590k49443j30206j7933P3020J99570L53000
14266a953510L95960L60689L19542J88309N3391L3374O9827J18307J36487J07687
14256a69937J8837p1810r0905m3710M4894J12171R2311j4241j78972k42823n9602
14245f03787J43661J66165Q5311l2993j21256m7975J07247J59945R9276o197j56129
$$ y = [-711027, -654070, -572532, -440272, -300734, -266703, -358166, -473903, -528397, -575916, -666921, -770502, -827658, -770680, -639383, -525132, -521717, -559616, -530961, -451051, -373373, -376714, -533073, -817784, -1055305, -1142687, -1159432, -1108220, -984128, -898693, -953794, -1145683, -1388917, -1531574, -1450371, -1207560, -948826, -706028, -374944, -96237, -123714, -390193, -727564, -1072498, -1436848, -1826928, -2181518, -2430961, -2561167, -2579100, -2506080, -2306510, -1953510, -1557550, -1196861, -877319, -689010, -635619, -602245, -532418, -414111, -277624, -169937, -151100, -222910, -313815, -357525, -312631, -200460, -108149, -122390, -301362, -544185, -603787, -460126, -293961, -208650, -241643, -362899, -410874, -303627, -143682, -44406, -50603, -206732]
14234b06732k97655k36072K1298L53014N53183N06798K49313o1640k35846k74253
14224C71408j55090P5007K30587K27449J74791J03896K4883N4477R3496j6518
14214A184386j79667j99905j28230q7221j43720k74775k95102j43814R7212K83780
14204A12944L26858L51863L73024K90654J43079k3075k07109l62959m45497n40750
14194A9032n01357k05695J28327J91784K913j13755L8057K73207K76954J32183
14184B41650P0261Q9415N6108Q505M6953J51808J90111K171k52438k87331r7923
14173B19290R0540J59337P5638j4910N4775Q4285j60874m90059o39949n76976
14163a198903k85350L9653K13339K69425K62635K04035R8755o9280j67272j00422
$$ y = [-206732, -504387, -740459, -719161, -366147, 187036, 693834, 943147, 881507, 645661, 371408, 216318, 291325, 521912, 749361, 924152, 1028048, 1052931, 1107408, 1200904, 1184386, 1004719, 804814, 676584, 589363, 445643, 170868, -124234, -268048, -170836, 112944, 439802, 791665, 1164689, 1455343, 1598422, 1575347, 1368238, 1005279, 559782, 19032, -482325, -688020, -559693, -367909, -364996, -478751, -440694, -167487, 109467, 241650, 311911, 401326, 457434, 465939, 512892, 664700, 854811, 856982, 604544, 317213, 219290, 309830, 469167, 544805, 529895, 584670, 668955, 508081, 18022, -621927, -1198903, -1484253, -1444600, -1231261, -961836, -699201, -495166, -396411, -465691, -632963, -733385]
14153g33385R9670L22538M00742K75105N8514o1420n3010n4929p0990m7705k023
14142A33107J0511k9304q6789r0896j0288J02033J96920J92722Q4014j3495p753
14131D80782J1794j16418l00818l85079l53242k10152K4189K44530L19791L22030
14121C7407K30342l7493l27317m65478m43143l05551j06321R3436K66583M05449
14111f52086M34227L38894K36149J94026K46674L01142R5318k68166m49434m20016
14101E6728k75208j07011n2971m6080Q2208K34495K32698J31392j4353j38280
14091A03618j67682k18023k56145j38629J9277J31383K07034K02449J45542K5109
14081E3933j46429k90874l91722m05660j93335K06172N62512O35982L72825J074
$$ y = [-733385, -633715, -311177, 89565, 364670, 423184, 361764, 308754, 253825, 182835, 135130, 133107, 143618, 114314, 27525, -63371, -73659, 28374, 225294, 418016, 502030, 488535, 480782, 492576, 376158, 75340, -309739, -662981, -873133, -848944, -604414, -284623, 37407, 267749, 230256, -97061, -562539, -1005682, -1311233, -1417554, -1324118, -1057535, -652086, -217859, 121035, 357184, 551210, 797884, 1099026, 1194344, 926178, 476744, 56728, -218480, -325491, -378462, -424542, -342334, -107839, 124859, 256251, 241898, 103618, -64064, -282087, -538232, -676861, -657584, -526201, -319167, -116718, 28824, 53933, -92496, -383370, -775092, -1180752, -1374087, -1167915, -605403, 30579, 403404, 404478]
14071D04478k66110l01743j30776K8512J40779J57088L1165k6342L4625R6531
14061A68207M4907j16630k58065l25892j85916J38376L44347L35459K22238R9394
14051D66425j3755r9911j62088j50568n6436M3395P7998M8023M9929M4555K9404
14040B76971J1861j08177k34899k05755j03742m3476n9324j21988j37827l8067
14030g64423J55392L03340L08971K30251J37717J12381J66342K57967K72207J39609
14020A319754n4759k16606k60265j87290j42570k54119l55119k15654O6208K35344
14010f5076K86994K67289K05505J24963P2742P2543J220j37210k31126k12806
14000C85038j32945k958R3316m133j53609q4486J50403L41689M60712N22677M42521
$$ y = [404478, 138368, -163375, -294151, -265639, -124860, 32228, 63393, 37051, 71676, 168207, 213114, 96484, -161581, -487473, -673389, -535013, -190666, 144793, 367031, 466425, 452670, 352759, 190671, 40103, -16333, 27062, 105060, 153083, 203012, 247567, 276971, 288832, 180655, -54244, -259999, -363741, -407217, -466541, -588529, -726356, -764423, -609031, -305691, 3280, 233531, 371248, 483629, 649971, 907938, 1180145, 1319754, 1264995, 1048389, 788124, 600834, 458264, 204145, -150974, -366628, -300420, -65076, 221918, 489207, 694712, 819675, 892417, 964960, 966180, 828970, 597844, 385038, 252093, 249135, 342451, 338318, 184709, 100223, 250626, 592315, 1053027, 1575704, 2018225]
13989B018225K34644P6308P6390J05146J24574K12878L15986K76900K5519k36457
13979C230113l36316m08964n18634n87949m43770q5244J27490P6797p2862j25029
13969H55632k0824Q6539l855k56716m15408l35017j22826R7329J08807p3435k21998
13958c01772j97260j850J02955L6478n3348p9613L7682J69982J63447J33049J45304
13947A55054J65383R2616L5585R1491R2718m5135j92410j79671q8705j8299J18006
13936B26633J71879j1431k10850k29672m6392K17708L24846K00096N3960P9632
13926G76409J53159J21194J383j03712k14551k08493l5569r955j64364k30145
13916H5356j62173o5766L267j0064n5836l9709L2963Q9694K04120L87402M60069
$$ y = [2018225, 2252869, 2329177, 2405567, 2510713, 2635287, 2848165, 3164151, 3441051, 3466570, 3230113, 2893797, 2484833, 1966199, 1378250, 934480, 849236, 976726, 1053523, 980661, 855632, 834808, 921347, 917492, 660776, 245368, -89649, -212475, -115146, -6339, -79774, -301772, -499032, -500882, -397927, -361449, -414797, -494410, -456728, -286746, -123299, 9750, 155054, 320437, 413053, 448638, 540129, 632847, 587712, 395302, 215631, 126926, 108627, 226633, 398512, 387081, 176231, -53441, -99833, 117875, 442721, 642817, 696777, 776409, 929568, 1050762, 1052145, 948433, 733882, 525389, 489820, 479865, 315501, 85356, -76817, -142583, -139316, -149380, -205216, -244925, -211962, -122268, 81852, 469254, 929323]
13905I29323L15117R4894j29727k86702k58471j95381j65352l7307k4183j52616
13895H9595j47139k5352L8457P4938O8031p062k8101K1282M8101o8093k40142
13884a75485j97472L8855J97698J58810K1393l7915q9302j81642j06297R8621
13874b72736J58486J05022N5594O9289J64591K22330P6986o6632j0277Q3681L3978
13863F20312j26825k46489k31385j47128j2275J93198L21325L01825K16542J46768
13853A035868Q5233K0974k6443p9484j45735j27754l6315n753r9131k26952k67512
13842A26996j92301o3375J13708L46998N23940N57146M08113J02229j76507k92694
13832A454253k73937k68961l17499k95777k39585k45477k52193k35578j63465
$$ y = [929323, 1244440, 1339334, 1209607, 922905, 664434, 469053, 303701, 266394, 242211, 89595, -57544, -82896, -44439, 30499, 98530, 91468, 63367, 84649, 132750, 64657, -175485, -372957, -334102, -136404, 22406, 43799, 5884, -83418, -265060, -371357, -272736, -114250, -9228, 46366, 115655, 280246, 502576, 579562, 512930, 502653, 586334, 620312, 493487, 246998, 15613, -131515, -143790, 49408, 370733, 672558, 889100, 1035868, 1121101, 1142075, 1115632, 1036148, 890413, 762659, 726344, 720591, 621460, 394508, 126996, -65305, -128680, -14972, 332026, 855966, 1413112, 1821225, 1923454, 1746947, 1454253, 1180316, 911355, 593856, 298079, 58494, -186983, -439176, -674754, -838219]
13823h38219l2879K5577J02928K06059J34277n418k8479Q9911K37294K64719K16703
13812C72473J88243J84399K15790K05046N5805j46235j93099l694J66162J09605
13802A154495p4786k33205l39142l93013l47084k17785j30145j25897q5376Q1727
13792g10211K57756K93702K89324L49335K92600o727k69088k99979k12887q1199
13782i7374K5980Q1694O7993n881j13942j85152r5658N2322K1733j67535k56511
13771f72331j62371o7640r1998j39825j32230m7760J48259L39280L39368K19269
13761b67979M2095j06792j40408k09095k86306k20466n1588O1623P7214P0374
13751a031328J53105K93535L49054L49698K46664L7379j27834k53901l78891l75103
$$ y = [-838219, -871098, -845521, -742593, -536534, -402257, -407675, -436154, -346243, -108949, 155770, 372473, 560716, 745115, 960905, 1165951, 1221756, 1075521, 882422, 878728, 1044890, 1154495, 1079709, 846504, 507362, 114349, -232735, -450520, -580665, -706562, -791938, -710211, -452455, -158753, 130571, 479906, 772506, 765779, 496691, 196712, -16175, -97374, -71394, 10300, 78293, 72412, -41530, -226682, -322340, -270018, -248285, -415820, -672331, -834702, -902342, -994340, -1134165, -1266395, -1314155, -1165896, -826616, -487248, -267979, -225884, -332676, -473084, -682179, -968485, -1188951, -1240539, -1178916, -1101702, -1031328, -878223, -584688, -235634, 114064, 360728, 398107, 270273, 16372, -362519, -737622]
13741g37622j87070Q7474K62924J83951j4260l9243J04449K71547L09835J84599
13731D26584L7064p1922j22924j09521o9235m4161o6326j79133l03753k66948
13721g70275l4929K34435L37137K76165K28355L00812L51206K61295R9193j05174
13711A178220k45593j86935L8213K35850K61772J31279m537m0816m8982j24286
13701A194185k72282m00533l84281k24208m3966j3211j22912j74813j03327k8889
13691e74237J17987K79559K60893J00273J4491Q9679J62277J16435Q1931Q8854
13681G38142L7535j3787K8648J7336j27168l06250l65642k37111j01502q5411
13671d15210r6084n5712K4402Q3420R5400J86146K76122K30242J31977L3641o9787
$$ y = [-737622, -924692, -837218, -574294, -390343, -404603, -443846, -339397, -67850, 241985, 426584, 463648, 391726, 268802, 159281, 90046, 45885, -20441, -199574, -503327, -770275, -805204, -570769, -233632, 42533, 270888, 571700, 922906, 1184201, 1283394, 1178220, 932627, 745692, 783905, 1019755, 1281527, 1412806, 1408269, 1367453, 1318471, 1194185, 921903, 521370, 137089, -87119, -131085, -144296, -267208, -442021, -545348, -574237, -456250, -176691, 84202, 184475, 198966, 288645, 450922, 567357, 649288, 738142, 775677, 761890, 790538, 807874, 680706, 374456, 8814, -228297, -329799, -415210, -511294, -567006, -542604, -459184, -363784, -177638, 98484, 328726, 460703, 494344, 424557]
13660D24557j21456j24705j40640j60839j56105j53827j85460k47073k66911k14579
13650a347038p3596J25150K09499J92752J97782K06493K08631K20750J94276R4677
13640B29376k5626j23434j46809l8490O5375J6236o4173k8671M6979P1350M4223
13629D6336j4503M236J25953K59780K79042J70521L3673j45409k32465j14866
13619D12298O3151J64929J28666M5340J5870Q529n126L2605Q8273J28366J40174
13608A223075N4748p2000k14608l51965l39041j47698J4205N6229N2003R1449
13598C66397J56635J29391L0253l0239k0035o8967j88576k06505o5041M0331m3215
13587A00429j49681j29700j06873j52859j14146l917O7673l106j79510k16246
$$ y = [424557, 303101, 178396, 37756, -123083, -279188, -433015, -618475, -865548, -1132459, -1347038, -1420634, -1295484, -1085985, -893233, -695451, -488958, -280327, -59577, 134699, 229376, 203750, 80316, -66493, -104983, -39608, -23372, -87545, -116216, -69237, 2113, 46336, 31833, 36069, 162022, 421802, 700844, 871365, 905038, 759629, 527164, 412298, 475449, 640378, 769044, 814384, 830254, 838783, 833657, 866262, 954535, 1082901, 1223075, 1277823, 1205823, 991215, 639250, 300209, 152511, 166716, 222945, 274948, 366397, 523032, 652423, 682676, 652437, 632402, 563435, 374859, 168354, 103313, 143644, 100429, -49252, -178952, -285825, -438684, -552830, -556747, -489074, -492180, -671690, -887936]
13577h87936o3835J03826K35152L04773K26277J50805J09008J8204p2641q2817
13567D0816k9531k6584k7333j6578p2558j31956j35102r5866k5837K2453K2900
13556d75176L9034L0353k504o2636j11003j04928m9467Q6630K12069K32806J29716
13545g5106m2077p4146P5652K16304K10367J08386n766j17438j76746j25501l7252
13534d3323J271j1663l7646n793M6246o1616k09798k57027k08621j51091q0125
13523a019186M9882J54873K58193L32441K31492O7144p5587k05783j89140K8219
13513c67452L07669M26174L20705J27501J7022n1653j31211j55809l6141J27266
13503E84071J17777p561r8685j69312j95843j28596n3784L9610L02789O02911
$$ y = [-887936, -951771, -847945, -612793, -308020, -81743, 69062, 178070, 196274, 123633, 40816, 11285, -15299, -42632, -59210, -131768, -263724, -398826, -494692, -520529, -498076, -475176, -436142, -405789, -408293, -470929, -581932, -686860, -736327, -649697, -437628, -204822, -75106, -117183, -191329, -115677, 100627, 310994, 419380, 413614, 296176, 119430, -6071, -43323, -42052, -53715, -91361, -97154, -50908, -112524, -322322, -579349, -787970, -939061, -1019186, -969304, -814431, -556238, -223797, 7695, 74839, -748, -206531, -395671, -367452, -59783, 366391, 687096, 814597, 831619, 779966, 648755, 492946, 456805, 584071, 701848, 694287, 595602, 426290, 230447, 101851, 48067, 87677, 390466, 993377]
13493I93377N69789K14941p4630j30714j08358j34634j75928j40597p0088r7545
13483H45613n1292J47486K57122J80456J5818r3148n9444l2569r5577j13371j22806
13472H78288j21127r9505q9305n1222J2106O662n4821P685K28237M29906L77590
13461A524494J59292j3999k44661m79567n09457l95748k02436P296J66310K48850
13451B60374K00919Q6187K8137O992O0709K25494L73135L67868K12729J124j72264
13440A651404j63727l6539n1267j50317j74850j85297k67678l49823l12241k22992
13430b63327k01083k02862k39345k58596j70813j16832j38271j16840J0215K03954
13420a493800L58819L38560J77710J25943J76561P8302j30655k12408o5275K49657
$$ y = [993377, 1563166, 1778107, 1703477, 1572763, 1464405, 1329771, 1153843, 1013246, 943158, 845613, 794321, 941807, 1198929, 1379385, 1395203, 1302055, 1242611, 1210042, 1114465, 1001094, 878288, 757161, 657656, 568351, 517129, 529235, 535897, 481076, 488761, 716998, 1146904, 1524494, 1683786, 1669787, 1425126, 945559, 436102, 40354, -162082, -154786, 11524, 260374, 461293, 547480, 575617, 582609, 643318, 868812, 1241947, 1609815, 1822544, 1823668, 1651404, 1487677, 1451138, 1399871, 1249554, 1074704, 889407, 621729, 271906, -40335, -263327, -464410, -667272, -906617, -1165213, -1336026, -1452858, -1591129, -1707969, -1697754, -1493800, -1134981, -796421, -618711, -492768, -316207, -237905, -368560, -580968, -646243, -396586]
13410c96586M44294L25552O5529o2941n0800L2161M6236l7547p1872l3962J0534
13399B70598j0338l1670j4992k6876M7024K43173L92266L23758J52477O5635K5849
13388A436904m3797j04182j21394q7718q1979j69280k21904j76910n6608J3486
13378C86618o7579j77645k17997j69650l7399O7648L7375o3068m5898J10108K70223
13367I2736L09516L14153L70339L47472J34235q8672j82174j10212m3196j03571
13357A040626k6528J33859J88477J84571J44320P253j07988m8542J00311J63427
13347A779786J01521p8041k47150k45723j22042M692J0426l2045n7332p9260r5614
13336I39218r0706O8720K90055L09133J62632J09146J63660P9157j58017l27795
$$ y = [-396586, 47708, 373260, 438789, 375848, 325048, 357209, 403445, 365898, 294026, 260064, 270598, 260260, 228590, 213598, 186722, 233746, 476919, 869185, 1192943, 1345420, 1411055, 1436904, 1393107, 1288925, 1167531, 1079813, 997834, 828554, 606650, 429740, 373132, 386618, 319039, 141394, -76603, -246253, -283652, -216004, -178629, -241697, -287595, -177487, 92736, 402252, 716405, 1086744, 1434216, 1568451, 1479779, 1297605, 1187393, 1144197, 1040626, 1014098, 1147957, 1336434, 1521005, 1665325, 1672578, 1564590, 1516048, 1616359, 1779786, 1881307, 1803266, 1556116, 1310393, 1188351, 1193043, 1203469, 1171424, 1114092, 1034832, 939218, 848512, 917232, 1207287, 1516420, 1679052, 1788198, 1951858, 2031015, 1872998, 1545203]
13326A545203l07773k04313j08825j5502J2091o8694j15319m5715m3014p4281
13316E73858l1257r7621l21560m21409k88134r0524J38620L95929M83526L98186
13306G39614K77864J48746M4030m5692p3406J21040L45185K32160o0042j37943
13296A591556P551J81330J71887j9264j98964k45022j02690Q4994J26330L5132
13286A632840j1666J4378L6078P780j2628k1460p1641j50296j91209k24495j95470
13275H12211r3260n3894q4061r0127o0348Q583J42353K18965J47179L6041M2006
13264A025648Q1097J5367p0693n3925N0793J21224Q3325P3607J39231K13601K54206
13253A933481K31411J88837J07112l4411j40946j76307k19492k94995k59826j61395
$$ y = [1545203, 1237430, 1033117, 924292, 908790, 920881, 852187, 736868, 691153, 648139, 573858, 542601, 444980, 123420, -297989, -586123, -676647, -538027, -142098, 341428, 739614, 1017478, 1166224, 1210254, 1164562, 1091156, 1212196, 1557381, 1789541, 1729499, 1591556, 1599107, 1780437, 1952324, 1933060, 1734096, 1489074, 1386384, 1471378, 1597708, 1632840, 1621174, 1635552, 1671630, 1679410, 1666782, 1645322, 1573681, 1423385, 1232176, 1007681, 812211, 718951, 665057, 580996, 490869, 430521, 439104, 581457, 800422, 947601, 983642, 1025648, 1106745, 1122112, 1051419, 997494, 1048287, 1169511, 1252836, 1326443, 1465674, 1679275, 1933481, 2164892, 2353729, 2460841, 2426430, 2285484, 2109177, 1889685, 1594690, 1334864, 1173469]
13243A173469j55581j48423j6229J58427K14654J20197o4171j84685k25954k32168
13233F39536j99317j86081j80083r4337O5759K54766L90289L93091K64506P0416
13223A418545q28J09103K69759L63893K95964O6231r7160j01754n7856o5352j42072
13212B058473k46511k39924k2816K43688M49233N66309N36587L06072K4027r9786
13202C575352j54719k42482k84745k46948k51295k46263r4213J03026K34710L52527
13192B744950M15799K75374M8013m4918q7057j67075j67931r5617p9947r0409
13182B751182m9090J7692N5413J05181J10883M3563M0692j8272j25187j66393
13172B765664j47487l3999M0070J5256K5632N7163N7469P9786J32214K23396L30406
$$ y = [1173469, 1017888, 869465, 853236, 1011663, 1226317, 1346514, 1282343, 1097658, 871704, 639536, 440219, 254138, 74055, -20282, 45477, 300243, 690532, 1083623, 1348129, 1418545, 1417717, 1526820, 1796579, 2160472, 2456436, 2522667, 2425507, 2323753, 2265897, 2200545, 2058473, 1811962, 1572038, 1549222, 1792910, 2242143, 2808452, 3345039, 3651111, 3675138, 3575352, 3420633, 3178151, 2893406, 2646458, 2395163, 2148900, 2054687, 2157713, 2392423, 2744950, 3160749, 3436123, 3484136, 3439218, 3352161, 3185086, 3017155, 2921538, 2841591, 2751182, 2702092, 2719784, 2775197, 2880378, 2991261, 3034824, 3075516, 3057244, 2932057, 2765664, 2618177, 2584178, 2624248, 2639504, 2665136, 2722299, 2779768, 2859554, 2991768, 3215164, 3545570]
13161C545570L21890J96127J26903J08699J34284J95745K01286O3185j35672k19652
13151D538365k26969k57000k72080k70924k39576j05511Q1635J49581O6655k403
13141C461773k3113N3087K38534L20399J84870q389j21159j71139l01548m64779
13131C168536m03557j44114J29982L28312L95594K71429P7455l6852j08999j80854
13121C496932k41115k31122p9619J09789J61694J33119J28689J33837J20303J32833
13111C865340J75575J34013L0338N9819J46736P7305j55432m30384n36041l40312
13101C026957k3408K07948L69051M52904M10430L14434J62076L6778M7313J36248
13091E140731J58376K9703j14823j89956j60251R081J59585J38597K8974K9852
$$ y = [3545570, 3867460, 4063587, 4190490, 4299189, 4433473, 4629218, 4830504, 4893689, 4758017, 4538365, 4311396, 4054396, 3782316, 3511392, 3271816, 3166305, 3247940, 3397521, 3464176, 3461773, 3438660, 3491747, 3730281, 4050680, 4235550, 4227161, 4106002, 3934863, 3633315, 3168536, 2764979, 2620865, 2750847, 3079159, 3474753, 3746182, 3823637, 3786785, 3677786, 3496932, 3255817, 3024695, 2945076, 3054865, 3216559, 3349678, 3478367, 3612204, 3732507, 3865340, 4040915, 4174928, 4205266, 4265085, 4411821, 4489126, 4333694, 3903310, 3367269, 3026957, 3003549, 3211497, 3580548, 4033452, 4443882, 4758316, 4920392, 4957170, 5004483, 5140731, 5299107, 5328810, 5213987, 5024031, 4863780, 4872861, 5032446, 5171043, 5200017, 5229869]
13081E229869O3569l8305j32208j08679n5362L8370J38227K06396K62580L49129
13071E953586M66820M67226K50472M5490R407M4723P6938P6130L5881k1833K2223
13060G427063J46278J57713J43665K51869L15015K35195K2613j97163k09294l8119
13050H254835J01901J37299R7919j1249n6294P5156K36395K15887J09241O9225
13040I230315J01295J80810K57925K00383P5049J27415K59059L27840M42270N06627
13030A1708988L25794R6324O1757K17128L16863K85875K55840L28875M39336M66652
13020A4503432M37750M00378L36144K75963L08860L95381N39726O78757O62376
13011A8538767N13290L55467L74851O27407Q83040J012413J085404J181302J335614
$$ y = [5229869, 5293438, 5255133, 5122925, 5014246, 4958884, 4997254, 5135481, 5341877, 5604457, 5953586, 6420406, 6887632, 7138104, 7183594, 7193001, 7237724, 7314662, 7390792, 7426673, 7404840, 7427063, 7573341, 7731054, 7874719, 8126588, 8441603, 8676798, 8699411, 8502248, 8292954, 8254835, 8356736, 8494035, 8591954, 8580705, 8524411, 8599567, 8835962, 9051849, 9161090, 9230315, 9331610, 9512420, 9770345, 9970728, 10045777, 10173192, 10432251, 10760091, 11202361, 11708988, 12034782, 12131106, 12192863, 12409991, 12726854, 13012729, 13268569, 13597444, 14036780, 14503432, 14941182, 15341560, 15677704, 15953667, 16262527, 16657908, 17197634, 17876391, 18538767, 19052057, 19407524, 19782375, 20409782, 21292822, 22305235, 23390639, 24571941, 25907555]
13002B5907555J476362J456318J248383J119106J351375J809799K286308K662362
12994C9317568K795376K785637K836514L073764L528632M069712M579564N165619
12986F8152386N976999O938952P972283R110636J0488271J2312698J4517511J7032574
12978A52502310J9958207K3372061K7390337L1959838L6702881M0630959M1663727
12971C74180320L6744305K3264022K033539k0957536l8054979m5653052m5276207
12964B86280412m0516561l4461949k8737705k3864965j9741943j6310759j3661524
12957A08985006j1520196r751674q316305p070995o005539n095590m363168l831147
12949E3030392l421760l090711k718232k300587j922552j637759j479603j336551
$$ y = [25907555, 27383917, 28840235, 30088618, 31207724, 32559099, 34368898, 36655206, 39317568, 42112944, 44898581, 47735095, 50808859, 54337491, 58407203, 62986767, 68152386, 74129385, 81068337, 89040620, 98151256, 108639527, 120952225, 135469736, 152502310, 172460517, 195832578, 223222915, 255182753, 291885634, 332516593, 374180320, 410924625, 434188647, 436222186, 415264650, 377209671, 331556619, 286280412, 245763851, 211301902, 182564197, 158699232, 138957289, 122646530, 108985006, 97464810, 87713136, 79396831, 72325836, 66320297, 61224707, 56861539, 53030392, 49608632, 46517921, 43799689, 41499102, 39576550, 37938791, 36459188, 35122637]
12941C5122637j122317q72850p14812p31476p58543p03358n38764l68699k81246
12932B9030572j84386l2347J52503L60417N73757P06022O72573N43123M44100
12923C2266334M49688N99071Q76010J225679J654546K093910K368603K529310
12915D4063151K647244K798386K913382K812959K365823J559409P84389L83276
12907F0328019L23226N14203Q79863J386016K092597L011533L944481M799262
12899G7279200N626344O472050P419028Q646726J0343008J2445291J4841442J7550578
12891A60623667K0629453K4314246K8779711L3729235L8413215M1641968M1364416
12884C89495911L4495219J8585630m562039k7550870m2564719m7488334m5279675
$$ y = [35122637, 34000320, 33127470, 32412658, 31681182, 30922639, 30219281, 29680517, 29311818, 29030572, 28846186, 28813839, 28966342, 29326759, 29900516, 30606538, 31279111, 31822234, 32266334, 32716022, 33315093, 34191103, 35416782, 37071328, 39165238, 41533841, 44063151, 46710395, 49508781, 52422163, 55235122, 57600945, 59160354, 59944743, 60328019, 60651245, 61165448, 62045311, 63431327, 65523924, 68535457, 72479938, 77279200, 82905544, 89377594, 96796622, 105443348, 115786356, 128231647, 143073089, 160623667, 181253120, 205567366, 234347077, 268076312, 306489527, 348131495, 389495911, 423991130, 442576760, 438014721, 410463851, 367899132, 320410798, 275131123]
12877B75131123l9779776l3545542k7773984k2856440j8812402j5566792j2948977
12870A03847210j0764788q978272p593938o642041o015834n435894m724900l953515
12862D9738028l282101k724933k249874j912156j729494j581478j352364j165911
12854C3739717j133240j170255j221278j214477j062551q05297o03498m85122
12846B6043999l83924k72369j56217p9313p1404j35931k29360j17936J17217J71185
12836B4885947J33261K34947N27880Q68123J092606J148723J045122Q76227P94713
12827C1607549Q96962J026215J068997J184473J405155J696170K055395K395397
12819D3336313K707700L071456L493200L917050M325698M774691N360854O100848
$$ y = [275131123, 235351347, 201805805, 174031821, 151175381, 132362979, 116796187, 103847210, 93082422, 84104150, 76510212, 69868171, 63852337, 58416443, 53691543, 49738028, 46455927, 43730994, 41481120, 39568964, 37839470, 36257992, 34905628, 33739717, 32606477, 31436222, 30214944, 29000467, 27937916, 27132619, 26529121, 26043999, 25660075, 25387706, 25231489, 25152176, 25080772, 24944841, 24715481, 24597545, 24714762, 24885947, 25019208, 25254155, 25782035, 26650158, 27742764, 28891487, 29936609, 30812836, 31607549, 32504511, 33530726, 34599723, 35784196, 37189351, 38885521, 40940916, 43336313, 46044013, 49115469, 52608669, 56525719, 60851417, 65626108, 70986962, 77087810]
12811G7087810P056224Q265508R621666J1163002J3028367J5276353J7995080
12804A59494010K1339676K5298683K9762934L4576169L9019605M1511606L9506366
12797C90509049L0032696J1908043j1285845l1819735m3709066m6556893m3413971
12790B55664278l7624817l1514755k6111731k1605736j7930015j4959205j2486105
12783I3431914j0429661q849519p626643o557672n640491m897421m274698l732582
12775D1423227l219593k730290k382201k201351k058607j888946j723027j599677
12767B3619535j464722j259086j047362j009129j112403j146650j045446q53605
12759A4681132o79844n87265m83671l43340k23855k82693l86759l46307l20997
$$ y = [77087810, 84144034, 92409542, 102031208, 113194210, 126222577, 141498930, 159494010, 180833686, 206132369, 235895303, 270471472, 309491077, 351002683, 390509049, 420541745, 432449788, 421163943, 389344208, 345635142, 299078249, 255664278, 218039461, 186524706, 160412975, 138807239, 120877224, 105918019, 93431914, 83002253, 74152734, 66526091, 59968419, 54327928, 49430507, 45155809, 41423227, 38203634, 35473344, 33091143, 30889792, 28831185, 26942239, 25219212, 23619535, 22154813, 20895727, 19848365, 18839236, 17726833, 16580183, 15534737, 14681132, 14001288, 13414023, 12930352, 12587012, 12363157, 12080464, 11693705, 11347398, 11026401]
12750A1026401m09209m79129m42142l76558l33569k71383k61233l23927l48386
12741G780865l23428l25856l21497l00683k56793j36644M220N3780M5530P7622
12731F297116O7836p1086k91070m95834n82032n11165l24884j69841k07543k18649
12721C492848j39691j32845j34910j25452j36470j30548o9835J15166L00266K39100
12711C277629p6559m04440m95795l53137j23029Q6789K12972K67167K09235l8823
12701B562009k59530k39498j38951j43049j88006j54609n3267l0970q4689r9195
12691A170245m6516p4908j17915n6847j3030K2861K04174M08246M54843M13027
12681B364180K63237P143k14155m20793o43997o67657m13072j22613J13513L10515
$$ y = [11026401, 10617192, 10138063, 9695921, 9319363, 8985794, 8714411, 8453178, 8129251, 7780865, 7457437, 7131581, 6810084, 6509401, 6252608, 6115964, 6120184, 6173964, 6219494, 6297116, 6364952, 6293866, 6002796, 5506962, 4924930, 4413765, 4088881, 3919040, 3711497, 3492848, 3353157, 3220312, 3085402, 2959950, 2823480, 2692932, 2623097, 2738263, 3038529, 3277629, 3201070, 2796630, 2300835, 1947698, 1824669, 1911458, 2124430, 2391597, 2600832, 2562009, 2302479, 2062981, 1924030, 1780981, 1592975, 1438366, 1385099, 1354129, 1269440, 1170245, 1123729, 1048821, 930906, 874059, 861029, 883890, 1088064, 1496310, 1951153, 2364180, 2627417, 2634560, 2420405, 1999612, 1355615, 687958, 274886, 152273, 265786, 576301]
12671E76301L90334L85057K73876O9297k9783J4467P0382M7619m1187o8273n7653
12660A630437r1246j31370j06892k7981k8072j49286k54945k84756k02096l3919
12650C19874O3107J16660J38340J04158J15517J67981J25966r7o9324j74755l39474
12639E67953l40435j44917k2103j5465K8272J32159J84443J65591J16307P4527
12629G46332J11199K13016K03476J02708M5898j9194j95790l87966l81723j83852
12619B54104L4490K08550L63538M12405J81343j60502l04086k11905p8187o7367
12609F32383q8614n5539k3205o6553r7269m9903P9436J82044J10473k4195q0105
12598E18953m0126n0463k10043l34978k80245j35241K1359J24347P2517l7967
$$ y = [576301, 966635, 1351692, 1625568, 1694865, 1665082, 1679549, 1749931, 1797550, 1756363, 1688090, 1630437, 1539191, 1407821, 1300929, 1272948, 1244876, 1095590, 840645, 555889, 353793, 319874, 382981, 499641, 637981, 742139, 857656, 1025637, 1151603, 1151506, 1082182, 907427, 567953, 227518, 82601, 60498, 45033, 73305, 205464, 389907, 555498, 671805, 746332, 857531, 1070547, 1274023, 1376731, 1422629, 1403435, 1207645, 819679, 437956, 254104, 288594, 497144, 860682, 1273087, 1454430, 1293928, 989842, 777937, 699750, 632383, 543769, 488230, 465025, 398472, 301203, 251300, 330736, 512780, 623253, 599058, 518953, 478827, 428364, 218321, -116657, -396902, -532143, -510784, -386437, -313920, -351887]
12588c51887n5109k8022N2878J23176Q5957l0555j34844j77177j78866j58842
12578h53291r3193P2650K60818K85248J26393r2645j99020k04667j53975k787
12568h54469J78194L72520N06576M08700J49227P854j5325p7993j02346m6583
12558E26355M6612N6384Q266M9800J02640J10338L2666p8739j57470j70765o2255
12547D63832O7808M2286p4949j07382q6531q7580p1246j6154K3715Q4594J25045
12536C63438k8954k77803l67705k43442n6665J07522K20873J91810M9263j5999
12526e7662J18139L48342L48834P0104r6389n9127k5962o8678j33604j07011Q1068
12515D18054K71682L42258L37253K80857R4453j45354k23843j22921M9727R9241
$$ y = [-351887, -406996, -435018, -382140, -258964, -173007, -203562, -338406, -515583, -694449, -853291, -946484, -873834, -613016, -327768, -201375, -294020, -493040, -697707, -851682, -854469, -676275, -303755, 202821, 611521, 760748, 768602, 753277, 675284, 572938, 526355, 572967, 629351, 637617, 687417, 790057, 900395, 933061, 854322, 696852, 526087, 463832, 531640, 573926, 498977, 391595, 305064, 217484, 146238, 130084, 153799, 238393, 363438, 334484, 56681, -311024, -554466, -611131, -503609, -282736, -90926, -41663, -57662, 60477, 408819, 757653, 827757, 731368, 672241, 646279, 577601, 443997, 336986, 418054, 689736, 1031994, 1369247, 1650104, 1744557, 1599203, 1375360, 1252439, 1302166, 1401407]
12505A401407K5261k3883o4629j37881j43714k0149J17525J24060K0592r0203
12495A208386j68934j94411p3146J68733L24814K73702J15597l2328j28143j67377
12485A326893j99552j90813k16348k68268k76937k27861j40561p1493L4492J40418
12475i0030K09767K13901J10713l197j6475K6841M3073l1j08793j99558j56003
12464C0208n5083r719l5759l1037R4417K32053J93478K9324r0309j76884k74059
12453i3370l65466m21466l57420j97968m6350L7957K9312J1804M0337P1248M1080
12442a250302o384J7463L7784O1490J76952L15555L96916L78283L17370J90994
12432F36121k7514j38514o3684J9216p362l2989n4872j34045k16984k46577k09527
$$ y = [1401407, 1426668, 1402785, 1338156, 1200275, 1056561, 1036412, 1153937, 1277997, 1298589, 1208386, 1039452, 845041, 771895, 940628, 1265442, 1539144, 1654741, 1622413, 1494270, 1326893, 1127341, 936528, 720180, 451912, 174975, -52886, -193447, -264940, -230448, -90030, 119737, 333638, 444351, 441154, 424679, 451520, 494593, 494562, 385769, 186211, 30208, -24875, -34594, -70353, -101390, -6973, 225080, 418558, 447882, 357573, 180689, -93370, -458836, -880302, -1237722, -1435690, -1482040, -1444083, -1414771, -1402967, -1362630, -1291382, -1250302, -1256686, -1239223, -1201439, -1139949, -962997, -647442, -250526, 127757, 445127, 636121, 608607, 470093, 406409, 425625, 418263, 385274, 330402, 196357, -20627, -267204, -476731]
12421d76731o5792J02546J78433J26867R2115J27071J34467R1764j6218j38362
12411A56160j79193j26327q5930m2905O8225J59261J40110l453k37791l33562
12401d85405k09329q7712j08493j78550j88831j46338q780K09640L49461L33405
12391e20932J72796M7087L8216P607n5534n1003N4272J63149K47106K87143K62157
12380F52064J87635O7141l3263p7267r2929j64903k05079p4690J15734J94425
12370E68868J40580O2528M002j15878k17628j82800m9406k2177j37867k12732
12360a62510k10495j75595m1614L3387m6642k02477l09759k79556k06774j32698
12350a734733l9994j195L300Q0127K08771L27784L15270J53354K3748R2758K63258
$$ y = [-476731, -542523, -439977, -261544, -134677, -42562, 84509, 218976, 310740, 294522, 156160, -23033, -149360, -235290, -278195, -209970, -50709, 89401, 85948, -151843, -485405, -694734, -782446, -890939, -1069489, -1258320, -1404658, -1413438, -1203798, -854337, -520932, -348136, -301049, -262833, -255226, -310760, -361763, -307491, -144342, 102764, 389907, 652064, 839699, 906840, 873577, 796310, 703381, 538478, 333399, 258709, 374443, 568868, 709448, 771976, 775978, 660100, 442472, 259672, 210266, 188089, 50222, -162510, -373005, -548600, -590214, -556827, -603469, -805946, -1115705, -1395261, -1602035, -1734733, -1774727, -1775922, -1772622, -1692495, -1483724, -1155940, -840670, -687316, -663568, -570810, -307552]
12339c07552K81219P4471j82944k81314k17668j55662j55360j86415j93542j16922
12329a441689R4125L19564M20160M56963M48406L22377J52717j03957l43171l48522
12319b3027k00519j20050r7023o4761k8864j0486l9192L034N1691o9368k85757
12308h84322l64746k43803o8061Q9252K45951L15842K46446J39943N9155k8449
12298d92792j46817k24138k13463j29293J7837K00556K58993J25370l6975m3929
12288f84651k678M02J250k7351k2251P479J8704Q5189J79251L17557M56624L75996
12276G05521Q7475r8049l5531N8064l041j63267k25419j70331p8867L2641R6157
12265B05353P1706n1361k37860l57031l01413j99182k41892l92761m78879m62605
$$ y = [-307552, -26333, 48138, -134806, -416120, -633788, -789450, -944810, -1131225, -1324767, -1441689, -1347564, -1028000, -607840, -150877, 297529, 619906, 772623, 668666, 325495, -23027, -223546, -343596, -440619, -505380, -534244, -544730, -583922, -580888, -529197, -598565, -884322, -1249068, -1492871, -1560932, -1471680, -1225729, -909887, -663441, -523498, -464343, -492792, -639609, -863747, -1077210, -1206503, -1188666, -988110, -729117, -603747, -640722, -684651, -687329, -686927, -685677, -713028, -735279, -727800, -709096, -623907, -444656, -127099, 329525, 705521, 792996, 694947, 659416, 717480, 714439, 551172, 325753, 155422, 76555, 109196, 205353, 277059, 225698, -12162, -369193, -670606, -869788, -1111680, -1504441, -1983320, -2445925]
12255b445925l38173l5679L41624N62981N82264O12439O23594N40032L36134M5553
12245H24844k82954n51853n88311m19809j72919O1765J43122L6202j29523k13796
12235a293232j47331K8302K10092K83286K90850L33685L81141L02906J37491L980
12225E31170J2389J73157L16089K96886K46189K83893L81279M48058L07759o2280
12215B934589m14314n20357m94694m75013m34880l88326l73027k46251q878Q2565
12205c38586m7066j06412Q7999K26810J20653M6678Q5237J39972K03811K00485
12195F19581J56698J09098L4173n058K1633L6439K4434J26716L08473L70565K62054
12184B064806N5442r2052j65705k42878k96827k77703k56334k43216k04573j23498
$$ y = [-2445925, -2784098, -2819777, -2478153, -1915172, -1332908, -720469, -96875, 443157, 779291, 824844, 541890, -9963, -598274, -1018083, -1191002, -1129237, -986115, -949913, -1079436, -1293232, -1440563, -1412261, -1202169, -918883, -628033, -294348, 86793, 389699, 527190, 531170, 543559, 716716, 1032805, 1329691, 1575880, 1859773, 2241052, 2689110, 2996869, 2934589, 2520275, 1999918, 1505224, 1030211, 595331, 207005, -166022, -412273, -421151, -338586, -385652, -492064, -404065, -177255, -56602, -9924, 75313, 215285, 419096, 619581, 776279, 885377, 919550, 914492, 936125, 972564, 996998, 1123714, 1432187, 1802752, 2064806, 2120248, 2028196, 1862491, 1619613, 1322786, 1045083, 788749, 545533, 340960, 217462]
12174B17462q0233j18659j78325k24094j23934J08804K23698J52208J9668j64441
12164a67846k85315j71345p490n114q0350n0622N7427R2276J5453q9375j47277
12153h39578r2533J02045L05294L50983K65804J79660Q1151q0399j75051p0615
12143B6761M8965O7156j3182j62937k71060k69974j82292p4646o4739j29327j11462
12132a136737K4180J69747K09958J62231O3563m5264J7129K04316K40060J00074
12122I257n0449k3903J45333K16296J30369K2934k3943k287N9474O2960O4775
12111F10816Q3016J5352j35151k81096l23880l02882k78614j98075r490K50380
12101e69624L64529K38388J2929j14178j28729j35138j99799k24692j28292K5427
$$ y = [217462, 137229, 18570, -159755, -383849, -507783, -398979, -175281, -23073, -3405, -167846, -453161, -624506, -631996, -637110, -717460, -768082, -710655, -618379, -602926, -692301, -839578, -932111, -830066, -524772, -173789, 92015, 271675, 352826, 272427, 97376, 26761, 75726, 142882, 129700, -33237, -304297, -574271, -756563, -831209, -895948, -1025275, -1136737, -1112557, -942810, -732852, -570621, -507058, -552322, -535193, -330877, -90817, 9257, -41192, -65095, 80238, 296534, 426903, 449837, 425894, 423607, 483081, 546041, 610816, 693832, 709184, 574033, 292937, -30943, -333825, -612439, -810514, -820004, -569624, -205095, 33293, 46222, -67956, -196685, -331823, -531622, -756314, -884606, -859179]
12091h59179J10260P8536l5211k11480k73369j35227N1254J54116J72676K07908
12081g39716L18569M02375L38890K17256J54354J13723M6084o4668j68867k44622
12071C73378l18570k42240N2379L14610L70865K64273R1752l2890j01400j24946
12061F47211r9119o4130j58964l42977m01295k92982k05199j65588r8507o4061
12051a245611j02711j32707j1399J98752L65082M35080M55790M14389K54221J31526
12041G62412O9037l9597j22517p4212l4612r5656j22314j7948J32114J94302J45133
12030G96142N128j42547k29873k47556k40944k42578k15749j13899J3832R1577
12020e26467R4882N9760j5707o4081n760J13442J95275J86419J69542K02387K39680
$$ y = [-859179, -748919, -670383, -705594, -917074, -1190443, -1325670, -1274416, -1120300, -947624, -739716, -421147, -18772, 320118, 537374, 691728, 805451, 851535, 786867, 618000, 373378, 54808, -187432, -135053, 179557, 550422, 814695, 906447, 873557, 772157, 647211, 548092, 483962, 324998, -17979, -419274, -712256, -917455, -1083043, -1181550, -1245611, -1348322, -1481029, -1492428, -1293676, -928594, -493514, -37724, 376665, 630886, 762412, 831449, 791852, 669335, 595123, 560511, 464855, 342541, 324593, 456707, 651009, 796142, 801270, 658723, 428850, 181294, -59650, -302228, -517977, -631876, -618044, -526467, -431585, -371825, -387532, -451613, -457373, -343931, -148656, 37763, 207305, 409692, 649372]
12009F49372K00687J05289M9811m8687j59666j17074K4728P3648L547M469Q5498
11998H71622n407k17598l52483m18152m06062j69240K31022M26644L21166J59111
11988D40623J5258j13868j56900j33140j29002j57719k06156k43787k89855k84426
11978a258972j59507L3545J84002K44116K02870J08729R1825J18285N1962n5365
11968d38510r4398n8512n2075j12307j30181n8573R6724K42204K65422K02760
11958a37446J06034K1725l7571o3252l9172j13067k97245l90914k84624k8238
11948a263770K25604L11102K86498K68847J51713k4826n6047K2575Q7652J63160
11938A72508J28797j08935k87393k15591o0778r796R186Q5217J51668J28514J11254
$$ y = [649372, 850059, 955348, 1005159, 956472, 796806, 679732, 704460, 778108, 781655, 786124, 871622, 866215, 648617, 296134, -122018, -528080, -697320, -466298, -39654, 281512, 440623, 455881, 342013, 185113, 51973, -77029, -234748, -440904, -684691, -974546, -1258972, -1418479, -1384934, -1200932, -956816, -753946, -645217, -553392, -435107, -383145, -438510, -532908, -591420, -643495, -755802, -885983, -944556, -847832, -605628, -340206, -137446, -31412, -9687, -47258, -110510, -149682, -262749, -559994, -950908, -1235532, -1263770, -1038166, -727064, -440566, -171719, -20006, -44832, -100879, -78304, 9348, 172508, 301305, 192370, -95023, -310614, -371392, -381188, -372002, -286785, -135117, -6603, 104651]
11927A04651J41170J01443j7052q8114l0279M5500O7916Q3348J54423K39597K05449
11916A008052J58406J15600l6147k41595k97295j11586J16954J81896R8212J5291
11906A007788k5162j09235k08869j28322L0381K2609q1594j11118m1425l7982
11896C17071k9508L9786M9242j4047o2949k9981N6002J17119J09890R5133L3022
11885F80780r7151j33049j6802J02915P2009k7016p2979k06470l96715m27640
11875e22118l15929j07264J33400K69361K90447K27984J33152Q9869j2628j57322
11865B8952j80019j36185j32818j47649j08051P155J20957K27267L34261L36422
11855C50292K54727K25866L16654L98602M24266M79031M79620M54450M25177L72441
$$ y = [104651, 245821, 347264, 330212, 242098, 211819, 257319, 325235, 408583, 563006, 802603, 1008052, 1166458, 1282058, 1245911, 1004316, 707021, 595435, 712389, 894285, 992497, 1007788, 982626, 873391, 664522, 536200, 566581, 589190, 507596, 396478, 355053, 317071, 287563, 327349, 376591, 362544, 299595, 269614, 325616, 442735, 552625, 647758, 680780, 583629, 450580, 433778, 536693, 608702, 581686, 508707, 302237, -94478, -522118, -838047, -945311, -811911, -542550, -252103, -24119, 109033, 198902, 186274, 28952, -151067, -287252, -420070, -567719, -675770, -668615, -547658, -320391, 13870, 350292, 605019, 830885, 1147539, 1546141, 1970407, 2449438, 2929058, 3383508, 3808685, 4181126]
11845D181126L97564N16985O78470P62200P69521P86595Q38457R07420J048785
11836A0887123J296770J464790J454846J312913R51391L05037m84293j260701
11828A5927876j777640j896495j726316j479060j321172j224680j065444q00335
11820D636734m08905K5166J54490q1080k73571k02462j18275j39161j43140j56722
11810C293074k37885k38708j52818r1282k6277M7215K9808o8573j55159j98764
11800B200631j86306j33148q4558o4018n5360M538O7091K2107m4467K1712J54999
11789A903221J77429J78374K29023K00271O2997J8439K09731M67438N14526L04905
11779D266354k2455k75788l42335k74582j62871o7012k1959P3931K47579L62731
$$ y = [4181126, 4578690, 5095675, 5774145, 6536345, 7305866, 8092461, 8930918, 9838338, 10887123, 12183893, 13648683, 15103529, 16416442, 17367833, 17672870, 17188577, 15927876, 14150236, 12253741, 10527425, 9048365, 7727193, 6502513, 5437069, 4636734, 4227829, 4252995, 4407485, 4326405, 4052834, 3850372, 3732097, 3592936, 3449796, 3293074, 3055189, 2816481, 2663663, 2572381, 2546104, 2593319, 2623127, 2554554, 2399395, 2200631, 2014325, 1881177, 1796619, 1732601, 1677241, 1681779, 1748870, 1770977, 1726510, 1748222, 1903221, 2080650, 2259024, 2488047, 2688318, 2751315, 2769754, 2979485, 3446923, 3961449, 4266354, 4243899, 3968111, 3625776, 3351194, 3188323, 3121311, 3099352, 3173283, 3420862, 3783593]
11769C783593M30825M14156L56311K77328K40328L06806M14561N68476P02655
11760G495039P70625Q45835R28926R66793R33165Q61652R21883J209445J560188
11751A6493551J865213K249876K646463K891471L028653K924209K305166J059409
11743C5464011o59323k250641l097483l193165k883202k422528j964368j584898
11735A7408403j295979j011882o80814m76514l85798j64742R3446M31862R60868
11726A4878850J514928J943982K157439K412534K923957L686740M667769N724559
11718C9910758O459533O426957M973121J410576l458285p157915q254016p516037
11710C2794692o165954m816363l687986k786633k053397j563891j297234j169420
$$ y = [3783593, 4214418, 4628574, 4984885, 5262213, 5502541, 5809347, 6223908, 6792384, 7495039, 8265664, 9111499, 10040425, 11007218, 11940383, 12802035, 13723918, 14933363, 16493551, 18358764, 20608640, 23255103, 26146574, 29175227, 32099436, 34404602, 35464011, 34804688, 32554047, 29456564, 26263399, 23380197, 20957669, 18993301, 17408403, 16112424, 15100542, 14419728, 13943214, 13557416, 13392674, 13486120, 13917982, 14878850, 16393778, 18337760, 20495199, 22907733, 25831690, 29518430, 34186199, 39910758, 46370291, 52797248, 57770369, 59180945, 55722660, 48564745, 40310729, 32794692, 26628738, 21812375, 18124389, 15337756, 13284359, 11720468, 10423234, 9253814]
11702I253814r82872o69746m27264l67813m59227o06322o81077o24552m91602
11693C943339l91871l28104j52299P6014J65049N393k99774n25670n53237m18095
11683A520745k63763j20154J07726K32393J48323K9090r8169k09426k46073k13860
11673H86832j61158j35192r1226l7174n0844j12287j05853q2828r8093n4609K1299
11662b1133L0953j8008r3181j60100j54152r2183N4235K05633K10572J01685K7428
11651I1749O1045R0223O6740P7474M0842k1397q8808j56561j45141L2022K81364
11640C29552L77473J97025n2786j21859o2542m6961q7117j17325j47466j12943
11630A55051o7886j29161k01101k11638k12206k19793j85307j02326L3189J40530
$$ y = [9253814, 8270942, 7601196, 7173932, 6806119, 6346892, 5740570, 5059493, 4434941, 3943339, 3551468, 3223364, 3071065, 3147079, 3312128, 3317521, 3017747, 2492077, 1938840, 1520745, 1256982, 1136828, 1244554, 1476947, 1625270, 1654360, 1556191, 1346765, 1100692, 886832, 725674, 590482, 499256, 462082, 411238, 298951, 193098, 110270, 12177, -42432, -21133, 9820, -8188, -101369, -261469, -415621, -507804, -453569, -247936, -37364, 64321, 91749, 152794, 243017, 309757, 387231, 428073, 406676, 317868, 161307, 16166, 48188, 329552, 707025, 904050, 851264, 729405, 666863, 619902, 532785, 415460, 267994, 155051, 87165, -41996, -243097, -454735, -666941, -886734, -1072041, -1174367, -1141178, -1000648]
11620a000648J53328P8541k7159J6808J89549L23260L81893L59458K37111p968
11610G04173j28822L5885J97998J35710r973k7269N7762J69909J93848Q3770l7471
11599A375520o9196k2954O8147J73383J72646K4240j05993j59602k14826k57365
11589I84000j73647l9962K2772P3972J43995J58454M6270n2183q7930r8659O13
11578I77695J20119J53848J14431M6602l3258j68740l23786l23628j46955N3771
11568D70099K71194L79005K94050J49978O2898R349n2591k9115R9711J84844J00439
11557A939861n7690j74625k75619l75074m07108l16251j34726j437Q9907J18859
11547D06097Q0942J35296K22602J91235R8974K6879j55542l63774l40444k12266
$$ y = [-1000648, -847320, -768779, -795938, -779130, -589581, -266321, 115572, 475030, 712141, 704173, 575351, 611236, 809234, 944944, 934971, 907702, 965464, 1135373, 1329221, 1412991, 1375520, 1306324, 1283370, 1351517, 1524900, 1697546, 1721786, 1615793, 1456191, 1241365, 984000, 810353, 770391, 793163, 867135, 1011130, 1169584, 1215854, 1163671, 1075741, 977082, 977695, 1097814, 1251662, 1366093, 1412695, 1379437, 1210697, 886911, 563283, 416328, 470099, 741293, 1120298, 1414348, 1564326, 1627224, 1636573, 1583982, 1554867, 1654578, 1839422, 1939861, 1882171, 1707546, 1431927, 1056853, 649745, 333494, 198768, 197331, 287238, 406097, 487039, 622335, 844937, 1036172, 1135146, 1162025, 1006483, 642709, 302265, 89999]
11537H9999j62694j49275L6293K73269K53870R9771l3370j22584k15121l29257
11527b59099l43779j60476J36489L39123L66416K54760M3052j58112k62624k97797
11517c42047k54804j28472K5566J17978J09359R1919R1209J19296J29432K0679
11507a9885j32186j43374j016J46996J37261K0230o4976j54289k14580j69058
11497e94877K2912K04510K27461J48487R559j19369j06169K4502Q1130K3958J4291
11486f3605P3875J47595J92771J63858Q1927O667K3007M0880r170k3920j03665
11475E30220l76606o48725o22583l19718l0546J72998L08160L21673K17503Q9542
11465c58082k9134j30199j35206q4492o3246j22389k25661k86177k37948l5771
$$ y = [89999, -72695, -221970, -185677, 87592, 341462, 441233, 407863, 285279, 70158, -259099, -602878, -763354, -626865, -287742, 78674, 333434, 376486, 218374, -44250, -342047, -596851, -725323, -699757, -581779, -472420, -380501, -289292, -169996, -40564, -19885, -152071, -295445, -296461, -149465, -12204, 8026, -56950, -211239, -425819, -594877, -571965, -367455, -139994, 8493, 18052, -101317, -207486, -182984, -101854, -77896, -63605, 10270, 157865, 350636, 514494, 596421, 603088, 626095, 666975, 657805, 633885, 530220, 153614, -495111, -1117694, -1437412, -1467958, -1294960, -986800, -665127, -447624, -358082, -387216, -517415, -652621, -737113, -800359, -922748, -1148409, -1434586, -1672534, -1708305]
11455a708305J90454K39934J70028J18422R8253Q8905J18059J44292J38101J77575
11445b24282K80091L22845K69046J85486O6780m3730j47563k62592l30850l10465
11435a95234j26855J31755K23856R0230j36564k26249m4135J80832J88472n2563
11425C3545k07605j67464j16047j03521o7912P1909K06840K17931J35496R3174
11415I6346J20704K6976k17578k69346q9369Q5618J31438J55741J79124J53606
11405C73260J22849P2004j6275q5407j22171j46089j42606q9667n417n1335j82007
11394b72861k14021j09226R1729L00650L93761K26165j38188l02792j84564m5639
11384b54986K2125K2232j16417l02664l54579k66787j86629j68966r0309L157
$$ y = [-1708305, -1517851, -1277917, -1107889, -989467, -891214, -802309, -684250, -539958, -401857, -224282, 55809, 378654, 647700, 833186, 899966, 856236, 708673, 446081, 115231, -195234, -322089, -190334, 33522, 123752, -12812, -239061, -283196, -102364, 86108, 33545, -174060, -341524, -457571, -561092, -629004, -557095, -350255, -132324, 3172, 96346, 217050, 244026, 26448, -242898, -332267, -246649, -115211, 40530, 219654, 373260, 496109, 568113, 551838, 466431, 344260, 198171, 55565, -34102, -39519, -90854, -272861, -486882, -596108, -504379, -203729, 190032, 416197, 278009, -24783, -209347, -254986, -232861, -210629, -327046, -629710, -984289, -1251076, -1437705, -1606671, -1696980, -1693823]
11374a693823K9287M5536Q9565K15033L09863L22312L54953K57035M6074j19224
11364a43389k20953k63683k39422q4827J31010K20084J48892M3899M0723J34202
11354b33464K27783K42275K08802J71462J56786Q1651r2032j83002j49177q7614
11344C43470O429J01949J44779P8095k9853j11477j36464j26677j74575j50196
11334e4520L2329J82198K45267K81000K17672J7482j00626o3010p6549j36264
11324E44979j34614j41948j43895k4144J90113K67156Q2521q7224j48724j47389
11314B56831q3369o230J34563J90744M784k25550k58273j87638j69184j94448
11304e37770j59546j6114J65764K79341J78833n4461j11700L2842N1123q1319
$$ y = [-1693823, -1664536, -1619000, -1529435, -1314402, -1004539, -682227, -327274, -70239, -24165, -143389, -364342, -628025, -867447, -952274, -821264, -601180, -452288, -408389, -367666, -233464, -5681, 236594, 445396, 616858, 773644, 855295, 763263, 580261, 431084, 343470, 349899, 451848, 596627, 674722, 644869, 533392, 396928, 270251, 95676, -54520, -22191, 160007, 405274, 686274, 903946, 921428, 820802, 757792, 681243, 544979, 410365, 268417, 124522, 100378, 290491, 557647, 640168, 552944, 404220, 256831, 173462, 167232, 301795, 492539, 497323, 271773, 13500, -174138, -343322, -537770, -697316, -713430, -547666, -268325, -89492, -143953, -255653, -222811, -171688, -253007]
11294b53007r7149r3614j17323O5607L84560N38648N07873L76630J79042K3023
11284A514290j26623k92928l60108l05843k06330j24624L4472K64863L47765J55940
11274I00874j72652l56940l43208k86673k47950j91450j77614k17095k41179o3065
11264a396952K51411L74795K25235Q7004J28959K20909K34171J07896j24751l15248
11254b06571l71794l50780k77600j30354O4239K41418L39257L15962K82219L52283
11244B58279L31342J55938k6159j67498k38278k23402j05143P9764K24766K45766
11234E35375J51317L0503o5220j13122p7986P6041J06724j09433k98704k76329
11224d0834j67872n8972N9287J28749J23090O2304j31637l01293k41337K3044
$$ y = [-253007, -350156, -443770, -561093, -495486, -110926, 427722, 935595, 1312225, 1491267, 1514290, 1387667, 1094739, 734631, 428788, 222458, 97834, 132306, 397169, 744934, 900874, 728222, 371282, 28074, -258599, -506549, -697999, -875613, -1092708, -1333887, -1396952, -1145541, -770746, -545511, -458507, -329548, -108639, 125532, 233428, 108677, -206571, -578365, -929145, -1206745, -1337099, -1272860, -1031442, -692185, -376223, -94004, 258279, 589621, 745559, 719400, 551902, 313624, 90222, -14921, 64843, 289609, 535375, 686692, 717195, 651975, 538853, 460867, 536908, 643632, 534199, 235495, -40834, -208706, -267678, -208391, -79642, 43448, 105752, -25885, -327178, -568515, -545471]
11214e45471K51993K54321P7584q6671r9182n0245M157M4366k2608j37706j21934
11203d31396J4692P8701j0053j35094k45098l24330l24846k19605J9694J81592
11193a395743J02932j6409Q048P8938O2929j2262o892R6460J78626J13798J0053
11182g79522O6547J73934J88934Q0643j20111k91561l47696k96007j82437q6199
11172a593475L3840J29216J45398J19605J11873J69639K13919R6097j05564k18758
11162h98210k82652k81566j51698k0499j8091j32083k62148l42739k92098q213
11152b689997L66571N63139N29672K95903M2381o1802j12470j32425p3335p638
11142a280001o6031j33214j4637K34102L77603L32451K33916J68392J02936j4166
$$ y = [-545471, -293478, -39157, 38427, -48244, -147426, -197671, -193514, -149148, -171756, -309462, -431396, -416704, -338003, -348056, -483150, -728248, -1052578, -1377424, -1597029, -1577335, -1395743, -1292811, -1309220, -1301172, -1222234, -1159305, -1171567, -1178459, -1081999, -903373, -789575, -779522, -712975, -539041, -350107, -269464, -389575, -681136, -1028832, -1324839, -1507276, -1593475, -1559635, -1430419, -1285021, -1165416, -1053543, -883904, -669985, -573888, -679452, -898210, -1180862, -1462428, -1614126, -1634625, -1652716, -1784799, -2046947, -2389686, -2681784, -2689997, -2323426, -1760287, -1230615, -934712, -892331, -954133, -1066603, -1199028, -1272363, -1280001, -1346032, -1479246, -1493883, -1259781, -882178, -549727, -315811, -147419, -44483, -58649]
11132e8649k29173l67047k91494j37153p0365p2131q6461r7337p4984N3435K26209
11121a205150K47361J48683Q2481M5017l0122n5066j9698k4648p2207j4740J22065
11110g76024J47907O2260j6370n4987L9228J75032J98702Q1218p3803p7385K0384
11099b73838L9255m854n6324o9505o2223L713J42626J68150M7789o2694j22036
11088b49941p2192M9408J29343J46835P3578o8885j74497j24583J4785P5975N7846
11077a42328N9551O9952Q1726N0200q7892j66290o1134Q8743J40312J31381J34532
11066B98753J29003J16687J24999J44866Q9702m4291j36834j27019j21631r8207
11056C76028j5888n0477j65262j42973Q4721K57444K17630J54806P8934j12376
$$ y = [-58649, -287822, -654869, -946363, -1083516, -1153881, -1226012, -1312473, -1409810, -1484794, -1431359, -1205150, -957789, -809106, -726625, -681608, -711730, -766796, -786494, -811142, -883349, -898089, -776024, -628117, -565857, -582227, -637214, -597986, -422954, -224252, -143034, -216837, -294222, -273838, -234583, -239437, -295761, -365266, -427489, -423776, -281150, -113000, -65211, -127905, -249941, -322133, -272725, -143382, 3453, 77031, 8146, -166351, -290934, -276149, -200174, -142328, -82777, -12825, 68901, 119101, 31209, -135081, -196215, -107472, 32840, 164221, 298753, 427756, 544443, 669442, 814308, 904010, 859719, 722885, 595866, 474235, 376028, 360140, 309663, 144401, 1428, 86149, 343593, 561223, 716029, 794963, 682587]
11046F82587k37639k20692k20751k45016j54548L353N0021j6973J629J51453K75229
11035F8653K58143J84205J40571J8353k30708l72560k43737n8837Q9123J76233
11025B9439J96988K53552K33765M2815j02256j29740p8364P3462K03415J76643
11015H99719J06522J5788k02735m04067l92857k14445l1025Q1560J27331J57532
11005A43323K37284L67388M32784L26689P5495j54906k28849k17272k13203k07868
10995E60865j84580q6433J7938l0761r7867q3136j04096k16181l04064k25099
10985g53414m9110J53068K84415K44448J73037J07716p2455l12329m01549k93804
10975i19977j03519n433j47061l22272k76674j42763q6451j4953R5645J90224
$$ y = [682587, 444948, 224256, 3505, -241511, -396059, -392706, -342685, -359658, -358029, -206576, 68653, 326796, 511001, 651572, 669925, 439217, 66657, -177080, -235917, -146794, 29439, 226427, 479979, 713744, 756559, 654303, 524563, 446199, 519661, 723076, 899719, 1006241, 1022029, 819294, 415227, 22370, -192075, -223100, -141540, -14209, 143323, 380607, 747995, 1180779, 1507468, 1582963, 1428057, 1199208, 981936, 768733, 560865, 376285, 289852, 307790, 277029, 179162, 96026, -8070, -224251, -528315, -753414, -802524, -649456, -365041, -120593, 52444, 160160, 87705, -224624, -626173, -919977, -1023496, -1028929, -1175990, -1498262, -1774936, -1917699, -2004150, -2019103, -1923458, -1733234]
10965a733234K20746J00939q9360j03250Q1880K97678L55675K21581P1746N7226
10955e18373R7728J08816R9457K2312j14014j89253j25347P9344K84074L68254
10945A12998L67021K62973J19138j9651o7681k827K0928p0821j29219o4314J6010
10934E44555N4898O2501Q8736N9123o2951j74892j82666j82374k45725j79768
10924b18563N2625J77161J26769Q718j05143p5805O8447J87863J96056R7233k1750
10913D93611j58865j85178L5565J70809L5282j59959k23739j45047o4760p0926
10903b73207p1737L1979O7849n1599q4237Q4527K51329J87088l1821j84887j43208
10892b17924M3602J80164J77005R4013l8992k14754k55180k29474k68228k16471
$$ y = [-1733234, -1512488, -1411549, -1500909, -1604159, -1522279, -1224601, -868926, -647345, -575599, -518373, -420645, -311829, -212372, -190060, -304074, -493327, -618674, -539330, -255256, 112998, 480019, 742992, 862130, 842479, 774798, 771971, 792899, 722078, 592859, 528545, 544555, 599453, 661954, 750690, 809813, 746862, 571970, 389304, 206930, -38795, -218563, -165938, 11223, 137992, 146710, 41567, -34238, 34209, 222072, 418128, 515361, 493611, 334746, 149568, 185133, 355942, 391224, 231265, 7526, -137521, -202281, -273207, -344944, -312965, -245116, -296715, -380952, -296425, -45096, 141992, 110171, -74716, -217924, -174322, 5842, 182847, 276860, 237868, 23114, -232066, -461540, -729768, -946239]
10882i46239r8011k8418J09487L81634O14598O32815M49597J68422j8060o2237
10872A203588j34431l64224n63476m89628l19904j69562n6286r006J06182K24111
10862e72636J47589p3118k83415l62084l25255k58137j44610n853J01093J27462
10852a648964N5866K6362O0296P6038J16937J92833J97646J23772J03478J57815
10842e37921J85812J69147J49853J72708J74363M2228j34257j16289O8881J69342
10832C43867J42131J61910J99930J13306m3679r0743l8311L031J5824Q3844J68758
10821A059868R6441n5340j97672k91300k79829j87983j64474k71737l04168j19498
10811g15692J42718L12075L39378K24862O1920j4835L399M9242R9581J90916K65280
$$ y = [-946239, -1044250, -1072668, -963181, -581547, 33051, 665866, 1115463, 1283885, 1265825, 1203588, 1069157, 704933, 141457, -348171, -668075, -837637, -893923, -902929, -796747, -572636, -425047, -498165, -781580, -1143664, -1468919, -1727056, -1871666, -1877519, -1776426, -1648964, -1593098, -1566736, -1506440, -1430402, -1313465, -1120632, -922986, -799214, -695736, -537921, -352109, -182962, -33109, 139599, 313962, 356190, 221933, 105644, 174525, 343867, 485998, 647908, 847838, 961144, 917465, 826722, 788411, 791442, 807266, 891110, 1059868, 1156309, 1100969, 903297, 611997, 332168, 144185, -20289, -292026, -596194, -715692, -572974, -260899, 78479, 303341, 365261, 350426, 353825, 403067, 502648, 693564, 958844]
10800I58844K00493q032j96499j71320N5850K22008K19689J62784Q9194Q723p9099
10789A462635j88909k72682k23366j23684k6805K4947q74K0049l052j7698M9189
10778F99750P365j34711j24586J1132j1653k36395m58856m91415l10219K795K89446
10767g57347L95287L21526R3980j46519k56207k35802j49865l2965N6983O8217
10757f42712N5764M0353N5849N9644l350K4839J03110N5332p4014j42619j25560
10746e93364j35286j41970q992J69379J79606J04352K1113j07720k17083k58498
10736i88463k62611j71747m4355O8326J68258K26369L56483M60614M27767L33332
10726E73973J20873q9774j78516k30272k52650j64043m3491j4244o5739q6600
$$ y = [958844, 1159337, 1151305, 954806, 783486, 839336, 1061344, 1281033, 1443817, 1533011, 1541734, 1462635, 1273726, 1001044, 777678, 653994, 627189, 652136, 651262, 671311, 668259, 650561, 699750, 707115, 572404, 447818, 458950, 447297, 210902, -247954, -739369, -1049588, -1046793, -757347, -362060, -40534, 53446, -93073, -349280, -585082, -734947, -767912, -710929, -642712, -586948, -546595, -490746, -431102, -434452, -409613, -306503, -251171, -325185, -467804, -593364, -728650, -870620, -879612, -710233, -530627, -426275, -405162, -512882, -729965, -988463, -1251074, -1422821, -1467176, -1398850, -1230592, -1004223, -647740, -187126, 240641, 573973, 694846, 605072, 426556, 196284, -56366, -220409, -263900, -278144, -343883, -430483]
10716d30483k8139k3460l6059k820k9246q6883o2931P1596J98412J70013n3308
10705c13308k28758k04918j33759j14665l7300J35688J88608R1644M0258N4693
10695e21817M7041N5675J58473K86701K97049K91661K41593j032l16444m41833
10685I7067l28947k14466j60743j13276q9816n1651L9369J03812Q7609J09179
10675e21863K13563K62664K34316J16406j9212q4560j18860j68175j75886p5798
10665c37405P4986K05434J96512Q4235N2808L7271j848J0669N5633M8939k3564
10654D03670j70657l27997l60903k69974j42482p0116j1896J03320K34190L07679
10644c05166L07529J45040k8191o412R8308J14064N0183L2882M4886P3920O2784
$$ y = [-430483, -458622, -482082, -518141, -520961, -550207, -637090, -700021, -628425, -430013, -260000, -313308, -542066, -746984, -880743, -995408, -1032708, -897020, -708412, -616768, -576510, -521817, -474776, -419101, -260628, 26073, 323122, 614783, 856376, 855344, 538900, 97067, -231880, -446346, -607089, -720365, -810181, -861832, -822463, -718651, -631042, -521863, -308300, -45636, 188680, 305086, 285874, 201314, 82454, -85721, -261607, -337405, -262419, -56985, 139527, 223762, 276570, 313841, 311993, 322662, 378295, 427234, 403670, 233013, -94984, -455887, -725861, -868343, -938459, -950355, -847035, -612845, -305166, 2363, 147403, 119212, 112800, 211108, 325172, 375355, 408237, 453123, 527043, 589827]
10633E89827n0753k47838m62107n34881m42883k77173j10603m1197j65459k87121
10623b030188k58073j61278j31477j26391p5656L7061K28384M51240N42796M35007
10613a088575K07693p6354l14697l11506l0969K70010M27105N07212M97646K98021
10603C85586O539j98188k77489k37934o3208J09497J20949O9162O6241J6083p4295
10592g7057j09319j14322r9057K2393J29436Q1346P102q049j3630n4651m2564
10581b78372J7816q088o8469j2449J28089J83772J20032O9920J29070J34235l401
10570D12155j42137k07571k39421k45321k60865k52343j75439o7211K7811Q5651
10560a064691R9015P9091P6069R5621J30591J59915J60365J42258J27774J85816
$$ y = [589827, 539074, 291236, -170871, -705752, -1148635, -1425808, -1536411, -1577608, -1743067, -2030188, -2288261, -2449539, -2581016, -2707407, -2783063, -2746002, -2517618, -2066378, -1523582, -1088575, -880882, -957236, -1271933, -1583439, -1614408, -1344398, -917293, -410081, 87565, 385586, 392125, 193937, -83552, -321486, -384694, -275197, -154248, -85086, -18845, -2762, -77057, -186376, -300698, -399755, -377362, -247926, -166580, -159478, -167527, -181157, -235808, -278372, -260556, -268644, -337113, -349562, -221473, -37701, 82331, 152251, 281321, 415556, 412155, 270018, 62447, -176974, -422295, -683160, -935503, -1110942, -1178153, -1150342, -1064691, -965676, -886585, -810516, -714895, -584304, -424389, -264024, -121766, 6008, 191824]
10550A91824K36278K31621K83523L17261J54486j74266n23420p05597o52146m19155
10540a059591j14036J14418K07872J58068K736q1910R785R2517N6905L2322Q7302
10529d93612J38103J17427J64270K55944J91234K2119r1831r1955p0882j59638
10519a8821k19875j08081L6550M5551r0457j22506J06051K96433K67544K05580
10509C97969J89175K03068K20065J11583j60695l95605m51813m03584k50144m9400
10499e89381q424r5705j16050m2442J0203L4844J0664j06660k26506j37552J26001
10488a141008L00542L38946K79775J41640P8974J25709J03770j9015j39831j84651
10478a15149j10257n2959p6784j7235J05351J25848R8046L2433j52677l03658
$$ y = [191824, 428102, 659723, 943246, 1260507, 1414993, 1240727, 717307, 11710, -640436, -1059591, -1173627, -1059209, -851337, -693269, -690533, -772443, -762658, -670141, -613236, -580914, -493612, -355509, -238082, -73812, 182132, 373366, 395485, 303654, 211699, 140817, -18821, -238696, -346777, -310227, -264676, -355133, -477639, -371588, -75155, 192389, 397969, 587144, 790212, 1010277, 1121860, 961165, 565560, 113747, -289837, -539981, -589381, -597805, -693510, -809560, -852002, -841799, -806955, -796291, -902951, -1129457, -1267009, -1141008, -840466, -501520, -221745, -80105, -1131, 124578, 228348, 209333, 69502, -115149, -225406, -278365, -355149, -372384, -267033, -141185, -43139, -10706, -163383, -467041]
10468d67041k69203j82767j06940l3499m8920k9225R7392K20683K75974L50701
10458a92845M69003N43308M77890J96024j31893l01509k78212k43249k68078k44616
10448B5823j04538K5334p561j40179j66263j21192q6466m73Q4398J08430J26243
10437b56444J08001P5821L3599M778j3556n7055n1697k8569j4562P2114Q3898
10426d3672r1199k12201j66102k8151Q4368O6780J6305R3024K40358L52397L91076
10415G02983L55249K32599j5436k50414k93723k20466p9013J34063K58413K25709
10405A049964J24702K6536K0O4676J42262J37408N9534P9555J44595j069k31797
10394A596386l32012l31325k46664j15185k8650P558N229J2911p776o6969p6856
$$ y = [-467041, -736244, -919011, -1025951, -1059450, -1108370, -1137595, -1040203, -819520, -543546, -192845, 276158, 819466, 1297356, 1493380, 1361487, 1059978, 781766, 538517, 270439, 25823, -78715, -53381, -60942, -201121, -367384, -488576, -575042, -575515, -491117, -382687, -256444, -148443, -72622, -39023, -34245, -47801, -104856, -156553, -185122, -199684, -127570, -43672, -134871, -347072, -513174, -541325, -456957, -390177, -373872, -280848, -40490, 311907, 702983, 1058232, 1290831, 1275395, 1024981, 731258, 510792, 431779, 565842, 824255, 1049964, 1174666, 1201202, 1201222, 1265898, 1408160, 1545568, 1605102, 1684657, 1829252, 1828183, 1596386, 1264374, 933049, 686385, 571200, 542550, 550108, 555337, 568248, 560472, 493503, 416647]
10383D16647K027O4095K625o6068j2221R4536J08047l0909k37043k66260j58061
10372h2585r7113m2474N7426J21482P1357p8794j77174j60246j04889K2276J47882
10361c22852J62254J61796J74825J61659J24822R5536R2318P571r5613j08213
10351D54103j7203J82004L59968L71689K30744L0596q3303l4099L006p0276j11483
10340A315746j01977j21373k02134k41174j91625j19712o8278r2981j21402j6470
10330C8620J68921K37579J27025q015k8432M7530R1859K4053j4633O5416Q1195
10319H31118m2795j36167j57923j67378j67577j05753n395R2191R4047j5141j39473
10308G9754k02789j59718j20047j76732k29611j27961L6918N1994j16336k40359
$$ y = [416647, 418674, 482769, 485394, 419326, 407105, 501641, 609688, 578779, 341736, 75476, -82585, -179698, -222172, -164746, -43264, 28093, -50701, -227875, -388121, -493010, -470734, -322852, -160598, 1198, 176023, 337682, 462504, 558040, 650358, 657929, 562316, 454103, 436900, 618904, 978872, 1350561, 1581305, 1611901, 1528598, 1494499, 1497505, 1427229, 1315746, 1213769, 1092396, 890262, 649088, 457463, 337751, 269473, 176492, 55090, 38620, 207541, 445120, 572145, 564130, 535698, 583228, 675087, 699140, 684507, 749923, 831118, 788323, 652156, 494233, 326855, 159278, 53525, 48130, 140321, 234368, 219227, 79754, -123035, -282753, -402800, -579532, -809143, -937104, -900186, -848192, -964528, -1204887]
10298a204887k14656j23147q493J24573K86262L53413K85258J09022k8086M6908
10288c73833J87902K68608L03925K54868O7362j08434k16738l32210l42542j98704
10278d89796r7277j69887k72082l04943k93188k63022j21902J94821M05754L96463
10268a015059L47647L71935L06368P0237j44441k02368j16438K404J0008j26918
10258d96625k97901l23394j63884l1265l0600J3978J70404K77231K02335q089
10248f87810j60873r0792R1462J43920Q7905j4488j89570k34308l8277J47233
10238i45598J34430Q6526Q5648L4313l6668l9474n119K7712Q5862J91302K62888
10227a18178K43674J47753K6194j32796k98624m04098l68447j43963J04924K27335
$$ y = [-1204887, -1419543, -1542690, -1551183, -1426610, -1140348, -786935, -501677, -392655, -420741, -373833, -185931, 82677, 386602, 641470, 708832, 600398, 383660, 51450, -291092, -489796, -587073, -756960, -1029042, -1333985, -1627173, -1890195, -2012097, -1817276, -1411522, -1015059, -667412, -295477, 10891, 81128, -63313, -265681, -382119, -379715, -369707, -496625, -794526, -1117920, -1281804, -1313069, -1343669, -1329691, -1159287, -882056, -679721, -687810, -848683, -939475, -848013, -704093, -616188, -630676, -820246, -1054554, -1092831, -945598, -811168, -724642, -638994, -604681, -641349, -680823, -685942, -658230, -572368, -381066, -118178, 125496, 273249, 299443, 166647, -131977, -536075, -904522, -1048485, -943561, -716226]
10217g16226K70689K91161K68572J42380L390J29J59131L29390K86594K6008j62790
10206H98428j80578j67229j30219r8237r2909p8242j03896j38397j11037j5663
10196b17979R0058J21792J12275J00227N2480r2590k70800l01934j74929O541
10186e74859J85683K79057K58245K03910J93759K23415K07144J38199R7723M5624
10176A257900l2070n8825j8317j3733m3164l2420O7907K35245L84599M30029L77279
10165B554430L00402K57323K19634J45537m567j03643p3453o658R1218J47704
10155C527927R5013r2052k87802k92453k09898j89216j85145j90719k51020l45900
10145A578735m38719m39168m03283l37740k16190p8750O4885J66722J71929J19166
$$ y = [-716226, -445537, -154376, 114196, 256576, 259966, 260095, 419226, 748616, 1035210, 1061218, 898428, 717850, 550621, 420402, 322165, 229256, 151014, 47118, -91279, -202316, -217979, -127921, -6129, 106146, 206373, 258853, 166263, -104537, -406471, -581400, -574859, -389176, -110119, 148126, 352036, 545795, 769210, 976354, 1114553, 1212276, 1257900, 1225830, 1167005, 1148688, 1134955, 1091791, 1059371, 1127278, 1362523, 1747122, 2177151, 2554430, 2854832, 3112155, 3331789, 3477326, 3472759, 3369116, 3295663, 3289005, 3380223, 3527927, 3622940, 3530888, 3243086, 2950633, 2740735, 2551519, 2366374, 2175655, 1924635, 1578735, 1140016, 700848, 297565, -40175, -256365, -335115, -270230, -103508, 68421, 187587]
10135A87587K1925m9080j7095O1939J38437P7148q1645r7793N9655J93123K28681
10124G22882K39422K10572N3722j54414k25640j11174R9344K70796K61164J00382
10114A467056q511p0080j98769k72742j88641j42283j99465j21999k88m199q0644
10103A79435j93403k86464k40422k2175J33461J36620J46204K34116L48569L32361
10093G68302R5555j98866l74852l85234k65258j05867R2135L07806L43615J42451
10083D19787j47701l97136m09172j74969K1000N1864N5814N5089N8284J35090
10073c32050J51387R3437J27005K03143J74127Q4565p456j87689l24664k88281
10063c06476j39116m8787j22181k05211k12057j49326M0137K71388L78403M27480
$$ y = [187587, 209512, 160432, 143337, 205276, 343713, 420861, 339216, 241423, 301078, 494201, 722882, 962304, 1172876, 1226598, 1072184, 846544, 735370, 834714, 1105510, 1366674, 1467056, 1458545, 1388465, 1189696, 916954, 728313, 586030, 386565, 264566, 264278, 260079, 179435, -13968, -300432, -540854, -563029, -429568, -292948, -146744, 87372, 435941, 768302, 863857, 664991, 290139, -95095, -360353, -466220, -374085, -66279, 277336, 419787, 272086, -125050, -534222, -709191, -688191, -636327, -580513, -525424, -467140, -332050, -180663, -87226, 39779, 242922, 417049, 501614, 494158, 306469, -18195, -306476, -445592, -494379, -616560, -821771, -1033828, -1183154, -1143017, -871629, -493226, -65746]
10053f5746M62361L13754K9781j36172j45103n7720O5329K00928K54436J81132
10043A102980Q3334J1789r0529r7115J46383L21585K01434j6066j82875l38089
10033A142831l91575k44862k0647J43422K17111K27894K29868K61120L11895K90992
10023B168049J41381l879j773K3598o2022j56924j44821J772J08652O4581J5701
10012B154315R3550J04382m0086j38389l4650K15865M26646M16284L14985K75860
10002C788762K86587L06148K27343J52639J46121P2754j7635O290J10853K37103
9992E316965K32028J43284K32913L92024L63205K00811q756k21160m23259n81725
9982E646330n54358l94425l79421m93980m82337l32379j72506o2190k9628l9001
$$ y = [-65746, 396615, 710369, 740150, 603978, 458875, 401155, 466484, 667412, 921848, 1102980, 1186314, 1198103, 1107574, 1010459, 1156842, 1478427, 1679861, 1663795, 1480920, 1142831, 751256, 506394, 485747, 629169, 846280, 1074174, 1304042, 1565162, 1877057, 2168049, 2309430, 2305551, 2303778, 2327376, 2265354, 2108430, 1963609, 1965381, 2074033, 2138614, 2154315, 2247865, 2352247, 2312161, 2173772, 2139122, 2354987, 2781633, 3197917, 3512902, 3788762, 4075349, 4381497, 4608840, 4761479, 4907600, 4980354, 4962719, 4969009, 5079862, 5316965, 5548993, 5692277, 5925190, 6317214, 6680419, 6881230, 6872474, 6651314, 6228055, 5646330, 5091972, 4697547, 4318126, 3824146, 3341809, 3009430, 2836924, 2774734, 2745106, 2706105]
9972B706105k7738Q2365J86642J50085J0483j05929j25570j16771j06863j60508
9962B492301k65899l23238k93848k43669j94305j40057j35846j76094j84998j07175
9952D27172J4913M4312m7363j26300j03177P007N8255k0165m0736k7580r4801
9941I1537j63469j97297q2152J35684K18640J86925J15800m9743k45734k88894
9931b78703j29020J827j8783M209J75740M18672N71225N23227L29662J24571o3989
9920A658638k14136k98665m03993m42697l07969o1762J15618J36889J22195O4791
9910C68909p3370j22845j6022L5823l7019l9328R5097K30521K81097L02012L34307
9899A359182K97645K45165J95730J09821p0710l07170l42251j85181n1888K1712
$$ y = [2706105, 2678367, 2760732, 2947374, 3097459, 3107942, 3002013, 2876443, 2759672, 2652809, 2492301, 2226402, 1903164, 1609316, 1365647, 1171342, 1031285, 895439, 719345, 534347, 427172, 442085, 486397, 439034, 312734, 209557, 216564, 274819, 254654, 213918, 186338, 91537, -71932, -269229, -351381, -215697, 2943, 189868, 305668, 255925, 10191, -278703, -407723, -405896, -424679, -420470, -244730, 173942, 745167, 1268394, 1598056, 1722627, 1658638, 1444502, 1145837, 741844, 299147, -8822, -70584, 45034, 181923, 304118, 368909, 295539, 172694, 156672, 192495, 155476, 116148, 211245, 441766, 722863, 1024875, 1359182, 1656827, 1901992, 2097722, 2207543, 2136833, 1829663, 1487412, 1302231, 1250343, 1272055]
9889A272055J00179J74471J64626P8952J04726K26413K23511J20135O422j6083
9879B455407J6372o6893k43186l24758k16330m9866J23245K52634K97569K92692
9869B536886J94686l6567k47104k96146k39226r7540R1449J37236l7235k42879
9859A763560l04654k79231k50061k39459k07159p8224P6912J30492J37740J35701
9849H85617J01527L5240q7757k22379l25342l33769k04588k9378K1724k905O5594
9838i6416J51489J44231N2823q9840r1412J05334K56215J78253k2285j98138k49221
$$ y = [1272055, 1372234, 1546705, 1711331, 1790283, 1895009, 2121422, 2344933, 2465068, 2471490, 2455407, 2471779, 2404886, 2161700, 1836942, 1620612, 1570746, 1693991, 1946625, 2244194, 2536886, 2731572, 2695005, 2447901, 2151755, 1912529, 1814989, 1906438, 2043674, 2006439, 1763560, 1458906, 1179675, 929614, 690155, 482996, 404772, 481684, 612176, 749916, 885617, 987144, 1022384, 934627, 712248, 386906, 53137, -151451, -180829, -159105, -162010, -96416, 55073, 199304, 252127, 162287, 70875, 176209, 432424, 610677, 588392, 390254, 141033]
$$ [...]
##END NTUPLES=NMR SPECTRUM
##END=
