##TITLE=C13_SR164k
 DMSO-d6, 20200 sc

 14.3.2023
##JCAMPDX= 6.0         $$ Bruker NMR JCAMP-DX V2.0
##DATA TYPE= NMR SPECTRUM
##DATA CLASS= NTUPLES
##ORIGIN= UXNMR, Bruker Analytische Messtechnik GmbH
##OWNER= root
$$ XWIN-NMR		Version 3.5
$$ Thu Mar 16 13:44:10 2023 Russian Standard Time (UT+4h)  she@DPX200
##.OBSERVE FREQUENCY= 50.327896
##.OBSERVE NUCLEUS= ^13C
##.ACQUISITION MODE= SIMULTANEOUS
##.ACQUISITION SCHEME= undefined
##.AVERAGES= 20200
##.DIGITISER RES= 17
##SPECTROMETER/DATA SYSTEM= spect
##.PULSE SEQUENCE= zgpg30
##.SOLVENT NAME= CDCl3
##.SHIFT REFERENCE= (INTERNAL, CDCl3, 0, 222.624)
##AUDIT TRAIL= $$ (NUMBER, WHEN, WHO, WHERE, WHAT)
$$ ##TITLE= Audit trail, XWIN-NMR		Version 3.5
$$ ##JCAMPDX= 5.01
$$ ##ORIGIN= Bruker BioSpin GmbH
$$ ##OWNER= she
$$ F:/spectra/data/she/nmr/c13/1/pdata/1/auditp.txt
$$ ##AUDIT TRAIL=  $$ (NUMBER, WHEN, WHO, WHERE, WHAT)
(   1,<2023-03-16 10:52:27.10 +0400>,<she>,<DPX200>,
      <created by zg, POWCHK disabled, PULCHK disabled
       terminated by command 'halt'
       configuration hash MD5:
       00 E9 B6 7A A2 85 ED C7 34 08 36 98 17 FE 4E 26
       data hash MD5: 32K
       46 66 95 C1 17 75 4B 80 2E BC CF 26 F4 8D B2 CD>)
(   2,<2023-03-16 13:41:45.57 +0400>,<she>,<DPX200>,
      <Start of raw data processing
       efp BC_mod = 2 LB = 2 FT_mod = 6 PKNL = 1 PHC0 = -311.8221 PHC1 = 19.01809 SI = 32K 
       data hash MD5: 32K
       2F BE B1 0E D7 D8 8E 9B 95 11 2E 5F 2A 36 0B B8>)
(   3,<2023-03-16 13:41:48.48 +0400>,<she>,<DPX200>,
      <abs ABSG = 5 
       data hash MD5: 32K
       73 43 2A B5 8D 79 24 0A C2 13 D8 F6 F1 62 93 96>)
(   4,<2023-03-16 13:42:08.23 +0400>,<she>,<DPX200>,
      <pk PHC0 = -12.46836 PHC1 = 16.4 
       data hash MD5: 32K
       47 08 F3 F7 B4 2F CA F2 2C 05 9F A5 85 D8 F4 74>)
(   5,<2023-03-16 13:42:11.79 +0400>,<she>,<DPX200>,
      <abs ABSG = 5 
       data hash MD5: 32K
       2C AD B6 3A AF 76 C2 9F 96 09 3D BE 26 8C 81 89>)
$$ ##END=
$$ 
$$ hash MD5
$$ 57 22 6B 0D 82 74 38 93 84 83 6F F9 37 E9 86 65
##$RELAX= 
##$RELAX= 
##$RELAX= 
##$RELAX= 
##$RELAX= 
##$RELAX= 
##$RELAX= 
##$RELAX= 
$$ Bruker specific parameters
$$ --------------------------
##$DU= <F:/spectra>
##$EXPNO= 1
##$NAME= <c13>
##$PROCNO= 1
##$TYPE= <nmr>
##$USER= <she>
##$AMP= (0..31)
100 100 100 100 100 100 100 100 100 100 100 100 100 100 100 100 100 100 
100 100 100 100 100 100 100 100 100 100 100 100 100 100 
##$AQSEQ= 0
##$AQ_mod= 1
##$AUNM= <au_zg>
##$AUTOPOS= <>
##$BF1= 50.322709
##$BF2= 200.13
##$BF3= 50.322709
##$BF4= 500.13
##$BF5= 500.13
##$BF6= 500.13
##$BF7= 500.13
##$BF8= 500.13
##$BYTORDA= 1
##$CFDGTYP= 0
##$CFRGTYP= 5
##$CHEMSTR= <none>
##$CNST= (0..31)
1 1 145 1 1 1 1 1 1 1 1 1 1 1 1 1 1 1 1 1 1 1 1 1 1 1 1 1 1 1 1 1 
##$CPDPRG= <waltz16>
##$CPDPRG1= <>
##$CPDPRG2= <waltz16>
##$CPDPRG3= <>
##$CPDPRG4= <mlev>
##$CPDPRG5= <mlev>
##$CPDPRG6= <mlev>
##$CPDPRG7= <mlev>
##$CPDPRG8= <mlev>
##$CPDPRGB= <>
##$CPDPRGT= <>
##$D= (0..31)
$$ [...]
##$SUBNAM4= <"">
##$SUBNAM5= <"">
##$SUBNAM6= <"">
##$SUBNAM7= <"">
##$SUBNAM8= <"">
##$SUBNAM9= <"">
##$SW= 239.972175391363
##$SWIBOX= (0..15)
0 1 3 0 0 0 0 0 0 0 0 0 0 0 0 0 
##$SW_h= 12077.2946859903
##$TD= 32768
##$TD0= 1
##$TE= 0
##$TE2= 300
##$TE3= 300
##$TEG= 300
##$TL= (0..7)
120 120 120 120 120 120 120 120 
##$TP= (0..7)
150 150 150 150 150 150 150 150 
##$TP07= 0
##$TPNAME0= <>
##$TPNAME1= <>
##$TPNAME2= <>
##$TPNAME3= <>
##$TPNAME4= <>
##$TPNAME5= <>
##$TPNAME6= <>
##$TPNAME7= <>
##$TPOAL= (0..7)
0.5 0.5 0.5 0.5 0.5 0.5 0.5 0.5 
##$TPOFFS= (0..7)
0 0 0 0 0 0 0 0 
##$TUNHIN= 0
##$TUNHOUT= 0
##$TUNXOUT= 0
##$USERA1= <user>
##$USERA2= <user>
##$USERA3= <user>
##$USERA4= <user>
##$USERA5= <user>
##$V9= 5
##$VALIST= <valist>
##$VCLIST= <CCCCCCCCCCCCCCC>
##$VD= 0
##$VDLIST= <DDDDDDDDDDDDDDD>
##$VPLIST= <PPPPPPPPPPPPPPP>
##$VTLIST= <TTTTTTTTTTTTTTT>
##$WBST= 1024
##$WBSW= 4
##$XGAIN= (0..3)
0 0 0 0 
##$XL= 0
##$YL= 0
##$YMAX_a= 114352941
##$YMIN_a= -39568331
##$ZGOPTNS= <>
##$ZL1= 120
##$ZL2= 120
##$ZL3= 120
##$ZL4= 120
##$ABSF1= 222.624
##$ABSF2= -17.3728
##$ABSG= 5
##$ABSL= 3
##$ALPHA= 0
##$AQORDER= 0
##$ASSFAC= 0
##$ASSFACI= 0
##$ASSFACX= 0
##$ASSWID= 0
##$AUNMP= <proc_1d>
##$AZFE= 0.1
##$AZFW= 0.5
##$BCFW= 0
##$BC_mod= 2
##$BYTORDP= 0
##$COROFFS= 0
##$CY= -3
##$DATMOD= 1
##$DC= 0
##$DFILT= <>
##$DTYPP= 0
##$F1P= 0
##$F2P= 0
##$FCOR= 0.5
##$FTSIZE= 32768
##$FT_mod= 6
##$GAMMA= 0
##$GB= 0
##$INTBC= 1
##$INTSCL= 4.134877e-10
##$ISEN= 128
##$LB= 2
##$LEV0= 0
##$LPBIN= 0
##$MAXI= 10000
##$MC2= 0
##$MEAN= 0
##$ME_mod= 0
##$MI= 0.1934396
##$NCOEF= 0
##$NC_proc= 2
##$NLEV= 6
##$NOISF1= 120.0001
##$NOISF2= 80.00006
##$NSP= 0
##$NTH_PI= 0
##$NZP= 0
##$OFFSET= 222.624
##$PC= 1.4
##$PHC0= -324.2905
##$PHC1= 35.41809
##$PH_mod= 1
##$PKNL= yes
##$PPARMOD= 0
##$PSCAL= 0
##$PSIGN= 0
##$REVERSE= no
##$SF= 50.3227315983092
##$SI= 32768
##$SIGF1= 140
##$SIGF2= 120
##$SINO= 11.81781
##$SIOLD= 32768
##$SREGLST= <13C.CDCl3>
##$SSB= 0
##$STSI= 32768
##$STSR= 0
##$SW_p= 12077.2946859903
##$SYMM= 0
##$S_DEV= 0
##$TDeff= 32768
##$TDoff= 0
##$TI= <>
##$TILT= no
##$TM1= 0
##$TM2= 0
##$TOPLEV= 0
##$USERP1= <user>
##$USERP2= <user>
##$USERP3= <user>
##$USERP4= <user>
##$USERP5= <user>
##$WDW= 1
##$XDIM= 32768
##$YMAX_p= 513311469
##$YMIN_p= -2030401
$$ End of Bruker specific parameters
$$ ---------------------------------
##NTUPLES= NMR SPECTRUM
##VAR_NAME=  FREQUENCY,     SPECTRUM/REAL,   SPECTRUM/IMAG
##SYMBOL=    X,             R,               I
##VAR_TYPE=  INDEPENDENT,   DEPENDENT,       DEPENDENT
##VAR_FORM=  AFFN,          ASDF,            ASDF
##VAR_DIM=   32768,         32768,           32768
##UNITS=     HZ,            ARBITRARY UNITS, ARBITRARY UNITS
##FACTOR=    0.368581032318806, 1,           1
##FIRST=     11203.0474430531, 0,            0
##LAST=      -874.247242937185, 0,           0
##MIN=       -874.247242937185, -2030401,    0
##MAX=       11203.0474430531, 513311469,    0
$$ Real data points
##PAGE= N=1
##DATA TABLE= (X++(R..R)), XYDATA
$$ [...]
10872C27998j30189k05664j48388k6628P714m1758r1456j39164j48676p1082L1486
10861f35807L9938m4580p4360q0403j04497n5457O0613J20498Q1935M8630P6675
10850e66815Q8663R2705R9294P0569O1178M3079m5929j36899j15860j908N8353
10839c53570J5p0073p3823L461J02390R4448j0770r6228j05360m4493N829J730
10827e46444j64J3290M6458Q3991P7749L0835k814j9191o5021r3450m2736M5697
10815d71800P0892l0627j41119j39960q2960k9565j859j0991o0392r5780l4314
10804a028475O2204P5438r144p2643n1914p445K4380K9361l7466j31480j31270
10793a278454m1997K1996M6938P9694J43957K40944K74163J74437O5445M4072
$$ plain form
10872 327998 197809 -7855 -156243 -182871 -175157 -216915 -308371 -447535 -596211 -667293 -635807
10861 -635807 -595869 -640449 -714809 -795212 -899709 -955166 -894553 -774055 -692120 -643490 -566815
10850 -566815 -478152 -385447 -286153 -215584 -154406 -111327 -157256 -294155 -410015 -411923 -353570
10839 -353570 -353555 -423628 -497451 -493990 -391600 -297152 -307922 -404150 -509510 -554003 -548174 -546444
10827 -546444 -546608 -533318 -486860 -402869 -325120 -294285 -297099 -316290 -381311 -474761 -517497 -471800
10815 -471800 -400908 -431535 -572654 -712614 -795574 -825139 -826998 -837989 -898381 -994161 -1028475
10804 -1028475 -966271 -890833 -899977 -972620 -1024534 -1031979 -1007599 -978238 -1015704 -1147184 -1278454
10793 -1278454 -1320451 -1298455 -1251517 -1171823 -1027866 -786922 -512759 -338322 -272877 -228805
10783b28805O1301M4756n411k4062K3437Q7245J13331R6600O8084O8905P8344
10772C83725M6537r983o3865j28499j73136j48217r2123p1876p8688j05211r7273
10761e38609j9327O5586J00186J09335J35402J99975K48526J91272O6941m7243
10751E12044j36324k00213k07289j31824l7602O06j2712l0925m4973p9443p3539
10740d42194J9696Q6195N2001j9022n4634n7434k1509J3339N5765J17922J14726
10729a35149Q2969P9993P7140N1415M57p5054j20498o0304l930k851K3022M3235
10717c9555L3615j1447n5757n4304l1498k3729m0654k8899L0378O0064J4383l3944
10705a81347R640R9777J26326J06522M7497n1946j22160j27710r4410k0862J2231
$$ plain form
10783 -228805 -167504 -122748 -128159 -152221 -128784 -41539 71792 168392 236476 305381 383725
10772 383725 430262 420279 356414 227915 54779 -93438 -185561 -257437 -336125 -441336 -538609
10761 -538609 -557936 -492350 -392164 -282829 -147427 52548 301074 492346 559287 512044
10751 512044 375720 175507 -31782 -163606 -201208 -200602 -213314 -244239 -289212 -368655 -442194
10740 -442194 -422498 -336303 -284302 -303324 -357958 -415392 -436901 -423562 -367797 -249875 -135149
10729 -135149 -52180 27813 104953 156368 156825 81771 -38727 -99031 -102961 -105812 -82790 -39555
10717 -39555 -5940 -17387 -73144 -127448 -158946 -182675 -223329 -252228 -221850 -161786 -147403 -181347
10705 -181347 -171707 -71930 54396 160918 208415 156469 34309 -93401 -187811 -208673 -196442
10694a96442k5942r625P5078J15506K5292q9463r9758k1782L4539Q800o0215r8259
10682c42271o4920j2213j0199l6209n3243j9919P2574J38577J12882J9510l2324
10671b27755j7683K3541N7455O9542R5390J48475K05782K19304J64613R5111O1861
10660H95636K4203p6380j57946j73564j49394r0727m0573k0382K2948N2915j3135
10649B73601n0226N325K6739K9846P0284Q0733O7578R2797J52303J66493Q8243
10638A003716N16m1027j07894j67211j35483o5123k0744L662j4348j15596k01860
10627A38608k02715j78312j05862j5264L0226K3334K9502P8364J45450K11612
10617A54943K53808K72202K48587J62865Q7854J02645J56866J11027k1498k7373
$$ plain form
10694 -196442 -222384 -232009 -156931 -41425 -16133 -105596 -205354 -227136 -192597 -183797 -244012 -342271
10682 -342271 -407191 -419404 -429603 -465812 -519055 -538974 -466400 -327823 -214941 -195431 -227755
10671 -227755 -245438 -221897 -164442 -94900 490 148965 354747 574051 738664 833775 895636
10660 895636 919839 843459 685513 511949 362555 271828 231255 210873 233821 286736 273601
10649 273601 223375 228700 255439 285285 355569 436302 503880 596677 748980 915473 1003716
10638 1003716 1004232 963205 855311 688100 552617 487494 466750 470412 456064 340468 138608
10627 138608 -64107 -242419 -348281 -363545 -333319 -309985 -280483 -202119 -56669 154943
10617 154943 408751 680953 929540 1092405 1180259 1282904 1439770 1550797 1529299 1501926
10607A501926Q3637J50699J27019P2986N1990N7185M5696l6988j34500j75768
10597A743882j71828j46806j12589p5480q4100j16983j09130q5339j44666k48682
10587D48279k82957j76827j7926J7848m0801r2234q0653k9058l8714j03142j48679
10576e44864j66922j25769k2695N9309N9590L1986M6647R7905J24268J03119Q6116
10565b51310Q6640R6053Q9497L4900M554O1039J31551J55246J71909J72244Q2365
10554H34688k314k1809l1830k5192k6364o1851r1063j16334p6607L8415P3980
10543D93719m4751j86545j84215n1662L1887l3153r9363q4146m1683k8145m4156
10532b72213n9292l1813K3788L5101k8945q4548p1268m0703n0887l9785J5333
$$ plain form
10607 1501926 1585563 1736262 1863281 1936267 1988257 2045442 2091138 2054150 1919650 1743882
10597 1743882 1572054 1425248 1312659 1237179 1153079 1036096 926966 841627 696961 448279
10587 448279 165322 -11505 -29431 -11583 -52384 -144618 -225271 -254329 -293043 -396185 -544864
10576 -544864 -711786 -837555 -860250 -800941 -741351 -709365 -662718 -564813 -440545 -337426 -251310
10565 -251310 -164670 -68617 20880 55780 60334 121373 252924 408170 580079 752323 834688
10554 834688 832374 810565 778735 753543 727179 665328 574265 457931 381324 419739 493719
10543 493719 448968 262423 78208 26546 58433 25280 -74083 -158229 -199912 -228057 -272213
10532 -272213 -331505 -363318 -339530 -304429 -333374 -417922 -489190 -529893 -580780 -620565 -605232
10521f05232R9726J78126J90633J78048J65087J27342L9712n1858l7204O5129
10511C49509J16645Q7220m015j09696j46804j27123o4801n827l0588r3161j33233
10500a61874j35212r3296l0708K8298K1759n6060j32676j73477j32363L369R3027
10489g69213O8531L1070P830r191O9398J86610K25413J55169M6690l869l2545
10478b4107m4216Q963J11034J75576J06756k9020q4621o1438l6289m1445l3188
10467D8005k558K3559O0782J08108J50151J20173m799j76053k24132r0778L5771
10456D8229N7369l5140j71975k41764j87773m4751O1403P0028L1352k2696j14423
10445e50141k07943j96216r2597k1831l329N8Q764N1756J21878J81856J59325
$$ plain form
10521 -605232 -505506 -327380 -136747 41301 206388 333730 373442 321584 284380 349509
10511 349509 466154 553374 549359 439663 292859 165736 100935 95108 64520 -28641 -161874
10500 -161874 -297086 -390382 -421090 -392792 -371033 -427093 -559769 -733246 -865609 -862240 -769213
10489 -769213 -700682 -669612 -661782 -670973 -601575 -414965 -189552 -34383 12307 8438 -24107
10478 -24107 -68323 -59360 51674 227250 334006 304986 220365 158927 122638 81193 48005
10467 48005 45447 69006 129788 237896 388047 508220 503421 327368 103236 12458 48229
10456 48229 105598 70458 -101517 -343281 -531054 -575805 -514402 -444374 -413022 -435718 -550141
10445 -550141 -758084 -954300 -1046897 -1068728 -1072057 -1071999 -1063235 -1011479 -889601 -707745 -548420
10434e48420J6924j17517j27230p7075r762J09888K28335K20827Q3031l3959n570
10423b60528Q8699J07993M9537P224J3623K4086J1794k9342n0191J385L7414K3912
10411B5606J9042k5718j44806k44660k37348j60062j07607r9038q9488o0998l7647
10400a162724J2222P2744J16300J35160J20956J28714J77099J97978J58808P0119
10390B7376l6830j04355j04380n1878O864L4153M2908M1027Q6946J61165J33074
10379B36070N451j30380k02624k09662j58159o3905k617j2962l4590l4598k2081
10368f30057J9861P6462R5894Q1251M7207k8654r7929q4074k8231M579L3970N0547
10356d59174K4400K1447O0240P0105L2215j7689n0567r3444j17706q4266p8050
$$ plain form
10434 -548420 -531496 -649013 -776243 -853318 -863080 -753192 -524857 -304030 -220999 -254958 -260528
10423 -260528 -171829 -63836 -14299 -7075 6548 30634 42428 13086 -37105 -35720 1694 25606
10411 25606 44648 18930 -125876 -370536 -607884 -767946 -875553 -974591 -1064079 -1125077 -1162724
10400 -1162724 -1150502 -1077758 -961458 -826298 -705342 -576628 -399529 -201551 -42743 27376
10390 27376 -9454 -113809 -218189 -270067 -263203 -229050 -186142 -145115 -58169 102996 236070
10379 236070 241521 111141 -91483 -301145 -459304 -523209 -525826 -538788 -573378 -607976 -630057
10368 -630057 -610196 -533734 -437840 -356589 -309382 -338036 -435965 -520039 -548270 -543691 -509721 -459174
10356 -459174 -434774 -413327 -353087 -282982 -250767 -268456 -319023 -412467 -530173 -614439 -692489
10345f92489j18193p3442N5917J72831K44068K57784K00037J04023j1078j09490
10335B9968r5972j8628K4314M5813O4339O8063M2397n4725j47266j36286o1790
10324b39773j3291l4836q7050j16484q6488k3844J9126O6552N5557p8326j40111
10313f78968m2287M7840M6165L6474M2147N4749R0320J09205O5082N15o1353j45789
10301d35900j51053l3449J02028J98168K07848J33958K2883p4484j17723r2574
10291b40298o8919j21065j86497j42908p275J12632J81314K08307J66636N4379
10281d3694J400M5868R6794J32261J32335N1837o6794j33357j26051p4807k0587
10270d795m3568j18661j38584j07062r8090j26418j30611p9715J2533J18139J57290
$$ plain form
10345 -692489 -810682 -884124 -828207 -655376 -411308 -153524 46513 150536 139458 29968
10335 29968 -66004 -84632 -60318 -14505 49834 117897 160294 105569 -41697 -177983 -239773
10324 -239773 -253064 -287900 -374950 -491434 -577922 -601766 -582640 -516088 -460531 -538857 -678968
10313 -678968 -721255 -673415 -627250 -590776 -548629 -493880 -403560 -294355 -229273 -228758 -290111 -435900
10301 -435900 -586953 -620402 -518374 -320206 -112358 21600 44483 -30001 -147724 -240298
10291 -240298 -309217 -430282 -616779 -759687 -766962 -654330 -473016 -264709 -98073 -43694
10281 -43694 -42294 3574 100368 232629 364964 416801 350007 216650 90599 15792 -4795
10270 -4795 -48363 -167024 -305608 -412670 -510760 -637178 -767789 -847504 -834971 -716832 -559542
10259e59542J27356P8642P8038J06873J07710J52047K34110K12856R3564j441
10249F30213n9580j23809j77643j68852r7247k0948L4406M1227L958n1180q6755
10238g6210p4551m8561m7471m3680n5138j08756r8029K0825J43243J75675J48635
10227f4018J25206O9572k4228n7871J9285Q6323M8540j3259n8332j10209j30155
10216a09146q1085K566M6761L8786L7265K5110o508l9450r6196j69574k24546
10205e76017k12511j45905q1140n3711m2770j2070M876J7153P2220J21549J01813
10194h06513K6037k1954J5579R1941J36343J09092O2626P891m1930l0191j1146
10183d62225r145J2495Q2293J54713J44743P5067m587r1087j33683j24466j11963
$$ plain form
10259 -559542 -432186 -353544 -275506 -168633 -60923 91124 325234 538090 631654 630213
10249 630213 570633 446824 269181 100329 3082 -17866 16540 57767 61725 10545 -76210
10238 -76210 -150761 -199322 -246793 -290473 -345611 -454367 -552396 -531571 -388328 -212653 -64018
10227 -64018 61188 130760 106532 48661 67946 154269 202809 189550 131218 21009 -109146
10216 -109146 -190231 -187665 -140904 -102118 -64853 -39743 -46251 -85701 -181897 -351471 -576017
10205 -576017 -788528 -934433 -1015573 -1069284 -1112054 -1124124 -1119248 -1102095 -1029875 -908326 -806513
10194 -806513 -780476 -802430 -786851 -694910 -558567 -449475 -386849 -378958 -420888 -451079 -462225
10183 -462225 -471370 -458875 -376582 -221869 -77126 -2059 -6646 -97733 -231416 -355882 -467845
10172d67845j07679n6534m283l7119o0792j4750P4378J49309J58774J25156P2728
10161a68657J2816Q764O7388J11031J04899O7418K8816L4110O9398P6677M2028
10150D54688q110o6563j24504r3670j1992Q316q685k9973k9351L4229J64922K33573
10138E22880J62979N1810n9283j41440j45747r7884m8884j4958J9484K4867J2680
10127B86504M4901M1376j5918o7583j31649j63750j49776q4580K873K0584Q244
10116b08774O951M0835J18431J83570J78294N0360p8821j00930q1148q7064j25550
10105a03846j15456l1057M5334Q9623J49233J79959J53740J18982R1306J14658
10095F92476J92183K75774L09932K17779N5624k76P9434J46761J60137J74304
$$ plain form
10172 -467845 -575524 -632058 -636341 -673460 -734252 -749002 -674624 -525315 -366541 -241385 -168657
10161 -168657 -155841 -147077 -79689 31342 136241 203659 232475 266585 335983 412660 454688
10150 454688 446578 380015 255511 161841 149849 158165 149480 119507 90156 124385 289307 522880
10138 522880 685859 737669 678386 536946 391199 293315 244431 229473 248957 273824 286504
10127 286504 331405 372781 356863 289280 157631 -6119 -155895 -240475 -237602 -217018 -208774
10116 -208774 -201823 -160988 -42557 141013 319307 369667 290846 189916 108768 21704 -103846
10105 -103846 -219302 -250359 -205025 -115402 33831 213790 367530 486512 577818 692476
10095 692476 884659 1160433 1470365 1688144 1743768 1743492 1822926 1969687 2129824 2304128
10085B304128J84500J72814J75613J13552o8671k64995l76449l96101l66391l19010
10075A158990k48124j42003m1488J2578j0456j01924k04945j87097n1058M050
10065A88523o7759j05671p5111m7272p370P7783J83318K58040K42122J21167l9890
10054G27880j46408j23085k484J12542J00040l5538j34451j23086o3447k831K4299
10043C33431l4136j43922k00523j85533j88012k23093k02485q5804L7611J14670
10033g77796J81416K23385K00479J17502N575r5744j20455n0268O6779J56333
10023i2794J30243K634j00360j06961o4056k7846J3861O9422R9597R7942J15538
10012A37220Q6802l3217j06233q2315n0524m1727m5238p7956j20407r7069L143
$$ plain form
10085 2304128 2488628 2661442 2837055 2950607 2881936 2616941 2240492 1844391 1478000 1158990
10075 1158990 910866 768863 727375 739953 729497 627573 422628 235531 184473 188523
10065 188523 120764 15093 -60018 -107290 -114660 -36877 146441 404481 646603 767770 727880
10054 727880 581472 458387 455903 568445 668485 632947 498496 375410 311963 309132 333431
10043 333431 299295 155373 -45150 -230683 -418695 -641788 -844273 -930077 -892466 -777796
10033 -777796 -596380 -372995 -172516 -55014 -49439 -145183 -265638 -315906 -249127 -92794
10023 -92794 37449 40083 -60277 -167238 -231294 -259140 -245279 -175857 -76260 21682 137220
10012 137220 224022 190805 84572 2257 -48267 -89994 -135232 -213188 -333595 -430664 -427521
10001d27521J20234J58949R5619K5483k8549j21331j83219j38868p6789k6392
9991f02384N2812J32442J71467J48230P4656K2691J442J846L3588N8867M5847
9980A41504K2706r645k4157k5446m6653j5264L1713J3575K0861R9272J49167J30216
9968D87849J02612O9287M67o6431r8932r4802r8323j09841j01337m8927K5231
9957F6853L7210Q136N184L0557M8737P2883J02604N6642m1625r6784q2511l4081
9945A73805j9824k7438K1597M8529N2621J43201K71417L95582M97710M97366L87512
9934B442078K88450K97456L65133L70404K82384J26088n2155j84489k73141l09142
9924C353066k75157k33399k20962k57439l38635l84886l49226k60321j32729k3332
$$ plain form
10001 -427521 -307287 -148338 -52719 -27236 -55785 -177116 -360335 -499203 -575992 -602384
9991 -602384 -549572 -417130 -245663 -97433 -22777 -86 1356 3202 36790 95657 141504
9980 141504 164210 154565 130408 104962 58309 43045 74758 88333 109194 208466 357633 487849
9968 487849 590461 659748 660215 593784 494852 400050 301727 191886 90549 41622 66853
9957 66853 104063 112199 117383 147940 196677 269560 372164 428806 387181 290397 207886 173805
9945 173805 153981 126543 148140 196669 249290 392491 663908 1059490 1557200 2054566 2442078
9934 2442078 2730528 3027984 3393117 3763521 4045905 4171993 4119838 3935349 3662208 3353066
9924 3353066 3077909 2844510 2623548 2366109 2027474 1642588 1293362 1033041 900312 876980
9914H76980q203p0932j32472j63598k26449k61647k06593j22595q053P1304O8620
9903a83638N1527R2812J54029J01527j3416o2780m9617l0261l2840l5947k1001
9892b9605K7578P2897Q1277M0526m8310q5367q4763n2965O851n806n3215p6031
9880b06933q5468p7970n0900n87O3027P5896K2676J2390P0104J08838J01055L9391
9868G1519l6404m4480J3041N2107L8437j986l5075n0820l9490M4253J53016J57082
9856C21200Q2469N2359M3828J5593l9094p0311m0119O184K4148M4794O1244K153
9844E04448j20017j99776j87852r4071J7218O8153R2473J66716K60517K70961
9834G78770J97252R2990K4171L6231M8321K9888L7948M4182k571p8597j30598
$$ plain form
9914 876980 868777 797845 665373 501775 275326 13679 -192914 -315509 -323562 -252258 -183638
9903 -183638 -132111 -39299 114730 216257 202841 140061 90444 60183 27343 -8604 -29605
9892 -29605 -2027 70870 152147 192673 144363 58996 -25767 -78732 -71881 -77687 -130902 -206933
9880 -206933 -292401 -370371 -421271 -421858 -358831 -282935 -260259 -247869 -177765 -68927 32128 71519
9868 71519 35115 -9365 3676 55783 94220 92234 57159 6339 -33151 11102 164118 321200
9856 321200 403669 456028 499856 515449 476355 406044 365925 372109 396257 441051 502295 504448
9844 504448 384431 184655 -3197 -97268 -80050 -11897 80576 247292 507809 778770
9834 778770 976022 1069012 1093183 1129414 1177735 1207623 1245571 1289753 1287182 1208585 1077987
9823A077987j44022j07938n7673m8192l2003P3425J84170J72731J14487Q6371
9813A319343K3562r6086k01337k10398j33549r480O2208L5582p623l2849o5049
9802F84324j16813j50105j24348o4258m1390l2253N1856J74284K51194K42777
9792H75268J43647L1118l4228r7903j54264j48227o4707M9686Q6773N07j29489
9781E58181j83904j16295J3473J31477K12515K58204K58428J96692R3835j1182
9771A411424j26454k01557j66089q0462K8248J66007K59415K90541K64650J83635
9761B029358J45927J68338J58327R2970M9995O0556O5181K1982k761p257k9714
9750B752902l9474k0733j2228l9673j07670j91108k57979k97319k88111k11496
$$ plain form
9823 1077987 933965 826027 768354 720162 688159 761584 945754 1118485 1232972 1319343
9813 1319343 1342905 1246819 1045482 835084 701535 692055 754263 789845 782222 749373 684324
9802 684324 567511 417406 293058 228800 187410 155157 207013 381297 632491 875268
9792 875268 1018915 1050033 1015805 917902 763638 615411 550704 600390 687163 687670 558181
9781 558181 374277 257982 271455 402932 615447 873651 1132079 1328771 1422606 1411424
9771 1411424 1284970 1083413 917324 836862 865110 1031117 1290532 1581073 1845723 2029358
9761 2029358 2175285 2343623 2501950 2594920 2644915 2705471 2770652 2792634 2789873 2782616 2752902
9750 2752902 2713428 2692695 2680467 2640794 2533124 2342016 2084037 1786718 1498607 1287111
9740A287111p8099Q2442J93751J69938R3908L6172n4683j57979k23587k18863
9730A130111j37575m1173k2539j22852k11493j79689o5819M8677P6114J5484l6963
9719D52283o7454j05277j01815p293O3279N9907R0580R1993q720p5639j1851R0680
9707D70673J71440J95241J35859R3199J00145Q2562J859p8152j24959j58380j18535
9696G70952N489R6329J04448J19631J87459K45539K12036J16447L1232k9961o0525
9685A799076l0354P2044J37482R3516j4323j14084j17300m3242O932O375p1868
9674A724254k18091l46987l61701k20675k269J40206J00696q0713k34678k45030
9664B55012j66367o2868L3553N9414j0547r3036r7684l9699M4343J28160J44111
$$ plain form
9740 1287111 1209012 1291454 1485205 1655143 1749051 1785223 1730540 1572561 1348974 1130111
9730 1130111 992536 951363 928824 805972 594479 414790 348971 397648 473762 489246 452283
9719 452283 384829 279552 177737 170444 233723 293630 384210 476203 467483 391844 379993 470673
9707 470673 642113 837354 973213 1066412 1166557 1249119 1250978 1172826 1047867 889487 770952
9696 770952 776441 872770 977218 1096849 1284308 1529847 1741883 1858330 1889562 1859601 1799076
9685 1799076 1768722 1840766 1978248 2071764 2057441 1943357 1826057 1782815 1789747 1796122 1724254
9674 1724254 1506163 1159176 797475 576800 574531 714737 815433 734720 500042 255012
9664 255012 88645 25777 59330 118744 108197 15161 -82523 -122222 -77879 50281 194392
9653A94392J00677L6895p1690j65229j78468j38027n4627N3402J24725J23655
9643B5705J03371J20603J47500J57986J12735R663j00420j07078q7465j02797
9633B79803r4998q2439j03008j13496m8652P0874J41768Q6140l6634j35986j46328
9622a82956r1277l6438J2763P0314J36195K16939K46474J86046R5755J7937n5184
9611F16568o5268N4196K31990L57246L38431J52031q4231k30472k25124j37706
9601A007661q4123r9914q7268l9116m4288j06559j69047j44291l9192O6686J38794
9590C99343J53882J01800N5623P0747J25189J44988J13033Q6857M1447o8276j75206
9579A049427k07323j65579l5219J24637J32143M9515L700j9774k1367p9513j73581
$$ plain form
9653 194392 295069 331964 260274 95045 -83423 -221450 -276077 -222675 -97950 25705
9643 25705 129076 249679 397179 555165 667900 677563 577143 470065 382600 279803
9633 279803 184805 102366 -642 -114138 -162790 -91916 49852 135992 99358 -36628 -182956
9622 -182956 -274233 -310671 -297908 -227594 -91399 125540 372014 558060 653815 671752 616568
9611 616568 551300 605496 837486 1194732 1533163 1685194 1600963 1370491 1145367 1007661
9601 1007661 923538 823624 736356 697240 652952 546393 377346 233055 193863 260549 399343
9590 399343 553225 655025 710648 781395 906584 1051572 1164605 1251462 1292909 1224633 1049427
9579 1049427 842104 676525 641306 765943 898086 947601 951301 931527 910160 830647 657066
9568F57066j25983R861O1552O1446J14484J60311R6688j1787p0101q3663n4250
9557H15624K0674Q1155J14468N0061j11455j80127r1838J9897O7432P7203M8583
9546I11677N788m165J8705O5903J02345N4103k3392l7498m1099p0556j31820j97652
9534F52339k17673j52808m3219M6109J34015J81544J58257J17874J16712J19801
9524A112951R6510O0439O803n9313j18555j11897l9377p816o8943j24720q3257
9513F62825L244J7437k9720o4265r1726j28264j27596r5116K7393J73586K43970
9502E91768K56933J80455k0277k31531k78203j52692M443Q2882J34149K38460
9492H06387L10539K58107J36851K1538o1810o3556Q885J12643K61891L62887L01345
$$ plain form
9568 657066 531083 540944 602496 663942 778426 938737 1035425 1023638 953537 869874 815624
9557 815624 836298 917453 1031921 1081982 970527 790400 698562 718459 785891 863094 911677
9546 911677 917465 913300 932005 997908 1100253 1154356 1130964 1093466 1052367 981811 849991 652339
9534 652339 434666 281858 238639 284748 418763 600307 758564 876438 993150 1112951
9524 1112951 1209461 1269900 1276703 1217390 1098835 986938 947561 939745 870802 746082 662825
9513 662825 666069 683506 653786 589521 497795 369531 241935 146819 174212 347798 591768
9502 591768 848701 1029156 1008879 777348 499145 346453 350896 433778 567927 806387
9492 806387 1116926 1375033 1511884 1533422 1471612 1408056 1416941 1529584 1791475 2154362 2455707
9481B455707J47983P6120J34387J83675J22789J1006m8601j9090J4398p580k6120
9470C044674j6687l4464j04295j51392j30465p6556m6607p8406j23240j21495
9460B161067j00016j01757j22992j35663r7146P506J25577J71114J13204L8339
9450B059233P600L1799J19689J89315K28130K48767K28001J54657N8611l0330
9440C295472j15919j64431j61090j19874p3730m2863m0887p9409j36310j81137
9430B179822k26868k76152k93966k46133j82404j13653n3838l4595m9228k9696
9420F73289J0875M6529R4183J44695J32230L3224j7217L8239Q3943L4431n1407
9409A223014q6455n8453K3074J35126J66376J13326R4236J39250J61301J10917
$$ plain form
9481 2455707 2603690 2679810 2814197 2997872 3120661 3131667 3083066 3063976 3078374 3070794 3044674
9470 3044674 3027987 2993523 2889228 2737836 2607371 2530815 2484208 2405802 2282562 2161067
9460 2161067 2061051 1959294 1836302 1700639 1603493 1610999 1736576 1907690 2020894 2059233
9450 2059233 2066833 2098632 2218321 2407636 2635766 2884533 3112534 3267191 3325802 3295472
9440 3295472 3179553 3015122 2854032 2734158 2660428 2617565 2576678 2497269 2360959 2179822
9430 2179822 1952954 1676802 1382836 1136703 954299 840646 786808 752213 702985 673289
9420 673289 684164 730693 824876 969571 1101801 1135025 1117808 1156047 1239990 1274421 1223014
9409 1223014 1136559 1078106 1101180 1236306 1402682 1516008 1610244 1749494 1910795 2021712
9399B021712K6169j2535K76k4700n3809l5519j5209J2426P7773J34577J03438
9388B234599k390q9950r8146m4827j6672l0992K1717Q7103N7363n5619k02066
9377A860120l06941k87435j79364m9457P3355J59848J76897J31379J01281J09443
9367A789126J09213N2491r9449k64393l46420l25599k46861j96381j88191j67488
9357A16048j22935o3843j2821j6248o4547p8201n5393r2602j34743n5114J15038
9346d65361J86753J08741K7388J9918L5488J6385k0730p2794q4874m7764k2531
9335c19381p503L2891P1570M2077m6536r2601p891R6498J15391J25244J72315
9324A82074J85691J19566K4377n0749r3908j12902j55460j83288j46051m0703
$$ plain form
9399 2021712 2047881 2035346 2035622 2010922 1957113 1921594 1906385 1918811 1996584 2131161 2234599
9388 2234599 2232209 2142259 2044113 1999286 1982614 1951622 1973339 2060442 2117805 2062186 1860120
9377 1860120 1553179 1265744 1086380 1036923 1110278 1270126 1447023 1578402 1679683 1789126
9367 1789126 1898339 1950830 1851381 1586988 1240568 914969 668108 471727 283536 116048
9357 116048 -6887 -70730 -83551 -99799 -164346 -242547 -297940 -390542 -525285 -580399 -465361
9346 -465361 -278608 -169867 -142479 -122561 -87073 -70688 -91418 -164212 -249086 -296850 -319381
9335 -319381 -326884 -293993 -222423 -180346 -226882 -319483 -327374 -230876 -115485 9759 182074
9324 182074 367765 487331 511708 460959 367051 254149 98689 -84599 -230650 -271353
9314b71353J18718K19548J88970Q5212j3110m7140K720L3093k5823r5746j17101
9303G7988j18417j35087j62045j51220q6182q560L6027P5235J12301J12754J28139
9292a19067J37651J24054Q9551L7478L4440L1840L669O22m4805j51422j47822
9281c811L20J03598R4021M3893J6723J0062k5612p0596q2116p8265p2271o0930
9269a24984q0776j02807o0775M2882J23857J47704J29335P1723L2055R717K1780
9258B09711O0243L2827n2807j13767j22452j31687j46432r4697k9947M3021J10588
9247b35399Q7631J3794l5850k8756L978M0772Q2380R9567O5082M670q3816k12310
9235a98257k73511j74628L3083J75546J70210J59597J60932R5167L5473L1951
$$ plain form
9314 -271353 -152635 66913 255883 341095 327985 280845 283565 316658 290835 195089 77988
9303 77988 -40429 -175516 -337561 -488781 -574963 -583523 -547496 -472261 -359960 -247206 -119067
9292 -119067 18584 142638 232189 269667 304107 335947 339616 340238 295433 144011 -3811
9281 -3811 -3491 100107 194128 238021 254744 264806 239194 168598 86482 8217 -64054 -124984
9269 -124984 -205760 -308567 -369342 -326460 -202603 -54899 74436 146159 178214 187931 209711
9258 209711 269954 302781 249974 136207 13755 -117932 -264364 -359061 -389008 -345987 -235399
9247 -235399 -147768 -133974 -169824 -198580 -194602 -153830 -71450 28117 93199 97869 14053 -198257
9235 -198257 -471768 -646396 -613313 -437767 -267557 -107960 52972 148139 183612 215563
9225B15563N2247O0977L6708J5272M087k9441m6776J3781J25100J86232J41418
9214G75168J1108j20235j40556q0431n2603p2088j04153r5425Q644R5275P1601
9203B96305m550o3299p4388n5879o6893o4280m6296k7555K8708R9634J00427N756
9191A27690p6066r0275q0333k8182M2372L0423k2777n0291k5475J4995L2048L8934
9179h6937J8114o9027j30735p2931M4217J42334J89093J91100J43855N9288m147
9168D24224J1290P1628O1335j1379o5415n5202k9397k1085q07j0353j9477p742
9156C47620m5383r5274j03773k6150R6257J10378K0441r3989j67202j36637m7644
9145a41356k199J4755L9292R6854J41406J43054J27018Q4599q374j47756k02938
$$ plain form
9225 215563 267810 328787 365495 380767 384854 355413 308637 322418 447518 633750 775168
9214 775168 786276 666041 525485 445054 392451 320363 216210 120785 129429 224704 296305
9203 296305 291755 228456 154068 98189 31296 -32984 -79280 -106835 -78127 21507 121934 127690
9191 127690 51624 -38651 -118984 -147166 -104794 -74371 -97148 -147439 -172914 -157919 -125871 -86937
9179 -86937 -68823 -137850 -268585 -341516 -297299 -154965 34128 225228 369083 428371 424224
9168 424224 435514 507142 568477 557098 491683 436481 407084 385999 385192 374839 355362 347620
9156 347620 302237 206963 103190 77040 173297 283675 304116 210127 42925 -93712 -141356
9145 -141356 -143555 -128800 -89508 7346 148752 291806 418824 503423 495049 347293 144355
9134A44355j42149q8913q6999n1823K8605N9262L8157O4317J29990J53494J27932
9123C76228Q2128J8899l9141m2549n9073j35493j62882r9167o0796j34532k20349
9112d76727j94340n3148Q7589J15926O6748L9152L2425L0736O8863J49285K07147
9101G3656K11035J94791J40856Q297j37966j74385p6357O6712J47041R4418o6792
9090D81306j74419j79775j50185j09213n5982J1096N5242K0832l2931m0034l0151
9079b04214k1993l0081m8125m5939K2811J36445K34533J99857L4410l9420P212
9068B45496N1170J18415J98959J92458J38676O8815n0982j58132k33736k35102
9058C36037j28850l1191k4228n7318m7952p877K5870J7120k0005n0091p5639q7779
$$ plain form
9134 144355 2206 -86707 -173706 -225529 -196924 -137662 -99505 -35188 94802 248296 376228
9123 376228 458356 477255 438114 395565 336492 200999 38117 -61050 -121846 -256378 -476727
9112 -476727 -671067 -724215 -636626 -520700 -453952 -414800 -382375 -351639 -282776 -133491 73656
9101 73656 284691 479482 620338 628635 490669 316284 239927 306639 453680 548098 481306
9090 481306 306887 127112 -23073 -132286 -188268 -177172 -121930 -101098 -134029 -174063 -204214
9079 -204214 -226207 -256288 -304413 -350352 -327541 -191096 43437 243294 277704 238284 245496
9068 245496 296666 415081 614040 806498 945174 1013989 963007 804875 571139 336037
9058 336037 207187 175996 151768 94450 46498 38621 64491 81611 61606 11515 -64124 -151903
9046a51903j06636j29868j17451q3989n2261K7699J57546K03307J11839j6666
9036a58383q9063r3839p9607p5418p7392o3454n3106q3865j13200l3656J30096
9025g90887K11410J74258J10940O8319M3159L1103L9254K8763j7568m5007k5348
9014a71604J5628L2393N823j2289n6031j23884j01944R484Q7940J26588J36063
9003e1833J09885P7265P7961R5173P4727P9019J07181J02176O4693J5587l1945
8992G19889p4138j13531j40079j56293j48875j19022q0040k8204K1619N3112K6629
8981c8933j1398J0513N6511P3664N3999L9330N9380P7615P5146M4586j6150m2990
8969C81273L5708J49937J49925J7076j29734j99043j57545p0680k1396p015k0051
$$ plain form
9046 -151903 -258539 -388407 -505858 -589847 -642108 -614409 -456863 -253556 -141717 -158383
9036 -158383 -247446 -341285 -420892 -496310 -573702 -637156 -690262 -774127 -887327 -920983 -790887
9025 -790887 -579477 -405219 -294279 -225960 -182801 -151698 -112444 -83681 -101249 -146256 -171604
9014 -171604 -155976 -123583 -117760 -130049 -186080 -309964 -411908 -402424 -314484 -187896 -51833
9003 -51833 58052 135317 213278 308451 383178 462197 569378 671554 736247 751834 719889
8992 719889 645751 532220 392141 235848 86973 -32049 -112089 -140293 -118674 -65562 -38933
8981 -38933 -50331 -39818 16693 90357 144356 183686 243066 320681 395827 440413 424263 381273
8969 381273 416981 566918 716843 733919 604185 405142 247597 176917 155521 148506 128455
8958A28455k9958Q40J1958n5666j31955j13863n7147l0118k9720l3577K4550R4937
8946b21264J16205R7794O4212R3613J56461J25573Q832p7985j09308j17946r8766
8935C7421q9282q6074r0468j07272o0669L258K6496L4844J7793j1949k5247M116
8923c47033Q4668J59634J66504J09632P293j19894j83322j61632j13961p7688
8913d75799r7487r5073N258R8731R9922M7722n555K1645J20548J80386J42131
8902D2429J0276j07828j24166p1907N0859J88344K39635J59439K2949q9917j31655
8891A88458r1719l4871R717P1329R9055O8852N1330L845j05391j73960j53005
8880f6360r7017n9423n1435q3563q7326j5859L5742N1484Q6568P9996M0869J1615
$$ plain form
8958 128455 98497 99337 111295 55629 -76326 -190189 -247336 -277454 -307174 -340751 -316201 -221264
8946 -221264 -105059 -7265 56947 150560 307021 432594 441426 363441 254133 136187 37421
8935 37421 -51861 -137935 -228403 -335675 -396344 -393086 -366590 -331746 -313953 -325902 -351149 -347033
8923 -347033 -262365 -102731 63773 173405 180698 60804 -122518 -284150 -398111 -475799
8913 -475799 -573286 -668359 -663101 -564370 -464448 -416726 -422281 -400636 -280088 -99702 42429
8902 42429 52705 -55123 -179289 -251196 -200337 -11993 227642 387081 410030 320113 188458
8891 188458 96739 61868 71585 142914 241969 310821 362151 365996 260605 86645 -66360
8880 -66360 -163377 -222800 -274235 -357798 -445124 -460983 -425241 -373757 -287189 -207193 -166324 -154709
8868a54709J0872Q8411J57638J62760J24966N8045P637j6403n5242r7292j11942
8857A74741j26458j49751j52197j31791j01118k3249O7318J21679J29113O7500
8847a24213j7065k6626J7245M7562K3379m8254j39560k63113k92732j74968m3817
8836a042162J6617K7665M4693P0042N7595l59m6780J3957J45846K06173J46701
8825c60012N1691j9138q166P5387J19161K4030j18049j65928j08149k6612O1123
8814d74662J56028J76270J01568O417p2870j09177p0975l332N3960J30756K04707
8803I8690J68239L5847n5979r0264r0758r098O9966K7488l9913l9035k614L2467
8791A05036M0017J6755o4330j69415j87194q5467L8399J04581J46086J60540Q0667
$$ plain form
8868 -154709 -143837 -55426 102212 264972 389938 447983 455620 439217 383975 286683 174741
8857 174741 48283 -101468 -253665 -385456 -486574 -509823 -442505 -320826 -191713 -124213
8847 -124213 -141278 -167904 -150659 -103097 -79718 -127972 -267532 -530645 -823377 -998345 -1042162
8836 -1042162 -1025545 -997880 -953187 -883145 -825550 -825909 -872689 -858732 -712886 -506713 -360012
8825 -360012 -308321 -327459 -335625 -260238 -141077 -117047 -235096 -401024 -509173 -535785 -474662
8814 -474662 -318634 -142364 -40796 -34379 -107249 -216426 -287401 -290733 -236773 -106017 98690
8803 98690 266929 302776 246797 156533 65775 56677 126643 154131 114218 75183 72569 105036
8791 105036 145053 161808 97478 -71937 -259131 -344598 -306199 -201618 -55532 105008 185675
8780A85675o6427j71043k28967k50766j89586l5005J54736K52541K23054J63262
8770C7474J15972N5275J3494K0604N5180Q7188M7498j8125p6201j40919j78916
8759A8524k02229j56226l0148O9032O0651J4537j014j675l308p477m111P08J4652
8746b28084P4475J17078J23724J44900J15240J1426q8992j25151r6116m1728J5651
8735B2423L9017K9063L1096J06p6034q1922l1337K404M2948P7934N5453K1631
8723A32782K9330N1680M4856P39l7417j8875j6952m6042k8479l90m4296r0539
8711b3603l9965L1964N0115O4393Q0440O6781K4699k2941p6389j12534m7777J03545
8699I8728J98836J72664N0793l8549m2119l4398R130O904o6652j38451j59092
$$ plain form
8780 185675 119248 -51795 -280762 -531528 -721114 -756119 -601383 -348842 -125788 37474
8770 37474 153446 208721 222215 242819 297999 385187 432685 414560 338359 197440 18524
8759 18524 -183705 -339931 -370079 -301047 -240396 -225859 -226873 -228548 -231856 -239333 -243444 -242736 -228084
8746 -228084 -153609 -36531 87193 232093 347333 358759 269767 144616 48500 6772 22423
8735 22423 61440 90503 121599 121705 45671 -36251 -67588 -65184 -22236 55698 111151 132782
8723 132782 162112 213792 258648 259387 221970 203095 186143 140101 111622 111232 66936 -23603
8711 -23603 -63568 -31604 18511 82904 163344 230125 254824 231883 155494 42960 -4817 98728
8699 98728 297564 470228 521021 482472 440353 405955 415085 421989 355337 216886 57794
8688E7794j11063j7979J9979j8372n5824o6316m0187j3115p5217j82660j88485
8677f91445q7852J8382M9863M1090Q0318J42544J27534P0865N6922R9297J33195
8666D0713N6942m3123n1271j6229k6725k7182M0140O3677r514r7333j43450j11565
8654c24920o2611m4649k6271J0827O8540J05302R9536N3615J5814K3437L6343
8643d5037l3385j49132k19043j98305q4672N0406J38711J83727K09912K00388
8633E3570J73223J63770J53038R1346J0561m7990p1343l3759q479j1570j3520
8622D58847m9491j23619j55503q5652M697j2138j10236j99498k57420k09967q6952
8611h26932k8483M8493J99086K59041J65155M1634J7003L9776K7150n252l9484
$$ plain form
8688 57794 -53269 -71248 -51269 -69641 -125465 -191781 -231968 -245083 -320300 -502960 -691445
8677 -691445 -779297 -760915 -711052 -669962 -589644 -447100 -319566 -248701 -191779 -92482 40713
8666 40713 97655 54532 3261 -12968 -39693 -66875 -26735 36942 27428 -69905 -213355 -324920
8654 -324920 -387531 -432180 -458451 -447624 -379084 -273782 -174246 -120631 -104817 -81380 -45037
8643 -45037 -78422 -227554 -446597 -644902 -729574 -679168 -540457 -356730 -146818 53570
8633 53570 226793 390563 543601 634947 645508 597518 526175 492416 483937 472367 458847
8622 458847 409356 285737 130234 44582 49279 37141 -73095 -272593 -530013 -739980 -826932
8611 -826932 -855415 -806922 -607836 -348795 -183640 -142006 -125003 -85227 -58077 -63329 -102813
8600a02813n7727m7606n3041r1587n0287P1297J49863J61419J76164K16745K19754
8589E92181J79339J04268j480q3029j42976j78599j65440j37012j16504p6031
8579b5283q173J6871k7569n2214l2374j1189K3887Q1277J15750J09103L7051m7908
8567A79229p0634m6667R164O4404N2448j9949r7651j58806j64304j20242m9468
8556d22476J127k2125r8719q5441N8589J85129J71186O8573l095p0765j28949
8545c46966j16638l5482P5696J58004J85928J80065J58374Q3747k6315q6142q4017
8534A46254n7652o2664p6139l532R2721J16549Q3728N4095n28p5091j20932q9174
8522G635J6205Q8798R9309J31165J80585J77303J26198P5780Q5515J09836R1765
$$ plain form
8600 -102813 -160540 -208146 -261187 -352774 -403061 -331764 -181901 -20482 155682 372427 592181
8589 592181 771520 875788 874308 791279 648303 469704 304264 167252 50748 -25283
8579 -25283 -33456 -16585 -44154 -96368 -128742 -139931 -116044 -34767 80983 190086 227137 179229
8567 179229 108595 61928 71092 135496 187944 167995 70344 -88462 -252766 -373008 -422476
8556 -422476 -421349 -443474 -542193 -627634 -569045 -383916 -212730 -144157 -147252 -218017 -346966
8545 -346966 -463604 -499086 -423390 -265386 -79458 100607 258981 342728 316413 230271 146254
8534 146254 88602 25938 -50201 -53733 38988 155537 239265 293360 292832 217741 96809 7635
8522 7635 23840 112638 211947 343112 523697 701000 827198 902978 988493 1098329 1190094
8511A190094M0335j0162m8195r9266j24767j21262j24471j44264j70103j72817
8501B15122j10081k1810J382m5699o7031k5000L7618K6048q4599j17714l865J07291
8489h8338J36488J19058Q0143K8018m2572q0222m7469J6045Q0729J62268K38828
8478F02976K49516J89424M3999j01635j13372m5023J0138j5404j26079k27371
8468D67169k01590l1094J31126J67426J27497P6790K7407l685l1832p4787q1985
8457E72442p3653o6718k4507K0879L6513L9383N4950R8873O4183o5181j31722
8446E25442j08325j10699j32435q1309J3110O2440N0458K2806k4419o3818o0521
8435I2730J1509J32656J70268J20000P7222K5439l5278p4142q8949j06594j07504
$$ plain form
8511 1190094 1230429 1220267 1172072 1072806 948039 826777 702306 558042 387939 215122
8501 215122 105041 83231 84613 38914 -28117 -53117 -15499 10549 -74050 -191764 -195629 -88338
8489 -88338 48150 167208 247351 275369 232797 152575 105106 121151 201880 364148 602976
8478 602976 852492 1041916 1085915 984280 870908 825885 836023 820619 694540 467169
8468 467169 265579 234485 365611 533037 660534 737324 764731 761046 729214 654427 572442
8457 572442 498789 432071 407564 428443 464956 504339 559289 658162 722345 657164 525442
8446 525442 417117 306418 173983 92674 105784 168224 218682 241488 217069 153251 92730
8435 92730 104239 236895 407163 527163 604385 629824 594546 520404 431455 324861 217357
8424B17357K924J88483K41351J06344k3448m2521m6037q6349o3573J1151j6593
8413D89089j29213k44039k96660k24774j04201l2409K2152J14484K00539K17580
8403A2548J92889J05327j9535l0778M1728Q9727P4400P750o1086o6254J3463J18358
8391D78537J47485O9719n0461j39103j24238o2351l4986l3906m6854m1049R419
8380A72212N0544N1115L4819N4385J13056J25228Q6617O7933P7212Q0490M7644
8369I61255K1145Q3265J89257J82686O9922J1919M4183K3688p0677j25732m5075
8358A345836J20014J71840Q3476l7454j27110j22984k0029N1371M7467o381m4750
8347A461296k1570N1701J32432J77462J57837N0738j00525j77253j42832q1578
$$ plain form
8424 217357 220281 408764 650115 756459 733011 690490 644453 558104 494531 505682 489089
8413 489089 359876 115837 -180823 -405597 -509798 -542207 -520055 -405571 -205032 12548
8403 12548 205437 310764 291229 260451 302179 391906 466306 474056 412970 346716 360179 478537
8391 478537 626022 695741 645280 506177 381939 319588 284602 250696 203842 162793 172212
8380 172212 222756 273871 308690 363075 476131 601359 687976 755909 833121 913611 961255
8369 961255 982400 1065665 1254922 1437608 1507530 1519449 1563632 1587320 1516643 1390911 1345836
8358 1345836 1465850 1637690 1721166 1683712 1556602 1433618 1413589 1464960 1512427 1506046 1461296
8347 1461296 1439726 1491427 1623859 1801321 1959158 2009896 1909371 1732118 1589286 1507708
8337A507708m7187R757L1879L9614J02026K11824K82921K64674J53232n763j25936
8326B424749j95499k01075j70443j62360j82211j63247r9389j0767Q066j7404
8316A230420M0560J04594P3953K9891J9668K1364L1159L5883L4120J8978j9098
8305A621492m6088l2221p597q082J1020K6743J7003M6279J01160R6298K5126J1130
8293A862263Q2238J26374J01680Q3412Q6413M1492o4391j24247j23394j12337
8283A959503o3542k325p978n9071p0598n5091j5806L9461J03207J45436J48071
8272B121267J36182P5443l1155j04585j29078j21786p2066m55O1562J16549J85869
8261B237747J94165P9878n5130j06793j10575q3047K6937J80140K52964J70532
$$ plain form
8337 1507708 1460521 1470278 1502157 1541771 1643797 1855621 2138542 2403216 2556448 2550685 2424749
8326 2424749 2229250 2028175 1857732 1695372 1513161 1349914 1250525 1239758 1247824 1230420
8316 1230420 1270980 1375574 1449527 1479418 1499086 1520450 1551609 1587492 1621612 1640590 1621492
8305 1621492 1575404 1543183 1535586 1527504 1538524 1565267 1582270 1628549 1729709 1826007 1851133 1862263
8293 1862263 1944501 2070875 2172555 2255967 2342380 2383872 2319481 2195234 2071840 1959503
8283 1959503 1895961 1893636 1885658 1826587 1755989 1700898 1685092 1724553 1827760 1973196 2121267
8272 2121267 2257449 2332892 2301737 2197152 2068074 1946288 1874222 1873767 1935329 2051878 2237747
8261 2237747 2431912 2511790 2456660 2349867 2239292 2156245 2183182 2363322 2616286 2786818
8251B786818L5946k4175n7014j22017j44818r8050m2177J4515O5611R3467J04718
8240B612824P5572L3078O4915J27420J43067J18884P3853J2785q8253j40928r2181
8229B941036J3081J47048K46677K65608K24247R6626q6175k29458k58929k57940
8219C101821k85512k33654r4215J6507R1868J32667J08155L5440k7526j7370N7340
8208B885521J18729J35298J12610M6813Q295K933k0197o2997j06511j10734q0060
8197B929700m4186k170M4317R5639J38564J60017J20790M4144L6513J13895J21362
8186C758585N8819L8640M4022N6387N8338l1771j66239j80770o1902N5494P9240
8175C708843L5178P365M4546R4388J07216J03935P8903O7580J13026J79073J49335
$$ plain form
8251 2786818 2822764 2798589 2741575 2619558 2474740 2376690 2334513 2349028 2414639 2508106 2612824
8240 2612824 2688396 2721474 2786389 2913809 3056876 3175760 3249613 3262398 3174145 3033217 2941036
8229 2941036 2954117 3101165 3347842 3613450 3837697 3934323 3848148 3618690 3359761 3101821
8219 3101821 2816309 2582655 2488440 2504947 2596815 2729482 2837637 2873077 2845551 2828181 2885521
8208 2885521 3004250 3139548 3252158 3298971 3307266 3310199 3290002 3227005 3120494 3009760 2929700
8197 2929700 2885514 2883344 2927661 3023300 3161864 3321881 3442671 3486815 3523328 3637223 3758585
8186 3758585 3817404 3856044 3900066 3956453 4014791 3983020 3816781 3636011 3574109 3629603 3708843
8175 3708843 3744021 3751386 3795932 3890320 3997536 4101471 4180374 4247954 4360980 4540053 4689388
8164D689388L1836L149J02640J53652Q1087l8130j19474p6480R0225K36275K68147
8153E422315K33684K33106K40384J76938N6459n1878q9570j5250J24150J59778
8143F490116P3785k7260j02843j66846k12232k35109k12699j46341j09213r5618
8133E255740k7157O7394Q0085K1517k0779k8243j7496N630O2764J31680J49751
8122E680886J35634J31088J23578Q2548L0519l5731j16502j63607j46717j30574
8112E591122j56761j40172n8716J3967L1217L7511M6993Q216k3914J1299J01672
8101E462434K25341K96193K47789J61671O8783l1837q1483o4439m316j59n6212
8090F223765q7446P07J39815J50848N4072j6395k7522n4192q4022K814J63070
$$ plain form
8164 4689388 4721224 4724373 4827013 4980665 5061752 5023622 4904148 4827668 4917893 5154168 5422315
8153 5422315 5655999 5889105 6129489 6306427 6362886 6311008 6221438 6206188 6330338 6490116
8143 6490116 6563901 6536641 6433798 6266952 6054720 5819611 5606912 5460571 5351358 5255740
8133 5255740 5228583 5295977 5376062 5397579 5376800 5348557 5331061 5336691 5399455 5531135 5680886
8122 5680886 5816520 5947608 6071186 6153734 6184253 6148522 6032020 5868413 5721696 5591122
8112 5591122 5434361 5294189 5235473 5249440 5280657 5318168 5365161 5373377 5349463 5360762 5462434
8101 5462434 5687775 5983968 6231757 6393428 6462211 6430374 6348891 6284452 6280136 6279977 6223765
8090 6223765 6136319 6137026 6276841 6427689 6481761 6465366 6437844 6383652 6299630 6302444 6465514
8079F465514K60042K87734K50616J19190L38k0629k8092m5392j8165N0665Q7274
8068G409095M5750k577M1554J69014L19254M39634M69654L87844K11759L6829
8058I527810q2660j12652j1482J29363K13765K11185J19981O3676J03912J61915
8048A0324813J89087J97873J85102J11504O7403J15342J68759J80947K16991K48632
8038A2006453K83895L27632L09848K86683K87885K47071J56307J23034J90460
8029A4219268K80355L23329L17242K86751K39812K52164L74295N37646O69491
8020A7500353P18904O90367O33332N72147N86938P26518Q95067J017560J115703
8011B4456889J239375J392089J563603J741592J932927K204104K513000K795692
$$ plain form
8079 6465514 6725556 7013290 7263906 7383096 7383434 7362805 7334713 7289321 7271156 7321821 7409095
8068 7409095 7454845 7452268 7493822 7662836 7982090 8421724 8891378 9279222 9490981 9527810
8058 9527810 9445150 9332498 9321016 9450379 9664144 9875329 9995310 10058986 10162898 10324813
8048 10324813 10513900 10711773 10896875 11008379 11075782 11191124 11359883 11540830 11757821 12006453
8038 12006453 12290348 12617980 12927828 13214511 13502396 13749467 13905774 14028808 14219268
8029 14219268 14499623 14822952 15140194 15426945 15666757 15918921 16293216 16830862 17500353
8020 17500353 18219257 18909624 19542956 20115103 20702041 21428559 22323626 23341186 24456889
8011 24456889 25696264 27088353 28651956 30393548 32326475 34530579 37043579 39839271
8003C9839271L087579L363862L623555L898994M143727M311966M392763M371509
7995G1033226M200577L765392L010369K001492Q57560k97631j360639k226364
7987H0983982k892330l370815l650769l724609l649228l444646l109184k673940
7979E4468461k204530j803603j463424j144650q48783o37723n49913m99404l90219
7970D4926212j75581P7551K19202K49731K98002L84478N36580P58725R83924J200781
7960D9459605J421054J705488K026494K314721K584564K852833L149776L541568
7952F9056103M042403M610726N267019O063607O924023P737665Q532691R379448
7944A21613685J0321978J1277044J2088108J2673699J2974542J2832595J2097922
$$ plain form
8003 39839271 42926850 46290712 49914267 53813261 57956988 62268954 66661717 71033226
7995 71033226 75233803 78999195 82009564 84011056 84868616 84570985 83210346 80983982
7987 80983982 78091652 74720837 71070068 67345459 63696231 60251585 57142401 54468461
7979 54468461 52263931 50460328 48996904 47852254 47003471 46365748 45815835 45316431 44926212
7970 44926212 44750631 44828182 45047384 45297115 45595117 45979595 46516175 47274900 48258824 49459605
7960 49459605 50880659 52586147 54612641 56927362 59511926 62364759 65514535 69056103
7952 69056103 73098506 77709232 82976251 89039858 95963881 103701546 112234237 121613685
7944 121613685 131935663 143212707 155300815 167974514 180949056 193781651 205879573
7937B05879573J0653923Q419564N451426J933524j786853n258721q155849j0330262
7929B06806325j1656592j2147735j1986247j1348764j0423290r429156q427452
7922A31387089p380378o341946n465349m740410m077123l447059k849734k271442
7914I4813648j746114j363389j106982q47445n02934j29502K15604N20805P80363
7905I0634054J114666J603827K155582K651998L146027L759732M476349N253697
7897A14795932O097241O973259P863611Q820581R933763J1251499J2763764J4429338
7889A92928988J6203521J8095273K0043653K1910750K3565787K4888358K5625272
7882C43261602K5358311K3755723K0689206J6085027J0046373L038927m321654
$$ plain form
7937 205879573 216533496 224953060 230404486 232338010 230551157 225292436 217136587 206806325
7929 206806325 195149733 183001998 171015751 159666987 149243697 139814541 131387089
7922 131387089 124006711 117664765 112199416 107459006 103381883 99934824 97085090 94813648
7914 94813648 93067534 91704145 90597163 89749718 89246784 89117282 89332886 89853691 90634054
7905 90634054 91748720 93352547 95508129 98160127 101306154 105065886 109542235 114795932
7897 114795932 120893173 127866432 135730043 144550624 154484387 165735886 178499650 192928988
7889 192928988 209132509 227227782 247271435 269182185 292747972 317636330 343261602
7882 343261602 368619913 392375636 413064842 429149869 439196242 442235169 437913515
7875D37913515j1363909j7339641k1681451k4228562k5182898k4880642k3665282
7868B89571130k1876670j9831698j7706791j5601211j3655484j1920146j0402866
7861A78576264r106312p942425o780375n682132m820366m174127l611575l090705
7853A33368247k607709k156678j674234j156120o15668m7515O07983J308572J944838
7844A28971716K652447L507117M406296N277676O173675P188016Q316329R556221
7836A76049493J0997691J2668280J4517726J6472794J8512460K0665532K2892985
7829B92776961K5045289K6970236K8512124K9286683K8833820K6907113K3371148
7822D81703374J8018981J0924545K664569n978173j4149369k1028552k6059705
$$ plain form
7875 437913515 426549606 409209965 387528514 363299952 338117054 313236412 289571130
7868 289571130 267694460 247862762 230155971 214554760 200899276 188979130 178576264
7861 178576264 169469952 161527527 154747152 149065020 144244654 140070527 136458952 133368247
7853 133368247 130760538 128603860 126929626 125773506 125157838 125110323 125718306 127026878 128971716
7844 128971716 131624163 135131280 139537576 144815252 150988927 158176943 166493272 176049493
7836 176049493 187047184 199715464 214233190 230705984 249218444 269883976 292776961
7829 292776961 317822250 344792486 373304610 402591293 431425113 458332226 481703374
7822 481703374 499722355 510646900 513311469 507333296 493183927 472155375 446095670
7815D46095670k9091186l0276894k9955412k8561074k6473957k4032647k1544100
7808B56160400j9140792j6829271j4747109j3012104j1477297j0015223q681456
7801A62257148p523169o550647n712037m975980m324975l686499l012688k362588
7793A24108565j774204j233650p12036j91583L40608R43140J621152K332229L106980
7784A28541201L912040M720956N617163O663968P850310R116631J0495741J2040502
7776A88958512J3749297J5554019J7381417J9184061K0910624K2522089K3823954
7769C22083973K4466050K4079966K2393867J9234314J4472666Q309714J253039
7762D36293589o073882j2981845j8778844k2984862k5440224k6343132k6000786
$$ plain form
7815 446095670 417004484 386727590 356772178 328211104 301737147 277704500 256160400
7808 256160400 237019608 220190337 205443228 192431124 180953827 170938604 162257148
7801 162257148 154733979 148183332 142471295 137495315 133170340 129483841 126471153 124108565
7793 124108565 122334361 121100711 120388675 120197092 120537700 121480840 123101992 125434221 128541201
7784 128541201 132453241 137174197 142791360 149455328 157305638 166422269 176918010 188958512
7776 188958512 202707809 218261828 235643245 254827306 275737930 298260019 322083973
7769 322083973 346550023 370629989 393023856 412258170 426730836 435040550 436293589
7762 436293589 430219707 417237862 398459018 375474156 350033932 323690800 297690014
7755B97690014k4713739k2842447k0785108j8744150j6758378j4900277j3224332
7748A65721583j1720015j0347881r111925q009720p031038o257204n641873n013758
7740A02588169m348377l747501l225148k747754k332436j921871j471308j079541
7732H1714233p84493m75126o8146L95860Q25976J208092J626091K124133K659445
7723H9226065L235785L927032M749417N605216O453185P333331Q241410R170531
7715A37941972J0065102J0868098J1487655J1709298J1395184J0503672Q974709
7708B12945690O713777L746261K61818l417760o882136r773043j1869542j3078093
7700A78646972j3491186j3314974j2678764j1723804j0655132r610183q662826
$$ plain form
7755 297690014 272976275 250133828 229348720 210604570 193846192 178945915 165721583
7748 165721583 154001568 143653687 134541762 126532042 119501004 113243800 107601927 102588169
7740 102588169 98239792 94492291 91267143 88519389 86186953 84265082 82793774 81714233
7732 81714233 80929740 80454614 80386468 80782328 81608304 82816396 84442487 86566620 89226065
7723 89226065 92461850 96388882 101138299 106743515 113196700 120530031 128771441 137941972
7715 137941972 148007074 158875172 170362827 182072125 193467309 203970981 212945690
7708 212945690 219659467 223405728 223667546 220249786 213367650 203594607 191725065 178646972
7700 178646972 165155786 151840812 139162048 127438244 116783112 107172929 98510103
7693I8510103p764000o895027o065386n304350m688610m224727l838676l467747
7685E6261580l082263k705734k399287k126418j862412j593261j360490j173950
7677C9957765r70022p52465n51224m07376l14191k17773q0245N5145J67714L67786
7667C7255114O64207R95159J296296J492849J636615J832567K131037K458502
7659D9762346K775697L114519L411594L619588L720840L629812L294098K729894
7651G6058388J958258J035560J6996j152962k372471l358924l987808m310656
7643F3886381m423398m346766m125759l847281l556865l253881k921847k588600
7635C4821984k294694k035678j821548j567321j264353j040457r48938q99155
$$ plain form
7693 98510103 90746103 83851076 77785690 72481340 67792730 63568003 59729327 56261580
7685 56261580 53179317 50473583 48074296 45947878 44085466 42492205 41131715 39957765
7677 39957765 38987743 38235278 37684054 37276678 36962487 36744714 36664469 36719614 36887328 37255114
7667 37255114 37919321 38914480 40210776 41703625 43340240 45172807 47303844 49762346
7659 49762346 52538043 55652562 59064156 62683744 66404584 70034396 73328494 76058388
7651 76058388 78016646 79052206 79069202 77916240 75543769 72184845 68197037 63886381
7643 63886381 59462983 55116217 50990458 47143177 43586312 40332431 37410584 34821984
7635 34821984 32527290 30491612 28670064 27102743 25838390 24797933 23848995 22949840
7627B2949840p94796o77279o12435n52548m24403k84481k03542k04189k18286
7618A8977881j89642j70094j65109j09658p0091j11787j70602k27929k83248l28565
7608A7151156l72154m16243m04236l65331l77037l94552l57616l55228m21500
7599A3687259m74172m84945m58017m13105l94767l45498k41582k03908k65473
7590A0405792l45117l62731l31476l30451l25886k30620j20272q9067j21533k05550
7580G943089k31585j99257k18362k72078k60089j57562j05008j24067j57615j82557
7570F034909j91114k37611k85610k31889j59448j16617p6219p5652p4484l5293
7560D550972K3371J1950n4798l5086j2865l4798k2066p15M308j5329q2552j06498
$$ plain form
7627 22949840 22155044 21477765 20865330 20312782 19888379 19603898 19400356 19196167 18977881
7618 18977881 18788239 18618145 18453036 18343378 18273287 18161500 17990898 17762969 17479721 17151156
7608 17151156 16779002 16362759 15958523 15593192 15216155 14821603 14463987 14108759 13687259
7599 13687259 13213087 12728142 12270125 11857020 11462253 11116755 10875173 10671265 10405792
7590 10405792 10060675 9697944 9366468 9036017 8710131 8479511 8359239 8270172 8148639 7943089
7580 7943089 7711504 7512247 7293885 7021807 6761718 6604156 6499148 6375081 6217466 6034909
7570 6034909 5843795 5606184 5320574 5088685 4929237 4812620 4736401 4660749 4586265 4550972
7560 4550972 4574343 4586293 4531495 4496409 4483544 4448746 4426680 4425965 4430273 4414944 4332392 4225894
7548D225894k9172M7095O7195J5089n8719j07670j60002j82415j59092j42881
7538C515322j11158l3725M1893P6503O4310M1522M9153J06385Q8172k6282j41344
7527C670751j39391m2217K1781K7211K0756j746m4675m4107J6832R4942J01637
7516C681774L2149j7094l8134j10440k18117k55268k39998k31760j87615j12276
7506B303221q7839j04226o6993J4525N3782K0866q2779j43819n1283R5395J47060
7495B097910R0564K4176j2806o7410j43148j43431j899J42077J83485J35446L2803
7484B337767m5421q0245p8084o7849n2043j9011K3788R0486J55384J46438Q0182
7473B491392M7767O8426O4379K5125K4825N5552L8695k8705n9384J2577J31830
$$ plain form
7548 4225894 4196722 4243817 4311012 4326101 4267382 4159712 3999710 3817295 3658203 3515322
7538 3515322 3404164 3370439 3412332 3488835 3553145 3594667 3643820 3750205 3838377 3812095 3670751
7527 3670751 3531360 3489143 3510924 3538135 3558891 3557145 3512470 3468363 3485195 3580137 3681774
7516 3681774 3713923 3696829 3658695 3548255 3330138 3074870 2834872 2603112 2415497 2303221
7506 2303221 2215382 2111156 2044163 2058688 2112470 2133336 2050557 1906738 1855455 1950850 2097910
7495 2097910 2188474 2212650 2199844 2132434 1989286 1845855 1843956 1986033 2169518 2304964 2337767
7484 2337767 2292346 2212101 2134017 2066168 2014125 1995114 2018902 2109388 2264772 2411210 2491392
7473 2491392 2539159 2607585 2671964 2697089 2721914 2777466 2816161 2787456 2728072 2740649 2872479
7462B872479J84726J46636Q4807R084m6785k1536j7558j21829k57671l53691l50200
7451B128462k62832j87647j50871r1496n857O9433J16066J00621M4849l87L4739
7440A795080J08583J42020J25526L6611q8462k01243k31695j55063j3702J07408
7430A625063J45451Q9506l303m8310n3779l8716l6395o4420o6326o1131j05968
7419A381672j19728k9114N7476L8573k6150m9810n2145q144J38226K65655J94801
7408A791312J8967r5264j66078k06599j68116k8422J23089J82023J63010J57142
7398A771064K13098J96585Q8563m468q2821j72460k49008k52723j55005j83Q0661
7387A433303K5163o8600p4263J2313P0763P6767J07618J37859J17391O7992L6157
$$ plain form
7462 2872479 3057205 3203841 3288648 3297732 3250947 3229411 3211853 3090024 2832353 2478662 2128462
7451 2128462 1865630 1677983 1527112 1435616 1429759 1499192 1615258 1715879 1760728 1760341 1795080
7440 1795080 1903663 2045683 2171209 2207820 2119358 1918115 1686420 1531357 1517655 1625063
7430 1625063 1770514 1860020 1856717 1808407 1754628 1715912 1679517 1615097 1548771 1487640 1381672
7419 1381672 1261944 1232830 1290306 1328879 1302729 1252919 1200774 1192630 1330856 1596511 1791312
7408 1791312 1810279 1715015 1548937 1342338 1174222 1145800 1268889 1450912 1613922 1771064
7398 1771064 1984162 2180747 2269310 2264842 2182021 2009561 1760553 1507830 1352825 1352642 1433303
7387 1433303 1458466 1389866 1315603 1327916 1398679 1475446 1583064 1720923 1838314 1906306 1942463
7376A942463k2792j28229j99802j98622j62971r6623k097M5513M8133P435p4097
7365A158311j01106o4253l2487l9382m9578m7235o6185q7835p0011k2008J7324
7354E95555K0792L5914N4399N1543M4762P0022Q4889P8967P5899j0141j60203
7343I42398k29498j68575r2486p8529q5107n2509M8594J71018K08776J04176m5942
7332G22316j02082k3704P2734O6759j4008l2717J5246M1433Q4007J98007K98576
7321A326567K65373J26342K9246l4224j25919k02243k09360j88312j73116j53869
7311F60485j18062q2474m1474K9341M3954j6128p1140n2111N365P9859J55685
7300E93300J70921J19809P8272N1164K3385O8838J03779M5792m1953r9852j08653
$$ plain form
7376 1942463 1919671 1791442 1591640 1393018 1230047 1133424 1131327 1176840 1224973 1232408 1158311
7365 1158311 1057205 992952 960465 921083 871505 824270 758085 670250 600239 578231 595555
7354 595555 616347 652261 706660 758203 802965 872987 957876 1036843 1112742 1102601 942398
7343 942398 712900 544325 451839 373310 288203 235694 284288 455306 664082 768258 722316
7332 722316 620234 596530 669264 736023 722015 689298 704544 745977 829984 1027991 1326567
7321 1326567 1591940 1718282 1747528 1713304 1587385 1385142 1175782 987470 814354 660485
7311 660485 542423 459949 418475 447816 491770 475642 404502 352391 357756 437615 593300
7300 593300 764221 884030 962302 1013466 1036851 1105689 1209468 1255260 1213307 1113455 1004802
7289A004802r7871l3034Q5872J66953J74287J58100J70906J10797o2512k25919
7279A452381l05141l26212k63633j20592j0064K9640J08061J86538J86873J71446
7269A109297J87248J73487O8732q2659j54210r4112K0147J02939Q5219Q866m0980
7258A383974k9445J6300M3544P927k9536k7143K7597J15524J78728J76688J32256
7247A996414J11455P8794k3056j59448k24987j50577n9180k1467j0337k9866l6021
7236A471724N6941J40177Q7292K0162Q3024J75693J74116J27740R1906N0580p4147
7225B405208k11965k30944j47094m7024N566L4880N0107k6816j34965j32657n8748
7214A505548L694J4126m1845j04018j26878j38436j09101p2946o3945m1759m7760
$$ plain form
7289 1004802 906931 873897 959769 1126722 1301009 1459109 1630015 1740812 1678300 1452381
7279 1452381 1147240 821028 557395 436803 426739 456379 564440 750978 937851 1109297
7269 1109297 1296545 1470032 1538764 1456105 1301895 1207783 1227930 1330869 1416088 1424954 1383974
7258 1383974 1354529 1370829 1414373 1422300 1392764 1365621 1393218 1508742 1687470 1864158 1996414
7247 1996414 2107869 2186663 2163607 2004159 1779172 1628595 1569415 1547948 1537611 1507745 1471724
7236 1471724 1528665 1668842 1756134 1776296 1859320 2035013 2209129 2336869 2428775 2479355 2405208
7225 2405208 2193243 1962299 1815205 1768181 1773747 1808627 1858734 1831918 1696953 1564296 1505548
7214 1505548 1509242 1523368 1481523 1377505 1250627 1112191 1003090 930144 866199 824440 776680
7203G76680j06261r9266j0353L9617N2486N5939N6649P6426J19196J49773Q5572
7192A196458l7431q8169j03707j45107j14642J3171J40072J80080J25062N6415
7182A222202P992m0816q1440p8895k8025j8220m1313n4050n9717n6510p3032j01963
7170E96213n8258M0258P3836P9625J64834K38814J80779M4471m0331p7115r4276
7159A148850r6369o6618j3940j8624q3791j34429j35836j37537j67055k22897
7149G1754k34650j14638Q2394K25595K68037K12938M5128j21545j44085p7667
7139B13261k900R3183J70698J81445J40582P9934L1644l527q575J5755M9486M5212
7127A006198k2519j11747j30565p2420n176k0401j30857k13786k01187j35884
$$ plain form
7203 776680 670419 571153 560800 600417 652903 708842 765491 841917 961113 1110886 1196458
7192 1196458 1159027 1070858 967151 822044 707402 720573 860645 1040725 1165787 1222202
7182 1222202 1230194 1189378 1107938 1029043 1001018 982798 941485 887435 827718 771208 698176 596213
7170 596213 537955 578213 652049 731674 896508 1135322 1316101 1360572 1320241 1243126 1148850
7159 1148850 1052481 985863 971923 953299 869508 735079 599243 461706 294651 71754
7149 71754 -162896 -277534 -195140 30455 298492 511430 556558 435013 290928 213261
7139 213261 210361 303544 474242 655687 796269 876203 907847 904320 895745 911500 960986 1006198
7127 1006198 983679 871932 741367 668947 663771 643370 512513 298727 97540 -38344
7117c8344q6389m4591K5874R6933J39600J25300N8656J8052M5689J09415J42389
7106E92584R5275L1608L8844M2046o962k9341j8893m5995j02630j01124m6876
7095D48536l290M2690Q9035J25301J39421O6735p2811j45048q8633l6407r3899
7084D71630j94520j71849j5166J06530J54642J68603J17806M5129L8866P8107
7074G99778P3901J2914p1597j30727j26925q9208p3509n7859K806Q4053Q6102
7063E09729n455j16807j49980o2181O1650J18213Q4566K1658p7298j83458j84900
7052A5737n9517K8592j3213o7800o3349N703J39016K38365K00165J22422R0362
7041F36483N7266O5861J22742J21091Q8752O9231J3904k6383q310J7765N2804
$$ plain form
7117 -38344 -124733 -169324 -143450 -46517 93083 218383 277039 295091 340780 450195 592584
7106 592584 687859 719467 758311 800357 793395 764054 745161 699166 596536 495412 448536
7095 448536 445246 487936 576971 702272 841693 908428 835617 690569 601936 565529 471630
7084 471630 277110 105261 90095 196625 351267 519870 637676 682805 721671 799778
7074 799778 873679 886593 814996 684269 557344 468136 394627 336768 339574 423627 509729
7063 509729 504274 387467 237487 175306 236956 355169 439735 461393 384095 200637 15737
7052 15737 -43780 -15188 -28401 -96201 -159550 -153847 -14831 223534 423699 546121 636483
7041 636483 693749 759610 882352 1003443 1092195 1161426 1175330 1148947 1140637 1158402 1211206
7030A211206R0253Q9167M6844q952m8196k3417M0723M3882r773o2177n3778n397
7018A310385K5851J7679l3919o9626n3919j3858K6625L8531N9983J05242R6664
7007A509638J8287o6372j14672j33827j24049j22482j45726j41038q5872l8225
6997E55662l1558n2999q1344q2825m0594K2666J10486J99801K62554K40685J22350
6986A224884j8380j25116j85907j96720j21990m768L2329R481N7857J49249J69213
6975I90132J69299J45699P6098J5467p915O033J9860J2140k5725o0297j02279
6964A238512j38930r3888P949M5548l7735j10859p5315j5710L6825J14606J82552
6953A153555J81433Q7524j6803j7108O8665J52048J46361N6172r7454k64679l21363
$$ plain form
7030 1211206 1301459 1390626 1437470 1428518 1380322 1356905 1397628 1441510 1431737 1369560 1315782 1310385
7018 1310385 1336236 1353915 1319996 1250370 1196451 1182593 1209218 1247749 1307732 1412974 1509638
7007 1509638 1527925 1461553 1346881 1213054 1089005 966523 820797 679759 593887 555662
6997 555662 524104 471105 389761 306936 266342 289008 399494 599295 861849 1102534 1224884
6986 1224884 1206504 1081388 895481 698761 576771 572003 604332 613813 671670 820919 990132
6975 990132 1159431 1305130 1381228 1396695 1388780 1394813 1414673 1426813 1401088 1340791 1238512
6964 1238512 1099582 1005694 1013643 1059191 1021456 910597 835282 819572 856397 971003 1153555
6953 1153555 1334988 1422512 1405709 1388601 1457266 1609314 1755675 1811847 1714393 1449714 1128351
6942A128351k13352k6369J19748J72227J98494K06112K06831K49360L15007L39588
6932B695997K76165J68579J50967K18344K08728J19366O5896P4110J20142J71810
6922D270104J91387J99417J88852J14769J0920l8856o473L8345Q1452J36169J46230
6911E332316J28016J62086K29321K22068J24935N8615O0330O7340J03002J16913
6901F604942O4875p149o9077j24456j80131j94942j66570j18673q7699j07505
6891E613615j82431k95203l29090k35856j76680k23824k98125l63913l60456k58866
6881B889171j72620j45064j39037j15242o9479o7656j04268j17064p2532J9525
6871A905734N5962o1207k38612k86270j81896n0660K238k8238n5279o4162j06021
$$ plain form
6942 1128351 914999 888630 1008378 1180605 1379099 1585211 1792042 2041402 2356409 2695997
6932 2695997 2972162 3140741 3291708 3510052 3718780 3838146 3904042 3978152 4098294 4270104
6922 4270104 4461491 4660908 4849760 4964529 4975449 4936593 4930120 4968465 5049917 5186086 5332316
6911 5332316 5460332 5622418 5851739 6073807 6198742 6257357 6317687 6385027 6488029 6604942
6901 6604942 6669817 6662668 6593591 6469135 6289004 6094062 5927492 5808819 5721120 5613615
6891 5613615 5431184 5135981 4806891 4571035 4394355 4170531 3872406 3508493 3148037 2889171
6881 2889171 2716551 2571487 2432450 2317208 2247729 2180073 2075805 1958741 1886209 1905734
6871 1905734 1961696 1900489 1661877 1375607 1193711 1143051 1145289 1117051 1061772 997610 891589
6860H91589j25661p3457k3619m5059q0167k8456L2857Q464n2040p6907n9160n6358
6848C12026n7375k7277P452K1610J0981k7272m4386j1018P4248J92133K51925
6837G03047J72926q254j70429k79028k70697r8272M2068K3754l5928l1637P685
6826E5235K9312q46q2332j24636p3190L0007P8458O5370N7511Q4862R7344K8031
6814B45126o1442m8501J8219L9737L9296K9370N9660J35759J76681J28615j8794
6803G43726j71586k05935j06474R296L4597M586k4819k0723N7974J70631J79634
6792F70907Q8606Q85n5759p3984o2902n0586k4189J8163K6842N598k6154p3443
6780D43984j16831j36063j35827q1329N2632J70677J75861J10826Q4959R6626
$$ plain form
6860 891589 765928 692471 668852 623793 543626 515170 548027 556491 504451 427544 368384 312026
6848 312026 254651 227374 234826 256436 267417 240145 195759 184741 258989 451122 703047
6837 703047 875973 867719 697290 418262 147565 49293 91361 115115 79187 47550 55235
6826 55235 84547 83701 1369 -123267 -196457 -166450 -87992 -22622 34889 119751 217095 245126
6814 245126 183684 135183 153402 193139 232435 261805 321465 457224 633905 762520 743726
6803 743726 572140 366205 259731 269027 303624 308210 283391 262668 320642 491273 670907
6792 670907 759513 760398 704639 630655 567753 517167 492978 511141 537983 543581 517427 443984
6780 443984 327153 191090 55263 -26066 26566 197243 373104 483930 568889 665515
6770F65515P4171J1047k2467R124M0124M596p0305o1283L1162R0120J11446J09561
6758I92811N8906m9021j72514j88696r5973M0383J37097J43914J25282J18946
6748A111135J13209J08033Q9668O8185O0823M6637M8330O6920O4749L3604k0804
6737A790489o9077o4956k639M0974L6989M9926P6928Q1168N4029M889l6605l8587
6725A923528j8944j238M3262J28929K27422K39910J36506P1970M4343l9609j19724
6714B636355j06561j4329P4249J47466K61385L88619M27625M14949M51634M78205
6704E159597M53327M31715L89025K76410K05065K79810M02060M57919M64168N12837
6694I031933N55152N40632N34706N46400N12342M46905M40736M45192L20159N2933
$$ plain form
6770 665515 739686 750733 728266 737390 777514 782110 711805 650522 681684 771804 883250 992811
6758 992811 1051717 1002696 830182 641486 545513 585896 722993 866907 992189 1111135
6748 1111135 1224344 1332377 1422045 1490230 1551053 1597690 1646020 1712940 1777689 1811293 1790489
6737 1790489 1721412 1656456 1653817 1694791 1731780 1781706 1858634 1939802 1993831 1998720 1962115 1923528
6725 1923528 1904584 1903346 1946608 2075537 2302959 2542869 2679375 2751345 2795688 2756079 2636355
6714 2636355 2529794 2515465 2589714 2737180 2998565 3387184 3814809 4229758 4681392 5159597
6704 5159597 5612924 6044639 6433664 6710074 6915139 7194949 7597009 8054928 8519096 9031933
6694 9031933 9587085 10127717 10662423 11208823 11721165 12168070 12608806 13053998 13374157 13427090
6684A3427090k62185n36287o80149o43668n01715l97393l90346m27711m54649
6675I132987m53114m40207m41725m44452m13384l56174k82686k28305k36831k67927
6665E568182k56840k00989j36070o8031k2323o674j7371p7029r7819p1593r7959
6654D515484j41314j29120n1185P9296J98405K14939J13974l6486j29207j71812
6644D462974j83494j68148k06366k90744l25596k90658k23392j57679j32400j31372
6634B353125j01127n6995l7868o3252q8730j00457j28245j42456j42129r5748
6624A396118N556P5670Q9832P6599J1869p1572r0031o6761k5075L1063M9053O000
6612A488321m9701r6280j51822j95025j40134j0218R2282J46486J34168R4252
$$ plain form
6684 13427090 13164905 12628618 11948469 11304801 10803086 10405693 10015347 9587636 9132987
6675 9132987 8679873 8239666 7797941 7353489 6940105 6583931 6301245 6072940 5836109 5568182
6665 5568182 5311342 5110353 4974283 4906252 4883929 4877255 4859884 4782855 4685036 4613443 4515484
6654 4515484 4374170 4245050 4193865 4273161 4471566 4686505 4800479 4763993 4634786 4462974
6644 4462974 4279480 4111332 3904966 3614222 3288626 2997968 2774576 2616897 2484497 2353125
6634 2353125 2251998 2195003 2157135 2093883 2005153 1904696 1776451 1633995 1491866 1396118
6624 1396118 1401674 1477344 1567176 1643775 1655644 1584072 1494041 1427280 1402205 1433268 1482321 1488321
6612 1488321 1438620 1342340 1190518 995493 855359 845141 937423 1083909 1218077 1312329
6602A312329K2627p2707j38456j51926r4254J4036O8257L9909n143k4404N631
6591I75899L5513l1134j25004j24829o7315j2890O950l9107q3932l4699L0388
6580E29840K8080K5420M8340K1661m7251m8624j0276j5369J3414P6435R6861Q3803
6568H02334L5062j2991k3490o9721j49434j74558j23096k4621M2687R233r7521
6557B13884j48486q2023K8429R6163R9693M8605K4203N2067N3868N2033R4963
6546E33399J04644O4928Q2613J12985P4757J6580o648l1675p5248j47416j73515
6535E55404j15560n0372l8564l3527k389K9330O9189J08570J18441P8599K7233
6524G46354J9407Q881j5713J759N1600O4116M571n2313o2030q7685j09913m8140
$$ plain form
6602 1312329 1334956 1262249 1123793 971867 877613 891649 959906 999815 994672 970268 975899
6591 975899 1011412 980278 855274 730445 663130 650240 657190 618083 534151 499452 529840
6580 529840 557920 583340 631680 653341 606090 557466 547190 531821 545235 621670 718531 802334
6568 802334 837396 824405 800915 731194 581760 407202 284106 259485 302172 311405 213884
6557 213884 65398 -16625 11804 107967 207660 256265 280468 332535 386403 438436 533399
6546 533399 638043 702971 785584 898569 973326 989906 983258 951583 876335 728919 555404
6535 555404 439844 389472 350908 317381 314992 344322 413511 522081 640522 719121 746354
6524 746354 765761 774642 758929 760688 812288 876404 880975 828662 766632 678947 569034 520894
6512E20894P6857J83293J96193R9723j7524o8556m0589K985J0747k2214o5377
6501H76432n2973n260J4554K2767J4008n1870j30187j23088K8105J59812J54895
6490I07195Q5593L8693J4014l9953j15656j56171j51209q3170O2508J57993J37603
6479H57440N1577m0325m2263N4077J24036O3461n0933q5234l0180M1400R6926
6468A039982J29495R8392j7600j19272j39521j21987j41782j45693m8538R811
6458E43287p0367j39687l5767J59782K49430J80265P7142L3794M6281Q6707O3966
6447A194833j0778m1322m6897n9901q1654j26581k18176k65254j75703m499J23063
6436B87131J09569K2702p584L5512J09072J60233J25982M6191l3270p6678p5469
$$ plain form
6512 520894 597751 781044 977237 1076960 1059436 990880 950291 953276 964023 941809 876432
6501 876432 823459 818199 832753 855520 869528 817658 687471 564383 592488 752300 907195
6490 907195 992788 1031481 1045495 1005542 889886 733715 582506 499336 561844 719837 857440
6479 857440 909017 868692 826429 880506 1004542 1068003 1017070 931836 901656 943056 1039982
6468 1039982 1169477 1267869 1250269 1130997 991476 869489 727707 582014 533476 543287
6458 543287 472920 333233 297466 457248 706678 886943 964085 997879 1044160 1130867 1194833
6447 1194833 1184055 1142733 1095836 1035935 954281 827700 609524 344270 168567 164068 287131
6436 287131 396700 419402 411818 447330 556402 716635 842617 888808 855538 778860 703391
6425G03391p8418r4249j04433o1614K8456P8891R6643J18824J14813J25202J74333
6414A101839J83009J26435P7641M7184k0481p4273q3171q9613q5293p791R3660
6403A269146J54001K14677K49259K00671Q1271k5939j05424j45381q8358M4651
6393A848574J14523M8617m5934k9012P2566J24871J59322K45110K40040R7664
6383B876341k1868p492N5633K3780o6305q9415m718O3338j9067j40017j49184
6372B521026p9984j7058M4551R1383M4095j9612l1631j0184O0612R9705O0961
6361B763864k9022p9022r967J33066K37618K19829J14123Q0251J49898J79843
6351C760481J05294O268r2475k08174k56454k42368j90258p0203K7843O5647J09666
$$ plain form
6425 703391 624973 530724 426291 364677 393133 472024 568667 687491 802304 927506 1101839
6414 1101839 1284848 1411283 1488924 1536108 1515627 1441354 1358183 1268570 1183277 1175486 1269146
6403 1269146 1423147 1637824 1887083 2087754 2169025 2143086 2037662 1892281 1803923 1848574
6393 1848574 1963097 2011714 1965780 1936768 2009334 2134205 2293527 2538637 2778677 2876341
6383 2876341 2854473 2846981 2902614 2926394 2860089 2770674 2765956 2829294 2810227 2670210 2521026
6372 2521026 2441042 2423984 2468535 2559918 2604013 2584401 2552770 2542586 2603198 2702903 2763864
6361 2763864 2734842 2655820 2645853 2778919 3016537 3236366 3350489 3430740 3580638 3760481
6351 3760481 3865775 3872043 3779568 3571394 3314940 3072572 2882314 2812111 2839954 2905601 3015267
6340C015267J35106N5133l969J04321K45771K47675J67034J36157J57232J56485
6330D416212Q3136k7320j15599j51291r9409K527L0486J5307M7708Q2288Q2011
6319D366056P0124L0423k7995p8981j31856j83788j74366p0478K5313L0808q956
6308C846304p661Q9549K04253K47925K37357K40495K84420K89393J95338K0870
6298E648243j34821k05060k04568j60199q6297J6410O9970J4285j08606j79118
6288D670239j38168m0264J9002p602n6123l6100K6374O9674J32872J92451J84033
6277E016388R7603p251k5732L9012J01232R1102P330m1405k6679m060k4804r8199
6265E124537j18414p3153p1578j26654j41499j12866m9049K8980P5018O3182j0209
$$ plain form
6340 3015267 3150373 3205506 3201537 3305858 3551629 3799304 3966338 4102495 4259727 4416212
6330 4416212 4499348 4472028 4356429 4205138 4105729 4108256 4138742 4154049 4201757 4284045 4366056
6319 4366056 4436180 4466603 4438608 4359627 4227771 4043983 3869617 3799139 3824452 3855260 3846304
6308 3846304 3838643 3928192 4132445 4380370 4617727 4858222 5142642 5432035 5627373 5648243
6298 5648243 5513422 5308362 5103794 4943595 4857298 4873708 4943678 4957963 4849357 4670239
6288 4670239 4532071 4491807 4510809 4503207 4447084 4410984 4437358 4507032 4639904 4832355 5016388
6277 5016388 5113991 5106740 5081008 5120020 5221252 5312354 5319684 5278279 5251600 5247540 5222736 5124537
6265 5124537 5006123 4932970 4861392 4734738 4593239 4480373 4431324 4460304 4535322 4598504 4588295
6254D588295r0998j61574k10847k08074j37029o7650l5444o0807j75582k65490
6244C174800k63478j79472j01954j16488j21769o7986M1046J56448K00850J62894
6234B884891P1038l7387q5726p113O5372K9824m2454l5101O6113J27964R5658
6223C133079O5793O621j18149j66770j21464q2873n8684k7031m9608j70436k54856
6212B155622j84531j01972j14671j21165n8449P4576K11004K48561J95284J24463
6202B428722O6459k0008j20264j47025j10585q9224r4670j27140j67707j49052
6192A469506j00037l7153O5296J99127K75510K29062R4413k9307q8082o4249J1493
6181B025579L8140M244l8497o3382o9825q8010j52026k02577j62473o1474M0252
$$ plain form
6254 4588295 4497297 4335723 4124876 3916802 3779773 3712123 3676679 3615872 3440290 3174800
6244 3174800 2911322 2731850 2629896 2513408 2391639 2323653 2364699 2521147 2721997 2884891
6234 2884891 2955929 2918542 2832816 2825703 2891075 2920899 2878445 2843344 2909457 3037421 3133079
6223 3133079 3198872 3205493 3087344 2920574 2799110 2716237 2657553 2630522 2580914 2410478 2155622
6212 2155622 1971091 1869119 1754448 1633283 1574834 1649410 1860414 2108975 2304259 2428722
6202 2428722 2495181 2475173 2354909 2207884 2097299 2008075 1913405 1786265 1618558 1469506
6192 1469506 1369469 1332316 1397612 1596739 1872249 2101311 2195724 2166417 2078335 2014086 2025579
6181 2025579 2063719 2067963 2029466 1966084 1896259 1808249 1656223 1453646 1291173 1229699 1269951
6170A269951Q5456Q8143P2883M9105L4071P159k4514j5568j7229o3580q7458p4581
6158A323838n8136l4199j8910J175Q0350J87633K27749J81939J48581J83704K63879
6147B487603L12960K53270J20788L384k7717P0341J52747J03302L7325K1016k6727
6136C508292j30903k14124k65424k81575k18393j28053j03977j09789j16981q1584
6126A857489L8517J70455J99651R5141n4740j19780q1103m8197l4368m380n54
6115B018131l8035k4650N4476J06473P0437k0076j14063k10218k88758k63913
6105A289804j55394j06872j27710p8025K7992J19296J74583J59192N8851o7268
6095A294449j36721j18751n0329J9163L9727L1551J5712J9083P5632J22684J05295
$$ plain form
6170 1269951 1355407 1443550 1516433 1565538 1599609 1606768 1582254 1566686 1549457 1485877 1398419 1323838
6158 1323838 1265702 1231503 1212593 1213768 1294118 1481751 1709500 1891439 2040020 2223724 2487603
6147 2487603 2800563 3053833 3174621 3178005 3150288 3220629 3373376 3476678 3514003 3535019 3508292
6136 3508292 3377389 3163265 2897841 2616266 2397873 2269820 2165843 2056054 1939073 1857489
6126 1857489 1896006 2066461 2266112 2361253 2306513 2186733 2105630 2057433 2023065 2018685 2018131
6115 2018131 1980096 1955446 2009922 2116395 2186832 2166756 2052693 1842475 1553717 1289804
6105 1289804 1134410 1027538 899828 821803 849795 969091 1143674 1302866 1361717 1294449
6095 1294449 1157728 1038977 988648 1007811 1047538 1079089 1094801 1113884 1189516 1312200 1417495
6084A417495O0523L122o9220q9205p7324j39353k21647k80663k75830j58497l782
6073A65619Q9708J16085J43706J62210J31894J20650J55913J79886J38581N0744
6063A454996p593o7518j20261j42097j86163k46134k26630j48989n9951q518m7726
6052A93416p5100o967R4470J42029J15690N1224n3366r3585j1045M4132K9944
6041D30842J127k5846k9507j0894l6060p9771p9402o4561n4709J621Q0426J38833
6029B72099J80150J83197J20119N3459J3949n6922j39694j17318L8091J73574
6019G20704J86772P9516o6646j40101j31867j19509j34224j40581o7010R4620
6009B81674K21415K33501J61951R2796M2774L0779Q2215J26995P1045l3057l4804
$$ plain form
6084 1417495 1478018 1481140 1411920 1322715 1245391 1106038 884391 603728 327898 169401 165619
6073 165619 255327 371412 515118 677328 809222 929872 1085785 1265671 1404252 1454996
6063 1454996 1447403 1379885 1259624 1117527 931364 685230 458600 309611 249660 241142 193416
6052 193416 118316 111349 205819 347848 463538 514762 461396 367811 356766 400898 430842
6041 430842 431969 406123 376616 365722 329662 249891 170489 105928 51219 52840 133266 272099
6029 272099 452249 635446 755565 809024 822973 766051 626357 509039 547130 720704
6019 720704 907476 986992 920346 780245 648378 528869 394645 254064 187054 281674
6009 281674 503089 736590 898541 991337 1034111 1064890 1147105 1274100 1345145 1312088 1277284
5998A277284j0476n8520q4381l2611M7049O9768N5537L7884L904r4592k42151
5987I68695l62695m00461l15896j40105L3732J36111J51665R1965R551m3532p4533
5976E4497q1527n5564J4837R7931J12868P3851O5187N0911J0918L4245R3686R8373
5964E70213M3801K314J2533K2318k368l2888r5070j59167j43493m0448L4912M9835
5952B62492M2409J4762l7826n6967m4224j3071L8289R0282J53961J59630N7961
5941F67698q6874j96672k39127j92365o5212P8886J68950J67303J06096M4684
5931D53367K8248R5335K03975K48243J87978M9173j02601j77099j27784m6194
5921H12641q477l6765j31577k43068k82633k28247j63990j26031l9572P4874J20975
$$ plain form
5998 1277284 1266808 1208288 1123907 1091296 1138345 1208113 1263650 1301534 1305438 1210846 968695
5987 968695 606000 205539 -110357 -250462 -216730 -80619 71046 163011 172562 129030 54497
5976 54497 -27030 -82594 -67757 30174 143042 216893 282080 332991 343909 378154 471840 570213
5964 570213 614014 616328 628861 651179 648811 615923 520853 361686 218193 177745 212657 262492
5952 262492 304901 319663 281837 224870 180646 167575 205864 296146 450107 609737 667698
5941 667698 580824 384152 145025 -47340 -112552 -33666 135284 302587 408683 453367
5931 453367 481615 576950 780925 1029168 1217146 1266319 1163718 986619 858835 812641
5921 812641 804164 767399 635822 392754 110121 -118126 -282116 -408147 -447719 -372845 -251870
5910b51870R8624M2711o287n5507n0234P3569J76751J37814N4146R539p763l5937
5898A85556j05398j57666j05063R812J08140J39961J22020J21937J33185J05763
5888E58247K8631l5193j39532k61624k75871k05783j25867p2103p3725p1943J5396
5877f59367J40244J74755Q0417l7006q0312m9144n9332j17419r8738o238J4607
5866f97533n0576q8793l5904Q9225J74302J44785Q1494O6047N0936L2368O0585
5855a73064J10427J22801Q6775N1252K542n1689o5499k2198j0539q5458j14330
5844a48980m9562J8494O2639O6086L4415L5032P4862Q6006M7263L4288P6428N8538
5832C95509k8693p9636j14442j36918p6824j4201k0969l7427m6528m7759n1839
$$ plain form
5910 -251870 -153246 -110535 -116822 -172329 -222563 -148994 27757 165571 219717 229256 221493 185556
5898 185556 80158 -77508 -182571 -172759 -64619 75342 197362 319299 452484 558247
5888 558247 586878 551685 412153 150529 -125342 -331125 -456992 -529095 -602820 -674763 -659367
5877 -659367 -519123 -344368 -263951 -300957 -381269 -430413 -489745 -607164 -705902 -712140 -697533
5866 -697533 -748109 -836902 -872806 -783581 -609279 -464494 -383000 -316953 -266017 -233649 -173064
5855 -173064 -62637 60164 146939 198191 200733 149044 83545 61347 50808 -34650 -148980
5844 -148980 -198542 -180048 -117409 -51323 -16908 18124 92986 178992 226255 260543 336971 395509
5832 395509 366816 287180 172738 35820 -41004 -55205 -76174 -113601 -160129 -207888 -259727
5821b59727k9982L5455P0820L9271o24k6124k9735r083J7071K6506p341j6559
5809a90052K8169O3360Q5449R7595R7223P5921J6909o8884j38219j06805L603
5798c5731N593j11195j46537r9038o0901j35J11067K12782K36612J75286N7214
5787C45017q0209j99380k75146k24650o7424O7748J21855J03558N1478J4185r878
5776a52846j6878k9209r1849j36673j09067n8226o8729j05194j03778l0162R8188
5765h04423J63104J22045N6819K7327r770n0211o4611o4522k3594P335k909O1472
5753e81938J58833J51129N7781k5440k6462L3347N9836N4949m58j21641j56633
5742c96697o7560J8304O2484Q6789L5220k2433M517O4022J10350J00287M0701
$$ plain form
5821 -259727 -289709 -254254 -183434 -144163 -144787 -170911 -200646 -209729 -192658 -166152 -173493 -190052
5809 -190052 -161883 -98523 -13074 84521 181744 257665 274574 205690 67471 -39334 -35731
5798 -35731 -30138 -141333 -287870 -386908 -447809 -447944 -336877 -124095 112517 287803 345017
5787 345017 264808 65428 -209718 -434368 -501792 -434044 -312189 -208631 -157153 -142968 -152846
5776 -152846 -169724 -198933 -290782 -427455 -536522 -594748 -663477 -768671 -872449 -902611 -804423
5765 -804423 -641319 -519274 -462455 -435128 -444898 -495109 -559720 -624242 -647836 -640501 -643410 -581938
5753 -581938 -423105 -271976 -214195 -239635 -266097 -232750 -172914 -117965 -118423 -240064 -396697
5742 -396697 -464257 -445953 -383469 -296680 -261460 -283893 -279376 -215354 -105004 -4717 35984
5731C5984l591n915K3978M9968K5765k7862o0574j7179O9313J21899J12002J03283
5719D27071J11630L9354n1654o4568n9671k1016M5184M8823M316l0725m9180o0394
5707C39170n9380n0404p0831j37533j51869j23825j27614j53484j58498n5357
5697g49625J35279K77596L05349K24994Q1437J6067O6008J28590J39162R4286
5687G19143K5658l2168l1711k9404q7260j54020j43275m0186M4580K9925j6474
5676B84808l3337q0333j18899m8777K3592J1482j1651k0526l2980m7732n8252
5665a32605k1574K4202K9050J108k5979k8514q848J2929K3328M132m0642o4621
5653b28034j8801M1848Q9085J13525P1908K156O174J8240j7884n0537j17757j69072
$$ plain form
5731 35984 32393 26478 50456 100424 126189 98327 37753 20574 89887 211786 323788 427071
5719 427071 538701 578055 526401 461833 402162 381146 426330 475153 479469 448744 399564 339170
5707 339170 279790 229386 158555 21022 -130847 -254672 -382286 -535770 -694268 -749625
5697 -749625 -614346 -336750 -31401 193593 275030 291097 357105 485695 624857 719143
5687 719143 744801 712633 680922 651518 564258 410238 266963 226777 271357 301282 284808
5676 284808 251471 171138 52239 3462 27054 38536 26885 6359 -26621 -74353 -132605
5665 -132605 -154179 -129977 -100927 -99819 -125798 -154312 -163160 -150231 -126903 -122771 -163413 -228034
5653 -228034 -246835 -204987 -115902 -2377 69531 71687 77861 96101 78217 27680 -90077 -259149
5641b59149j39309n2636L8462K8536o4388j30736j12139L409Q8367M2973m9278
5630f05888r4411r3701q1032l6260N6402J32178J29860L8143r7354j25057R87
5619g76133J26018J79946J74462J06028k1282j36326j30999l2440K6101J7920
5609d66705N183L7054P9538O8246O096n7723q8373j14933j34849j20485n7335
5598h44286L4170J00402J03840P4703J4041m1215o6255q4708n0351J7308R0424
5587f51927J34322J04910N4065M7073N2772J4595j9728J6609M6645L8859N3971
5576a07834J16490J76091J52080P3531K3373J1046k0976j10740j83111j60215
5566c0265j26966j25721j27188j26053r3995j4146R5208J36392N5348l0773J2717
$$ plain form
5641 -259149 -398458 -451094 -412632 -384096 -448484 -579220 -691359 -687950 -599583 -556610 -605888
5630 -605888 -700299 -794000 -875032 -911292 -854890 -722712 -592852 -554709 -652063 -777120 -776133
5619 -776133 -650115 -470169 -295707 -189679 -210961 -347287 -478286 -510726 -484625 -466705
5609 -466705 -461522 -424468 -344930 -276684 -270588 -328311 -416684 -531617 -666466 -786951 -844286
5598 -844286 -810116 -709714 -605874 -531171 -517130 -558345 -624600 -709308 -759659 -742351 -651927
5587 -651927 -517605 -412695 -358630 -311557 -258785 -244190 -263918 -247309 -200664 -161805 -107834
5576 -107834 8656 184747 336827 410358 433731 444777 423801 313061 129950 -30265
5566 -30265 -157231 -282952 -410140 -536193 -630188 -644334 -549126 -412734 -357386 -388159 -375442
5555c75442J24129J45872P2293J0196j7662j3690K3345N3078M0908K6790O4913
5544A54730R5697K3736j47248k72486k25677q0977O457j5128q8546r9224n1570
5533g00236n8575o9657n8013m8200k1001L7655Q3220N1494L0783J06959K42631
5522d02940K78777J47031P951n3931p1670n9378l0649o315L6617P6762M6567m3978
5510g5156j18737j61103k10148k22441j23629K7680J17541J17472Q3194O4163
5500e01164L2011k0247o9172m8581N5274J36123J66896J74241J18068j0916j11465
5489g8932q6220J1576R1449R6842O0373N6239M2815n3787j75573j96581j59174
5478c90973j04669j9464L4649j9101r2974p3115K7317J19000J70437J79900Q9198
$$ plain form
5555 -375442 -251313 -105441 -33148 -22952 -40614 -54304 -30959 22119 63027 89817 154730
5544 154730 250427 274163 126915 -145571 -371248 -452225 -445768 -460896 -549442 -648666 -700236
5533 -700236 -758811 -828468 -886481 -934681 -955682 -918027 -834807 -783313 -752530 -645571 -402940
5522 -402940 -124163 22868 30819 -23112 -94782 -154160 -184809 -191124 -154507 -77745 -31178 -75156
5510 -75156 -193893 -354996 -565144 -787585 -911214 -883534 -765993 -648521 -565327 -501164
5500 -501164 -469153 -489400 -558572 -607153 -551879 -415756 -248860 -74619 43449 32533 -78932
5489 -78932 -165152 -153576 -62127 34715 95088 151327 194142 140355 -35218 -231799 -390973
5478 -390973 -495642 -515106 -480457 -499558 -592532 -665647 -638330 -519330 -348893 -168993 -79795
5467g9795q4920j88276j64685r7167m3122k1705l5661q0052j03229l9074P7462
5456h60224J00448k2455j72370k05765j6222K50030L25313K22881J21746Q6672
5446a69946P3342M8911N5592O2797O1001Q4284R5347Q4472P2369M9491j5356r7051
5434D05253j76483j96937j55548j00422n563J24914J95881J84342J35138M9181
5424D59756l0754r5108j51724j88114j36058k749P0355L5202r707L3184J04913
5413H9196J37287R2017l4124j21307p8423j7446l6025n9242p285L8613m988q5083
5401h6810j04601o0520n2936q7294r8823k7621J17637K22806J89549R7949K660
5390A11996j46758k80194k57121j23017j8722K9219m080q2296r8927m7607j9147
$$ plain form
5467 -79795 -164715 -352991 -517676 -614843 -657965 -679670 -715331 -795383 -898612 -937686 -860224
5456 -860224 -759776 -782231 -954601 -1160366 -1176588 -926558 -601245 -378364 -256618 -169946
5446 -169946 -96604 -47693 7899 70696 131697 215981 311328 395800 468169 517660 502304 405253
5434 405253 228770 31833 -123715 -224137 -229700 -104786 91095 275437 410575 459756
5424 459756 429002 333894 182170 -5944 -142002 -144751 -74396 -39194 -48901 -15717 89196
5413 89196 226483 318500 284376 163069 84646 67200 31175 -28067 -35352 3261 -1727 -86810
5401 -86810 -191411 -251931 -304867 -392161 -490984 -518605 -400968 -178162 11387 109336 111996
5390 111996 -34762 -314956 -572077 -695094 -713816 -684597 -688677 -770973 -869900 -917507 -936654
5379i36654J6339J01857J80464J85365Q4262n6833j50880j36147m9024J6974J04552
5368f39725J64433J01108N137k2571K0031M5745L0112K059j8448l8472k5495M3596
5356c32490Q2277L4373n8441j00023o8957r034M2525Q6200Q2156J0468r7675j83060
5344e11681k01379j98154j89001q8249O7311J95844K54929K52791J60435J5916
5334b41238m7819l1115L9949Q9546N2384j2058l8909r519M1996P0761M7727k7785
5322f6080r3529o6009K9268Q6393Q9058O9503M0936L7157Q9496R4942J6425q9482
5310B38078j93053k34810j63055P160J35600J38890N4890l0920l3716l8346r3456
5299b12738o9198j5857O186M4221P3837R529j34650j95752j39808m6897N2097
$$ plain form
5379 -936654 -920315 -818458 -637994 -452629 -368367 -425200 -576080 -712227 -761251 -744277 -639725
5368 -639725 -475292 -374184 -369047 -391618 -371587 -325842 -295730 -293671 -312119 -350591 -376086 -332490
5356 -332490 -250213 -215840 -274281 -374304 -443261 -452295 -409770 -323570 -241414 -230946 -328621 -511681
5344 -511681 -713060 -911214 -1100215 -1188464 -1121153 -925309 -670380 -417589 -257154 -241238
5334 -241238 -289057 -320172 -280223 -190677 -138293 -150351 -189260 -198779 -156783 -86022 -38295 -66080
5322 -66080 -159609 -225618 -196350 -109957 -20899 48604 89540 126697 216193 311135 327560 238078
5310 238078 45025 -189785 -352840 -345680 -210080 -71190 -16300 -47220 -80936 -119282 -212738
5299 -212738 -281936 -297793 -291607 -247386 -173549 -164020 -298670 -494422 -634230 -681127 -629030
5288f29030J05102R5807P1903Q1559J38773J71021Q9326p4865k21353k39069j46947
5277e57773m7442K5153R2796J56176J45888Q2864M4087J203p0212j29328j71383
5266d27971j68928j00884k7558J2193N1478J09087J23314N7311o213L948Q2030
5255b92193J19945N2042k3762l4300p7708j87535k30891j63058l9625M9337P8277
5244g49471J01487J04275K9294o4551j10781j01688k0356Q9937J56990J63431
5234d01433J46447J34821J00482J9377n7399o2086m2285o3206o6082Q166R4829
5223a88369J11309N6875K5275R5340K04734J86859L1846j05383j56745j58883
5213A02858j40712j38130j57682j80684j40988K0618J28482N3895q6765j40698
$$ plain form
5288 -629030 -523928 -428121 -356218 -274659 -135886 35135 124461 49596 -171757 -410826 -557773
5277 -557773 -605215 -580062 -487266 -331090 -185202 -102338 -58251 -57048 -127260 -256588 -427971
5266 -427971 -596899 -697783 -725341 -713148 -661670 -552583 -429269 -371958 -378171 -374223 -292193
5255 -292193 -172248 -120206 -143968 -178268 -255976 -443511 -674402 -837460 -877085 -827748 -749471
5244 -749471 -647984 -543709 -514415 -578966 -689747 -791435 -811791 -721854 -564864 -401433
5234 -401433 -254986 -120165 -19683 -306 -57705 -119791 -162076 -225282 -291364 -283198 -188369
5223 -188369 -77060 -20185 5090 100430 305164 492023 523869 418486 261741 102858
5213 102858 -37854 -175984 -333666 -514350 -655338 -634720 -506238 -452343 -539108 -679806
5203f79806j17358o4624J3581Q5681J37603J47069J25122R0686L2035n7998j33215
5192d21224j20542q428J13771J49716J29715J07839J06278R0466p754q5783n7005
5181b951J56N9719O6931j0788j04777j48034j18140o1381p3340j12122m7100R8032
5169d53795J80827J61231J00459N2349j2259n4372l290Q7793J31344R6629K4454
5158C11370o9162j92668k32299j61169p7730n7857p6038l3984R0133J94231J42288
5147a62885K1621j4752m682j4088q051J3194m819m6190n2691L2382J79361K61885
5135B00285K00417P0537j2903n5040r2549q9704p3146j33942k05560k02155j25270
5124e19030n3989r1133j25661o0282N2041J24452J31509J11122O3607m006p564
$$ plain form
5203 -679806 -797164 -861788 -848207 -762526 -624923 -477854 -352732 -262046 -230011 -288009 -421224
5192 -421224 -541766 -550194 -436423 -286707 -156992 -49153 57125 147591 139837 54054 -2951
5181 -2951 -2795 56924 123855 113067 8290 -139744 -257884 -319265 -392605 -504727 -551827 -453795
5169 -453795 -272968 -111737 -11278 41071 28812 -25560 -28850 58943 190287 286916 311370
5158 311370 242208 49540 -182759 -343928 -421658 -479515 -555553 -589537 -499404 -305173 -162885
5147 -162885 -141264 -156016 -160698 -174786 -182837 -169643 -174462 -220652 -273343 -240961 -61600 200285
5135 200285 400702 471239 458336 403296 310747 221043 147897 13955 -191605 -393760 -519030
5124 -519030 -573019 -664152 -789813 -850095 -798054 -673602 -542093 -430971 -367364 -371370 -378934
5113c78934J9063J0666l5516p1212r5797j27283j70842j63040m1993J03018J37664
5102h14206O2018r348m5362l9753k4986K828O8698J38786J38501J24978J60992
5091b36854J31601K0140m7324q352J7320o3093j50702j75181j61431j61681j71819
5080a007376j25448p278J16906J65743J40045O7732l4409l7677P4414J62667J78850
5069c05831J20045L0951m818K450M7856M5610k4858J1289O7231J6437m1853n3535
5057h9026o3367q7370p8150n9686l8496q867R076K040l732j6898n5222j05136
5045e94834j87306k70987k68163j53553L7118J91809K39156J99603J52811J37740
5035e16606J13024M4833r7156j88516j45738j8210J22835K02429J84223J31842
$$ plain form
5113 -378934 -359871 -349205 -384721 -455933 -551730 -679013 -849855 -1012895 -1054888 -951870 -814206
5102 -814206 -752188 -761536 -806898 -846651 -871637 -868809 -800111 -661325 -522824 -397846 -236854
5091 -236854 -105253 -85113 -132437 -140789 -123469 -186562 -337264 -512445 -673876 -835557 -1007376
5080 -1007376 -1132824 -1140102 -1023196 -857453 -717408 -649676 -684085 -721762 -647348 -484681 -305831
5069 -305831 -185786 -154835 -159653 -157203 -109347 -63737 -88595 -77306 -10075 6362 -35491 -89026
5057 -89026 -152393 -239763 -317913 -377599 -416095 -424962 -415886 -413846 -417578 -434476 -489698 -594834
5045 -594834 -782140 -1053127 -1321290 -1474843 -1437725 -1245916 -1006760 -807157 -654346 -516606
5035 -516606 -403582 -358749 -455905 -644421 -790159 -808369 -685534 -483105 -298882 -167040
5025a67040J42715J78417J53503O2629n8218j12668n3663K2166J7597j1520l7246
5014A36672j06138j27116q9882r0450j24545j25881m9698M0722J16572J48508
5004b71236P6556O634r431n7056r8837p2323O611P6900P5854K3610N0021J63551
4992b9146K06268J76258J20750P4975L2036l4799l8718M0275P5618Q347r7878
4981E33986j50803j19781j3044J27694K27146K27453J66366J13764J18258K15852
4971A446891L57059M47442M68586L96457K73975J73666P0848l3422j38956k81195
4961C181351l96126m11830l26370k61683k94930l21454k59441j90227k02244j92457
4951C24589q4746L0650P1611M5713J9812l694m4957m1203K9561Q9925R5419K1159
$$ plain form
5025 -167040 -24325 154092 307595 370224 312006 199338 145675 167841 185438 173918 136672
5014 136672 30534 -96582 -186464 -276914 -401459 -527340 -577038 -536316 -419744 -271236
5004 -271236 -194680 -188046 -197477 -254533 -353370 -425693 -419082 -342182 -266328 -242718 -192697 -29146
4992 -29146 177122 353380 474130 549105 581141 546342 507624 547899 623517 631864 533986
4981 533986 383183 263402 250358 378052 605198 832651 999017 1112781 1231039 1446891
4971 1446891 1803950 2251392 2719978 3116435 3390410 3564076 3634924 3601502 3462546 3181351
4961 3181351 2785225 2373395 2047025 1785342 1490412 1168958 909517 719290 517046 324589
4951 324589 239843 270493 342104 387817 407629 403935 358978 317775 347336 437261 532680 553839
4939E53839r0551q6547j3676j3223n5612q8559m9590K9909M5395K040l117L1708
4927B62016O5174Q1675L9379q6219k12355j98866m1008M3516k0986r2917j03393
4916b63984j58096k34398j65940k9138L9046J5811l6824J4641J47451K17932K09004
4905b44495J51698J05387Q4396L0272l2955r5884j39431j19913j05289j49775
4895e15989j57624n3863M4694O3190N3924K6425m4726j41673j56686q4450k8464
4884i95242K5040L6905J0799M6800J51267K66328L01025J98276K6965j28975j73072
4873b33884q8510J1526M6030L2691j5793m7409m5110k0158m1126j32465j54193
4862f88401m5397M9363M2048j6600p1818r0864l1173O6904J37087J58382R4720
$$ plain form
4939 553839 463288 376741 363065 349842 294230 205671 156081 185990 231385 233425 230308 262016
4927 262016 327190 408865 448244 362025 149670 -49196 -90204 -46688 -67674 -160591 -263984
4916 -263984 -422080 -656478 -822418 -851556 -812510 -796699 -833523 -818882 -671431 -453499 -244495
4905 -244495 -92797 12590 96986 127258 94303 -1581 -141012 -260925 -366214 -515989
4895 -515989 -673613 -727476 -682782 -619592 -565668 -539243 -583969 -725642 -882328 -966778 -995242
4884 -995242 -970202 -933297 -922498 -875698 -724431 -458103 -157078 41198 68163 -60812 -233884
4873 -233884 -322394 -310868 -264838 -232147 -247940 -295349 -340459 -360617 -401743 -534208 -688401
4862 -688401 -733798 -684435 -642387 -658987 -730805 -821669 -852842 -785938 -648851 -490469 -395749
4851c95749K0340J8336N3672M7985J0969j2539m2453j01834j84327k04672j22037
4840i12309j0748P6920J13637J10698R0085N3847J184k6611K86M6308P9038J00623
4828b77042R3224O1973L7236K9214L5578N5307J19760J91876J78192J01800N6907
4817F84025j2253j35400k20153k29563j86410j24869l8521L7081O5995N0229j2864
4806a22703j02722j51074j34923j06831p6343l8501J669J3459k0338m1734K0134
4795g59907J35326J60115O5412k1573n4536o9168n7074J6023J35645K24426J86792
4784c8519M8000m6043k8142M751l0461o1395M59O8536L6146p2516j80609k33754
4772e33547j83330p4162J9240P1860N1638j6514m5739l1400K437L0124N2905N3870
$$ plain form
4851 -395749 -375409 -357073 -303401 -255416 -244447 -256986 -299439 -401273 -585600 -790272 -912309
4840 -912309 -923057 -846137 -732500 -621802 -531717 -477870 -476686 -503297 -503011 -456703 -377665 -277042
4828 -277042 -183818 -121845 -84609 -55395 -19817 35490 155250 347126 525318 627118 684025
4817 684025 671772 536372 316219 86656 -99754 -224623 -263144 -226063 -160068 -109839 -122703
4806 -122703 -225425 -376499 -511422 -618253 -694596 -733097 -731428 -717969 -738307 -780041 -759907
4795 -759907 -624581 -464466 -399054 -420627 -475163 -544331 -601405 -585382 -449737 -225311 -38519
4784 -38519 9481 -36562 -64704 -59953 -90414 -151809 -151350 -82814 -46668 -119184 -299793 -533547
4772 -533547 -716877 -791039 -771799 -699939 -648301 -664815 -710554 -741954 -739517 -709393 -656488 -602618
$$ [...]
##END NTUPLES=NMR SPECTRUM
##END=
