##TITLE=C13_SR164.TFA
 CDCl3, 22400 sc

 18.5.2023
##JCAMPDX= 6.0         $$ Bruker NMR JCAMP-DX V2.0
##DATA TYPE= NMR SPECTRUM
##DATA CLASS= NTUPLES
##ORIGIN= UXNMR, Bruker Analytische Messtechnik GmbH
##OWNER= root
$$ XWIN-NMR		Version 3.5
$$ Fri May 19 13:41:21 2023 Russian Standard Time (UT+4h)  she@DPX200
##.OBSERVE FREQUENCY= 50.327896
##.OBSERVE NUCLEUS= ^13C
##.ACQUISITION MODE= SIMULTANEOUS
##.ACQUISITION SCHEME= undefined
##.AVERAGES= 22401
##.DIGITISER RES= 17
##SPECTROMETER/DATA SYSTEM= spect
##.PULSE SEQUENCE= zgpg30
##.SOLVENT NAME= DMSO
##.SHIFT REFERENCE= (INTERNAL, DMSO, 0, 222.624)
##AUDIT TRAIL= $$ (NUMBER, WHEN, WHO, WHERE, WHAT)
$$ ##TITLE= Audit trail, XWIN-NMR		Version 3.5
$$ ##JCAMPDX= 5.01
$$ ##ORIGIN= Bruker BioSpin GmbH
$$ ##OWNER= she
$$ F:/spectra/data/she/nmr/c13/1/pdata/1/auditp.txt
$$ ##AUDIT TRAIL=  $$ (NUMBER, WHEN, WHO, WHERE, WHAT)
(   1,<2023-05-19 13:39:16.14 +0400>,<she>,<DPX200>,
      <created by zg, POWCHK disabled, PULCHK disabled
       terminated by command 'halt'
       configuration hash MD5:
       00 E9 B6 7A A2 85 ED C7 34 08 36 98 17 FE 4E 26
       data hash MD5: 32K
       84 B8 BA 36 B0 44 4C 5F A3 16 90 CB 1F CE 43 D6>)
(   2,<2023-05-19 13:39:21.01 +0400>,<she>,<DPX200>,
      <Start of raw data processing
       efp BC_mod = 2 LB = 2 FT_mod = 6 PKNL = 1 PHC0 = -371.4602 PHC1 = 24.76414 SI = 32K 
       data hash MD5: 32K
       51 B2 BB B0 68 A3 11 79 4E 80 21 0A B1 2C 81 7B>)
(   3,<2023-05-19 13:39:28.62 +0400>,<she>,<DPX200>,
      <abs ABSG = 5 
       data hash MD5: 32K
       B1 F1 C4 49 B1 13 7D 3F A6 C9 86 55 1E 2C 92 65>)
(   4,<2023-05-19 13:39:54.09 +0400>,<she>,<DPX200>,
      <pk PHC0 = -9.469221 PHC1 = 17.4 
       data hash MD5: 32K
       8E 16 8A 0C 7A 09 23 1F C5 94 4E D8 2C F3 8B 3C>)
(   5,<2023-05-19 13:39:57.50 +0400>,<she>,<DPX200>,
      <abs ABSG = 5 
       data hash MD5: 32K
       80 32 E3 44 38 5B 68 B2 8B 01 DE 1C B6 DF 72 37>)
(   6,<2023-05-19 13:40:31.00 +0400>,<she>,<DPX200>,
      <pk PHC0 = 1.918216 PHC1 = -4.8 
       data hash MD5: 32K
       2F 11 E1 14 07 95 6A 05 FC B4 2E A4 D4 2F 47 CC>)
(   7,<2023-05-19 13:40:34.64 +0400>,<she>,<DPX200>,
      <abs ABSG = 5 
       data hash MD5: 32K
       7D D8 E0 1B 76 D4 E1 A7 39 82 E9 76 BE BA D6 AA>)
(   8,<2023-05-19 13:40:54.20 +0400>,<she>,<DPX200>,
      <abs ABSG = 5 
       data hash MD5: 32K
       0E D0 77 A9 08 A7 DA 76 23 31 73 63 AD C0 77 AD>)
$$ ##END=
$$ 
$$ hash MD5
$$ C7 3C 90 0B 93 34 91 A3 D9 0E A3 DE 52 51 1E D9
##$RELAX= 
##$RELAX= 
##$RELAX= 
##$RELAX= 
##$RELAX= 
##$RELAX= 
##$RELAX= 
##$RELAX= 
$$ Bruker specific parameters
$$ --------------------------
##$DU= <F:/spectra>
##$EXPNO= 1
##$NAME= <c13>
##$PROCNO= 1
##$TYPE= <nmr>
##$USER= <she>
##$AMP= (0..31)
100 100 100 100 100 100 100 100 100 100 100 100 100 100 100 100 100 100 
100 100 100 100 100 100 100 100 100 100 100 100 100 100 
##$AQSEQ= 0
##$AQ_mod= 1
##$AUNM= <au_zg>
##$AUTOPOS= <>
##$BF1= 50.322709
##$BF2= 200.13
$$ [...]
##$SUBNAM4= <"">
##$SUBNAM5= <"">
##$SUBNAM6= <"">
##$SUBNAM7= <"">
##$SUBNAM8= <"">
##$SUBNAM9= <"">
##$SW= 239.972175391363
##$SWIBOX= (0..15)
0 1 3 0 0 0 0 0 0 0 0 0 0 0 0 0 
##$SW_h= 12077.2946859903
##$TD= 32768
##$TD0= 1
##$TE= 0
##$TE2= 300
##$TE3= 300
##$TEG= 300
##$TL= (0..7)
120 120 120 120 120 120 120 120 
##$TP= (0..7)
150 150 150 150 150 150 150 150 
##$TP07= 0
##$TPNAME0= <>
##$TPNAME1= <>
##$TPNAME2= <>
##$TPNAME3= <>
##$TPNAME4= <>
##$TPNAME5= <>
##$TPNAME6= <>
##$TPNAME7= <>
##$TPOAL= (0..7)
0.5 0.5 0.5 0.5 0.5 0.5 0.5 0.5 
##$TPOFFS= (0..7)
0 0 0 0 0 0 0 0 
##$TUNHIN= 0
##$TUNHOUT= 0
##$TUNXOUT= 0
##$USERA1= <user>
##$USERA2= <user>
##$USERA3= <user>
##$USERA4= <user>
##$USERA5= <user>
##$V9= 5
##$VALIST= <valist>
##$VCLIST= <CCCCCCCCCCCCCCC>
##$VD= 0
##$VDLIST= <DDDDDDDDDDDDDDD>
##$VPLIST= <PPPPPPPPPPPPPPP>
##$VTLIST= <TTTTTTTTTTTTTTT>
##$WBST= 1024
##$WBSW= 4
##$XGAIN= (0..3)
0 0 0 0 
##$XL= 0
##$YL= 0
##$YMAX_a= 147254004
##$YMIN_a= -37582875
##$ZGOPTNS= <>
##$ZL1= 120
##$ZL2= 120
##$ZL3= 120
##$ZL4= 120
##$ABSF1= 222.624
##$ABSF2= -17.3728
##$ABSG= 5
##$ABSL= 3
##$ALPHA= 0
##$AQORDER= 0
##$ASSFAC= 0
##$ASSFACI= 0
##$ASSFACX= 0
##$ASSWID= 0
##$AUNMP= <proc_1d>
##$AZFE= 0.1
##$AZFW= 0.5
##$BCFW= 0
##$BC_mod= 2
##$BYTORDP= 0
##$COROFFS= 0
##$CY= -3
##$DATMOD= 1
##$DC= 0
##$DFILT= <>
##$DTYPP= 0
##$F1P= 0
##$F2P= 0
##$FCOR= 0.5
##$FTSIZE= 32768
##$FT_mod= 6
##$GAMMA= 0
##$GB= 0
##$INTBC= 1
##$INTSCL= 4.134877e-10
##$ISEN= 128
##$LB= 2
##$LEV0= 0
##$LPBIN= 0
##$MAXI= 10000
##$MC2= 0
##$MEAN= 0
##$ME_mod= 0
##$MI= 0.1934396
##$NCOEF= 0
##$NC_proc= 2
##$NLEV= 6
##$NOISF1= 120.0001
##$NOISF2= 80.00006
##$NSP= 0
##$NTH_PI= 0
##$NZP= 0
##$OFFSET= 222.624
##$PC= 1.4
##$PHC0= -379.0112
##$PHC1= 37.36414
##$PH_mod= 1
##$PKNL= yes
##$PPARMOD= 0
##$PSCAL= 0
##$PSIGN= 0
##$REVERSE= no
##$SF= 50.3227315983092
##$SI= 32768
##$SIGF1= 140
##$SIGF2= 120
##$SINO= 11.81781
##$SIOLD= 32768
##$SREGLST= <13C.CDCl3>
##$SSB= 0
##$STSI= 32768
##$STSR= 0
##$SW_p= 12077.2946859903
##$SYMM= 0
##$S_DEV= 0
##$TDeff= 32768
##$TDoff= 0
##$TI= <>
##$TILT= no
##$TM1= 0
##$TM2= 0
##$TOPLEV= 0
##$USERP1= <user>
##$USERP2= <user>
##$USERP3= <user>
##$USERP4= <user>
##$USERP5= <user>
##$WDW= 1
##$XDIM= 32768
##$YMAX_p= 339173088
##$YMIN_p= -1856898
$$ End of Bruker specific parameters
$$ ---------------------------------
##NTUPLES= NMR SPECTRUM
##VAR_NAME=  FREQUENCY,     SPECTRUM/REAL,   SPECTRUM/IMAG
##SYMBOL=    X,             R,               I
##VAR_TYPE=  INDEPENDENT,   DEPENDENT,       DEPENDENT
##VAR_FORM=  AFFN,          ASDF,            ASDF
##VAR_DIM=   32768,         32768,           32768
##UNITS=     HZ,            ARBITRARY UNITS, ARBITRARY UNITS
##FACTOR=    0.368581032318806, 1,           1
##FIRST=     11203.0474430531, 0,            0
##LAST=      -874.247242937185, 0,           0
##MIN=       -874.247242937185, -1856898,    0
##MAX=       11203.0474430531, 339173088,    0
$$ Real data points
##PAGE= N=1
##DATA TABLE= (X++(R..R)), XYDATA
$$ [...]
18207 483941 480971 435628 348299 244989 168690 134742 133233 155562 198668 244300 257542 237677
18195 237677 274166 361254 362455 246818 69707 -77437 -169679 -268142 -359542 -329171 -100368
18184 -100368 212485 413849 420352 239803 -61545 -339800 -523306 -642907 -691836 -656824
18174 -656824 -580328 -490787 -406745 -301347 -142427 18612 143468 211939 221138 215975 217026
18163 217026 196790 156441 112644 62953 -30273 -187253 -301975 -308121 -211658 -37611 142027
18152 142027 311933 420371 401923 247880 -2650 -323174 -676461 -960349 -1064705 -983913
18142 -983913 -819729 -695138 -638724 -563114 -436979 -294171 -180748 -163422 -250742 -325508
18132 -325508 -323460 -314496 -330914 -361330 -371386 -344406 -293512 -226918 -149497 -91006 -91429 -141324
18120 -141324 -207617 -269095 -352936 -480640 -610888 -664558 -601005 -456175 -272397 -98061
18110 -98061 25517 65200 9279 -66484 -116063 -211370 -368265 -539131 -715015 -893079 -1020632
18099 -1020632 -1020864 -913021 -801693 -707326 -590172 -447743 -324817 -262122 -270902 -337977 -404712
18088 -404712 -441968 -485248 -516637 -485555 -453263 -451424 -420515 -355785 -316724 -329286 -385988 -406554
18076 -406554 -322164 -187599 -113800 -131275 -172930 -161770 -108406 -68504 -83332 -104691 -76437
18065 -76437 -51125 -75158 -139388 -246090 -380666 -489939 -545960 -578728 -611742 -629110 -590555
18054 -590555 -433293 -218733 -99588 -74415 -18698 76704 162615 246602 312456 316050 246287
18043 246287 118796 -1641 -33043 20315 49606 -8192 -106081 -201188 -273622 -313157 -318943
18032 -318943 -295829 -266819 -190276 -50243 62648 85962 50215 -4243 -72316 -172936 -300951
18021 -300951 -382707 -365867 -259360 -124785 -59506 -137191 -332608 -481471 -434309 -250895
18011 -250895 -102625 -87790 -181414 -311756 -415341 -438981 -375161 -289982 -281794 -350307 -383090
18000 -383090 -288079 -75317 154244 337563 467073 533838 495448 354957 230753 209789
17990 209789 248412 286074 348573 426458 439256 348958 213836 62965 -87463 -156905 -130879
17979 -130879 -55758 51895 189770 323729 376045 290685 86177 -141137 -299777 -360764
17969 -360764 -324480 -247518 -164935 -48033 84350 233763 407992 538991 558922 481779
17959 481779 387501 339425 312352 270050 238936 217605 144197 36562 -21973 -20451 -2713
17948 -2713 50992 158177 261702 327331 439717 607446 695190 647307 552743 487951 443876
17937 443876 381553 295563 210300 125484 25990 -113760 -295642 -454146 -543286 -532694 -414087
17926 -414087 -240382 -96581 -5285 119751 291807 393933 358846 238033 96888 -53030
17916 -53030 -164940 -201225 -172838 -87587 -24353 -63641 -168353 -216260 -182394 -115427 -34014
17905 -34014 50185 137298 233071 308033 335832 321545 289283 289864 314826 300250 291861 404378
17893 404378 629009 821001 868688 799032 696499 587889 460430 321531 222483 184255
17883 184255 198928 240656 258961 231043 198938 217683 280344 333143 370330 427674 462893
17872 462893 404758 278020 128933 13427 -5012 61691 211687 387479 453652 357202
17862 357202 154406 -52418 -191034 -269101 -307631 -266917 -202694 -242315 -378505 -533550
17852 -533550 -666677 -724211 -673082 -602919 -599699 -614434 -554684 -398167 -212965 -73797 13106
17841 13106 129354 318840 514009 627925 630383 537381 417544 348579 350032 398309 479693
17830 479693 597701 721176 785589 759060 605583 348344 78701 -131581 -237050 -237076 -184116
17819 -184116 -100966 -32288 -14092 -41580 -109783 -200352 -251787 -220290 -126708 -26003 37603
17808 37603 -3644 -154150 -310463 -400060 -460553 -485036 -358068 -56403 266341 515803
17798 515803 690409 776687 807545 814666 770195 641393 445849 219935 -9332 -185418
17788 -185418 -231018 -135136 58223 231000 297615 286325 275675 277681 244234 172647 107142
17777 107142 89531 133502 207909 263419 292931 337974 386628 403916 374558 290757 166685
17766 166685 40003 -10066 57109 181589 291923 357512 393943 439638 529847 672179 788827
17755 788827 810637 765479 709830 663342 615134 546707 482746 434103 348518 233835 218430
17744 218430 373349 600348 834230 1070227 1250302 1324456 1297009 1202519 1087968 954729
17734 954729 816114 709868 648356 611103 550319 439585 311742 250216 318179 456408
17724 456408 560363 596045 630057 736591 880029 985103 1011454 974101 933995 928350 972447
17713 972447 1049024 1072269 1010340 928074 842411 734775 657230 669068 742335 832742 876962
17702 876962 830161 717841 648891 706993 909516 1184997 1401992 1477915 1439315 1332617
17692 1332617 1176457 1020599 924945 917078 989353 1109237 1223269 1242011 1136050 942743
17682 942743 775616 754543 873671 1045046 1177167 1235588 1284572 1358778 1399698 1362388 1309449
17671 1309449 1314907 1389004 1507310 1622408 1693229 1732947 1788943 1859748 1888303 1866109 1873470
17660 1873470 1918089 1949528 1995117 2162152 2471521 2806769 3069130 3290294 3482589 3637545
17650 3637545 3774040 3881416 3975322 4102151 4255834 4404366 4547427 4717593 4938724 5206731
17640 5206731 5477248 5710184 5941023 6233905 6592061 6943817 7242201 7516248 7801578
17631 7801578 8071444 8281150 8472175 8703984 8984846 9323627 9737851 10209371 10718154
17622 10718154 11273601 11868504 12441492 13027591 13761332 14710238 15832351 17012315 18110915
17613 18110915 19081048 19987322 20851648 21600370 22226709 22783031 23276482 23673395 23873706
17604 23873706 23802022 23517929 23133108 22696189 22223942 21722207 21100005 20261223 19225021
17595 19225021 18131362 17095584 16143147 15230016 14311832 13398881 12516577 11693088 10950183
17586 10950183 10291970 9676244 9066318 8538818 8204356 8026962 7834935 7526180 7154757
17577 7154757 6788791 6441200 6098702 5770893 5519000 5382876 5253428 5067140 4839085
17568 4839085 4572691 4297681 3988183 3600018 3188302 2822062 2539458 2341503 2260470 2320774
17558 2320774 2450046 2555061 2575379 2522669 2426332 2289280 2173300 2121521 2076897 1967671
17548 1967671 1783647 1599953 1455332 1277729 1033600 791967 604838 473656 395193 372836
17538 372836 429027 553324 701641 834444 912601 891946 790473 663176 510157 349498
17528 349498 244745 189680 160655 187937 272308 409438 553425 609101 573949 554732 604640
17517 604640 645113 569979 437875 363394 346414 309266 231601 200010 242350 275361 224091
17506 224091 90187 -97093 -301085 -462379 -540790 -507479 -378388 -237702 -139031 -76344
17496 -76344 -14864 49597 99853 172152 291401 387241 383301 248099 32508 -196120 -388209
17485 -388209 -458385 -384004 -210364 -36797 71376 126284 177674 245004 295755 358488 480586
17474 480586 577195 569480 488883 388065 308522 269949 282901 370116 499900 631634 721354
17463 721354 716602 643087 594102 567692 538479 527993 559575 631047 641131 513294 283784
17452 283784 33409 -127497 -163043 -93823 42573 120027 23068 -169752 -296846 -292449 -181539
17441 -181539 -22375 112297 194318 198775 106173 -23832 -147355 -293919 -456755 -554449
17431 -554449 -534572 -422120 -268993 -130748 -105889 -217292 -372437 -492508 -550534 -564298
17421 -564298 -583950 -635055 -745147 -934532 -1155727 -1296733 -1300091 -1196208 -1001999 -757684
17411 -757684 -592449 -519781 -448692 -380051 -376690 -421389 -455839 -481307 -498622 -496378 -501565 -535477
17399 -535477 -538068 -455378 -320801 -199800 -127862 -91287 -95098 -166057 -311130 -502110 -673635
17388 -673635 -801916 -923000 -1017046 -1040835 -978371 -830039 -594901 -297593 -69296 27805
17378 27805 36155 -17314 -81482 -118844 -133361 -127420 -86096 -2488 117300 251124 374931
17367 374931 477205 530714 478915 320092 132880 -3523 -28005 109164 330114 485382
17357 485382 548423 585711 619350 615037 562219 470334 346317 244473 195296 113872 -55476
17346 -55476 -251688 -407562 -473569 -409107 -255672 -145130 -141248 -218445 -343816 -484363 -587643
17335 -587643 -612470 -591275 -524992 -347852 -148259 -80773 -166718 -309046 -398359 -415210 -402648
17324 -402648 -440942 -583771 -773898 -939361 -1060445 -1112082 -1057764 -902006 -738315 -659248
17314 -659248 -635579 -611338 -555363 -462081 -331779 -180814 -36571 81815 154871 180016 163058
17303 163058 102847 33769 -9143 -57198 -155004 -278846 -415915 -586895 -767530 -886963
17293 -886963 -895294 -829765 -717512 -583537 -494915 -480431 -512312 -600441 -732807 -835250 -886520
17282 -886520 -951387 -1035457 -1102828 -1175526 -1245444 -1281175 -1273004 -1175175 -973413 -727534 -516924
17271 -516924 -406036 -392954 -436557 -470157 -434458 -337553 -232484 -148966 -81858 -12996 85894
17260 85894 239832 372718 399280 351416 316291 321424 325855 295014 244248 256327 381696
17249 381696 569144 734871 847038 925789 951256 862601 670703 496929 414649 366705
17239 366705 298686 223903 169958 162681 203248 262065 332310 392667 397367 335871 224074 87705
17227 87705 -21494 -117127 -212250 -254132 -249878 -255653 -316774 -480363 -698891 -882486 -924764
17216 -924764 -851490 -798462 -788167 -769328 -729123 -693178 -663002 -625386 -500854 -208082 179997
17205 179997 514959 706920 768443 771420 760477 723367 619468 452240 247386 1177
17195 1177 -209015 -324227 -417255 -547114 -650940 -640953 -498982 -294817 -150011 -131401 -238165
17184 -238165 -422713 -639540 -861104 -1049329 -1194531 -1277265 -1272661 -1238267 -1234152 -1232972 -1186904
17173 -1186904 -1082097 -938986 -818910 -769016 -765467 -777850 -758329 -674160 -619585 -655244 -733471
17162 -733471 -776745 -723414 -602469 -476558 -408074 -427195 -441004 -311915 -76653 76157
17152 76157 53534 -15020 -32993 -9003 72046 168732 235164 283079 322421 344337 332563 314182
17140 314182 355296 467536 598031 687642 732851 748537 737403 725878 749133 772335 701533
17129 701533 500907 247622 53211 12147 89921 157003 167860 144213 108972 49248 -85736
17118 -85736 -300418 -497805 -585179 -622927 -734481 -895289 -977389 -946766 -880300 -842908 -819929
17107 -819929 -773533 -685272 -543467 -379436 -258107 -195351 -153237 -105034 -101471 -174959 -235839
17096 -235839 -219044 -138056 51 145044 190322 124269 45735 -20950 -105244 -194442 -256429
17085 -256429 -280584 -278346 -281876 -308698 -322819 -262334 -154263 -69027 -20773 -443 -22331 -76336
17073 -76336 -113598 -138601 -205233 -337375 -472705 -539570 -534942 -496613 -452636 -445444 -506511 -603726
17061 -603726 -708369 -792919 -857538 -872344 -777013 -625970 -497004 -389412 -288431 -213446
17051 -213446 -154847 -113026 -118719 -172398 -250999 -302959 -251851 -67282 210350 481687 673420
17040 673420 770738 810443 832978 834118 831398 827163 750353 610132 521689 531642 598755 635803
17028 635803 524229 239629 -113114 -406181 -538709 -458470 -207139 88680 281450 308141
17018 308141 229075 130589 19014 -138469 -360201 -600372 -764993 -797240 -720558 -635917
17008 -635917 -588474 -513377 -339516 -86776 173250 357332 417879 365872 301706 315386 344710
16997 344710 273905 109068 -65322 -185482 -231663 -246361 -240099 -159382 -10965 120961 174587
16986 174587 155798 120324 71664 -26151 -154752 -238883 -227336 -160003 -102398 -126921 -249051
16975 -249051 -394902 -482939 -503799 -486141 -443051 -396030 -363568 -316109 -220247 -104100 9062
16964 9062 165501 361908 503282 532678 449711 262584 -6399 -209923 -218453 -103752 -29622
16953 -29622 -76210 -189138 -324913 -491302 -645619 -746007 -804976 -836985 -842834 -810719 -753991
16942 -753991 -653363 -468811 -245069 -52185 39121 36922 -943 -65141 -148582 -208058 -210947
16931 -210947 -184999 -164030 -173823 -227184 -319368 -409587 -471760 -507122 -499168 -452541 -373522 -261283
16919 -261283 -184942 -215541 -323867 -385093 -338777 -232487 -139679 -99447 -104452 -156654 -227507
16908 -227507 -276455 -284842 -217542 -31893 204647 350401 400226 389375 348605 318031 344851
16897 344851 452541 571611 632981 615015 544284 477517 454614 508974 634648 760358 827174
16886 827174 834738 792693 738129 770696 925244 1099199 1159451 1091096 956960 834420 774515
16875 774515 769112 819959 950560 1117925 1205904 1176198 1115325 1081808 1079313 1119798 1224895
16864 1224895 1414220 1651248 1862151 2049125 2253890 2428935 2525141 2585703 2637320 2663033
16854 2663033 2643523 2613423 2630434 2726368 2928548 3193355 3430323 3605420 3753434 3949121
16844 3949121 4237604 4616774 5031852 5437681 5823708 6188033 6516265 6744054 6837497 6911562
16834 6911562 7072836 7242065 7336243 7398032 7440051 7438900 7392581 7306883 7188160 7031382 6797533
16823 6797533 6470765 6083611 5619892 5110399 4669775 4352934 4140194 3974285 3839461
16814 3839461 3717421 3560734 3378950 3198349 3012759 2818325 2624208 2409490 2162633
16805 2162633 1896503 1647320 1456043 1369971 1386396 1425286 1467104 1505301 1492273 1419764 1332969
16794 1332969 1258177 1184194 1091386 954174 784303 680831 728294 881434 1038110 1176294
16784 1176294 1269696 1324992 1371544 1368686 1302155 1169287 966214 765053 670525 659308 615675
16773 615675 527486 474792 482940 479906 371914 150764 -131048 -380895 -541635 -606718 -544614
16762 -544614 -366753 -134815 111027 323905 472308 541082 531905 476568 409081 320532 243311
16751 243311 218664 141155 -17315 -87839 22024 223838 401089 482433 433522 314401
16741 314401 210909 128132 52889 22688 56883 141689 218594 239872 210574 185286 246457
16730 246457 417616 655346 903114 1114240 1226739 1252872 1244954 1174300 1003660 774109
16720 774109 561034 382370 210667 65794 -34025 -78987 -50300 27501 80594 86011 63837
16709 63837 15432 -16827 2050 36108 43592 9369 -53293 -75894 -65238 -100207 -129017 -57156
16697 -57156 71155 156421 189900 203559 213304 215136 159054 52013 -59708 -147101 -166517
16686 -166517 -110092 -21197 69983 178601 311623 388546 327209 149489 -35032 -127265 -137881
16675 -137881 -97657 -38979 -46233 -152310 -286502 -360699 -366219 -335240 -311939 -322409 -341652
16664 -341652 -334293 -294648 -240422 -171458 -118290 -121266 -147345 -112923 15287 178417 299721
16653 299721 354763 359048 348943 319114 237283 148883 29939 -189233 -469281 -686106 -771821
16642 -771821 -757370 -674703 -557011 -439640 -351781 -365941 -496955 -678938 -836231 -909222
16632 -909222 -865702 -799368 -803767 -801816 -695590 -524313 -374873 -321110 -373295 -425391 -371704
16621 -371704 -202604 -14167 93358 164673 284814 428732 538687 542730 458557 388176
16611 388176 374092 420254 509812 567753 510977 351697 232459 238523 282673 227004 26213
16600 26213 -241207 -448586 -543257 -550760 -556435 -632973 -712322 -703499 -628460 -515213 -376689
16589 -376689 -219890 -43126 108558 167895 142225 91831 92840 171274 308042 428821 475018
16578 475018 498061 559475 589141 465115 215075 -49416 -284100 -475660 -622112 -741250
16568 -741250 -804477 -724102 -529909 -407216 -395401 -388650 -363385 -370685 -433112 -545980 -688469
16557 -688469 -811860 -858449 -825333 -735590 -594843 -455120 -359454 -271459 -124213 65862
16547 65862 204364 252860 250741 209316 161776 187097 267136 334056 410785 540561 618847
16536 618847 552491 396607 244281 136922 54957 -27739 -79132 -76791 -45116 -6399 43707
16525 43707 99595 143127 211673 339133 523347 731344 882179 886988 770200 623342 497087
16514 497087 390085 258125 90996 -66899 -195365 -300824 -402897 -504886 -561989 -497437
16504 -497437 -362384 -286954 -287951 -307526 -334606 -401481 -462595 -478601 -443137 -343003 -241081
16493 -241081 -244993 -336734 -394272 -370446 -259662 -105102 -9870 -5730 -65332 -172551 -312098
16482 -312098 -478064 -626944 -687084 -677758 -641504 -573320 -458423 -293385 -125441 -35486 1384
16471 1384 34400 23998 -32606 -75193 -45228 25995 13284 -122875 -326216 -508759 -598627
16460 -598627 -598827 -539118 -427468 -314325 -264609 -245699 -209738 -128564 3937 119499 141836
16449 141836 86008 -1302 -105956 -146384 -58590 80220 168606 188696 163805 108748 18500
16438 18500 -114236 -197298 -166727 -110043 -72150 -23173 25659 47857 35146 12883 -17041
16427 -17041 -48784 -71932 -123390 -216218 -331620 -409286 -400307 -312501 -190449 -96177 -61072
16416 -61072 -76138 -82177 -19731 120352 282566 404500 451282 435602 378686 273573 155505
16405 155505 54429 -55926 -193066 -293732 -324732 -338603 -362376 -379404 -406559 -432491 -467110
16394 -467110 -503564 -465052 -309967 -83042 119750 233081 254799 210376 108229 -56995
16384 -56995 -245202 -387252 -439184 -403090 -328879 -257018 -194003 -177438 -218384 -269158 -270847
16373 -270847 -220623 -150490 -73409 17960 123705 166407 84851 -40498 -92369 -88404 -109580
16362 -109580 -137271 -97440 31210 195030 296739 288084 187666 32081 -159461 -366022
16352 -366022 -524538 -556246 -492917 -403386 -274069 -183122 -176693 -200740 -270144 -377624 -462934
16341 -462934 -478973 -434662 -361568 -296034 -301870 -401400 -524806 -585895 -570436 -536367 -505108
16330 -505108 -415658 -265834 -146053 -102747 -86713 -25885 140070 406205 625224 657389
16320 657389 537415 392674 282404 221722 248048 342750 428306 413302 321897 240452 176009
16309 176009 54342 -153017 -352983 -447191 -431623 -385072 -377425 -415332 -448235 -463743 -469109
16298 -469109 -449134 -386388 -270858 -133580 -39120 -26775 -46946 -54167 -97762 -187388 -214267
16287 -214267 -95496 58802 99967 13612 -104569 -171515 -172842 -142634 -107703 -115068 -165001
16276 -165001 -186636 -124690 -27745 -7347 -87460 -239818 -456846 -695811 -897880 -1053971
16266 -1053971 -1176706 -1265179 -1291930 -1233744 -1110218 -973783 -876074 -828160 -812541 -829598 -846348
16255 -846348 -816195 -767301 -749432 -752466 -739392 -726677 -744153 -781191 -820363 -862814 -921226 -981243
16243 -981243 -1010536 -1008937 -994370 -986256 -1018553 -1099426 -1158193 -1150751 -1142119 -1177409 -1221698 -1232908
16231 -1232908 -1182462 -1066306 -934327 -840601 -800770 -764848 -669409 -533258 -440819 -450772 -523461
16220 -523461 -615610 -722746 -763940 -665845 -473707 -307979 -287179 -424251 -593982 -685124
16210 -685124 -706742 -743784 -850638 -975083 -1033154 -1003152 -924774 -820014 -710413 -653664 -656987
16199 -656987 -654039 -582768 -448732 -343056 -322017 -326954 -287408 -174179 -15515 130038 173509
16188 173509 84332 -48152 -130942 -161391 -201900 -308238 -477641 -657607 -751503 -743865 -677551
16177 -677551 -535040 -352517 -245130 -248149 -303985 -356026 -347287 -282730 -246548 -277611 -326266
16166 -326266 -340400 -291514 -168747 8189 164211 244494 258953 222557 166046 125508 94606
16155 94606 73173 60896 8480 -71116 -120888 -134956 -146462 -207729 -289596 -307940 -277644 -247383
16143 -247383 -224134 -230103 -289996 -373971 -423640 -470019 -612373 -816002 -917318 -867460 -720782
16132 -720782 -554067 -418526 -341175 -303579 -258790 -198568 -150579 -111911 -62329 25632 123319
16121 123319 147926 69174 -84434 -273429 -425940 -462882 -400225 -289542 -127523 30891
16111 30891 84751 28553 -87912 -234498 -383842 -506695 -589065 -641040 -647556 -538886 -322943
16100 -322943 -109819 27274 96066 182234 364048 530421 554958 487871 381847 221016
16090 221016 12814 -162141 -276504 -418786 -577322 -637712 -599440 -580931 -688385 -859365
16080 -859365 -892541 -729808 -472946 -226028 -40443 114611 254504 267026 80600 -204670
16070 -204670 -410659 -466233 -404591 -316927 -271496 -301623 -422240 -586679 -701256 -701520 -584118
16059 -584118 -445191 -441486 -600217 -734124 -692391 -497181 -253917 -65691 28282 -5314
16049 -5314 -136493 -248012 -271901 -291863 -405272 -545273 -613266 -576427 -465679 -341513 -225324
16038 -225324 -151739 -129398 -114199 -54660 48084 118025 97167 16271 -46121 -47183 9024
16027 9024 76259 78029 -4059 -150378 -323859 -487544 -622285 -711889 -758532 -796436 -811556
16016 -811556 -787931 -750937 -682688 -594121 -520088 -442942 -346321 -281840 -280749 -276223 -265234 -340832
16004 -340832 -488371 -610402 -676265 -697530 -631406 -486485 -315713 -133714 31536 137226
15994 137226 163992 94449 -52053 -219422 -387654 -524718 -570322 -489538 -266756 46221
15984 46221 333597 491428 502107 429557 354954 329048 373693 494662 655313 802651 886220
15973 886220 882239 795370 660878 502087 322303 131275 -27938 -94240 -81102 -68412 -81415
15962 -81415 -48246 39661 91431 79439 74104 123406 177714 155231 22607 -148478 -250291
15951 -250291 -237490 -135081 -15890 47351 21915 -55049 -114297 -87185 25759 162087 258673
15940 258673 304107 334002 383878 438227 445596 394045 294381 121437 -92019 -185447 -101177
15929 -101177 45400 139238 173946 209861 303147 391210 363084 231323 39853 -148202 -192474
15918 -192474 -57335 98458 122857 59047 33047 84049 173051 255014 330256 392375 453693
15907 453693 528010 576650 574781 557229 576211 625878 627057 551587 438863 339177 304378 293054
15895 293054 267448 203692 82259 -25495 -55561 -52326 -45167 3959 83160 108235 65119
15884 65119 -12317 -86006 -123853 -153200 -166892 -144061 -124467 -143075 -165512 -143852 -107948 -119599
15872 -119599 -162979 -221955 -287024 -403166 -616796 -866109 -1072304 -1209686 -1282707 -1299287
15862 -1299287 -1267307 -1174081 -997279 -753403 -524444 -379291 -299929 -239635 -203554 -204478 -234232
15851 -234232 -259519 -269042 -310562 -389439 -445091 -447858 -448002 -484517 -517828 -495260 -451018 -432822
15839 -432822 -460145 -509552 -563061 -619163 -599335 -486637 -373684 -296360 -264298 -285544 -293120
15828 -293120 -250972 -182802 -156414 -246477 -409664 -540908 -599452 -616922 -669149 -756693 -830180
15817 -830180 -883603 -901677 -898688 -927115 -965360 -939276 -876279 -870002 -915250 -905415 -806034 -727363
15805 -727363 -684246 -599486 -456587 -303123 -190127 -140095 -136122 -145485 -148644 -150048 -179227 -256836
15793 -256836 -356278 -374025 -307088 -281322 -389902 -602882 -730435 -668992 -516775 -393352
15783 -393352 -327980 -343696 -417805 -448429 -431785 -407506 -380510 -378211 -400567 -451473 -555143
15772 -555143 -681566 -763031 -762926 -713300 -627685 -498886 -377978 -291694 -181447 -21428 130330
15761 130330 165282 78961 7422 20766 74452 90002 48252 -24656 -101029 -190194 -277685
15750 -277685 -343016 -378710 -340702 -196647 -31117 37414 14979 -33689 -63952 -28596 31154
15739 31154 27914 -7048 -34485 -91089 -192079 -295099 -382892 -440324 -432061 -382321 -352573 -332245
15727 -332245 -268083 -175913 -146379 -171092 -206448 -275336 -372445 -421560 -371773 -282696 -215670
15716 -215670 -165721 -137179 -141195 -161637 -200718 -286460 -401728 -499938 -558723 -571649 -509688
15705 -509688 -400189 -363049 -386733 -383586 -350493 -354426 -445198 -573773 -647689 -634841 -545995
15694 -545995 -464361 -473117 -521690 -530316 -502766 -488590 -481622 -429507 -318309 -177159 4558
15683 4558 178793 236169 177687 114724 64007 -13718 -77771 -87493 -83915 -143875 -292953 -478458
15671 -478458 -578321 -508822 -327232 -129952 52391 179025 184166 92187 -6195 -79186 -165802
15660 -165802 -318575 -530152 -728821 -844494 -888087 -895816 -888057 -883848 -885057 -866688 -839360
15649 -839360 -894725 -1045397 -1164896 -1195790 -1174934 -1102245 -979720 -852986 -773485 -719368 -629701
15638 -629701 -524537 -455814 -379951 -284084 -213412 -122561 40769 221140 301048 222970 52485
15627 52485 -97828 -163329 -152009 -62213 144977 393202 523593 540451 537448 518064 435420
15616 435420 300507 181474 88464 -21314 -177039 -338953 -404082 -392416 -412383 -462360
15606 -462360 -467889 -412773 -333609 -295081 -330039 -393852 -456777 -491872 -443444 -312093 -169861
15595 -169861 -52683 27608 31357 -61920 -196644 -306413 -393426 -485400 -657020 -935529 -1164050
15584 -1164050 -1190283 -1096583 -1017406 -945820 -841724 -717607 -598632 -523687 -541410 -628357 -695847
15573 -695847 -680966 -578613 -419762 -292162 -244326 -227872 -242508 -297308 -328453 -308042 -259402
15562 -259402 -141385 56848 285333 472615 495071 305210 35579 -196042 -385448 -504142
15552 -504142 -509033 -412337 -297236 -237082 -203069 -158989 -148410 -197427 -273010 -330581 -405283
15541 -405283 -544766 -729541 -897613 -991914 -1026541 -1075358 -1136753 -1079856 -862380 -618117
15531 -618117 -480168 -426500 -375169 -320854 -308888 -329787 -357632 -405209 -462958 -529136 -599676
15520 -599676 -607960 -521450 -413813 -404886 -518817 -685857 -874428 -1049312 -1164220 -1223460 -1247313
15509 -1247313 -1212987 -1112315 -944833 -738796 -574297 -517392 -571697 -696198 -821575 -903491
15499 -903491 -881653 -737527 -530133 -291960 -98330 -14896 -54133 -144660 -166781 -96148 -18518
15488 -18518 -1313 -40510 -94755 -157454 -253794 -340135 -357007 -351486 -395504 -499438 -587701 -594425
15476 -594425 -596894 -691923 -810857 -886434 -941171 -924565 -822772 -719264 -681601 -654103 -547838
15465 -547838 -390753 -243708 -126117 -46113 20655 108944 223704 323927 356140 263707
15455 263707 29671 -244088 -427620 -494075 -420998 -184172 138438 392882 492327 511271
15445 511271 567977 644219 645581 571755 425453 215583 21187 -110304 -201118 -260834 -268745
15434 -268745 -235591 -218521 -218183 -160429 4279 261221 515934 693454 771351 743307 632424
15423 632424 470169 273035 72745 -123443 -317220 -449880 -526964 -580552 -562898 -451127
15413 -451127 -276547 -133214 -79932 -77042 -96421 -126483 -156404 -208291 -275946 -321387 -358107
15402 -358107 -441878 -548642 -611022 -585542 -478643 -382270 -360738 -376894 -389020 -386069 -348187
15391 -348187 -260482 -72590 200867 416234 532799 612630 619404 509850 351175 214574
15381 214574 152926 130978 95217 97757 171722 271383 345787 347993 286669 240527 259085 346570
15369 346570 454251 517261 534307 535079 507416 411904 257535 91869 -38627 -59780 11787
15358 11787 60523 53536 49273 112310 221093 308110 394566 505071 614058 700460 704983 593591
15346 593591 352896 27682 -260741 -440822 -526829 -561288 -548146 -504012 -447065 -355731 -183291
15335 -183291 52652 231358 232562 77814 -95196 -165605 -83418 141836 402052 550252
15325 550252 560603 527686 516047 514624 484185 424896 335925 221712 166051 222662 340079
15314 340079 463106 535978 526993 443192 329601 239819 202400 247651 400350 577480 601674
15303 601674 417408 174272 22845 -94899 -300734 -589544 -860334 -1005843 -981555 -845337
15293 -845337 -663409 -472194 -319039 -259722 -303712 -338300 -283506 -173927 -129172 -195205 -310114
15282 -310114 -362755 -294900 -147586 42972 257242 498477 706957 802450 790600 700248
15272 700248 572086 460350 394058 382036 394901 374174 337551 320370 280152 205000 135967
15261 135967 118522 125330 118698 117407 172075 245056 252877 239858 263632 284540 299315 345352
15249 345352 413049 429342 393191 361263 285705 174246 129847 203880 331679 352558 246306
15238 246306 129489 64455 42494 -19840 -191712 -387095 -501493 -537328 -555045 -595489 -657737
15227 -657737 -722238 -740694 -683352 -605347 -513473 -377735 -255614 -153231 -22449 132290
15217 132290 284007 403768 462796 480321 494716 513551 474248 342154 165263 20051
15207 20051 -31761 -968 49832 85320 93568 55010 -17748 -59414 -26951 62569 131736 103921
15195 103921 -2360 -136525 -243540 -282047 -283864 -242128 -130845 -49622 -117387 -247085 -275416
15184 -275416 -211391 -128578 -66963 -81106 -221472 -438451 -661143 -830838 -896345 -888819 -840238
15173 -840238 -810813 -857935 -918518 -924420 -890491 -805536 -692218 -579710 -476215 -431836 -466830
15162 -466830 -540055 -635628 -765960 -913461 -1053392 -1185822 -1317336 -1367637 -1314926 -1223950
15152 -1223950 -1102246 -994967 -967024 -1028905 -1129243 -1152634 -1022521 -803572 -596409 -469616
15142 -469616 -391248 -322011 -256034 -185783 -111893 -55589 -65063 -86628 -60337 -5152 39155 42369
15130 42369 4889 -84029 -193957 -287968 -347611 -357424 -365027 -406548 -444876 -450262 -464773 -468976
15118 -468976 -412492 -328355 -268197 -240753 -202109 -162716 -134080 -65793 28719 132509 239971
15107 239971 332391 420548 500539 493340 342379 70660 -243260 -525745 -751070 -916199
15097 -916199 -1022778 -1040984 -957530 -826394 -667298 -512403 -429136 -477949 -660525 -881419
15087 -881419 -1000045 -1005389 -1003011 -1018218 -1008239 -940743 -845473 -821091 -922301 -1056476 -1109442
15076 -1109442 -1062085 -923985 -716694 -482252 -299041 -236898 -292772 -361907 -361477 -303397 -246233
15065 -246233 -234155 -212837 -147991 -107935 -102519 -41387 108230 291882 462341 581327 615363
15054 615363 586971 560357 587748 665190 714433 680767 571519 436351 275302 52019 -164141
15043 -164141 -308392 -425742 -521925 -586058 -663159 -717139 -670114 -509112 -320761 -230008 -238516
15032 -238516 -248193 -255043 -304667 -442222 -681515 -973797 -1217840 -1297579 -1194372 -979672 -711679
15021 -711679 -410419 -177156 -108687 -138672 -142985 -90820 -6885 47979 38817 -16479 -107682
15010 -107682 -175513 -167717 -127339 -133320 -224394 -349121 -409082 -370267 -254858 -101264 40992
14999 40992 121961 141554 129390 78679 -37411 -206046 -355626 -434202 -466526 -477116 -494436
14988 -494436 -535198 -534612 -466640 -362184 -239274 -75453 124461 278030 333266 328562 312774
14977 312774 272993 168567 -3176 -198056 -309347 -261315 -71470 178658 367452 408957
14967 408957 302503 123797 -53001 -211737 -336608 -388481 -350715 -236561 -113453 -37224
14957 -37224 -5037 35546 171270 380874 530260 552716 528126 537850 560259 596082 624549
14946 624549 573512 424928 258896 176662 204735 321575 458424 554226 596394 557749 442219
14935 442219 334102 283150 246656 157329 17310 -162173 -379841 -557468 -656540 -706572
14925 -706572 -691860 -611968 -527830 -462009 -382047 -288875 -226944 -232094 -293360 -339553 -373957 -467478
14913 -467478 -594457 -651214 -620888 -570987 -516055 -432569 -334373 -253003 -211984 -155787 -25605
14902 -25605 109094 208493 261251 239961 144346 -8931 -144772 -219111 -281818 -358095 -423929
14891 -423929 -488048 -548259 -604936 -673437 -776764 -905563 -1010092 -1056638 -1063716 -1075058 -1074806
14880 -1074806 -1017776 -916728 -830232 -775233 -686854 -501725 -267321 -123061 -81293 -68125
14870 -68125 -91479 -165597 -255409 -318909 -332132 -315592 -342264 -426198 -495380 -476074 -326995
14859 -326995 -89076 152521 369748 554047 670366 751099 843135 882317 835677 789052
14849 789052 782986 758202 681760 559940 454960 411941 385967 325876 230361 151906 158312
14838 158312 245485 340589 382019 363867 287660 155147 -34591 -291684 -573899 -757215
14828 -757215 -774794 -694179 -600210 -519243 -454522 -387689 -272704 -81168 69283 60107 -18980
14817 -18980 -40547 3920 59649 85254 17811 -152748 -334134 -461831 -520487 -505240 -449303
14806 -449303 -398120 -307526 -127292 79316 234500 304044 295148 256491 220966 148297 -32054
14795 -32054 -276995 -493979 -682647 -809365 -793860 -642539 -496150 -440442 -429079 -403493
14785 -403493 -346665 -264663 -216876 -265660 -356630 -383435 -292546 -147484 -56753 -70993 -186413
14774 -186413 -348290 -504425 -655485 -776519 -816529 -790095 -743917 -699912 -681007 -663121 -618829
14763 -618829 -553705 -473947 -382142 -254938 -77558 134072 329062 472495 523845 451442
14753 451442 297863 134813 -28933 -197693 -344165 -444107 -467773 -390595 -250155 -121437
14743 -121437 -45124 -55226 -159425 -279402 -355461 -374621 -348989 -310428 -311160 -381380 -457988
14732 -457988 -459194 -318504 -15605 370652 716621 914964 910002 763475 597796 482813
14722 482813 395865 311420 228379 160530 134401 110498 75616 83055 156802 269820 409442
14711 409442 557752 650813 671484 653997 577196 421217 224569 10162 -187279 -335764
14701 -335764 -414461 -399743 -327568 -293137 -359704 -484213 -584475 -612080 -572403 -472212 -353925
14690 -353925 -270032 -214610 -181310 -184755 -224852 -288991 -378295 -461896 -517673 -578760 -639479 -695351
14678 -695351 -745830 -739355 -615266 -379092 -127563 39604 107140 131020 138240 152441 218188
14667 218188 303017 337141 348927 376997 426649 495262 542830 503683 359320 143388 -98753
14656 -98753 -286629 -389170 -462952 -596437 -802524 -998110 -1113386 -1117607 -1017634 -878302
14646 -878302 -759125 -663391 -566275 -451189 -318703 -171332 -25811 98156 192109 218214
14636 218214 89274 -179480 -400815 -442987 -352984 -221538 -92482 9344 10110 -127221
14626 -127221 -322359 -443950 -412584 -263078 -112247 5966 132477 263666 351342 363185
14616 363185 304076 208261 143206 129724 102524 26391 -106727 -291588 -486685 -640246 -732747
14605 -732747 -783746 -786269 -773560 -815445 -905783 -928849 -830780 -686031 -545952 -432191 -362680
14594 -362680 -348559 -415959 -519246 -595992 -656231 -711079 -752403 -799005 -856753 -915822 -959517
14583 -959517 -971357 -913256 -753038 -543059 -337121 -200256 -146790 -108216 -40274 47362 142410
14572 142410 231428 290440 271852 187553 135242 97678 31248 1455 42841 86407 32091
14561 32091 -114685 -263415 -349401 -376932 -348816 -285266 -239267 -200357 -159796 -112955 -107070
14550 -107070 -197733 -331218 -431985 -503157 -591426 -667919 -692116 -707501 -758546 -779800 -728289
14539 -728289 -610970 -403435 -178915 -64369 -55155 -74582 -76678 -94450 -109707 -83791 -58525
14528 -58525 -83183 -159148 -213111 -182577 -84163 14768 80935 115919 111846 74910 36465 12831
14516 12831 6655 44592 121612 174370 182977 195748 268771 398239 528037 591683 563467 501806
14504 501806 496940 577734 708661 777785 726105 598082 493794 501221 583995 656321 681665
14493 681665 690668 704322 760668 865210 963948 1034917 1064434 1042047 907754 672009 460397
14482 460397 337454 303695 286175 265374 324609 466610 580662 573816 479342 394669 379292
14471 379292 465914 599475 673982 684931 701398 775852 886773 995594 1063559 1039570 944252
14460 944252 871464 851913 812897 730953 629464 502645 361726 282671 315973 434294 548379
14449 548379 610876 634466 623402 608875 566090 447518 291359 167464 114668 109645 79297
14438 79297 43000 110169 266374 422567 546554 673692 757651 679539 460956 257582
14428 257582 151978 112115 120471 123127 45728 -19299 49927 202854 300378 346887 418596
14417 418596 428258 312295 164431 85405 104379 186177 245681 237932 150019 51699 28149
14406 28149 53184 60360 -8349 -167932 -356983 -497400 -590908 -681628 -753091 -782903 -785415
14395 -785415 -793645 -808238 -775037 -674475 -563920 -500443 -483537 -468582 -449514 -464291 -498155
14384 -498155 -486756 -449428 -440035 -416665 -325966 -180729 -59534 -53023 -137135 -208290 -216143 -152978
14372 -152978 -12959 111351 115156 1929 -121321 -190039 -212150 -199756 -151356 -38701 147686
14361 147686 330537 420500 441765 499237 621914 738112 803232 852804 919911 997346 1043705
14350 1043705 961996 754981 540975 373726 230648 76505 -56422 -133782 -193351 -238237
14340 -238237 -280216 -335682 -427723 -571822 -714154 -811152 -914816 -1043197 -1109088 -1113747 -1136272
14329 -1136272 -1136696 -1024729 -844823 -719262 -702382 -736523 -764233 -738734 -618286 -432700 -304537
14318 -304537 -321949 -435107 -564124 -634598 -658995 -740083 -897699 -1019534 -1020726 -981770 -978274
14307 -978274 -982429 -940261 -820712 -696250 -619020 -545846 -465411 -396019 -300403 -131066 66763
14296 66763 176431 130949 -5018 -133029 -238262 -281146 -181793 -9493 99696 158331
14286 158331 223065 245995 184206 60977 -49354 -91909 -111135 -205873 -367983 -486151 -520032
14275 -520032 -541684 -611207 -680923 -677374 -584748 -475374 -413940 -376160 -325002 -242752 -152393
14264 -152393 -145530 -219390 -288744 -295040 -216325 -133216 -99441 -74937 -38046 -17522 -74082 -269795
14252 -269795 -524195 -701638 -798793 -812487 -735273 -628810 -501971 -327238 -119703 111695
14242 111695 357123 549775 573358 408021 148985 -93286 -226800 -276470 -318937 -337199
14232 -337199 -283841 -177435 -61507 58860 158488 197526 157634 75102 -3380 -30722 23818
14221 23818 93210 95341 29018 -50781 -118582 -162637 -192415 -238998 -324284 -414166 -422367 -364842
14209 -364842 -294085 -207272 -121574 -95802 -198156 -396671 -598021 -727092 -728107 -575149 -308563
14198 -308563 -43132 121664 181795 162603 68225 -77919 -226191 -330782 -397755 -462301
14188 -462301 -517613 -544619 -559133 -566489 -586259 -611097 -629156 -640808 -607546 -495314 -268017
14177 -268017 67175 391507 610452 682466 628451 516379 413881 349665 344211 437943 599664
14166 599664 745747 761415 599845 321401 67296 -84712 -220280 -391295 -502720 -498423
14156 -498423 -449414 -425451 -414834 -404692 -352846 -239624 -125031 -34279 2788 -368 -13608
14145 -13608 -61862 -182325 -372365 -593201 -775540 -902185 -1006995 -1106090 -1191213 -1270151
14135 -1270151 -1283020 -1159618 -952500 -732492 -493225 -226375 46780 293167 460899 547049
14125 547049 583296 591672 572036 477239 277490 -6922 -335453 -667251 -959800 -1157452
14115 -1157452 -1187249 -1077180 -944812 -866739 -803831 -719894 -655859 -602664 -527271 -409883 -294468
14104 -294468 -222161 -141164 -46190 -37296 -156880 -329817 -473002 -544939 -608388 -683433 -676060
14093 -676060 -604842 -547640 -514850 -480112 -397355 -258657 -132763 -64043 -33695 -34227 -130755
14082 -130755 -344409 -583164 -746570 -776455 -694753 -567992 -408609 -181903 104232 339611
14072 339611 443033 459262 441784 370353 233774 49615 -140892 -238701 -176727 -9441
14062 -9441 160349 280934 382025 500086 625072 661687 517370 274967 88263 42820
14052 42820 154426 320246 363768 238045 36392 -167835 -323778 -378968 -363104 -321289
14042 -321289 -257008 -250677 -307854 -301497 -197126 -91825 -32699 35085 152209 335187 530935
14031 530935 605380 538925 451493 397450 352330 346231 421883 514152 559296 569048 559812 519848
14019 519848 408898 221916 -7394 -282283 -557192 -734510 -768331 -653352 -435651 -207092
14009 -207092 -30957 78645 132368 148841 124965 55668 -27637 -102677 -168206 -226369 -267031
13998 -267031 -287287 -269972 -171569 199 172377 253969 237358 213251 233435 276186 310074
13987 310074 281205 190983 112544 104060 148115 186975 215300 233994 177311 47901 -63472
13976 -63472 -106582 -47565 84474 208849 292808 341884 351548 309395 255211 231882 195195
13965 195195 110215 33681 31256 75303 111350 145101 169330 156920 165097 265593 374520
13954 374520 379460 339414 354224 389406 350702 218799 48189 -77843 -89879 -18334 6598
13943 6598 -83587 -253776 -428474 -531356 -526458 -435470 -351957 -325585 -331037 -346800 -374270 -417906
13931 -417906 -426513 -384964 -346391 -343055 -309457 -142865 106102 261637 220853 67193 -23520
13920 -23520 1491 42681 13532 -91911 -274163 -477479 -660706 -849528 -1029251 -1146593
13910 -1146593 -1168365 -1124348 -1040824 -895748 -660428 -393757 -152501 105986 354521 478631
13900 478631 454759 336588 187667 36888 -66775 -73970 -40907 -14042 37155 95478 100998
13889 100998 38908 -46931 -111376 -133791 -119886 -95332 -68531 -17001 54199 126540 219156
13878 219156 338645 384492 245283 -35528 -319530 -472598 -439063 -323886 -273282 -340200
13868 -340200 -453398 -507160 -475152 -397830 -302378 -192422 -85671 -14880 45295 106369 127818
13857 127818 133022 159263 191383 233817 307187 407483 547141 700155 793858 798115 731229
13846 731229 596542 343661 39122 -133618 -91061 44921 86210 21015 -36580 -21489
13836 -21489 60393 178616 283654 342251 386874 468320 544278 577380 590151 579220 577956
13825 577956 630556 729739 812987 807066 687997 484948 280363 119107 877 -67594 -61215
13814 -61215 15408 109098 154176 113271 -11963 -199810 -398804 -563461 -650823 -603832 -433982
13803 -433982 -202233 20330 156125 198260 201015 198908 188964 128473 21281 -62567 -82054
13792 -82054 -81030 -129413 -212218 -239717 -204486 -194206 -221611 -235197 -229147 -216848 -208679 -202346
13780 -202346 -168333 -155221 -204579 -287929 -418819 -585073 -702090 -702527 -656662 -667802 -699525
13769 -699525 -663090 -539407 -429679 -442471 -530956 -597174 -603542 -564704 -515111 -478621 -487746
13758 -487746 -553837 -613832 -631719 -611303 -562400 -487880 -368562 -223305 -109983 -33448 -2845
13747 -2845 -43587 -135557 -192978 -182436 -165282 -201180 -305169 -463388 -633559 -753444 -830462
13736 -830462 -919574 -1018113 -1042409 -931491 -699979 -420345 -187581 -122200 -207566 -297711 -308273
13725 -308273 -181109 48318 201406 166340 22746 -84396 -89195 -25634 -10798 -107891 -227129
13714 -227129 -269231 -249600 -235313 -234233 -231184 -226259 -209245 -154319 -61194 -12837 -46560 -103898
13702 -103898 -160306 -196887 -149813 -33097 102945 238042 335718 353404 269822 128002 22979
13691 22979 -10939 -3169 -15493 -126721 -343031 -553556 -638044 -615382 -581275 -559097 -498941
13680 -498941 -383575 -264852 -185639 -137828 -29747 201477 470148 668143 752830 717475
13670 717475 611978 494322 420742 441350 482959 447767 328953 145340 -44104 -142061
13660 -142061 -111690 -44680 -87842 -250896 -440159 -586243 -632805 -555361 -390591 -215204
13650 -215204 -71547 51966 176098 280417 331486 329870 301046 307026 367505 418860 442850
13639 442850 475278 491926 428233 246890 8275 -164381 -233526 -216251 -169184 -174258 -254519
13628 -254519 -355266 -417406 -467330 -584058 -760423 -836242 -716059 -497984 -311017 -181365
13618 -181365 -91899 -40191 -34633 -84298 -184415 -261295 -237915 -133331 -27994 41372 91639
13607 91639 146271 208942 226091 172045 66464 -98130 -247876 -302651 -299993 -286067 -260494
13596 -260494 -214985 -143805 -30017 138529 304116 409591 461236 472122 488853 482165 368204
13585 368204 191516 28659 -94309 -174577 -235935 -307637 -403037 -496271 -563180 -626795 -724473
13574 -724473 -820310 -850005 -807978 -704047 -536704 -320380 -106234 39979 84142 57912
13564 57912 -1641 -60311 -108562 -179093 -279657 -381615 -487403 -633449 -766479 -775631 -631236
13553 -631236 -419456 -188976 53584 241903 326040 344698 343086 276928 141874 -18939
13543 -18939 -127954 -112387 28887 293755 553317 625175 501379 307431 124257 -5728
13533 -5728 -71569 -111151 -132166 -98002 -26023 17098 3798 -73295 -178861 -268201 -343250 -416811
13521 -416811 -500198 -549695 -471247 -294012 -195150 -265868 -434418 -586972 -657511 -662706 -672885
13510 -672885 -697740 -716975 -748651 -780568 -755799 -653611 -511176 -355158 -197920 -28867
13500 -28867 137472 255426 312538 343397 391544 438506 430068 433100 530186 695588 855186
13489 855186 919526 797880 525770 265995 118501 37483 -88611 -243651 -339405 -387005
13479 -387005 -414545 -396548 -300279 -159810 -48528 -4504 685 58371 199045 363103 488422
13468 488422 592129 705542 783583 822521 839450 869971 932021 898614 659992 312363 6674
13457 6674 -173535 -178972 -72052 2663 -22662 -98549 -121520 -82065 -66186 -117758 -206946 -291488
13445 -291488 -372178 -431119 -416919 -333390 -235188 -175915 -121932 -5233 136570 256187 321750
13434 321750 275032 155497 45201 -38812 -91980 -85900 -2264 117552 207151 305580 442124
13423 442124 569566 617478 519347 347236 219476 106524 -108482 -424348 -657285 -654865
13413 -654865 -474031 -280304 -182190 -126573 -20907 89578 112242 32297 -120011 -292130
13403 -292130 -400176 -421416 -382607 -267368 -72464 149395 330388 454456 555395 658431
13393 658431 770013 886737 986396 1046125 1033586 922743 741216 562128 396106 221045
13383 221045 50728 -52430 -42713 40291 137523 233092 320034 386651 400238 333592 197181
13372 197181 27895 -115010 -185060 -160413 -57665 56682 164910 292688 462961 627430
13362 627430 681834 609118 490003 400015 345675 283415 188009 64108 -97454 -269294 -395746
13351 -395746 -462616 -486090 -497883 -484188 -405230 -238077 -26466 188494 382135 504165
13341 504165 533442 475178 401348 444627 618779 772673 783331 664817 507850 405285
13331 405285 368957 378990 430090 471702 431826 338206 296670 330759 371821 406268 454314
13320 454314 482054 445998 360702 337257 439701 598146 710312 698243 560977 352140
13310 352140 123431 -63144 -133878 -54015 129134 316326 476341 617430 689830 645296
13300 645296 484686 273221 91426 -48751 -87346 35507 186740 242446 241980 246184 257269
13289 257269 271766 246339 154460 57199 47348 186760 465310 841170 1208896 1440597 1522697
13278 1522697 1491645 1360053 1144382 926283 780842 687898 628734 611379 600414 540091
13268 540091 447369 382695 368984 399337 436853 507180 644891 788307 867272 888854 903696
13257 903696 926648 918796 881289 859297 893872 978137 1044440 1050097 984313 898543 827773 726606
13245 726606 559853 365694 163118 -91014 -350102 -499206 -503176 -341290 -22369 350128
13235 350128 677960 941570 1093486 1125157 1107315 1098781 1154645 1289188 1410618 1399510 1266104
13224 1266104 1117407 1038950 1067533 1188989 1330295 1412053 1422274 1430191 1454018 1427758 1323124
13213 1323124 1186728 1026554 853696 723519 627111 531387 460967 402639 322977 278509
13203 278509 341669 483477 616589 657933 591973 521682 531035 597505 688394 799353 930162
13192 930162 1084985 1264221 1389967 1423731 1428572 1442729 1495750 1575985 1578005 1425024 1200709
13181 1200709 1051888 1031170 1105448 1198363 1262529 1250438 1142401 1006366 910993 872564 853195
13170 853195 835052 890259 1060920 1291554 1447998 1475388 1437573 1406464 1412672 1470765 1554180
13159 1554180 1618182 1594503 1463670 1337001 1338085 1476306 1652894 1806108 1924462 2002701
13149 2002701 2075149 2171538 2287572 2401740 2495647 2576362 2669422 2731957 2682316 2584166 2565053
13138 2565053 2602547 2622729 2603672 2523964 2395706 2233351 2047068 1942318 1991485 2121765
13128 2121765 2254379 2347746 2434098 2531644 2592947 2570463 2495099 2409275 2292915 2198841 2188029
13117 2188029 2183313 2112051 2025804 1972620 1979689 2064991 2140993 2123226 2053939 2066165 2219039
13106 2219039 2413708 2561315 2715828 2884303 2976104 2980692 2949155 2882979 2794366 2713548 2621705
13095 2621705 2504672 2410810 2381211 2408003 2494731 2642917 2795518 2886614 2897028 2862518 2835197
13084 2835197 2795192 2696461 2584892 2563348 2669342 2864720 3070510 3214677 3306876 3423086
13074 3423086 3590415 3763337 3872707 3883529 3777805 3592901 3422725 3296626 3185086 3109198
13064 3109198 3092547 3157115 3298879 3473437 3642594 3728561 3712801 3671853 3634847 3567870 3490348
13053 3490348 3489918 3604990 3812322 4072087 4283549 4380236 4395924 4409693 4467294 4547680 4661417
13042 4661417 4850492 5086975 5296397 5436336 5504334 5531336 5532359 5520816 5535838 5626753 5812536
13031 5812536 6055173 6318750 6564733 6766342 6944697 7110943 7242968 7346986 7456732
13022 7456732 7595367 7775945 7960909 8117844 8272147 8468426 8726738 9038068 9356989
13013 9356989 9658880 9993875 10371344 10772035 11167650 11530159 11924949 12457522 13097413
13004 13097413 13753862 14376104 14982795 15655972 16431525 17284765 18170237 19087929 20121557
12995 20121557 21338567 22723098 24195923 25792499 27636406 29768159 32143644 34663782
12987 34663782 37291114 40186151 43560714 47506593 52027380 57098938 62753082 69211130
12979 69211130 76720107 85457017 95648835 107578141 121541961 137796026 156729698
12972 156729698 178934668 204925993 234777500 267463139 299734524 325214355 335628748
12965 335628748 325789890 298201227 261152132 222873630 188203230 158799727 134535756
12958 134535756 114692493 98584318 85582121 75094919 66599095 59581425 53614422
12951 53614422 48452086 43959532 40085675 36798398 34041546 31698045 29579144 27547612
12943 27547612 25625135 23907886 22465726 21310495 20387446 19613535 18947288 18390230 17918165
12934 17918165 17462286 16982688 16507188 16088768 15759215 15551678 15501192 15601553 15808969
12925 15808969 16025960 16170222 16262544 16363778 16509499 16720604 17041683 17500121 18094336
12916 18094336 18824552 19667141 20591177 21631255 22805983 24082130 25445625 26873633
12908 26873633 28279657 29579613 30749401 31802438 32886873 34210599 35908346 38029843
12900 38029843 40602752 43641441 47084595 50945501 55318719 60346242 66199141 72927809
12892 72927809 80600759 89469644 99866129 112117475 126550552 143496518 163416693
12885 163416693 186870484 214263810 245485311 279132926 311120904 333942630 339173088
12878 339173088 323328287 291233986 252214977 214017224 180468047 152444712 129487232
12871 129487232 110780417 95463274 82834049 72416224 63870828 56873966 51026209
12864 51026209 46000415 41678312 37984475 34807692 32123161 29907521 28071154 26469263
12856 26469263 25009499 23678206 22478842 21366275 20318068 19387953 18613681 17973146
12848 17973146 17433304 16949956 16452094 15966785 15579017 15270425 15018127 14838523 14734248
12839 14734248 14700935 14767090 14954516 15188097 15389878 15585276 15814379 16064287 16284811 16468804
12829 16468804 16704302 17088235 17657529 18454271 19429480 20390455 21286484 22251572 23354583
12820 23354583 24596214 26021459 27677721 29574848 31683568 33993987 36551246 39458624
12812 39458624 42820590 46681888 51017087 55820461 61163962 67145254 73921406 81735011
12804 81735011 90836107 101495807 114110962 129103771 146785424 167496145 191744219
12797 191744219 219885000 251537597 284629230 314149130 332213682 331489401 310793350
12790 310793350 276484100 237562024 200634339 168664544 142087554 120300192 102510554
12783 102510554 88022369 76233635 66589445 58585775 51834769 46111496 41252426 37094448
12775 37094448 33486569 30365407 27677100 25315128 23228864 21411278 19824500 18445418
12767 18445418 17221293 16067366 14965491 13954158 13059329 12241157 11418648 10611310 9932413
12758 9932413 9393671 8881499 8393439 8025516 7717688 7320805 6782210 6219281 5810776
12749 5810776 5597734 5536792 5517669 5407577 5185478 4907644 4619494 4350451 4150641 4079142
12739 4079142 4090799 4060526 3968129 3913836 3950905 4034174 4066593 3952354 3715217 3459696 3252873
12728 3252873 3042294 2777793 2511277 2290460 2123625 1987140 1839503 1658388 1462440
12719 1462440 1295000 1160318 1048415 1002038 1053297 1143535 1186920 1180302 1183891 1244474 1327229
12708 1327229 1397897 1477342 1547128 1551023 1473354 1390887 1344107 1319437 1310590 1322020 1327489 1287991
12696 1287991 1231951 1241893 1295288 1282220 1252209 1324125 1468252 1555929 1493705 1332415 1196505
12685 1196505 1124519 1073357 1012106 988824 1025609 1048012 997564 912732 846032 791750 706597
12674 706597 572558 431291 343577 331809 364418 418866 494170 555543 570035 587857 663988
12663 663988 755419 853821 967895 1013029 971531 921508 885339 814251 683958 515163 328375
12652 328375 183068 183439 287625 363844 376062 433904 560701 623985 573421 449632 329159
12641 329159 281230 283914 297163 266624 163349 41736 -51057 -160875 -303797 -424920 -500838
12630 -500838 -567042 -699522 -918722 -1156038 -1288997 -1213409 -952526 -642818 -362759 -103829
12620 -103829 91470 183382 225786 253992 281802 342153 434995 546637 698331 860286 926284
12609 926284 875754 824166 814429 772920 694738 644320 594447 460047 252681 36644 -155490
12598 -155490 -318419 -438149 -495095 -479872 -351906 -129355 109890 297320 409562 494612
12588 494612 540753 489147 341215 169732 60849 63028 126579 159047 108998 -15264 -154013
12577 -154013 -283040 -413601 -482677 -414073 -214272 17645 143528 137793 74896 -4815 -79721
12566 -79721 -108876 -121265 -126662 -94623 -53924 -46702 -59766 -52643 3173 108827 229460 306125
12554 306125 306870 284714 306587 397906 560061 731225 860244 952354 990779 913813 686183
12543 686183 365196 90833 -12127 36795 92341 104069 150500 298933 512691 688831
12533 688831 729185 610200 408810 227742 78998 -67112 -169496 -197239 -170458 -111633
12523 -111633 -17067 103641 234016 377683 490137 519829 505804 488238 491358 510253 513227
12512 513227 496548 438826 336755 196237 25958 -129255 -212212 -208837 -155442 -97573 -95345
12501 -95345 -161562 -197091 -146711 -48956 30226 70482 100746 132527 177476 240737 288090 282964
12489 282964 229857 141454 72037 69881 116228 175881 229530 260529 266621 241378 159732 39012
12477 39012 -86784 -182677 -198282 -144625 -61826 -16734 -98636 -277096 -406441 -425707 -382579
12466 -382579 -351787 -405901 -515303 -616589 -687837 -726916 -727528 -681923 -645262 -661297 -708170
12455 -708170 -771509 -847806 -932344 -1003954 -978323 -828740 -658263 -536290 -451108 -373220 -276136
12444 -276136 -148406 10581 164190 227436 170688 71870 -21929 -96945 -136535 -156843 -147385
12433 -147385 -87446 11048 127450 263400 405482 481958 480198 479288 486155 424981 289917
12422 289917 130794 -30250 -145133 -141874 -20321 156537 310150 397747 404953 323624 167425
12411 167425 34751 4021 5428 -8700 -9186 26893 117516 216366 270994 304473 333757 303694
12399 303694 219512 121868 -39925 -269509 -491571 -596458 -518985 -307550 -62375 144947
12389 144947 271623 319664 311215 244197 150493 64771 -72465 -289276 -512759 -675807 -771741
12378 -771741 -861301 -959518 -1004689 -964738 -806063 -530184 -236370 -38537 18802 -25385 -124485
12367 -124485 -264311 -391343 -427686 -364486 -282803 -244720 -229977 -212852 -239948 -346247 -470451
12356 -470451 -544338 -570746 -605778 -639772 -565770 -420449 -330484 -287097 -223305 -128366 -51729
12345 -51729 -20547 -23666 -54437 -107776 -163626 -196536 -191220 -107587 73038 274061 400202
12334 400202 458598 484243 474501 425054 359993 330125 349265 360000 291173 147796 -42182
12323 -42182 -231712 -341290 -351838 -284827 -199074 -157374 -112876 -7623 137275 280790 383866
12312 383866 455624 505761 537024 539368 502805 432203 295791 102355 -72093 -183478 -247701
12301 -247701 -270614 -242499 -150771 2566 157455 211571 176635 135332 86628 28678 -9578
12290 -9578 -16696 3725 63131 161447 244537 265111 232921 177400 123623 120772 181369 228601
12278 228601 210332 139716 18998 -150075 -306482 -352596 -261473 -95052 80405 242984
12268 242984 366344 438812 493906 538970 579774 648516 729871 777526 758009 663215 563240
12257 563240 533200 557143 547853 458637 362446 312868 274126 230949 241911 341744 462588
12246 462588 501973 448098 379562 322410 190766 -21869 -195098 -266080 -255638 -205888 -123646
12235 -123646 7273 134759 150843 29263 -139997 -291065 -379379 -359985 -244029 -116236
12225 -116236 -51123 -27598 -17735 -62147 -199432 -415702 -638106 -812746 -978774 -1164542
12215 -1164542 -1275708 -1181904 -908268 -580825 -316188 -192522 -210981 -321606 -435417 -466494
12205 -466494 -357828 -201382 -175130 -278240 -424336 -574344 -678194 -710389 -720831 -745601
12195 -745601 -781778 -780249 -687391 -556932 -480492 -471251 -477297 -428998 -321672 -172008 13756
12184 13756 167103 215158 174872 85450 -65911 -217003 -302759 -336482 -324741 -270116 -197171
12173 -197171 -114008 1420 116741 208886 281888 291412 259784 247302 221283 172134 167941
12162 167941 208358 205168 131484 26458 -69387 -184061 -373639 -559835 -614794 -530081 -391874
12151 -391874 -254957 -211355 -374405 -717184 -1109828 -1413452 -1506130 -1371033 -1125658 -920472
12141 -920472 -843585 -868412 -916813 -979712 -1075525 -1158743 -1154843 -1034101 -847933 -698255 -632239
12130 -632239 -588525 -510815 -405030 -330520 -326384 -349745 -391224 -466432 -517495 -491766 -443766
12119 -443766 -407643 -374438 -382533 -432054 -461128 -477558 -502804 -478808 -349419 -140978 59917
12108 59917 183564 225960 242255 262612 268906 300061 398527 499157 493656 413412 343454 292434
12096 292434 273355 313296 406883 481754 434628 269206 107601 58738 134628 218648 175995
12085 175995 7345 -143012 -156920 -67658 16443 64821 58133 -42304 -239584 -458280 -599300
12074 -599300 -576567 -370210 -85726 143510 253387 281267 285079 290154 305651 312352 220146
12063 220146 35512 -122480 -271317 -421990 -489110 -495808 -493484 -443809 -325517 -205399 -141601
12052 -141601 -135856 -169852 -214240 -221443 -180563 -132030 -160665 -297565 -433990 -459587 -350179
12041 -350179 -151063 31917 110739 52379 -135122 -376937 -546402 -601554 -589029 -561857
12031 -561857 -544892 -533904 -545304 -557563 -564256 -562941 -534979 -510096 -486109 -472066 -484658 -481151
12019 -481151 -433495 -356485 -298554 -303010 -366979 -435408 -492976 -560706 -647356 -698088 -652152 -516180
12007 -516180 -349998 -174496 -8425 126680 236433 297682 296434 261544 255879 343792 494142
11996 494142 588104 559411 413537 248241 168710 165246 126933 -10744 -175600 -262241 -255526
11985 -255526 -235399 -284613 -356852 -386227 -445380 -605061 -776906 -818280 -725180 -554249 -354702
11974 -354702 -174689 -76603 -113959 -225876 -325944 -399401 -471625 -561128 -635321 -635758 -534701
11963 -534701 -370550 -218351 -121130 -68767 10002 123999 196783 186173 90168 -106900 -343940
11952 -343940 -535231 -654640 -702433 -694218 -624906 -496321 -331680 -190520 -122597 -136292 -177024
11941 -177024 -226872 -326663 -399995 -306725 -89439 70791 94912 16748 -126771 -282852 -386021
11930 -386021 -358603 -169770 97164 324073 447316 444292 368341 307113 262178 188684 112704
11919 112704 81530 54469 -24632 -189378 -426095 -643836 -722757 -648094 -500760 -362972
11909 -362972 -306660 -289428 -167645 104012 447533 709837 794044 783861 775913 754819 677156
11898 677156 528640 362168 265800 277400 351709 417802 471509 543115 624740 718390 828177
11887 828177 908931 913934 819983 649950 480203 385852 383710 449221 524469 570751 597235
11876 597235 644649 714458 781388 849060 893859 875455 847794 852195 855940 857793 872969 904332
11864 904332 954114 999593 963328 795793 544811 297252 98954 28074 120507 285202
11854 285202 424403 508334 544783 536399 524562 585390 774832 1078270 1430876 1736047 1907330
11843 1907330 1942058 1930652 1974579 2068679 2151598 2256193 2489912 2874502 3354569 3845364
11833 3845364 4300273 4729535 5132617 5506957 5906420 6403976 6952178 7427332 7762946
11824 7762946 8027433 8269458 8414344 8385899 8123410 7675234 7221077 6850038 6493426 6076540
11814 6076540 5596105 5102515 4646863 4220428 3854045 3626923 3536339 3492527 3454309 3431555
11804 3431555 3428481 3485639 3561955 3571178 3503178 3367858 3137680 2839215 2584379 2470027 2505245
11793 2505245 2646970 2796035 2877153 2916143 2919146 2904484 2899718 2882811 2862434 2862276 2878468 2935707
11781 2935707 3077204 3316221 3606936 3859098 4032449 4105592 4037993 3888242 3774759 3675615
11771 3675615 3478163 3203840 2974801 2815186 2684548 2556410 2453626 2434225 2512594 2640008
11761 2640008 2727341 2758529 2776053 2785066 2806070 2838323 2865195 2907496 2969789 3062246 3233331
11750 3233331 3515911 3880741 4342333 4938558 5611116 6275935 6918862 7595159 8325436
11741 8325436 9107761 10004873 11028429 12036671 12841936 13362108 13588899 13536136 13332537
11732 13332537 13160515 12893976 12300714 11421069 10440737 9569467 8927564 8418561 7830492
11723 7830492 7124330 6407738 5739390 5178043 4779273 4506797 4281924 4044075 3768229
11714 3768229 3448407 3115965 2815346 2606083 2513659 2483928 2465702 2436997 2382762 2313321
11704 2313321 2276096 2280899 2290563 2285369 2281495 2266891 2244562 2204502 2075923 1826292 1573394
11693 1573394 1496531 1614865 1839693 2079672 2226498 2201654 2087189 1998765 1953121 1955449
11683 1955449 1983527 1969423 1907804 1824663 1730135 1595059 1411732 1213309 1029748 904430
11673 904430 847824 849002 882228 903246 916248 940484 963360 939977 880255 831588 852794 974224
11661 974224 1151010 1324055 1429107 1412190 1243490 992517 772630 660928 657119 704481
11651 704481 744089 706935 580595 446160 374702 365856 348039 259175 133278 42517 24613
11640 24613 37724 -10378 -114940 -148995 -109633 -106642 -135220 -137505 -88912 30543 202051
11629 202051 351630 432324 424881 354703 275547 197243 134098 108805 116636 145743 157051 84706
11617 84706 -61517 -206227 -300712 -347805 -369555 -348624 -284193 -222657 -179489 -139604 -113219
11606 -113219 -108168 -155265 -286145 -398080 -353012 -164305 46651 234946 401820 524917
11596 524917 596407 594435 490226 337662 206188 111611 38745 -51685 -155245 -260429 -357380
11585 -357380 -436586 -508056 -552755 -535665 -463574 -354373 -210521 -56737 95088 204874
11575 204874 246773 196444 46313 -72857 -83991 -74166 -113238 -200537 -265450 -210345 -56471
11564 -56471 85691 148316 152923 176812 285437 451500 644634 829345 890674 761654 524338
11553 524338 290797 104045 -30454 -85266 -39708 24398 25933 4722 33529 137135 250260
11542 250260 285558 262599 247889 285355 351614 415163 474156 461198 335392 149657 4689
11531 4689 -28601 43180 148813 226050 218839 122922 14634 -38963 -69624 -144140 -236086 -235222
11519 -235222 -88535 118201 244782 258130 214909 184002 196349 241263 294523 279092 127262
11508 127262 -89301 -225036 -222882 -158464 -143335 -229459 -430444 -703868 -948947 -1066559
11498 -1066559 -1011860 -902979 -859121 -888162 -926377 -894030 -792289 -672505 -565664 -473447
11488 -473447 -413069 -386198 -370195 -376012 -398997 -348482 -207985 -71921 24969 85133 102633
11477 102633 86213 64825 32059 -57766 -154946 -161218 -73778 11879 55398 124689 227850
11466 227850 276493 231755 147456 80502 74181 175824 332827 421889 390847 280632 159811
11455 159811 108231 143128 186899 203712 237876 304432 380566 445555 512881 593232 674992
11444 674992 743813 768646 741014 713786 682244 597188 526145 574920 775066 1121750 1574015
11433 1574015 2109736 2720418 3375480 4007334 4612132 5233860 5862639 6559970 7538049
11424 7538049 8853061 10082005 10439221 9582687 8050215 6501628 5232203 4298193 3600755
11415 3600755 2979247 2397711 1931626 1580195 1260492 988940 824858 732771 640088 539736
11405 539736 469671 427675 459062 575970 650387 578434 399176 225227 115772 24554 -50540
11394 -50540 -44862 54400 237294 430136 510473 464911 374520 279004 206166 156731 75851
11383 75851 -29418 -95503 -100554 -92956 -164653 -316706 -454397 -558312 -668457 -790805 -872206
11372 -872206 -882361 -873054 -862996 -804640 -682375 -533549 -426468 -375857 -269205 -16778 310100
11361 310100 542132 577860 440224 258639 201307 276128 368194 451677 533530 529823 387653
11350 387653 178102 3358 -98466 -134604 -153542 -177968 -207189 -261819 -330536 -365802 -323332
11339 -323332 -216096 -82609 15031 60902 115004 200833 319165 459832 568857 572857 454312
11328 454312 311051 269901 347327 443140 417255 233854 9731 -148818 -248656 -302065 -295094
11317 -295094 -224883 -113601 -18038 13828 -57952 -222119 -374811 -435420 -396505 -283134 -111634
11306 -111634 75738 210752 281540 333142 380260 447751 522436 545306 540198 567133 620357
11295 620357 642175 590554 431940 237358 111226 54820 16082 -11600 11423 63050 66882
11284 66882 -53871 -309023 -601222 -822148 -877432 -813478 -740856 -667746 -542433 -373697
11274 -373697 -241998 -182204 -143245 -88732 -44229 -28770 -43476 -98494 -232756 -444475 -628040
11263 -628040 -692674 -705184 -736278 -749375 -690055 -564445 -440388 -315846 -152803 6715
11253 6715 84651 72735 56690 115448 245513 335293 305103 263788 300403 341858 319548 290606
11241 290606 270783 196237 72610 -44283 -154887 -278670 -375150 -379254 -268641 -74878
11231 -74878 102942 155233 111902 49219 -60528 -223212 -357502 -382771 -277845 -155654
11221 -155654 -105193 -76034 -18492 58389 107513 133418 162343 145484 63694 -213 11827
11210 11827 67120 127084 218618 385993 599087 776885 866410 856511 784080 663468 494282
11199 494282 306388 154094 63320 24580 9621 182 1256 2281 -32279 -140148 -288472
11188 -288472 -423363 -479091 -422003 -299718 -173160 -31806 161234 370438 433789 273018
11178 273018 26875 -149637 -223157 -223125 -198023 -213714 -256722 -279159 -326096 -485749 -763251
11167 -763251 -1033998 -1158445 -1119454 -970645 -758831 -534222 -380563 -297561 -234621 -165106
11157 -165106 -100675 -51523 15825 117831 195643 164786 -21458 -266772 -413262 -382695 -198318
11146 -198318 16377 177023 232219 111168 -164518 -450223 -667282 -830466 -936222 -969791
11136 -969791 -940014 -832790 -666654 -512474 -405409 -365098 -439251 -568508 -633433 -592113
11126 -592113 -485353 -357839 -256135 -230815 -278083 -344453 -409010 -459051 -467922 -445666 -430202
11115 -430202 -377768 -234184 -30453 144571 221144 213830 185114 205678 231711 151528 3162
11104 3162 -88735 -88857 -8486 98855 171300 212416 246873 240422 165154 73603 50258 135426
11092 135426 262331 321230 285920 229752 243404 307739 346703 328750 260017 188582 156362
11081 156362 155328 119469 5432 -128065 -263116 -411090 -490813 -469822 -429038 -427952 -400140
11070 -400140 -305800 -177367 -35403 151572 403918 628904 722161 720564 724962 766259 802841
11059 802841 804462 768601 637227 425093 252433 162720 106869 21590 -52457 -8546 163250
11048 163250 376475 482598 435605 335337 282631 249316 182992 117932 60867 1006 -75773
11037 -75773 -205540 -359649 -465900 -494734 -457059 -404770 -375493 -307730 -147406 53098 197702
11026 197702 251311 233216 131990 -19841 -97735 -47100 84562 214047 296886 370741 460183
11015 460183 569874 703842 794702 820544 841210 887931 917155 860302 691170 468729 328935
11004 328935 327452 402739 428925 338453 198154 81638 15806 -58169 -156515 -202221 -167123
10993 -167123 -84665 8371 90613 153259 247539 373022 504364 642459 763585 837974 891759
10982 891759 989973 1123805 1193629 1106579 836369 484390 197431 59702 58571 155369 356244
10971 356244 608395 792376 850477 804150 716879 637756 546562 437408 372273 405236 507828
10960 507828 607030 665786 663058 587845 444711 232522 10662 -112277 -134130 -134799 -101034
10949 -101034 6848 187841 386477 538817 596102 530034 400506 271800 201854 236724
10939 236724 279822 175762 -85494 -315516 -320710 -140334 56148 212268 363080 484740
10929 484740 534122 543241 563429 623895 701704 713254 671082 730452 967670 1315567 1680086
10918 1680086 2015910 2300425 2509041 2608515 2550248 2340827 2063009 1762137 1460854 1255735
10908 1255735 1225102 1321142 1445794 1550384 1648921 1763169 1849245 1822620 1683994 1512200
10898 1512200 1384375 1309234 1257088 1179712 1039115 861535 669725 455797 217358 11962
10888 11962 -78324 -33612 62124 120681 113485 61488 19795 -24933 -99373 -177138 -213650 -215075
10876 -215075 -207235 -190482 -119051 -535 57318 60345 105973 190156 239407 204874 93044
10865 93044 -79407 -238055 -274451 -184092 -26742 121147 209671 213260 104535 -71028 -202309
10854 -202309 -263012 -296839 -334549 -416346 -548305 -665142 -742857 -804885 -868431 -910656 -907143
10843 -907143 -851945 -755353 -619044 -417260 -136359 129757 268875 251136 74208 -217144
10833 -217144 -546419 -816155 -990192 -1123223 -1215185 -1217068 -1133197 -1081476 -1160291 -1281650 -1346343
10822 -1346343 -1304802 -1149157 -961285 -816179 -716511 -594301 -391388 -130820 108576 244821
10812 244821 211608 83009 26210 44414 47355 -7520 -128649 -326777 -549116 -711370 -813944
10801 -813944 -900061 -944105 -854348 -621146 -341592 -128504 -22897 19701 32130 7703 -5694
10790 -5694 33291 115090 213896 249213 117670 -158494 -435683 -592329 -635405 -600700 -521937
10779 -521937 -454968 -435258 -459896 -499408 -538633 -554041 -507423 -432634 -356660 -237859 -87952
10768 -87952 8797 -15789 -130329 -215882 -239790 -246836 -226225 -180159 -152905 -163913 -241181 -357605
10756 -357605 -457858 -506259 -460826 -309351 -105699 59943 110846 75884 93909 183347 210464
10745 210464 136400 62441 1693 -106598 -212864 -238625 -188157 -58387 102188 175106 113219
10734 113219 -10300 -116465 -155944 -121828 -103803 -148103 -177143 -169390 -163729 -159744 -172589 -221515
10722 -221515 -283155 -390545 -560235 -689590 -691086 -644735 -653155 -683383 -692756 -646210 -486846
10711 -486846 -248628 -47693 60565 116204 151781 170553 178803 174396 86793 -92027 -244430
10700 -244430 -268449 -195735 -152519 -167068 -223358 -317392 -399721 -445137 -491248 -532484 -507149
10689 -507149 -391196 -203308 39535 298258 458600 453179 312505 91426 -147743 -383657
10679 -383657 -604159 -759331 -824049 -836392 -796219 -622022 -330174 -37624 156233 231459
10669 231459 226109 160627 64170 -27174 -122465 -228530 -312435 -328482 -297878 -284366 -326667
10658 -326667 -409511 -472476 -468726 -418275 -365728 -332115 -365848 -472679 -599358 -724350 -842807
10647 -842807 -925914 -936363 -885004 -815557 -731291 -616017 -506571 -438679 -417316 -432701 -478559
10636 -478559 -541722 -568123 -527400 -441770 -363703 -362833 -481162 -676894 -821142 -832317 -780678
10625 -780678 -760480 -771028 -772843 -775109 -772313 -724070 -640920 -521738 -373444 -261056 -195677
10614 -195677 -130323 -92979 -74818 5627 129637 211005 210440 106814 -77541 -232971 -276680
10603 -276680 -229391 -145040 -63735 -2941 42032 108759 190062 223769 229201 253918 260137 210839
10591 210839 119340 36560 59915 149562 161956 45966 -144568 -374652 -619836 -820118
10581 -820118 -938589 -994778 -998515 -953101 -856976 -722107 -569170 -415490 -289487 -162274
10571 -162274 -13654 100121 121599 50864 -53653 -168935 -285144 -385410 -452747 -477941
10561 -477941 -474528 -495165 -585562 -748765 -939626 -1101247 -1210656 -1298144 -1401458 -1470592 -1476400
10550 -1476400 -1427894 -1349304 -1269956 -1170270 -986756 -735141 -519691 -387518 -317899 -262571
10540 -262571 -189655 -135661 -99233 -96709 -159815 -226846 -229868 -191420 -176623 -198328 -207986 -185196
10528 -185196 -182649 -159590 -8882 207383 353901 427410 427639 349325 194313 -37166 -266223
10517 -266223 -390370 -406479 -317971 -143883 53683 176426 153207 15481 -131941 -137995
10507 -137995 51315 343067 644887 904567 1041247 996749 799695 521747 258976 63967
10497 63967 -75989 -166165 -260305 -397208 -511268 -549387 -521965 -457073 -397202 -361800 -367581
10486 -367581 -420364 -483308 -511144 -446631 -276162 -107390 -33694 -81204 -271775 -542259 -779629
10475 -779629 -951190 -1055462 -1095275 -1154373 -1267689 -1376520 -1413080 -1369507 -1282691 -1186361 -1074415
10464 -1074415 -928265 -801101 -773709 -848923 -918598 -911216 -856200 -789245 -752818 -764619 -770881
10453 -770881 -723599 -610834 -449947 -256064 -80287 13789 5126 -20440 -13015 -30635 -111590
10442 -111590 -198696 -232525 -222121 -174936 -116654 -49832 10013 4057 -74307 -147086 -184896 -226096
10430 -226096 -273839 -297649 -274732 -206836 -128320 -111488 -204997 -374235 -524569 -557316 -479864
10419 -479864 -397458 -321131 -194343 -3723 193011 295795 237397 24677 -232795 -395820
10409 -395820 -440927 -424062 -344259 -212373 -75879 41204 97806 78929 21282 -19220 -44818
10398 -44818 -95534 -166770 -231728 -240177 -122036 34348 89386 47412 -18410 -115131 -276274
10387 -276274 -443843 -545675 -606313 -694630 -766466 -760950 -697327 -601509 -486123 -394139 -366896
10376 -366896 -405576 -463711 -484665 -442587 -435252 -519195 -628794 -734622 -864100 -1006795 -1086927
10365 -1086927 -1094250 -1061482 -1012764 -969639 -932272 -902870 -874189 -796246 -655608 -481180 -322116
10354 -322116 -213317 -123000 -1764 123207 194973 186969 111247 40378 2772 -15792 -17448
10343 -17448 4141 57976 77078 -14807 -202156 -391918 -512062 -575964 -620643 -662964 -693018
10332 -693018 -664073 -573607 -488200 -472612 -542836 -642269 -683378 -632281 -525887 -447880 -434193
10321 -434193 -434397 -388501 -335958 -353868 -396940 -384681 -301569 -180571 -52967 57863 137593
10310 137593 206766 206159 36981 -232205 -480221 -687764 -898313 -1137373 -1372256 -1521698
10300 -1521698 -1504736 -1373100 -1247155 -1128071 -969185 -792363 -630568 -491977 -422647 -439366
10290 -439366 -434218 -349529 -245997 -144159 -48535 4913 -11075 -102156 -257516 -404456 -455245
10279 -455245 -396243 -274740 -132167 24588 162655 268705 389039 528370 601333 570991
10269 570991 531141 542235 507253 360428 129505 -110459 -274025 -393790 -539428 -683157
10259 -683157 -767475 -819253 -883373 -919521 -841506 -640982 -399682 -221463 -163973 -173347 -175177
10248 -175177 -142174 -65189 9298 29851 -10659 -52317 -42845 -13337 -6372 -63349 -189430 -332821
10236 -332821 -451384 -494188 -453062 -382877 -334355 -304328 -244217 -139692 -45241 11744 88267
10225 88267 203382 305459 363628 416949 444911 390812 303457 247943 230647 277267 384327
10214 384327 477560 561365 677627 791070 860223 900504 945719 928785 779353 532739 256856
10203 256856 -18339 -250893 -381315 -399461 -342848 -257100 -216035 -267519 -314613 -261967 -128351
10192 -128351 -10555 8276 -33863 -82056 -156916 -239814 -290521 -314509 -320386 -347193 -422469
10181 -422469 -494617 -544878 -605599 -690554 -817638 -982601 -1110057 -1095270 -909161 -638320
10171 -638320 -398561 -260036 -235923 -273647 -282894 -241692 -179807 -140500 -180249 -310396 -425170
10160 -425170 -428529 -340885 -224920 -121708 -62314 -63331 -73001 -34684 36993 114973 215390
10149 215390 328950 428852 527290 614067 676867 705362 637434 467637 324614 298151 338504
10138 338504 375170 386495 308098 94994 -204392 -486633 -605360 -485177 -226424 -32898
10128 -32898 11131 -22240 -47291 -14190 109978 313888 509930 627421 644306 576835 523467
10117 523467 569068 676859 792057 875566 904681 907829 913317 963274 1086254 1211723 1256147
10106 1256147 1192161 1037518 797879 510834 236181 10158 -142560 -185982 -73925 158125
10096 158125 372533 487761 492617 348709 68157 -249749 -499249 -611391 -554072 -395678
10086 -395678 -267557 -185369 -50628 140339 289361 362325 355397 234260 33289 -124593
10076 -124593 -190472 -200756 -187589 -144988 -122557 -193124 -306298 -384044 -434798 -503242 -582626
10065 -582626 -650588 -659646 -566910 -432407 -320909 -207939 -82441 30498 61100 -57505
10055 -57505 -299430 -558491 -711434 -710851 -645051 -619327 -621890 -630745 -657483 -661059 -630299 -591281
10043 -591281 -565902 -556712 -582523 -660700 -748475 -830377 -948165 -1071808 -1127812 -1097192 -1027622
10032 -1027622 -1016105 -1104369 -1197225 -1236143 -1273041 -1345363 -1450051 -1564446 -1626629 -1573035 -1460697
10021 -1460697 -1426675 -1479724 -1540906 -1559931 -1489844 -1344487 -1194428 -1096883 -1059071 -1036840 -1003532
10010 -1003532 -933090 -838476 -704120 -544698 -447845 -426202 -434499 -468145 -534327 -605401 -636976
9999 -636976 -591559 -466343 -278085 -70762 146129 346194 426647 368920 272936 211537 179157
9988 179157 145155 92808 22720 -47720 -102533 -130212 -112305 -65372 -620 67678 124974 192547
9976 192547 280862 374823 478818 596009 687332 701831 599760 379200 138520 27280
9966 27280 78037 166645 177307 145820 181937 283733 352503 354228 304358 182377 -18906
9955 -18906 -212671 -253960 -109358 101149 272519 378177 390084 247415 -12753 -209330
9945 -209330 -237670 -198447 -214258 -286709 -349976 -353412 -316926 -265712 -182680 -108387 -78786 -111714
9933 -111714 -215060 -321157 -388861 -445231 -500891 -558935 -561415 -434463 -228454 -59549 -7160
9922 -7160 -79880 -194518 -305539 -426548 -535628 -557300 -476762 -377473 -329471 -319637 -304033
9911 -304033 -212812 -17022 198144 344330 433089 527438 627990 674562 638278 558057 508148
9900 508148 501771 453823 333457 213017 146547 121724 114142 116045 116993 116146 92403 6100 -113571
9887 -113571 -204831 -220240 -179680 -104503 28082 197278 340390 461281 605369 769697
9877 769697 935524 1107103 1282273 1390181 1372976 1249081 1056884 843778 651743 545419
9867 545419 548680 627865 722139 747097 685436 614153 622152 672866 678044 654479 621045 541171
9855 541171 436413 345895 254445 196771 222334 308745 378723 411074 403401 336731 211010
9844 211010 37509 -132510 -275978 -423540 -557230 -625539 -623150 -541527 -409204 -276330
9834 -276330 -129164 86350 333971 512742 614023 662225 651710 585806 511447 519105 624126
9823 624126 724311 748309 750305 787732 835618 824609 717263 594863 555174 551239 526627
9812 526627 541346 669858 880249 1043279 1067228 1015593 994869 1030212 1104680 1172566 1207190
9801 1207190 1190305 1118392 1007413 882067 771241 698322 679010 666796 654718 688754 810495
9790 810495 991023 1106856 1124671 1142315 1174336 1145476 1042428 938256 913302 920283 897788
9779 897788 842765 721296 542352 375679 287855 308295 473253 708407 850519 845814 750617
9768 750617 625469 545999 598644 729354 854206 1004649 1190247 1361443 1492215 1585356
9758 1585356 1643312 1686768 1737111 1788324 1814750 1833464 1867685 1935128 2036460 2145013 2258227
9747 2258227 2365947 2416648 2372965 2227071 2027478 1853818 1752689 1729297 1756740 1814804
9737 1814804 1884736 1922217 1855414 1670726 1504814 1500355 1664762 1921103 2196020 2433618
9727 2433618 2596303 2707759 2756916 2703469 2571840 2442283 2337410 2252027 2187185 2121080
9717 2121080 2032667 1953144 1909071 1871113 1810827 1725270 1640116 1579585 1528403 1444889 1313462
9706 1313462 1196646 1152532 1162807 1155314 1063211 971531 967598 1010684 1053055 1064366 1065466 1132082
9694 1132082 1266508 1360998 1346131 1257367 1212709 1285399 1385506 1368149 1242150 1098779 998687
9683 998687 986439 1108495 1359354 1584511 1650588 1550795 1309390 1010167 738458 548644
9673 548644 488960 555132 713581 945370 1184150 1348228 1439326 1533147 1651050 1753459
9663 1753459 1780670 1744079 1711770 1684738 1628386 1554997 1455290 1252371 970325 752558 674310
9652 674310 719730 826272 885265 878029 921000 1078133 1278285 1418069 1477182 1502597 1516768
9641 1516768 1492494 1386142 1242160 1191997 1268736 1369457 1412852 1422787 1423118 1426417 1465430 1527883
9629 1527883 1578559 1650581 1771985 1874448 1892249 1806240 1669630 1580345 1565133 1608169 1720402
9618 1720402 1827668 1899213 2042736 2285784 2513951 2628798 2662464 2672419 2671749 2688971 2761034
9607 2761034 2904324 3110537 3321910 3514222 3733160 4039148 4419215 4693244 4740064 4682600
9597 4682600 4663970 4645705 4551289 4412921 4318406 4266535 4177236 4021520 3763927 3404519 3065740
9586 3065740 2891069 2888564 2935163 2975793 3037462 3067942 2956607 2723868 2505632 2384363 2364784
9575 2364784 2378293 2322613 2168066 1951029 1750594 1628086 1595831 1592792 1555808 1545290 1638515
9564 1638515 1817005 2059588 2274929 2355398 2315776 2226885 2177548 2226077 2315599 2369047 2346469
9553 2346469 2257894 2148924 2008926 1795810 1557282 1343335 1165307 1075021 1045680 1031025
9543 1031025 1062719 1118165 1147570 1172218 1211478 1251831 1294283 1319647 1259003 1114030 981161
9532 981161 928230 996193 1182785 1370820 1488708 1569833 1637764 1705237 1765820 1806910 1859296
9521 1859296 1890841 1797102 1571336 1368930 1264172 1153690 951024 713805 546737 434328
9511 434328 347115 327813 357862 384335 442216 523044 587573 675890 825586 968130 976730
9500 976730 832171 655545 546046 496385 447548 341827 205197 123057 108532 136793 187787
9489 187787 262051 367481 506358 642992 694977 632561 493587 371178 363251 482845 659268
9478 659268 825412 953668 1058884 1160407 1226596 1231715 1220478 1224896 1199599 1102978 972957
9467 972957 884281 826103 753321 668255 586087 532956 531335 573577 681060 882230 1105849
9456 1105849 1249243 1276193 1187641 1027145 935763 1030801 1296798 1608899 1838511 1953778
9446 1953778 2026069 2107593 2204444 2285458 2279482 2111969 1857482 1690561 1609509 1508227 1412609
9435 1412609 1401486 1428671 1421080 1404112 1409832 1423417 1438650 1417158 1306387 1116641 919448
9424 919448 772357 677270 632294 626068 632238 698316 864058 1057348 1220127 1335409 1371713
9413 1371713 1320869 1238850 1191735 1149211 1046501 895614 744819 628195 576181 585653 609180
9402 609180 608545 586704 585211 593361 536223 382428 234709 232277 359390 486493 529683 497726
9390 497726 458971 463603 506607 603089 742467 865112 952476 1053601 1181306 1290402 1327262
9379 1327262 1253815 1104437 955817 849043 761700 664354 594232 601950 701158 863712 988244
9368 988244 970440 834872 714131 666895 598552 494377 426412 392417 366366 370701 413841
9357 413841 450807 429236 328536 187346 30626 -100722 -140142 -78487 18353 96168 143720
9346 143720 223238 388624 584648 706781 676527 558906 486214 464406 424650 403361 486367
9335 486367 650861 813685 931072 1006261 1052338 1106044 1166884 1217491 1280359 1385624 1505596
9324 1505596 1625629 1760544 1877245 1971149 2095568 2251138 2374592 2436677 2492301 2547531
9314 2547531 2565221 2547161 2518894 2443987 2263260 2040410 1860740 1725482 1637749 1639752 1732882
9303 1732882 1805470 1741891 1568357 1402776 1363566 1455820 1630291 1820974 1945864 1951910 1845265
9292 1845265 1639644 1376982 1156187 1034866 1008857 1063292 1166985 1284310 1358179 1371581
9282 1371581 1372362 1342570 1236732 1128563 1113267 1138933 1045967 806428 553762 418603 439374
9271 439374 525470 552559 513218 455458 408205 405422 427304 427299 418483 422797 466976 589160 728667
9258 728667 798797 755169 598369 363063 110691 -66192 -91172 -12406 84409 210853 352383
9247 352383 465931 563514 668715 794166 930195 1029719 1039581 954118 810491 647988 530693
9236 530693 507766 568565 647106 714205 833569 1006927 1136214 1174944 1123811 1069651 1091286
9225 1091286 1139241 1126606 1012873 856089 758582 736845 756812 808797 911176 1065469 1186083
9214 1186083 1221582 1198799 1124780 976570 805773 693752 660960 672997 673604 610817 493577
9203 493577 403661 384462 426194 488678 557038 607349 607252 572380 529030 491656 421320 327291
9191 327291 249917 202792 204102 258823 366611 495154 630884 786389 884329 804829 536419
9180 536419 189374 -107434 -306683 -398285 -412248 -412902 -391874 -379791 -394788 -376721 -329081
9169 -329081 -317776 -364380 -469433 -620680 -760255 -807391 -728381 -588236 -467036 -352328
9159 -352328 -204625 -28177 186891 429710 656681 830416 903189 851549 699650 543090
9149 543090 487911 492477 453608 376126 265731 129591 27009 23731 133989 283743 365399
9138 365399 341154 258412 140731 11747 -57996 -48556 -29036 -13709 -4604 -25065 -56844 -55667
9126 -55667 -42156 -59432 -69490 1116 152735 316568 429196 520304 618233 687767 702187
9115 702187 709351 726401 686038 582138 457905 322156 177737 24655 -146884 -326610
9105 -326610 -464887 -551803 -571862 -518351 -511290 -599050 -696058 -741620 -740161 -689082 -632497 -633967
9093 -633967 -678257 -691391 -618096 -471137 -303573 -149403 -49526 -28724 -71351 -150558 -237468
9082 -237468 -266168 -229235 -182244 -110570 -1316 82526 72396 -26995 -151349 -217429 -189898
9071 -189898 -70809 96602 226557 294294 360209 420291 415774 317750 149757 2276 -43370
9060 -43370 22894 134110 241830 337134 428157 521448 592173 640953 682100 677050 617448 567715
9048 567715 538720 446492 283155 81808 -97295 -179279 -195382 -185619 -71094 130442 246307
9037 246307 221181 155342 124644 140606 223131 373511 553173 702723 769902 695058 511723
9026 511723 378885 408427 517509 591063 599524 559591 501886 408788 284593 173263 90747
9015 90747 28481 -28802 -60479 -32069 29656 60223 71566 166030 316683 370981 297097 153658
9003 153658 -993 -105098 -165188 -250757 -364425 -437584 -470756 -496382 -515440 -525091 -527659
8992 -527659 -539044 -544245 -550695 -592360 -652556 -671669 -618594 -521892 -420392 -274247 -53206
8981 -53206 147338 292593 389351 352266 148995 -98785 -260503 -293230 -229987 -126567 -1163
8970 -1163 136756 257013 292676 251400 174107 50049 -93847 -219335 -255588 -149367 40910
8959 40910 261233 458215 508371 399376 257659 127728 -25664 -186541 -320664 -425431
8949 -425431 -512570 -601771 -686896 -716828 -663867 -572726 -461614 -319915 -188157 -127151 -139265
8938 -139265 -155931 -134757 -99503 -80503 -70150 -93355 -206592 -361473 -420422 -299602 -44276
8927 -44276 204990 332516 322697 253739 218617 283942 447470 640905 799253 905466 968829
8916 968829 967619 918257 869274 791700 676653 604741 588546 566089 538143 509508 492778 513757
8904 513757 527088 463091 318250 114829 -152096 -431328 -667409 -804915 -819001 -725688
8894 -725688 -535589 -330646 -158969 28062 246658 434011 503515 453075 356390 275404
8884 275404 243878 267729 320991 389993 514095 714473 937142 1063071 1007752 856775 704802
8873 704802 536708 337686 139974 -7249 -55244 -28848 41790 152457 251234 260529 236785
8862 236785 276022 356040 399843 360493 276611 220478 196794 175036 153129 127188 75608 -225
8850 -225 -25320 1057 77420 213638 280070 192001 58517 -6577 -28244 63 142754 336329
8838 336329 452245 453727 412450 384124 359032 277054 95551 -101233 -226576 -266953 -202834
8827 -202834 -108513 -69781 13041 242199 519906 705712 750787 685335 573951 455635 355916
8816 355916 335497 416095 510291 530323 449751 274270 77351 -75523 -171879 -229051 -254299
8805 -254299 -253827 -233992 -183952 -100271 -11861 27066 14323 9579 56678 159732 256538 269618
8793 269618 217850 180954 201097 236167 228495 154350 15996 -122613 -175533 -170194 -156436 -139734
8781 -139734 -79256 43427 146062 138610 52437 -23955 -68321 -73796 -36878 -11370 -27997 -37513
8769 -37513 277 24808 -16699 -117980 -305117 -503125 -624516 -734306 -901272 -1053740
8759 -1053740 -1047573 -865348 -655288 -566218 -619268 -711371 -745884 -717646 -636831 -524827 -431438
8748 -431438 -400084 -410986 -406544 -360380 -342115 -422529 -570767 -689335 -704608 -640388 -525479
8737 -525479 -369554 -222392 -127437 -111643 -115428 263 227694 404050 422039 333223 220651
8726 220651 87635 -90536 -269025 -394625 -457459 -491961 -516686 -523737 -525876 -486662 -373816
8715 -373816 -216986 -49152 131025 312268 449677 541489 631741 688026 625429 472502
8705 472502 332938 308656 389161 471567 478209 402432 283783 183840 122812 60123 -16494
8694 -16494 -85510 -153568 -234751 -283211 -278673 -268410 -302791 -356198 -330496 -193596 -13047 97235
8682 97235 98647 104699 205852 342284 382824 285509 150664 76847 78878 99342 77641 19993
8670 19993 20864 110555 193299 245971 325539 396332 399150 367285 327663 277500 205604 92525
8658 92525 -31329 -128507 -187214 -223159 -232826 -177976 -77576 -1247 -34898 -173455 -305958
8647 -305958 -310880 -145681 54071 96670 -39044 -202218 -237918 -120390 60480 239414
8637 239414 373010 412665 386027 310744 170396 -18577 -211955 -324181 -313384 -255451 -231581
8626 -231581 -226492 -163429 -50614 74812 201970 335812 447843 469419 401638 307845 205746
8615 205746 69715 -87208 -189408 -223319 -288381 -426302 -567498 -640087 -629068 -588962 -524382
8604 -524382 -347974 -127317 6461 35291 -16579 -87017 -60034 74321 219387 317820 309499
8593 309499 168161 -17469 -134403 -147769 -104759 -39302 48762 175146 336808 425414 389210
8582 389210 311472 276098 266693 240100 202032 176193 155853 99164 8255 -22843 46824 122693
8570 122693 89089 -59030 -249615 -416735 -508812 -471317 -311332 -113023 41765 117678
8560 117678 122425 88466 92370 219588 431259 622539 768826 854842 854722 779780 674908
8549 674908 578105 468751 308485 85292 -156824 -356306 -509766 -645111 -728077 -717820
8539 -717820 -646778 -564018 -489107 -416687 -349180 -311093 -289611 -273807 -284581 -304123 -282717 -228278
8527 -228278 -213200 -243305 -215777 -79767 148944 446145 746328 928912 943655 881725 803660
8516 803660 698978 566362 403084 220567 65656 -31704 -87592 -129370 -157215 -149527 -114136
8505 -114136 -46205 71872 218211 314243 347998 412429 557456 717732 805845 789020 647755
8494 647755 407174 141907 -88544 -276630 -475746 -663154 -707478 -564274 -359576 -288239
8484 -288239 -381853 -490324 -483752 -406369 -332964 -251140 -156233 -66362 27536 141716 274348
8473 274348 321216 235463 138660 90889 96570 200125 390405 584647 760264 909679 957156
8462 957156 870004 698261 487811 267000 69583 -115874 -306415 -452820 -514812 -512400
8452 -512400 -490296 -489217 -491656 -484844 -460800 -397617 -363364 -486798 -739139 -945948 -969361 -794793
8440 -794793 -486646 -146163 87652 105039 -55159 -303976 -535657 -662735 -689897 -689852 -741521
8429 -741521 -812484 -828309 -798615 -761127 -685037 -518819 -300140 -151189 -160219 -296970 -464794
8418 -464794 -543715 -508787 -457951 -452539 -464847 -469548 -462483 -464113 -448595 -364925 -229794 -118517
8406 -118517 -79747 -25935 120299 308546 440429 544292 688000 801307 797617 666861
8396 666861 437412 154510 -92915 -204255 -188975 -127093 -85020 -49249 17297 98652 209763
8385 209763 337859 416402 448031 477383 456746 316526 115256 -14453 8341 79136 37525
8374 37525 -125888 -301433 -366147 -319451 -207066 -23615 162413 278994 306626 292183 304509
8363 304509 359156 440972 558178 671890 682743 586843 433872 309134 267816 283488 315007
8352 315007 299508 205508 86799 -15470 -128821 -282172 -447361 -584090 -696196 -810467
8342 -810467 -867896 -830244 -736523 -636755 -582483 -551886 -500522 -409110 -244149 -21756 144274
8331 144274 179356 139770 142673 238586 399790 575941 648840 515834 242286 52812 57937
8320 57937 134012 131399 48070 -24723 -49130 45 100014 170083 188108 147080 36274 -88469
8308 -88469 -105147 34964 211837 300102 276826 183487 62273 -104873 -323841 -544719 -733326
8297 -733326 -860851 -881385 -800727 -661778 -468807 -258898 -142212 -142351 -176523 -192521 -188665
8286 -188665 -191188 -246227 -403163 -585412 -693361 -736478 -725606 -724160 -784759 -853983 -860257 -762411
8274 -762411 -576637 -382027 -255706 -206461 -210738 -286702 -434302 -575883 -630389 -569638 -426919
8263 -426919 -276422 -188434 -159121 -120299 -83445 -86719 -136068 -201388 -231804 -203825 -97035
8252 -97035 33735 101779 104205 102665 103271 83431 54138 -6763 -120949 -274797 -435530 -598151
8240 -598151 -761478 -860357 -881103 -905240 -928796 -850223 -691471 -536275 -378284 -218129 -105639
8229 -105639 -74015 -92706 -101768 -52549 86322 284301 452548 478931 395762 306285 215149
8218 215149 112212 -9063 -119074 -182370 -244335 -323519 -379142 -370856 -334478 -343692 -390839
8207 -390839 -381727 -331079 -300373 -276293 -246741 -261423 -347959 -417930 -405169 -332532 -240370 -157877
8195 -157877 -140925 -218755 -317794 -366824 -394246 -447688 -541113 -659438 -748482 -752845 -687078 -604773
8183 -604773 -528485 -464367 -416591 -333601 -185880 -9740 129303 158924 92855 34759 69051
8172 69051 205468 324033 337241 305729 291213 270874 209490 139598 91648 104389 178296
8161 178296 234639 212209 142133 101399 127732 224195 340636 357246 191139 -52598 -214490
8150 -214490 -277630 -235636 -43439 198722 347819 395411 365758 274905 187674 119998 15667
8139 15667 -98161 -157851 -167877 -159956 -114793 -50649 -46927 -113125 -190192 -225967 -212248 -173377
8127 -173377 -97522 24396 148757 286138 461467 617681 675095 668214 696072 823167 1027168
8116 1027168 1224365 1419207 1652887 1876101 2016391 2047584 2021303 2013647 2041131 2084220 2095545
8105 2095545 2032465 1918467 1810456 1705539 1600631 1558523 1593995 1654588 1696190 1697643 1656704
8094 1656704 1581297 1516720 1502134 1525414 1548571 1566329 1590871 1568220 1436110 1263891 1155300
8083 1155300 1134386 1172984 1165706 1079663 992328 945434 967349 1095549 1316551 1520421 1619647
8072 1619647 1642950 1642662 1632497 1601891 1546791 1465285 1359587 1235906 1068391 877829 751781
8061 751781 749236 878047 1095005 1279013 1316332 1177940 926202 646681 440260 383806
8051 383806 435659 488444 462712 411042 406700 430176 478700 544224 557908 528797 528586 596473
8039 596473 729403 897188 1044157 1073618 927722 671084 471992 425797 503859 611113
8029 611113 637445 543836 382661 213224 94345 74450 134512 247383 404103 559778
8019 559778 626633 579561 510492 534201 614843 651366 663639 668119 608484 470331 287591
8008 287591 117521 -22528 -167466 -332157 -476794 -566222 -587483 -567487 -516095 -430703 -334898
7997 -334898 -229892 -112739 -23020 13904 35355 49921 43083 45233 38206 -1267 -25502 10731
7985 10731 121791 275111 420184 513446 533327 503445 474785 461255 406652 319885 287400
7974 287400 323847 371753 420921 512545 619721 668466 648760 600743 501375 337673 208946
7963 208946 208944 303493 406181 460810 479595 464721 399851 310473 268041 291849 304878 275249
7951 275249 232649 175470 69555 -108480 -332888 -474727 -426243 -270141 -176076 -165166 -106096
7940 -106096 58652 258285 441286 570501 596030 509312 374905 266813 205701 204260 288780
7929 288780 405947 465600 448489 347302 189672 95476 137401 252062 344087 396624 431887
7918 431887 481796 511332 463354 358035 258501 204858 186948 187661 217193 276615 319483 303120
7906 303120 229831 153889 169771 312544 502008 592960 568061 503309 417291 333200 283944
7895 283944 279187 285036 264674 234825 188971 76357 -70346 -149066 -147620 -101775 -15427 67374
7883 67374 82773 81638 192531 400668 568985 603146 475034 243061 35246 -42794 18466
7872 18466 124731 195327 216807 203940 187746 180166 159962 119210 83233 29079 -115262 -301756
7860 -301756 -430422 -493029 -492651 -421176 -299915 -170860 -72278 16123 90015 77497 -2004
7849 -2004 -107171 -242400 -374544 -437272 -384190 -225925 -11041 139337 175561 171733 152981
7838 152981 103326 59627 90435 209088 358217 537338 771288 1009366 1145529 1107902
7828 1107902 920787 699859 548787 488578 476975 470197 477806 526825 662111 886494 1092709
7817 1092709 1166749 1066330 862426 673837 530524 409894 293623 195653 125977 113852
7807 113852 172225 302040 442269 497538 424890 281786 178165 161650 204440 244442 214712
7796 214712 137327 79582 42874 48742 99496 138152 118967 82014 94406 144624 198922 261570
7784 261570 325888 348551 327649 330044 374544 409797 418889 423563 417012 377547 304247 210071
7772 210071 155499 203480 307126 403290 467309 502433 524318 513141 443251 364227 369921 406624
7760 406624 364690 234617 19203 -227019 -385668 -406752 -314921 -189628 -92441 -22689 28204
7749 28204 111910 277612 478563 613352 676184 720821 751833 700705 563687 380005 162252
7738 162252 -70886 -302495 -506846 -622447 -601570 -511453 -470831 -468413 -454800 -427172 -382143
7727 -382143 -307371 -155132 46758 193902 272926 316254 304475 217794 75860 -69399 -202744
7716 -202744 -357100 -487129 -500797 -439610 -402425 -383820 -325495 -239785 -172167 -166137 -216948
7705 -216948 -307305 -428061 -498057 -478094 -405809 -327847 -290266 -309257 -355292 -376635 -385299 -442366
7693 -442366 -559218 -645805 -626494 -535771 -440225 -332502 -151141 107354 365492 557437
7683 557437 703786 853654 995577 1035722 937342 832996 799985 727573 584615 475733
7673 475733 475482 531850 528856 408521 222208 55776 -36169 -23259 56741 101831 29836 -169693
7661 -169693 -409748 -568546 -623245 -576814 -401371 -131400 137328 328455 364202 230535
7651 230535 46417 -41962 16037 115799 145464 85649 -30136 -100635 -55736 29387 60020
7640 60020 38521 26502 66435 164185 267927 327789 345794 356489 360112 355099 394071 447975
7628 447975 458099 466546 533381 616355 657601 717439 801497 855321 893202 966177 1020361 943280
7616 943280 773588 673701 701394 738909 686594 577522 537474 584328 627201 610842 497126
7605 497126 270846 27992 -83737 -36089 91806 245038 453762 722678 1013865 1303369
7595 1303369 1560273 1739951 1808466 1742484 1592415 1451952 1334366 1289351 1318279 1342927
7585 1342927 1365863 1440040 1592905 1759808 1851921 1833265 1764422 1764336 1895818 2123101 2353916
7574 2353916 2561306 2771400 2938765 3010394 3052124 3198088 3433092 3661922 3870357 4079062
7564 4079062 4283625 4448769 4557847 4622963 4653193 4692093 4807255 5057112 5418349 5789137
7554 5789137 6112009 6358816 6504054 6572655 6613099 6668615 6817018 7062399 7310514 7492207
7544 7492207 7606823 7707554 7864260 8078031 8300521 8484789 8565777 8470045 8259750 8043970
7534 8043970 7874100 7724674 7524456 7261865 7009980 6774236 6504901 6194585 5841199 5494174
7524 5494174 5210433 4965004 4737065 4521511 4321148 4164923 4072235 4019716 3946684 3844329
7514 3844329 3771912 3745599 3718557 3645465 3528635 3380211 3233712 3136295 3083518 3020619 2929978
7503 2929978 2848094 2790750 2757815 2721152 2676894 2676714 2730195 2771065 2731275 2641514 2586265 2574483
7491 2574483 2567309 2559040 2507930 2342767 2100374 1910695 1787291 1657165 1546502 1522879 1562809
7480 1562809 1631088 1699842 1759121 1783839 1747468 1683044 1615984 1556146 1500548 1450651 1423908
7469 1423908 1437140 1477675 1484865 1408674 1296436 1257739 1354997 1525708 1684468 1789014 1848035
$$ [...]
##END NTUPLES=NMR SPECTRUM
##END=
