##TITLE=C13_SR164
 DMSO-d6, 23200 sc

 22.3.2023
##JCAMPDX= 6.0         $$ Bruker NMR JCAMP-DX V2.0
##DATA TYPE= NMR SPECTRUM
##DATA CLASS= NTUPLES
##ORIGIN= UXNMR, Bruker Analytische Messtechnik GmbH
##OWNER= root
$$ XWIN-NMR		Version 3.5
$$ Thu Mar 23 13:37:54 2023 Russian Standard Time (UT+4h)  she@DPX200
##.OBSERVE FREQUENCY= 50.327896
##.OBSERVE NUCLEUS= ^13C
##.ACQUISITION MODE= SIMULTANEOUS
##.ACQUISITION SCHEME= undefined
##.AVERAGES= 19597
##.DIGITISER RES= 17
##SPECTROMETER/DATA SYSTEM= spect
##.PULSE SEQUENCE= zgpg30
##.SOLVENT NAME= CDCl3
##.SHIFT REFERENCE= (INTERNAL, CDCl3, 0, 222.624)
##AUDIT TRAIL= $$ (NUMBER, WHEN, WHO, WHERE, WHAT)
$$ ##TITLE= Audit trail, XWIN-NMR		Version 3.5
$$ ##JCAMPDX= 5.01
$$ ##ORIGIN= Bruker BioSpin GmbH
$$ ##OWNER= she
$$ F:/spectra/data/she/nmr/c13/1/pdata/1/auditp.txt
$$ ##AUDIT TRAIL=  $$ (NUMBER, WHEN, WHO, WHERE, WHAT)
(   1,<2023-03-23 10:41:58.53 +0400>,<she>,<DPX200>,
      <created by zg, POWCHK disabled, PULCHK disabled
       terminated by command 'halt'
       configuration hash MD5:
       00 E9 B6 7A A2 85 ED C7 34 08 36 98 17 FE 4E 26
       data hash MD5: 32K
       40 E5 B1 D4 F2 CD B6 29 2B B9 74 9D 9F 27 62 2D>)
(   2,<2023-03-23 13:35:47.50 +0400>,<she>,<DPX200>,
      <Start of raw data processing
       efp BC_mod = 2 LB = 2 FT_mod = 6 PKNL = 1 PHC0 = -316.2282 PHC1 = 25.81809 SI = 32K 
       data hash MD5: 32K
       07 5F 23 AD 52 04 56 76 AD D4 54 FC 35 FC EC 39>)
(   3,<2023-03-23 13:35:55.40 +0400>,<she>,<DPX200>,
      <abs ABSG = 5 
       data hash MD5: 32K
       C4 21 B9 25 74 89 3B 95 8C 80 F2 2F 4A 9D 64 E8>)
(   4,<2023-03-23 13:36:46.32 +0400>,<she>,<DPX200>,
      <pk PHC0 = -14.40033 PHC1 = 16.8 
       data hash MD5: 32K
       23 C4 BC F9 4E 6B 3F 88 16 2B 59 9B ED 1B 4C 73>)
(   5,<2023-03-23 13:36:49.53 +0400>,<she>,<DPX200>,
      <abs ABSG = 5 
       data hash MD5: 32K
       0B DB C4 B4 93 FE 84 A4 2F DB 0A 12 C4 92 09 61>)
(   6,<2023-03-23 13:37:04.54 +0400>,<she>,<DPX200>,
      <pk PHC0 = 2.936146 PHC1 = -3.6 
       data hash MD5: 32K
       6A F0 99 1D 22 4A F4 93 07 2F 0E 40 BC 6F 2B 66>)
(   7,<2023-03-23 13:37:08.17 +0400>,<she>,<DPX200>,
      <abs ABSG = 5 
       data hash MD5: 32K
       71 2D 96 F2 45 68 AF 3D 2F DC 61 D0 1F D7 54 0A>)
$$ ##END=
$$ 
$$ hash MD5
$$ 90 F6 B5 DC 76 9D B4 80 BD 6F 9A 5E 84 4F 14 69
##$RELAX= 
##$RELAX= 
##$RELAX= 
##$RELAX= 
##$RELAX= 
##$RELAX= 
##$RELAX= 
##$RELAX= 
$$ Bruker specific parameters
$$ --------------------------
##$DU= <F:/spectra>
##$EXPNO= 1
##$NAME= <c13>
##$PROCNO= 1
##$TYPE= <nmr>
##$USER= <she>
##$AMP= (0..31)
100 100 100 100 100 100 100 100 100 100 100 100 100 100 100 100 100 100 
100 100 100 100 100 100 100 100 100 100 100 100 100 100 
##$AQSEQ= 0
##$AQ_mod= 1
##$AUNM= <au_zg>
##$AUTOPOS= <>
##$BF1= 50.322709
##$BF2= 200.13
##$BF3= 50.322709
##$BF4= 500.13
##$BF5= 500.13
##$BF6= 500.13
##$BF7= 500.13
##$BF8= 500.13
##$BYTORDA= 1
##$CFDGTYP= 0
##$CFRGTYP= 5
##$CHEMSTR= <none>
$$ [...]
##$SUBNAM4= <"">
##$SUBNAM5= <"">
##$SUBNAM6= <"">
##$SUBNAM7= <"">
##$SUBNAM8= <"">
##$SUBNAM9= <"">
##$SW= 239.972175391363
##$SWIBOX= (0..15)
0 1 3 0 0 0 0 0 0 0 0 0 0 0 0 0 
##$SW_h= 12077.2946859903
##$TD= 32768
##$TD0= 1
##$TE= 0
##$TE2= 300
##$TE3= 300
##$TEG= 300
##$TL= (0..7)
120 120 120 120 120 120 120 120 
##$TP= (0..7)
150 150 150 150 150 150 150 150 
##$TP07= 0
##$TPNAME0= <>
##$TPNAME1= <>
##$TPNAME2= <>
##$TPNAME3= <>
##$TPNAME4= <>
##$TPNAME5= <>
##$TPNAME6= <>
##$TPNAME7= <>
##$TPOAL= (0..7)
0.5 0.5 0.5 0.5 0.5 0.5 0.5 0.5 
##$TPOFFS= (0..7)
0 0 0 0 0 0 0 0 
##$TUNHIN= 0
##$TUNHOUT= 0
##$TUNXOUT= 0
##$USERA1= <user>
##$USERA2= <user>
##$USERA3= <user>
##$USERA4= <user>
##$USERA5= <user>
##$V9= 5
##$VALIST= <valist>
##$VCLIST= <CCCCCCCCCCCCCCC>
##$VD= 0
##$VDLIST= <DDDDDDDDDDDDDDD>
##$VPLIST= <PPPPPPPPPPPPPPP>
##$VTLIST= <TTTTTTTTTTTTTTT>
##$WBST= 1024
##$WBSW= 4
##$XGAIN= (0..3)
0 0 0 0 
##$XL= 0
##$YL= 0
##$YMAX_a= 133668934
##$YMIN_a= -42069236
##$ZGOPTNS= <>
##$ZL1= 120
##$ZL2= 120
##$ZL3= 120
##$ZL4= 120
##$ABSF1= 222.624
##$ABSF2= -17.3728
##$ABSG= 5
##$ABSL= 3
##$ALPHA= 0
##$AQORDER= 0
##$ASSFAC= 0
##$ASSFACI= 0
##$ASSFACX= 0
##$ASSWID= 0
##$AUNMP= <proc_1d>
##$AZFE= 0.1
##$AZFW= 0.5
##$BCFW= 0
##$BC_mod= 2
##$BYTORDP= 0
##$COROFFS= 0
##$CY= -3
##$DATMOD= 1
##$DC= 0
##$DFILT= <>
##$DTYPP= 0
##$F1P= 0
##$F2P= 0
##$FCOR= 0.5
##$FTSIZE= 32768
##$FT_mod= 6
##$GAMMA= 0
##$GB= 0
##$INTBC= 1
##$INTSCL= 4.134877e-10
##$ISEN= 128
##$LB= 2
##$LEV0= 0
##$LPBIN= 0
##$MAXI= 10000
##$MC2= 0
##$MEAN= 0
##$ME_mod= 0
##$MI= 0.1934396
##$NCOEF= 0
##$NC_proc= 3
##$NLEV= 6
##$NOISF1= 120.0001
##$NOISF2= 80.00006
##$NSP= 0
##$NTH_PI= 0
##$NZP= 0
##$OFFSET= 222.624
##$PC= 1.4
##$PHC0= -327.6924
##$PHC1= 39.01809
##$PH_mod= 1
##$PKNL= yes
##$PPARMOD= 0
##$PSCAL= 0
##$PSIGN= 0
##$REVERSE= no
##$SF= 50.3227315983092
##$SI= 32768
##$SIGF1= 140
##$SIGF2= 120
##$SINO= 11.81781
##$SIOLD= 32768
##$SREGLST= <13C.CDCl3>
##$SSB= 0
##$STSI= 32768
##$STSR= 0
##$SW_p= 12077.2946859903
##$SYMM= 0
##$S_DEV= 0
##$TDeff= 32768
##$TDoff= 0
##$TI= <>
##$TILT= no
##$TM1= 0
##$TM2= 0
##$TOPLEV= 0
##$USERP1= <user>
##$USERP2= <user>
##$USERP3= <user>
##$USERP4= <user>
##$USERP5= <user>
##$WDW= 1
##$XDIM= 32768
##$YMAX_p= 316674403
##$YMIN_p= -820611
$$ End of Bruker specific parameters
$$ ---------------------------------
##NTUPLES= NMR SPECTRUM
##VAR_NAME=  FREQUENCY,     SPECTRUM/REAL,   SPECTRUM/IMAG
##SYMBOL=    X,             R,               I
##VAR_TYPE=  INDEPENDENT,   DEPENDENT,       DEPENDENT
##VAR_FORM=  AFFN,          ASDF,            ASDF
##VAR_DIM=   32768,         32768,           32768
##UNITS=     HZ,            ARBITRARY UNITS, ARBITRARY UNITS
##FACTOR=    0.368581032318806, 1,           1
##FIRST=     11203.0474430531, 0,            0
##LAST=      -874.247242937185, 0,           0
##MIN=       -874.247242937185, -820611,     0
##MAX=       11203.0474430531, 316674403,    0
$$ Real data points
##PAGE= N=1
##DATA TABLE= (X++(R..R)), XYDATA
$$ [...]
$$ plain form
11053 -167520 -136751 -119142 -86106 -12954 108021 246875 345538 388833 413490 454281 493103
11042 493103 513536 521517 508487 468329 415702 361066 300690 240736 192118 150801 95576 11306
11030 11306 -81949 -128748 -124729 -110564 -119836 -145299 -148590 -118491 -67216 -22433 -15020 -50227
11018 -50227 -121406 -193513 -240500 -279077 -308258 -304687 -278401 -259206 -262465 -277994 -292384 -288815
11006 -288815 -275290 -273636 -270557 -268657 -281313 -300678 -307463 -302978 -305198 -325042 -351613 -370050 -376682
10993 -376682 -382443 -393478 -390807 -378845 -373707 -352457 -279614 -159657 -24786 101060 185590
10982 185590 186848 121085 49459 8478 9674 60122 113074 122568 132165 182747 240347 245327
10970 245327 192428 122824 79456 85503 122065 157772 160791 128279 90231 63458 24526 -54780
$$ packed form
11053a67520L0769J7609L3036P3152J20975J38854R8663M3295K4657M0791L8822
11042D93103K0433P981j3030m0158n2627n4636o0376n9954m8618m1317n5225q4270
11030A1306r3255m6799M019J4165r272k5463l291L0099N1275M4783P413l5207
11018e0227p1179p2107m6987l8577k9181L571K6286J9195l259j5529j4390L569
11006b88815J3525J654L079J900j2656j9365o785M485k220j9844k6571j8437o632
10993c76682n761j1035K671J1962N138K1250P2843J19957J34871J25846Q4530
10982A85590J258o5763p1626m0981J196N0448N2952R494R597N0582N7600M980
10970B45327n2899o9604m3368O047L6562L5707L019l2512l8048k6773l8932p9306
$$ plain form
10958 -54780 -144649 -178655 -143057 -64691 24898 93480 123587 106283 58157 7386 -34199 -62119
10946 -62119 -77186 -92079 -115575 -126477 -103734 -58494 -4378 51959 89050 91683 60312 22411
10934 22411 22853 43092 39020 14503 1417 -21647 -81831 -160380 -232403 -286552 -323542 -336570
10922 -336570 -329403 -299607 -227529 -116997 -14163 44096 83104 134788 174293 174813 140398 86298
10910 86298 33235 -2041 -14394 -20578 -39449 -58077 -52032 -18711 25390 64261 87170 72263
10898 72263 18165 -34582 -57916 -76208 -90142 -79098 -62807 -70268 -92455 -105582 -110104 -99018
10886 -99018 -61905 -13453 35126 50483 19592 -20084 -46810 -56183 -62080 -83408 -129166 -198163
10874 -198163 -271613 -315614 -314436 -289891 -257843 -204376 -134753 -73927 -48774 -39821 -28942 -34792
$$ packed form
10958e4780q9869l4006L5598P8366Q9589O8582L0107j7304m8126n0771m1585k7920
10946f2119j5067j4893k3496j0902K2743M5240N4116N6337L7091K633l1371l7901
10934B2411M42K0239m072k4517j3086k3064o0184p8549p2023n4149l6990j3028
10922c36570P167K9796P2078J10532J02834N8259L9008N1684L9505N20l4415n4100
10910H6298n3063l5276j2353o184j8871j8628O045L3321M4101L8871K2909j4907
10898G2263n4098n2747k3334j8292j3934J1044J6291p461k2187j3127m522J1086
10886i9018L7113M8452M8579J5357l0891l9676k6726r373n897k1328m5758o8997
10874a98163p3450m4001J178K4545L2048N3467O9623O0826K5153Q953J0879n850
$$ plain form
10862 -34792 -78142 -166769 -264738 -328124 -363988 -394553 -408836 -378774 -311390 -258625 -255319 -285612
10850 -285612 -304143 -312560 -350562 -409844 -457783 -452201 -383325 -298982 -223180 -147596 -69505 -6648
10838 -6648 8042 -51639 -175853 -299932 -350349 -331167 -300207 -279236 -259370 -240350 -227218
10827 -227218 -241073 -276822 -309252 -336845 -368439 -405149 -454847 -536282 -621672 -653338 -608147
10816 -608147 -507699 -406937 -326035 -242584 -147541 -53783 15577 53443 93489 158371 216030
10805 216030 240961 238125 218819 194058 165487 139740 106698 63573 54239 75204 69272 24822
10793 24822 -31160 -59395 -41812 8145 74699 160827 246702 305776 340752 380799 452488 507972
10781 507972 495082 421343 337895 303804 317764 310617 235597 124653 50814 42218 43710 4797
$$ packed form
10862c4792m3350q8627r7969o3386l5864l0565j4283L0062O7384N2765L306l0293
10850b85612j8531q417l8002n9282m7939N582O8876Q4343P5802P5584P8091O2857
10838f648J4690n9681j24214j24079n0417J9182L0960K0971J9866J9020J3132
10827b27218j3855l5749l2430k7593l1594l6710m9698q1435q5390l1666M5191
10816f08147J00448J00762Q0902Q3451R5043R3758O9360L7866M0046O4882N7659
10805B16030K4931k836j9306k4761k8571k5747l3042m3125r334K0965n932m4450
10793B4822n5982k8235J7583M9957O6554Q6128Q5875N9074L4976M0047P1689N5484
10781E07972j2890p3739q3448l4091J3960p147p5020j10944p3839q596J492l8913
$$ plain form
10769 4797 -47080 -48194 3698 68490 102639 65942 -11404 -67814 -82849 -63898 4199 97756
10757 97756 138966 113921 63074 32773 32261 38441 43752 60663 65619 24393 -63313 -178592
10745 -178592 -298025 -396092 -458587 -490818 -506988 -507786 -488076 -451469 -407914 -375680 -345169 -304066
10733 -304066 -268912 -261027 -271155 -276445 -254914 -191524 -104347 -33765 -9658 -18448 -17920 11463
10721 11463 46174 71068 81303 69389 53811 52324 67579 89805 89935 31626 -78973 -169456
10709 -169456 -199111 -190782 -174101 -141220 -63077 43923 133486 178811 187515 173920 167324 191100
10697 191100 234584 286721 342990 402905 449379 463024 469107 470101 454050 449192 451859 420477
10685 420477 351082 277893 224811 183462 136578 75808 12428 -20860 -5949 41440 95407
$$ packed form
10769D797n1877j114N1892O4792L4149l6697p7346n6410j5035J8951O8097R3557
10757I7756M1210k5045n0847l0301n12O180N311J6911M956m1226q7706j15279
10745a78592j19433r8067o2495l2231j6170p98J9710L6607M3555L2234L0511M1103
10733c04066L5154P885j0128n290K1531O3390Q7177P0582K4107q790N28K9383
10721A1463L4711K4894J0235j1914j5578j487J5255K2226J30n8309j10599r0483
10709a69456k9655Q329J6681L2881P8143J07000Q9563M5325Q704j3595o596K3776
10697A91100M3484N2137N6269N9915M6474J3645O083R94j6051m858K667l1382
10685D20477o9395p3189n3082m1349m6884o0770o3380l3288J4911M7389N3967
$$ plain form
10674 95407 139705 163462 157923 142372 149095 170770 183690 185542 170418 152232 148595 152643 160545
10661 160545 166613 167537 145629 96926 55856 22983 -11711 -47721 -99574 -147365 -156557 -125913
10649 -125913 -51247 38657 77824 47473 445 -6901 27708 94042 173703 241921 294997 343284
10637 343284 408573 473061 474115 391197 272040 164275 80803 27868 -19641 -76034 -98295
10626 -98295 -78354 -46128 5546 100379 225970 317818 357058 394741 448221 493754 553570
10615 553570 638741 719575 787821 837311 879538 932203 979174 1018630 1089822 1213677 1350019
10604 1350019 1429786 1401665 1270732 1087998 893688 721715 591875 499666 432129 394007
10594 394007 412371 476313 530748 552533 567483 581363 568640 508325 416912 319653 244887
$$ packed form
10674I5407M4298K3757n539j5551O723K1675J2920J852j5124j8186l637M048P902
10661A60545O068R24k1908m8703m1070l2873l4694l6010n1853m7791r192L0644
10649a25913P4666Q9904L9167l0351m7028p346L4609O6334P9661O8218N3076M8287
10637C43284O5289O4488J054q2918j19157j07765q3472n2935m7509n6393k2261
10626i8295J9941L2226N1674R4833J25591R1848L9240L7683N3480M5533N9816
10615E53570Q5171Q0834O8246M9490M2227N2665M6971L9456P1192J23855J36342
10604A350019P9767k8121j30933j82734j94310j71973j29840r2209o7537l8122
10594C94007J8364O3942N4435K1785J4950J3880j2723o0315r1413r7259p4766
$$ plain form
10583 244887 207684 182534 145406 105641 93193 136943 213589 245240 203415 128084 60136
10572 60136 16129 -8429 -21523 -36538 -83299 -148120 -190557 -179701 -141605 -124938 -127463 -99156
10560 -99156 -6217 86437 92444 29273 -32883 -81895 -129409 -190059 -257993 -292739 -271621 -198102
10548 -198102 -82884 22918 59037 45646 40943 63456 87682 97972 82572 19128 -66874
10537 -66874 -143974 -222038 -284423 -298301 -264335 -195620 -109500 -56537 -85031 -176874 -290264
10526 -290264 -380999 -407372 -382666 -352301 -339398 -344750 -356249 -361252 -367383 -361472 -311005 -229216
10514 -229216 -168359 -153668 -157727 -141538 -101293 -52810 -244 36088 33401 28984 74407 133506
10502 133506 132513 78483 19296 -15710 -38015 -77922 -135170 -180878 -208053 -240655 -293000 -368602
$$ packed form
10583B44887l7203k5150l7128l9765j2448M3750P6646L1651m1825p5331o7948
10572F0136m4007k4558j3094j5015m6761o4821m2437J0856L8096J6667k525K8307
10560i9156R2939R2654O007o3171o2156m9012m7514o0650o7934l4746K1118P3519
10548a98102J15218J05802L6119j3391m703K2513K4226J0290j5400o3444q6002
10537f6874p7100p8064o2385j3878L3966O8715Q6120N2963k8494r1843j13390
10526b90264r0735k6373K4706L0365J2903n352j1499n003o131N911N0467Q1789
10514b29216O0857J4691m059J6189M0245M8483N2566L6332k687m417M5423N9099
10502A33506r93n4030n9187l5006k2305l9907n7248m5708k7175l2602n2345p5602
$$ plain form
10490 -368602 -447716 -481977 -457604 -388632 -284651 -159666 -41453 37406 89815 142336 168681
10479 168681 126097 11331 -124025 -214467 -256556 -274460 -253454 -198676 -134638 -65992 3274
10468 3274 58563 78852 36461 -50160 -127417 -175193 -194578 -208053 -237504 -268999 -281118 -279444
10456 -279444 -281965 -302904 -345598 -384426 -388897 -367119 -339662 -316346 -313504 -335894 -358847 -347627
10444 -347627 -295075 -244567 -246619 -288621 -301580 -283255 -280809 -296005 -307727 -312265 -321658 -328305
10432 -328305 -325347 -316328 -295106 -256015 -220325 -203301 -207436 -228518 -253069 -304958 -399029 -472775
10420 -472775 -471965 -406156 -318886 -237911 -176308 -156556 -184806 -230001 -240151 -202183 -140447 -86974
10408 -86974 -60777 -48204 -55488 -93627 -111140 -86288 -70315 -90345 -147853 -228147 -301436 -338469
$$ packed form
10490c68602p9114l4261K4373O8972J03981J24985J18213P8859N2409N2521K6345
10479A68681m2584j14766j35356r0442m2089j7904K1006N4778O4038O8646O9266
10468C274N5289K0289m2391q6621p7257m7776j9385j3475k9451l1495j2119J674
10456b79444k521k0939m2694l8828m471K1778K7457K3316K842k2390k2953J1220
10444c47627N2552N0508k052m2002j2959J8325K446j5196j1722m538r393o647
10432c28305K958R019K1222L9091L5690J7024m135k1082k4551n1889r4071p3746
10420d72775Q10O5809Q7270Q0975O1603J9752k8250m5195j0150L7968O1736N3473
10408h6974K6197J2573p284l8139j7513K4852J5973k0030n7508q0294p3289l7033
$$ plain form
10396 -338469 -336418 -326342 -319041 -284980 -221023 -148701 -72383 20762 110350 147075 136509 115082
10384 115082 113660 114192 75474 22319 -5323 967 46138 101494 132763 151263 158368 145564
10372 145564 115507 78422 43095 3439 -34993 -85176 -156589 -233821 -313352 -405704 -490595
10361 -490595 -515160 -467754 -397320 -308418 -200751 -108361 -28789 31974 47561 38616 40504 49583
10349 49583 31015 -22111 -69245 -80742 -54542 -21950 5328 54837 133036 203016 204555 141776
10337 141776 76646 30733 -19641 -58040 -78574 -114714 -174518 -222995 -217168 -166114 -114869 -84203
10325 -84203 -48896 3555 58477 122057 170764 159605 96707 23467 -30422 -36265 -6804 42
10313 42 -33371 -90530 -149614 -161469 -102636 -14227 36222 30046 6741 15407 73711 138185 165465
$$ packed form
10396c38469K051J0076P301L4061O3957P2322P6318R3145Q9588L6725j0566k1427
10384A15082j422N32l8718n3155k7642O290M5171N5356L1269J8500P105j2804
10372A45564l0057l7085l5327l9656l8432n0183p1413p7232p9531r2352q4891
10361d90595k4565M7406P0434Q8902J07667R2390P9572O0763J5587q945J888R079
10349D9583j8568n3126m7134j1497K6200L2592K7278M9509P8199O9980J539o2779
10337A41776o5130m5913n0374l8399k0534l6140n9804m8477N827N1054N1245L0666
10325h4203L5307N2451N4922O3580M8707j1159o2898p3240n3889n843K9461O846
10313D2l3413n7159n9084j1855N8833Q8409N0449o176k3305Q666N8304O4474K7280
$$ plain form
10300 165465 145118 88557 18707 -52778 -108408 -142539 -183924 -234916 -274372 -289320 -271360
10289 -271360 -209012 -109246 -9528 57331 75321 58536 41808 38664 37069 2618 -69368 -131074
10277 -131074 -166891 -226201 -331334 -464312 -576422 -593985 -525028 -451243 -402498 -347170 -248778
10266 -248778 -126458 -41406 -7315 5938 17601 45102 76319 70154 -2067 -127758 -246794
10255 -246794 -310401 -329419 -320932 -299419 -292461 -282857 -253768 -231876 -205939 -138223 -59219 -27608
10243 -27608 -43965 -47501 -12018 53234 141999 214786 232297 240006 270716 286995 287628 288210 278293
10230 278293 240651 152985 23998 -95028 -160563 -174138 -169169 -175909 -179014 -145727 -89639 -68979
10218 -68979 -102939 -148111 -178849 -207001 -241084 -260804 -262575 -246467 -212879 -180102 -183192 -239613
$$ packed form
10300A65465k0347n6561o9850p1485n5630l4131m1385n0992l9456j4948J7960
10289b71360O2348R9766R9718O6859J7990j6785j6728l144j595l4451p1986o1706
10277a31074l5817n9310j05133j32978j12110j7563O8957P3785M8745N5328R8392
10266b48778J22320Q5052L4091J3253J1663K7501L1217o165p2221j25691j19036
10255b46794o3607j9018Q487K1513O958R604K9089K1892K5937O7716P9004L1611
10243b7608j6357l536L5483O5252Q8765P2787J7511P709L0710J6279O33N82r917
10230B78293l7642q7666j28987j19026o5535j3575M969o740l105L3287N6088K0660
10218f8979l3960m5172l0738k8152l4083j9720j771J6108L3588L2777l090n6421
$$ plain form
10206 -239613 -332628 -431215 -508609 -561071 -594704 -605340 -576034 -507440 -407127 -280180 -155263
10195 -155263 -87768 -79074 -78798 -65775 -22315 46623 98382 111798 95275 71015 47964 35933
10183 35933 64929 129785 181081 181202 125917 40125 -45289 -111275 -153902 -169122 -165383 -152199
10171 -152199 -141618 -157766 -206862 -270088 -314000 -310112 -254053 -176236 -125971 -115210 -114661 -110439
10159 -110439 -94377 -51440 164 25372 12302 -11506 -19154 -17241 -34140 -70092 -96713 -104432
10147 -104432 -109788 -106652 -73520 -20231 15187 10908 -7166 8540 66749 145357 217578 247770
10135 247770 226996 162150 81701 39818 14097 -55764 -143377 -184537 -184386 -169016 -133502 -88116
10123 -88116 -55190 -35318 -3972 59582 141448 205723 221237 200727 189019 189709 199504 220383
$$ packed form
10206b39613r3015r8587p7394n2462l3633j0636K9306O8594J00313J26947J24917
10195a55263O7495Q694K76J3023M3460O8938N1759J3416j6523k4260k3051j2031
10183C5933K8996O4856N1296J21n5285q5792q5414o5986m2627j5220L739J3184
10171a52199J0581j6148m9096o3226m3912L888N6059P7817N0265J0761N49M222
10159a10439J6062M2937N1604K5208j3070k3808p648J913j6899l5952k6621p719
10147a04432n356L136L3132N3289L5418m279j8074J5706N8209P8608P2221L0192
10135B47770k0774o4846q0449m1883k5721o9861q7613m1160J51J5370L5514M5386
10123h8116L2926J9872L1346O3554Q1866O4275J5514k0510j1708O90R795K0879
$$ plain form
10111 220383 225794 196228 142602 82867 18332 -43183 -64689 -34557 21547 74817 86709 41208
10099 41208 -28170 -77322 -88385 -55934 31698 154154 276633 377244 466114 581358 733660
10088 733660 893136 1070157 1309609 1607879 1922955 2208961 2367247 2292194 2017050 1661255
10078 1661255 1295189 938551 618059 370705 198840 93023 51380 35046 -5837 -71842
10068 -71842 -140927 -193020 -200499 -173445 -148946 -146662 -185033 -259251 -332184 -350211 -307094 -250734
10056 -250734 -212150 -176374 -99589 49473 221770 354236 435256 471868 484421 491584 491201
10045 491201 499806 499816 453063 367724 274288 201578 150287 99222 24019 -74741 -163117 -214567
10033 -214567 -242435 -263513 -277377 -263289 -195907 -106902 -51618 -57067 -119542 -196228 -252065 -305705
$$ packed form
10111B20383N411k9566n3626n9735o4535o1515k1506L0132N6104N3270J1892m5501
10099D1208o9378m9152j1063L2451Q7632J22456J22479J00611Q8870J15244J52302
10088G33660J59476J77021K39452K98270L15076K86006J58286p5053k75144l55795
10078A661255l66066l56638l20492k47354j71865j05817m1643j6334m0883o6005
10068g1842o9085n2093p479K7054K4499K284l8371p4218p2933j8027M3117N6360
10056b50734L8584L5776P6785J49062J72297J32466Q1020L6612J2553P163l83
10045D91201Q605J0m6753q5339r3436p2710n1291n1065p5203r8760q8376n1450
10033b14567k7868k1078j3864J4088O7382Q9005N5284n449o2475p6686n5837n3640
$$ plain form
10021 -305705 -366732 -410012 -386030 -283596 -151900 -30091 65392 131644 163997 158091 117362
10010 117362 56224 9592 11243 56820 85416 32266 -79265 -164876 -178350 -137782 -81265
9999 -81265 -29223 -464 -19873 -81806 -128756 -137860 -143774 -163302 -162341 -142909 -160638 -212408 -253742
9986 -253742 -266043 -230648 -131861 1460 123690 208396 231513 187272 93381 -4454 -75494
9975 -75494 -131507 -183028 -232503 -284277 -343199 -387257 -378056 -303865 -198327 -96268 -27299 4342
9963 4342 56988 155446 258236 320047 332711 318896 301423 279382 245630 214884 169692 83516
9951 83516 -35967 -158531 -253290 -306568 -320907 -271640 -151626 46 131385 203877 231330
9940 231330 257266 315816 404546 502434 633056 832638 1079486 1331112 1570990 1776219
$$ packed form
10021c05705o1027m3280K3982J02434J31696J21809R5483O6252L2353n906m0729
10010A17362o1138m6632J651M5577K8596n3150j11531q5611j3474M0568N6517
9999h1265N2042K8759j9409o1933m6950r104n914j9528R61J9432j7729n1770m1334
9986b53742j2301L5395R8787J33321J22230Q4706K3117m4241r3891r7835p1040
9975g5494n6013n1521m9475n1774n8922m4058R201P4191J05538J02059O8969L1641
9963D342N2646R8458J02790O1811J2664j3815j7473k2041l3752l0746m5192q6176
9951H3516j19483j22564r4759n3278j4339M9267J20014J51672J31339P2492K7453
9940B31330K5936N8550Q8730R7888J30622J99582K46848K51626K39878K05229
$$ plain form
9930 1776219 1932303 2049137 2105606 2047552 1870430 1647379 1439809 1248118 1070838 926887
9920 926887 834609 772832 699028 600987 487408 376385 286288 210899 165184 166251 195836
9909 195836 220269 227177 242732 292627 358896 412534 419616 368238 300911 265927 257214 259975
9897 259975 269599 279475 300954 329859 339379 305519 247715 202478 190907 193339 178457 170846 199281
9884 199281 236999 250428 218231 150645 84803 41548 9617 -13125 -18063 6744 53472 83649
9872 83649 104393 143439 184870 209101 189698 112790 26844 -27615 -42220 -27778 7121 59739
9860 59739 108497 145722 182803 204768 186987 133545 73107 15729 -45707 -101674 -169418 -275322
9848 -275322 -404349 -529285 -595901 -565505 -474904 -378952 -280847 -176011 -69503 32613 121622
$$ packed form
9930A776219J56084J16834N6469n8054j77122k23051k07570j91691j77280j43951
9920I26887r2278o1777p3804r8041j13579j11023r0097p5389m5715J067K9585
9909A95836K4433O908J5555M9895O6269N3638P082n1378o7327l4984q713K761
9897B59975R624R876K1479K8905R520l3860n7804m5237j1571K432j4882p611K8435
9884A99281L7718J3429l2197o7586o5842m3255l1931k2742m938K4807M6728L0177
9872H3649K0744L9046M1431K4231j9403p6908q5946n4459j4605J4442L4899N2618
9860E9739M8758L7225L7081K1965j7781n3442o0438n7378o1436n5967o7744j05904
9848b75322j29027j24936o6616L0396R0601R5952R8105J04836J06508J02116Q9009
$$ plain form
9837 121622 178098 196994 203926 210290 213213 223515 270661 348526 419474 477079 529122 566305
9825 566305 592577 631854 674169 695763 704353 722105 752195 800678 851007 848867 787414 711912
9813 711912 658857 659450 704699 752436 787627 810310 815573 830838 892743 974022 1013830 978690
9801 978690 883063 733771 560301 425823 364325 364759 389463 419080 473041 533082 561711
9790 561711 549394 515256 486150 451728 404852 344597 257954 145690 48975 18171 37386
9779 37386 55612 63876 81870 127417 181018 211104 223057 232226 252913 308945 404154 521446
9767 521446 631439 724656 836510 1002742 1203130 1385297 1512230 1584163 1642408 1697163
9757 1697163 1726805 1736934 1736655 1710969 1662148 1586474 1491348 1427443 1396443 1337573 1216444 1043235
$$ packed form
9837A21622N6476J8896O932O364K923J0302M7146P7865P0948N7605N2043L7183
9825E66305K6272L9277M2315K1594Q590J7752L0090M8483N0329k140o1453p5502
9813G11912n3055N93M5249M7737L5191K2683N263J5265O1905Q1279L9808l5140
9801I78690r5627j49292j73470j34478o1498M34K4704K9617N3961O0041K8629
9790E61711j2317l4138k9106l4422m6876o0255q6643j12264r6715l0804J9215
9779C7386J8226Q264J7994M5547N3601L0086J1953R169K0687N6032R5209J17292
9767E21446J09993R3217J11854J66232K00388J82167J26933P1933N8245N4755
9757A697163K9642J0129k79k5686m8821p5674r5126o3905l1000n8870j21129j73209
$$ plain form
9745 1043235 857263 721656 656797 632266 615942 592931 568871 546969 537682 572863 643306
9734 643306 700828 719564 694034 632894 564275 501884 432341 359082 319142 327664 355761 390376
9722 390376 434617 468120 469232 444325 412014 369172 328812 322943 338210 358691 400607 467278
9710 467278 518185 522479 524669 561073 588634 556634 467018 350087 236576 167572 179428 263866
9698 263866 364806 430744 469970 497392 504150 520594 575098 668739 775841 842473 851218 847524
9686 847524 853320 862656 894688 964014 1040926 1097237 1131412 1140999 1145199 1182104 1231953 1241064 1211978
9673 1211978 1199512 1239121 1293168 1294641 1210561 1072297 934926 818488 712663 605866 490521
9662 490521 376070 260102 136948 53154 44079 95651 188417 286548 330781 311769 270650
$$ packed form
9745A043235j85972j35607o4859k4531j6324k3011k4060k1902r287L5181P0443
9734F43306N7522J8736k5530o1140o8619o2391o9543p3259l9940Q522K8097L4615
9722C90376M4241L3503J112k4907l2311m2842m0360n869J5267K0481M1916O6671
9710D67278N0907M294K190L6404K7561l2000q9616j16931j13511o9004J1856Q4438
9698B63866J00940O5938L9226K7422O758J6444N4504R3641J07102O6632Q745l694
9686H47524N796R336L2032O9326P6912N6311L4175R587M200L6905M9849R111k9086
9673A211978j2466L9609N4047J473q4080j38264j37371j16438j05825j06797j15345
9662D90521j14451j15968j23154q3794r075N1572R2766R8131M4233j9012m1119
$$ plain form
9651 270650 233816 220790 218578 198422 173672 166948 166059 143985 117208 112565 139316 180268 205825
9638 205825 185928 95223 -22675 -73895 -18257 88627 174524 233806 304703 403730 509434
9627 509434 590929 627868 593797 483666 315860 141002 35202 2043 -14668 -56373 -101431
9616 -101431 -100141 -44867 42977 135381 192476 198808 182987 172273 175635 162233 98560 18620
9604 18620 -27184 -9775 49157 104881 150675 187296 209465 201304 160210 132955 167805 232069
9592 232069 265616 276543 295797 296003 259530 242761 287146 388556 511039 589969 608938 603493
9580 603493 598890 585593 547840 520582 516753 506117 484306 460013 441919 470502 555666 646174
9568 646174 712412 778058 846175 885611 892247 874699 835447 777980 724695 700146 702229 737774
$$ packed form
9651B70650l6834j3026k212k0156k4750o724q89k2074k6777m643K6751M0952K5557
9638B05825j9897r0705j17898n1220N5638J06884Q5897N9282P0897R9027J05704
9627E09434Q1495L6939l4071j10131j67806j74858j05800l3159j6711m1705m5058
9616a01431J290N5274Q7844R2404N7095O332j5821j0714L362j3402o3673p9940
9604A8620m5804J7409N8932N5724M5794L6621K2169q161m1094k7255L4850O4264
9592B32069L3547J0927J9254K06l6473j6769M4385J01410J22483P8930J8969n445
9580F03493m603j3297l7753k7258l829j0636k1811k4293j8094K8583Q5164R0508
9568F46174O6238O5646O8117L9436O636j7548l9252n7467n3285k4549K083L5545
$$ plain form
9556 737774 802006 824197 755854 627628 468558 324265 271681 328616 435153 506712 517156
9545 517156 501957 506802 530594 540330 537323 534424 533900 548971 572696 572695 550207 528175 505823 467231
9531 467231 413959 376535 365019 352358 329403 304188 290075 311654 373079 431371 434004 390778
9519 390778 344380 306157 302580 341183 385659 414644 425617 422437 397790 353605 335218 364994
9507 364994 402932 413942 398900 387696 401849 434066 467930 496286 534438 599626 687110 766931
9495 766931 817395 856761 871772 817525 724064 672040 689483 773050 906842 1035614 1113439
9484 1113439 1135300 1139084 1183906 1291702 1437761 1576365 1693094 1812123 1931310 2007843
9474 2007843 2039500 2064230 2074013 2043678 1977859 1934848 1944558 1961552 1952364 1931677 1905991 1825534
$$ packed form
9556G37774O4232K2191o8343j28226j59070j44293n2584N6935J06537P1559J0444
9545E17156j5199M845K3792R736l007k899n24J5071K3725jk2488k2032k2352l8592
9531D67231n3272l7424j1516j2661k2955k5215j4113K1579O1425N8292K633m3226
9519C90778m6398l8223l577L8603M4476K8985J0973l180k4647m4185j8387K9776
9507C64994L7938J1010j5042j1204J4153L2217L3864K8356L8152O5188Q7484P9821
9495G66931N0464L9366J5011n4247r3461n2024J7443Q3567J33792J28772P7825
9484A113439K1861L784M4822J07796J46059J38604J16729J19029J19187P6533
9474B007843L1657K4730R783l0335o5819m3011R710J6994r188k0687k5686q0457
$$ plain form
9462 1825534 1651490 1433119 1240110 1102106 1031951 1016683 1026851 1003507 917622 814854
9452 814854 741142 693723 664224 674615 737957 828742 941016 1078943 1212093 1326529 1442542
9441 1442542 1569144 1662618 1686542 1662921 1623234 1588925 1566779 1518259 1408943 1267870 1142476
9430 1142476 1061985 1015542 963559 901602 861227 842460 816799 785043 761239 742164 704975
9419 704975 652405 644820 718920 836062 945203 1002571 1017497 1044218 1103061 1169643 1201341
9408 1201341 1213456 1239447 1272212 1295840 1312506 1302843 1227258 1121125 1075562 1115415 1186494
9397 1186494 1241432 1272323 1282726 1278800 1269569 1254146 1240570 1235222 1207263 1128562 1020239 917393
9385 917393 827623 737658 647698 556231 456491 380833 358870 378328 416021 448274 467538 476507
$$ packed form
9462A825534j74044k18371j93009j38004p0155j5268J0168k3344q5885j02768
9452H14854p3712m7419k9499J0391O3342R0785J12274J37927J33150J14436J16013
9441A442542J26602R3474K3924k3621l9687l4309k2146m8520j09316j41073j25394
9430A142476q0491m6443n1983o1957m0375j8767k5661l1756k3804j9075l7189
9419G04975n2570p585P4100J17142J09141N7368J4926K6721N8843O6582L1698
9408A201341J2115K5991L2765K3628J6666r663p5585j06133m5563L9853P1079
9397A186494N4938L0891J0403l926r231j5423j3576n348k7959p8701j08323j02846
9385I17393q9770q9965q9960r1467r9740p5658k1963J9458L7693L2253J9264Q969
$$ plain form
9373 476507 489763 495854 467027 421007 386003 379610 413036 472341 515092 508745 442047 330053
9361 330053 234803 189129 152781 99800 59773 68414 127734 207001 262186 304333 365960 428031
9349 428031 454246 444651 411628 362709 301489 223593 148134 91415 49851 28192 42719 92721
9337 92721 138811 139256 94886 41721 -3971 -37176 -44794 -33951 -26831 -20714 2032 47381 99630
9324 99630 119518 98018 84862 115469 183651 249285 281028 287175 271013 246845 232152 219398
9312 219398 202193 190224 180261 148729 84374 -4494 -115567 -224063 -297253 -328104 -331447 -323980
9300 -323980 -320849 -323368 -323893 -349880 -421166 -497953 -524215 -495860 -437419 -375636 -319168 -265741
9288 -265741 -228300 -215138 -208923 -190326 -168831 -169789 -199749 -208786 -153675 -60078 24427 86664
$$ packed form
9373D76507J3256O091k8827m6020l5004o393L3426N9305M2751o347o6698j11994
9361C30053r5250m5674l6348n2981m0027Q641N9320P9267N5185M2147O1627O2071
9349D28031K6215r595l3023m8919o1220p7896p5459n6719m1564k1659J4527N0002
9337I2721M6090M45m4370n3165m5692l3205p618J0843P120O117K2746M5349N2249
9324I9630J9888k1500j3156L0607O8182O5634L1743O147j6162k4168j4693j2754
9312B19398j7205j1969r963l1532o4355q8868j11073j08496p3190l0851l343P467
9300c23980L131k519n25k5987p1286p6787k6262K8355N8441O1783N6468N3427
9288b65741L7441J3162O215J8597K1495r58k9960r037N5111R3597Q4505O2237
$$ plain form
9276 86664 150621 251050 381812 508313 592453 633397 643681 589988 465205 335996 273561
9265 273561 271785 281137 280391 277470 290623 320343 341745 328320 285273 233614 189448 161123 146402
9252 146402 162359 215058 285656 332587 313995 242403 171298 114545 48718 -21098 -54825 -39129
9240 -39129 1152 46638 83371 90609 84281 80026 80809 96169 109197 121224 134441 119232 47455
9227 47455 -67616 -163309 -200995 -190886 -161976 -129462 -95849 -73828 -72139 -66715 -37660 -4016
9215 -4016 11219 -2705 -5639 20189 32847 18983 -4267 -7622 33246 125491 248264 347417
9203 347417 381473 366803 335940 315328 336736 399890 474304 516323 516399 488222 438901 405523
9191 405523 393487 338183 258760 256309 319416 375739 417737 452892 443927 369918 267671 183515
$$ packed form
9276H6664O3957J00429J30762J26501Q4140M0944J0284n3693j24783j29209o2435
9265B73561j776R352p46k921J3153K9720K1402j3425m3047n1659m4166k8325j4721
9252A46402J5957N2699P0598M6931j8592p1592p1105n6753o5827o9816l3727J5696
9240c9129M0281M5486L6733P238o328m255P83J5360J3028J2027J3217j5209p1777
9227D7455j15071r5693l7686J0109K8910L2514L3613K2021J689N424K9055L3644
9215d016J5235j3924k934K5828J2658j3864k3250l355M0868R2245J22773R9153
9203C47417L4056j4670l0863k0612K1408O3154P4414M2019P6k8177m9321l3378
9191D05523j2036n5304p9423k451O3107N6323M1998L5155q965p4009j02247q4156
$$ plain form
9179 183515 124897 82374 53495 31878 -1722 -44998 -64678 -39178 19083 90256 178180 272188
9167 272188 327875 314988 264872 244649 304649 420372 514769 568664 605423 611734 580169 535039
9155 535039 488121 413564 302540 190683 109282 48284 -15995 -83148 -143023 -192419 -221621
9144 -221621 -226446 -216801 -187877 -136259 -93691 -84322 -99013 -111216 -143541 -232420 -346882 -440039
9132 -440039 -485054 -472562 -429621 -404777 -413718 -427511 -424442 -402879 -359980 -299909 -239454 -203785
9120 -203785 -206617 -235072 -241722 -212582 -173900 -116654 -19355 95072 165751 166778 132175 101023
9108 101023 93816 105467 129214 153623 168132 175361 174245 169590 178871 189427 158815 92540 47241
9095 47241 45088 69284 118558 169131 182314 156238 132710 137085 132723 97417 60640 48666
$$ packed form
9179A83515n8618m2523k8879k1617l3600m3276j9680K5500N8261P1173Q7924R4008
9167B72188N5687j2887n0116k0223O0000J15723R4397N3895L6759O311l1565m5130
9155E35039m6918p4557j11024j11857q1401o0998o4279o7153n9875m9396k9202
9144b21621m825R645K8924N1618M2568R369j4691j2203l2325q8879j14462r3157
9132d40039m5015J2492M2941K4844q941j3793L069K1563M2899O0071O0455L5669
9120b03785k832k8455o650K9140L8682N7246R7299J14427P0679J027l4603l1152
9108A01023p207J1651K3747K4409J4509P229j116m655R281J0556l0612o6275m5299
9095D7241k153K4196M9274N0573J3183k6076k3528M375m362l5306l6777j1974
$$ plain form
9083 48666 67035 99978 108434 90378 72374 63832 66448 65720 45876 5104 -6689 71936 218831
9070 218831 347268 408834 415955 398949 385015 371758 334559 269612 199628 141991 81543 4856
9058 4856 -47743 -38550 18564 80495 130140 168052 180369 155849 87446 -534 -67623 -91963
9046 -91963 -97950 -115606 -122819 -80629 12157 114134 178332 181181 124748 49601 12241 23448
9034 23448 63038 126651 209835 291766 342419 355749 380257 447108 528428 600177 643614 646742
9022 646742 632846 628670 627778 607052 561081 511484 490500 527496 602808 661678 676806 661946
9010 661946 639574 598506 541809 497581 494823 552745 638345 706163 731814 702664 642117 577126
8998 577126 515077 478598 503828 566406 607307 600719 558909 497259 434465 384201 341983 310157
$$ packed form
9083D8666J8369L2943Q456j8056j8004q542K616p28j9844m0772j1793P8625J46895
9070B18831J28437O1566P121j7006j3934j3257l7199o4947o9984n7637o0448p6687
9058D856n2599R193N7114O1931M9645L7912J2317k4520o8403q7980o7089k4340
9046i1963n987j7656p213M2190R2786J01977O4198K849n6433p5147l7360J1207
9034B3448L9590O3613Q3184Q1931N0653J3330K4508O6851Q1320P1749M3437L128
9022F46742j3896m176q92k0726m5971m9597k0984L6996P5312N8870J5128j4860
9010F61946k2372m1068n6697m4228k758N7922Q5600O7818K5651k9150o0547o4991
8998E77126o2049l6479K5230O2578M0901o588m1810o1650o2794n0264m2218l1826
$$ plain form
8986 310157 301849 312485 328969 331342 296274 236206 182717 158123 184722 231973 253160 273206
8974 273206 313345 320285 288797 295951 348955 401375 428094 425045 415191 410530 401715 371845 307187
8961 307187 222455 140530 89641 67796 70275 108748 165562 182809 140681 101025 106918 150334
8949 150334 206290 252000 271346 266656 251589 259431 296533 312416 267885 184082 101367 32586
8937 32586 -12224 -31865 -24759 17958 76905 105585 76971 13849 -53626 -120331 -164761 -169923
8925 -169923 -167643 -176121 -200279 -235842 -253650 -256210 -233708 -163237 -69285 -2572 -726 -53356
8913 -53356 -100031 -108422 -81218 -28034 26550 55685 36952 -22110 -83527 -105727 -81810 -53545
8901 -53545 -41046 -42223 -68028 -101477 -98154 -48270 7642 35467 54907 95789 141003 154844
$$ packed form
8986C10157q308J0636J6484K373l5068o0068n3489k4594K6599M7251K1187K0046
8974B73206M0139O940l1488P154N3004N2420K6719l049r854m661q815k9870o4658
8961C07187q4732q1925n0889k1845K479L8473N6814J7247m2128l9656N893M3416
8949A50334N5956M5710J9346m690j5067P842L7102J5883m4531q3803q2715o8781
8937C2586m4810j9641P106M2717N8947K8680k8614o3122o7475o6705m4430n162
8925a69923K280q478k4158l5563j7808k560K2502P0471R3952O6713J846n2630
8913e3356m6675q391K7204N3184N4584K9135j8733n9062o1417k2200K3917K8265
8901e3545J2499j177k5805l3449L323M9884N5912K7825J9440M0882M5214J3841
$$ plain form
8889 154844 162716 206303 264295 288110 272099 242911 211131 179570 142000 99290 54462 -6806
8877 -6806 -85053 -151280 -175776 -147232 -86556 -21674 44294 102959 162251 238657 314509 375554
8865 375554 414209 419198 405897 379028 301000 180053 81261 44459 62802 123354 194944 237096
8853 237096 242347 220549 170002 109251 77406 81219 103992 120379 120931 137870 185590 224844
8841 224844 205667 150702 118954 114507 114967 122833 149562 178311 188146 171020 157607 173324 190539
8828 190539 185135 168905 152030 102459 18093 -49046 -66307 -56274 -49431 -17629 52834 121953
8816 121953 173784 220481 267957 304359 315603 308184 308880 315122 298201 249143 184488 150951
8804 150951 172497 197102 172352 74526 -91424 -255480 -346790 -366707 -348295 -295787 -210284
$$ packed form
8889A54844P872M3587N7992K3815j6011k9188l1780l1561l7570m2710m4828o1268
8877f806p8247o6227k4496K8544O0676O4882O5968N8665N9292P6406P5852O1045
8865C75554L8655M989j3301k6869p8028j20947r8792l6802J8343O0552P1590M2152
8853B37096N251k1798n0547o0751l1845L813K2773J6387N52J6939M7720L9254
8841B24844j9177n4965l1748m447M60P866K6729K8749R835j7126j3413J5717J7215
8828A90539n404j6230j6875m9571q4366o7139j7261J0033O843L1802P0463O9119
8816A21953N1831M6697M7476L6402J1244p419O96O242j6921m9058o4655l3537
8804A50951K1546K4605k4750r7826j65950j64056r1310j9917J8412N2508Q5503
$$ plain form
8793 -210284 -118767 -44991 13084 69821 141620 220130 287005 319978 320411 314958 332437 381527
8781 381527 427819 415245 348295 274584 219183 197569 207431 227718 231868 208370 167609 129820
8769 129820 111436 101664 75736 22359 -35375 -78585 -96504 -59942 49421 188230 287496
8758 287496 319756 293795 242419 192319 170523 168585 177427 220481 311435 434482 531440 551635
8746 551635 504198 417207 312338 206495 139438 156652 235869 308221 333733 334119 347882 391252
8734 391252 452258 496952 492068 422564 311288 215195 166286 121782 53470 -7480 -52216 -93012
8722 -93012 -117350 -104390 -69535 -35869 -21816 -34003 -60727 -86810 -107534 -119433 -89231 -31089
8710 -31089 6478 2510 -43867 -116006 -196441 -265259 -301096 -275834 -176234 -39313 65075 97760
$$ packed form
8793b10284R1517P3776N8075N6737P1799P8510O6875L2973M33n453J7479M9090
8781C81527M6292j2574o6950p3711n5401k1614R862K0287M150k3498m0761l7789
8769A29820j8384r772k5928n3377n7734m3210j7919L6562J09363J38809R9266
8758B87496L2260k5961n1376n0100k1796j938Q842M3054R0954J23047R6958K0195
8746E51635m7437q6991j04869j05843o7057J7214P9217P2352K5512L86J3763M3370
8734C91252O1006M4694m884o9504j11276r6093m8909m4504o8312o0950m4736m0796
8722i3012k4338J2960L4855L3666J4053j2187k6724k6083k0724j1899L0202N8142
8710c1089L7567l968m6377p2139q0435o8818l5837K5262R9600J36921J04388L2685
$$ plain form
8698 97760 74035 23650 -21489 -53933 -81855 -108249 -139746 -172695 -197074 -219451 -246248 -266946
8686 -266946 -253244 -207062 -140040 -40224 94632 217845 268111 247124 204444 179449 185580
8675 185580 225573 298235 376914 422687 422677 401609 377441 346829 311896 300832 338245 399348
8663 399348 455185 496677 494203 435858 366785 309180 257521 214363 194738 217953 281021 352246
8651 352246 385596 371293 328220 286395 284552 316783 350922 394211 464093 539187 577388 564818
8639 564818 509044 451992 443815 450677 429353 386862 373282 435813 533797 594994 619139 614710
8627 614710 587398 556100 527322 489233 449140 417760 370271 296677 219593 161506 150785 174962
8615 174962 197262 214540 235432 263458 290979 313855 342623 379261 456029 569827 638042
$$ packed form
8698I7760k3725n0385m5139l2444k7922k6394l1497l2949k4379k2377k6797k0698
8686b66946J3702M6182O7022R9816J34856J23213N0266k0987m2680k4995O131
8675A85580L9993P2662P8679M5773j0k1068k4168l0612l4933j1064L7413O1103
8663C99348N5837M1492k474n8345o9073n7605n1659m3158j9625K3215O3068P1225
8651C52246L3350j4303m3073m1825j843L2231L4139M3289O9882P5094L8201j2570
8639E64818n5774n7052q177O862k1324m2491j3580O2531R7984O1197K4145m429
8627F14710k7312l1298k8778l8089m0093l1380m7489p3594p7084n8087j0721K4177
8615A74962K2300J7278K0892K8026K7521K2876K8768L6638P6768J13798O8215
$$ plain form
8604 638042 619677 552508 487145 439691 407122 371774 328536 310784 363317 463713 523802
8593 523802 509664 445750 367486 283484 190456 120666 114520 164095 217458 239415 229687 193506
8581 193506 154668 149745 165077 141273 49903 -74583 -185875 -254866 -278513 -262205 -210107
8570 -210107 -132919 -60598 -12241 36710 95331 147367 185637 212787 241489 290945 349008 387397
8558 387397 399313 423713 494761 569648 568043 484613 387851 329150 318326 326286 325946 340207
8546 340207 390478 435518 447633 440636 426033 391471 332454 269955 231699 240016 271781 275822
8534 275822 241845 167042 68719 -32505 -135133 -223330 -253478 -208290 -128945 -46777 31164
8523 31164 83766 95776 70354 62815 120610 200190 253912 265829 247707 225312 197786 152614
$$ packed form
8604F38042j8365o7169o5363m7454l2569l5348m3238j7752N2533J00396O0089
8593E23802j4138o3914p8264q4002r3028o9790o146M9575N3363K1957r728l6181
8581A93506l8838m923J5332k3804r1370j24486j11292o8991k3647J6308N2098
8570b10107P7188P2321M8357M8951N8621N2036L8270K7150K8702M9456N8063L8389
8558C87397J1916K4400P1048P4887j605q3430r6762n8701j0824P960l40J4261
8546C40207N0271M5040J2115o997j4603l4562n9017o2499l8256Q317L1765M041
8534B75822l3977p4803r8323j01224j02628q8197l0148M5188P9345Q2168P7941
8523C1164N2602J2010k5422p539N7795P9580N3722J1917j8122k2395k7526m5172
$$ plain form
8511 152614 100757 60438 35748 8771 -11343 -4847 24750 56130 55093 25874 11404 47034
8499 47034 126608 204783 261859 312623 379369 462773 535579 586255 615721 627603 621045 586295
8487 586295 541637 520100 496719 444591 381193 325627 266391 175684 68099 -5399 -12595 43353
8475 43353 125662 188720 239653 314764 406673 484116 563038 657676 747203 810615 828016 803915
8463 803915 766151 738002 727401 745801 787662 822779 817347 781440 781545 820138 847014 842157
8451 842157 798396 709034 574736 434220 340512 312716 335356 369457 394637 413937 421390
8440 421390 428971 458154 497751 527397 545693 546045 517416 463915 385158 281273 218205 237763
8428 237763 297991 356383 384600 349886 239796 113144 32269 19931 75840 163518 244723
$$ packed form
8511A52614n1857m0319k4690k6977k0114O496K9597L1380j037k9219j4470L5630
8499D7034P9574P8175N7076N0764O6746Q3404P2806N0676K9466J1882o558l4750
8487E86295m4658k1537k3381n2128o3398n5566n9236r0707j07585p3498p196N5948
8475D3353Q2309O3058N0933P5111R1909P7443P8922R4638Q9527O3412J7401k4101
8463H03915l7764k8149j0601J8400M1861L5117n432l5907J05L8593K6876m857
8451H42157m3761q9362j34298j40516r3708k7796K2640L4101K5180J9300P453
8440D21390P581K9183L9597K9646J8296L52k8629n3501p8757j03885o3068J9558
8428B37763O0228N8392K8217l4714j10090j26652q0875j2338N5909Q7678Q1205
$$ plain form
8417 244723 315122 369270 399310 426140 461627 502445 544282 576543 610611 662242 725101 788706
8405 788706 843643 879053 874957 836530 800880 796138 838036 915375 982090 1004872 985810 960686
8393 960686 948923 928049 885336 819190 723574 629259 591669 637383 724771 786584 812876 833876
8381 833876 862007 873191 854066 837243 849100 879305 911584 920201 894570 855334 811526 744776
8369 744776 659444 584312 536158 513949 516902 554615 594676 608333 597433 556325 496511 449192
8357 449192 435839 468971 547992 644461 710128 722796 704743 694422 698674 697501 668737 621365
8345 621365 605178 640145 677265 699110 760877 865452 934369 935824 919258 892106 831182 773547
8333 773547 753593 747596 740761 758365 774139 732694 656815 611539 596249 565397 515045 453657
$$ packed form
8417B44723P0399N4148L0040K6830L5487M0818M1837L2261L4068N1631O2859O3605
8405G88706N4937L5410m096l8427l5650m742M1898P7339O6715K2782j9062k5124
8393I60686j1763k0874m2713o6146r5616r4315l7590M5714Q7388O1813K6292K1000
8381H33876K8131J1184j9125j6823J1857L0205L2279Q617k5631l9236m3808o6750
8369G44776q5332p5132m8154k2209K953L7713M0061J3657j0900m1108n9814m7319
8357D49192j3353L3132P9021R6469O5667J2668j8053j0321M252j173k8764m7372
8345F21365j6187L4967L7120K1845O1767J04575O8917J455j6566k7152o0924n7635
8333G73547j9954n997o835J7604J5774m1445p5879m5276j5290l0852n0352o1388
$$ plain form
8321 453657 393305 350968 316962 291168 306880 401866 562919 736701 890522 1023509 1126828
8310 1126828 1183687 1190777 1151388 1089240 1025983 952677 890672 881242 934973 1043672 1176354
8299 1176354 1281565 1322380 1302410 1249599 1198892 1158015 1145552 1152436 1146617 1108516 1022738 914514
8287 914514 839307 835318 904623 1014610 1127739 1225346 1291989 1309939 1267299 1194760 1138203
8276 1138203 1126700 1183862 1284784 1361025 1367742 1309321 1209795 1116594 1070996 1085150 1121754
8265 1121754 1121977 1082049 1029804 992840 999207 1039519 1081350 1113428 1143659 1172595 1190959 1201060
8253 1201060 1207613 1201394 1182561 1170601 1180817 1202581 1206208 1202254 1241245 1330825 1452326 1575966
8241 1575966 1663507 1720173 1774606 1859200 1948542 1970568 1917365 1828403 1707959 1549947 1413734
$$ packed form
8321D53657o0352m2337l4006k5794J5712R4986J61053J73782J53821J32987J03319
8310A126828N6859P090l9389o2148o3257p3306o2005r430N3731J08699J32682
8299A176354J05211M0815j9970n2811n0707m0877j2463O884n819l8101q5778j08224
8287I14514p5207l989O9305J09987J13129R7607O6643J7950m2640p2539n6557
8276A138203j1503N7162J00922P6241O717n8421r9526r3201m5598J4154L6604
8265A121754K23l9928n2245l6964O367M0312M1831L2078L0231K8936J8364J0101
8253A201060O553o219j8833j1960J0216K1764L627l954L8991Q9580J21501J23640
8241A575966Q7541N6666N4433Q4594Q9342K2026n3203q8962j20444j58012j36213
$$ plain form
8230 1413734 1336225 1282982 1243937 1243622 1257806 1237751 1186955 1136928 1136966 1212487 1310343 1366891
8218 1366891 1374633 1386753 1460387 1579608 1679504 1711558 1686911 1648652 1609735 1566430 1530891
8207 1530891 1510417 1502390 1502805 1518884 1564026 1614018 1638573 1642262 1636333 1630303 1633205 1641385 1651866
8194 1651866 1677629 1737584 1818155 1895510 1941651 1942661 1914626 1860120 1779107 1700038 1656164 1672957
8182 1672957 1746977 1859371 1992893 2089842 2125105 2129558 2138840 2167234 2195326 2219848 2254828
8171 2254828 2285873 2303046 2317210 2323787 2301630 2276640 2304299 2391358 2506064 2629624 2741396
8160 2741396 2809451 2823563 2799713 2766992 2753294 2749778 2744191 2773876 2849468 2946026 3074728 3230612
8148 3230612 3361356 3397140 3331087 3249639 3221098 3250911 3302925 3330869 3311250 3250828 3184904
$$ packed form
8230A413734p7509n3243l9045l15J4184k0055n0796n0027L8P5521R7856N6548
8218A366891P742J2120P3634J19221R9896L2054k4647l8259l8917m3305l5539
8207A530891k0474q027M15J6079M5142M9992K4555L689n929o030K902Q180J0481
8194A651866K5763N9955Q0571P7355M6141J010k8035n4506q1013p9069m3874J6793
8182A672957P4020J12394J33522R6949L5263M453R282K8394K8092K4522L4980
8171B254828L1045J7173J4164O577k2157k4990K7659Q7059J14706J23560J11772
8160B741396O8055J4112k3850l2721j3698l516n587K9685P5592R6558J28702J55884
8148C230612J30744L5784o6053q1448k8541K9813N2014K7944j9619o0422o5924
$$ plain form
8137 3184904 3134579 3118409 3139384 3145505 3111245 3035335 2945654 2898425 2896100 2893232 2857017 2792639
8125 2792639 2731234 2704482 2716523 2737230 2727799 2661540 2542941 2411462 2315956 2289952 2322551
8114 2322551 2369703 2429127 2491236 2516633 2519874 2546963 2609246 2704150 2830725 2968541 3092001
8103 3092001 3180801 3222186 3215554 3167653 3109386 3084264 3082922 3076253 3063192 3056832 3065764 3092618
8091 3092618 3135142 3206141 3315487 3420706 3472070 3464468 3414804 3350970 3285771 3247541 3254547
8080 3254547 3291094 3343455 3395334 3425778 3444304 3469160 3471726 3432167 3392525 3411332 3493352 3597340
8068 3597340 3687549 3745309 3777149 3787169 3814206 3896652 3995528 4077032 4129049 4150289 4138159
8057 4138159 4090934 4037206 4008613 4042708 4168657 4339222 4485365 4573561 4586494 4562369 4572844
$$ packed form
8137C184904n0325j6170K0975O121l4260p5910q9681m7229k325k868l6215o4378
8125B792639o1405k6752J2041K0707r431o6259j18599j31479r5506k6004L2599
8114B322551M7152N9424O2109K5397L241K7089O2283R4904J26575J37816J23460
8103C092001Q8800M1385o632m7901n8267k5122j342o669j3061o360Q932K6854
8091C092618M2524P0999J09346J05219N1364p602m9664o3834o5199l8230P006
8080C254547L6547N2361N1879L0444J8526K4856K566l9559l9642J8807Q2020J03988
8068C597340R0209N7760L1840J0020K7037Q2446R8876Q1504N2017K1240j2130
8057D138159m7225n3728k8593L4095J25949J70565J46143Q8196J2933k4125J0475
$$ plain form
8046 4572844 4652697 4784802 4943375 5098597 5236094 5379101 5522822 5637989 5719431 5785744
8036 5785744 5857980 5960691 6098234 6234884 6348411 6448346 6547128 6638648 6721805 6831226
8026 6831226 6972674 7117860 7289520 7516069 7784159 8064429 8334654 8599296 8870860 9150356
8016 9150356 9437681 9736363 10041278 10368637 10748014 11200222 11773557 12496491 13338819 14279428
8006 14279428 15303607 16420864 17682218 19121061 20751883 22599838 24703740 27095112
7998 27095112 29830896 32946914 36373232 39921104 43342102 46378618 48739332 50124107
7990 50124107 50340099 49400701 47494630 44871799 41807417 38586447 35451856 32582355
7982 32582355 30071307 27926416 26126428 24654027 23478640 22536806 21773050 21178586 20739818
$$ packed form
8046D572844P9853J32105J58573J55222J37497J43007J43721J15167Q1442O6313
8036E785744P2236J02711J37543J36650J13527R9935R8782R1520Q3157J09421
8026F831226J41448J45186J71660K26549K68090K80270K70225K64642K71564K79496
8016I150356K87325K98682L04915L27359L79377M52208N73335P22934Q42328R40609
8006A4279428J024179J117257J261354J438843J630822J847955K103902K391372
7998B7095112K735784L116018L426318L547872L420998L036516K360714J384775
7990E0124107K15992r39398j906071k622831l064382l220970l134591k869501
7982C2582355k511048k144891j799988j472401j175387r41834p63756n94464m38768
$$ plain form
7973 20739818 20413839 20161200 19970728 19841604 19768864 19739177 19758575 19862536 20065621 20321137
7963 20321137 20597813 20927503 21341688 21837847 22411042 23075052 23862208 24819443 25984339
7954 25984339 27335503 28866323 30627004 32682263 35100688 37925051 41163978 44867027
7946 44867027 49146177 54087597 59742915 66182780 73506117 81794071 91040878 101061372
7938 101061372 111438242 121517304 130445042 137244285 141026218 141245054 137854143 131325061
7930 131325061 122500386 112378609 101929160 91924009 82832261 74872028 68076563 62337282
7922 62337282 57517789 53504274 50183788 47479406 45329036 43645119 42334360 41319508
7914 41319508 40546284 39949321 39449362 38995923 38576504 38202110 37938310 37852477 37959603 38271843
$$ packed form
7973B0739818l25979k52639j90472j29124p2740k9687J9398J03961K03085K55516
7963B0321137K76676L29690M14185M96159N73195O64010P87156R57235J164896
7954B5984339J351164J530820J760681K055259K418425K824363L238927L703049
7946D4867027M279150M941420N655318O439865P323337Q287954R246807J0020494
7938A01061372J0376870J0079062Q927738O799243L781933K18836l390911o529082
7930A31325061q824675j0121777j0449449j0005151r091748p960233o795465n739281
7922F2337282m819493m013515l320486k704382k150370j683917j310759j014852
7914D1319508p73224n96963m99959m53439m19419l74394k63800q5833J07126L12240
$$ plain form
7904 38271843 38823693 39643395 40714991 41999441 43487797 45244571 47327276 49764765
7896 49764765 52631805 56015942 59952517 64477019 69664884 75632114 82562613 90666039
7888 90666039 100109780 111077494 123804242 138476862 155141466 173648033 193580624
7881 193580624 214139848 234036788 251529348 264673727 271748784 271707613 264466389 250933278
7873 250933278 232794069 212079232 190703770 170162986 151416420 134921626 120753551
7866 120753551 108767557 98720822 90310762 83264366 77387927 72549674 68622978 65435467
7858 65435467 62808933 60621447 58764279 57125846 55658016 54362611 53246934 52310774
7850 52310774 51587504 51130499 50957728 51045910 51376728 51999398 52988493 54346757 56056310
$$ packed form
7904C8271843N51850Q19702J071596J284450J488356J756774K082705K437489
7896D9764765K867040L384137L936575M524502N187865N967230O930499Q103426
7888I0666039R443741J0967714J2726748J4672620J6664604J8506567J9932591
7881A93580624K0559224J9896940J7492560J3144379P075057m1171p241224j3533111
7873B50933278j8139209k0714837k1375462k0540784j8746566j6494794j4168075
7866A20753551j1985994j0046735q410060p046396n876439m838253l926696l187511
7858F5435467k626534k187486j857168j638433j467830j295405j115677r36160
7850E2310774p23270m57005j72771Q8182L30818O22670R89095J358264J709553
$$ plain form
7841 56056310 58172496 60764210 63868704 67540855 71877461 77003894 83026748 90009555
7833 90009555 98047057 107336249 118164350 130812551 145526872 162509493 181816469
7826 181816469 203305509 226500876 250424098 273523204 293749473 308814162 316674403
7819 316674403 316091250 306984636 290461941 268550666 243693364 218180820 193768735
7812 193768735 171523835 151933227 135072024 120727469 108590304 98387460 89849660
7805 89849660 82726355 76785703 71807604 67616939 64057818 61015371 58413788 56169387
7797 56169387 54217213 52536022 51101306 49894740 48935034 48237042 47761873 47494297 47501096
7788 47501096 47854846 48578484 49656461 51073448 52820391 54923895 57460385 60498004
$$ packed form
7841E6056310K116186K591714L104494L672151M336606N126433O022854O982807
7833I0009555Q037502R289192J0828101J2648201J4714321J6982621J9306976
7826A81816469K1489040K3195367K3923222K3099106K0226269J5064689P860241
7819C16674403n83153r106614j6522695k1911275k4857302k5512544k4412085
7812A93768735k2244900j9590608j6861203j4344555j2137165j0202844q537800
7805H9849660p123305n940652m978099m190665l559121l042447k601583k244401
7797E6169387j952174j681191j434716j206566r59706o97992m75169k67576O799
7788D7501096L53750P23638J077977J416987J746943K103504K536490L037619
$$ plain form
7780 60498004 64093852 68315622 73235198 78955512 85623858 93403194 102493353 113127917
7772 113127917 125528800 139850804 156146046 174278580 193801265 213862177 233125881
7765 233125881 249840559 262111330 268266432 267290180 259134008 244733646 225798283 204406987
7757 204406987 182507107 161548649 142437811 125628268 111155112 98816495 88344180
7750 88344180 79467296 71952202 65591308 60205464 55642494 51781181 48483132 45611798
7742 45611798 43080962 40851383 38888634 37157092 35638215 34322848 33222691 32348173
7734 32348173 31676779 31175139 30839152 30678587 30665241 30786245 31081683 31571604 32284677 33270579
7724 33270579 34546168 36123236 38024583 40276575 42955526 46185190 50074749 54673764
$$ packed form
7780F0498004L595848M221770M919576N720314O668346P779336R090159J0634564
7772A13127917J2400883J4322004J6295242J8132534J9522685K0060912J9263704
7765B33125881J6714678J2270771O155102r76252q156172j4400362j8935363k1391296
7757B04406987k1899880k0958458j9110838j6809543j4473156j2338617j0472315
7750H8344180q876884p515094o360894n385844m562970l861313l298049k871334
7742D5611798k530836k229579j962749j731542j518877j315367j100157q74518
7734C2348173o71394n01640l35987j60565j3346J21004K95438M89921P13073R85902
7724C3270579J275589J577068J901347K251992K678951L229664L889559M599015
$$ plain form
7716 54673764 60011529 66145165 73159182 81105959 89943757 99489133 109327552 118744421
7708 118744421 126835482 132678153 135451490 134658883 130316853 122946004 113398457 102661270
7700 102661270 91678796 81179250 71590417 63098875 55717740 49366161 43956788 39404406
7692 39404406 35576377 32348508 29620292 27263650 25167910 23280315 21604798 20164098
7684 20164098 18959694 17949083 17063410 16278427 15617472 15079535 14615359 14198958 13850055
7675 13850055 13591300 13431063 13357654 13357192 13429866 13552154 13680391 13849409 14140671 14578226
7665 14578226 15127700 15787180 16615029 17646245 18886719 20355040 22088632 24117620 26460194
7656 26460194 29122540 32048622 35128202 38230094 41147533 43612750 45365485 46159479
$$ packed form
7716E4673764N337765O133636P014017P946777Q837798R545376R838419R416869
7708A18744421Q091061N842671K773337p92607m342030p370849r547547j0737187
7700A02661270j0982474j0499546r588833q491542p381135o351579n409373m552382
7692C9404406l828029l227869k728216k356642k095740j887595j675517j440700
7684B0164098j204404j010611q85673p84983o60955n37937m64176m16401l48903
7675A3850055k58755j60237p3409m62P2674J22288J28237J69018K91262M37555
7665A4578226N49474O59480Q27849J031216J240474J468321J733592K028988K342574
7656B6460194K662346K926082L079580L101892K917439K465217J752735P93994
$$ plain form
7648 46159479 45836016 44397734 41982062 38847839 35324164 31707394 28211834 24986448
7640 24986448 22154224 19757620 17734146 16006815 14535606 13294595 12256520 11386231
7632 11386231 10645945 10015849 9486014 9041854 8683979 8426979 8253445 8114502 7963922
7623 7963922 7801844 7673757 7612007 7600096 7617251 7669920 7749517 7824434 7862750 7861814 7833259
7612 7833259 7778268 7692536 7577782 7434045 7268900 7091580 6903732 6699499 6475148 6233372
7602 6233372 5971597 5688549 5427202 5211485 4996954 4758370 4509390 4267687 4028888 3792456
7592 3792456 3579430 3400218 3270589 3184521 3103200 3000030 2868700 2704138 2533659 2405887
7582 2405887 2313963 2225595 2140233 2080965 2042957 2012264 1994949 1975887 1906126 1764816 1610885
$$ packed form
7648D6159479l23463j438282k415672l134223l523675l616770l495560l225386
7640B4986448k832224k396604k023474j727331j471209j241011j038075q70289
7632A1386231p40286o30096n29835m44160l57875k57000j73534j38943j50580
7623G963922j62078j28087o1750j1911J7155N2669P9597P4917L8316r36k8555
7612G833259n4991q5732j14754j43737j65145j77320j87848k04233k24351k41776
7602F233372k61775k83048k61347k15717k14531k38584k48980k41703k38799k36432
7592C792456k13026j79212j29629q6068q1321j03170j31330j64562j70479j27772
7582B405887r1924q8368q5362n9268l8008l0693j7315j9062o9761j41310j53931
$$ plain form
7571 1610885 1536066 1559272 1626665 1681429 1703818 1716640 1715581 1682104 1632712 1588291 1551373 1501215
7559 1501215 1412389 1304760 1225055 1204103 1232154 1261159 1262807 1232017 1163783 1079150 1035497
7548 1035497 1072383 1161944 1273627 1392372 1458294 1401862 1247627 1079963 927743 801366
7538 801366 712231 650342 597676 539860 491508 455389 413141 374359 361048 385080 440162 540061
7526 540061 679163 794024 850383 872287 890707 901904 872298 790111 672926 545795 429533
7515 429533 351127 316443 278804 213926 158564 148988 192102 263528 317228 356437 432293 556824
7503 556824 669041 718395 734114 734967 702739 663880 639298 629378 633636 649995 688401 733951
7491 733951 755372 758898 770352 774070 744450 700379 682433 699406 746221 809270 860820 885101
$$ packed form
7571A610885p4819K3206O7393N4764K2389J2822j059l3477m9392m4421l6918n0158
7559A501215q8826j07629p9705k0952K8051K9005J648l0790o8234q4633m3653
7548A035497L6886Q9561J11683J18745O5922n6432j54235j67664j52220j26377
7538H01366q9135o1889n2666n7816m8352l6119m2248l8782j3311K4032N5082R9899
7526E40061J39102J14861N6359K1904J8420J1197k9606q2187j17185j27131j16262
7515D29533p8406l4684l7639o4878n5362r576M3114P1426N3700L9209P5856J24531
7503E56824J12217M9354J5719Q53l2228l8859k4582r920M258J6359L8406M5550
7491G33951K1421L526J1454L718k9620m4071j7946J6973M6815O3049N1550K4281
$$ plain form
7479 885101 899462 899357 856121 797789 774296 781324 800251 839896 894572 955556 1031929 1116075
7467 1116075 1182116 1212341 1213744 1180964 1100512 1004913 938924 896228 866580 877849 939984 1018177
7455 1018177 1063047 1071524 1071721 1059754 1026715 989306 968669 974384 983002 960888 909806 845030
7443 845030 803587 822301 885557 953696 986799 979063 941964 872124 789984 732563 723604 739503
7431 739503 729950 679574 621790 591722 609060 678376 745887 771678 749092 674073 591350 548069
7419 548069 521836 453641 326465 193001 111923 85977 76246 65357 77254 124610 175914
7408 175914 200418 199214 170105 137794 124977 117764 101542 79470 54621 29676 6534 10308
7396 10308 86980 206490 295970 344930 379683 402453 407977 386985 346281 301011 240356 149465
$$ packed form
7479H85101J4361j05m3236n8332k3493P028J8927L9645N4676O0984P6373Q4146
7467A116075O6041L0225J403l2780q0452r5599o5989m2696k9648J1269O2135P8193
7455A018177M4870Q477J97j1967l3039l7409k0637N715Q618k2114n1082o4776
7443H45030m1443J8714O3256O8139L3103p736l7099o9840q2140n7421q959J5899
7431G39503r553n0376n7784l0068J7338O9316O7511K5791k2586p5019q2723m3281
7419E48069k6233o8195j27176j33464q1078k5946r731j0889J1897M7356N1304
7408A75914K4504j204k9109l2311j2817p213j6222k2072k4849k4945k3142L774
7396A0308P6672J19510Q9480M8960L4753K2770N524k0992m0704m5270o0655r0891
$$ plain form
7384 149465 57112 2911 -12828 -16552 -28215 -42326 -31355 24184 96331 139627 126395 62179
7372 62179 -23216 -77495 -72833 -31152 13702 34414 33783 25775 18424 53792 136633 216268 281513
7359 281513 340292 391283 441120 476883 457196 367941 266269 232016 249999 266983 278867
7348 278867 298518 322369 332573 306988 258720 206361 148858 97130 59030 12807 -49244 -97592
7336 -97592 -110124 -83457 -43465 -20871 3103 62042 152463 242836 291744 277866 241269 240061
7324 240061 264473 303476 363353 412500 411001 390040 390445 393618 362046 300212 262855 273501
7312 273501 293219 319893 365246 376811 325802 256098 206533 172283 143573 117476 94095 69554
7300 69554 55240 60948 86472 132755 182125 223062 258661 276739 272058 266199 286616 340742
$$ packed form
7384A49465r2353n4201j5739l724j1663j4111J0971N5539P2147M3296j3232o4216
7372F2179q5395n4279M662M1681M4854K0712o31q008p351L5368Q2841P9635O5245
7359B81513N8779N0991M9837L5763j9687q9255j01672l4253J7983J6984J1884
7348B78867J9651K3851J0204k5585m8268n2359n7503n1728l8100m6223o2051m8348
7336i7592j2532K6667L9992K2594K3974N8939R0421R0373M8908j3878l6597j208
7324B40061K4412L9003N9877M9147j499k0961M05L173l1572o1834l7357J0646
7312B73501J9718K6674M5353J1565n1009o9704m9565l4250k8710k6097k3381k4541
7300F9554j4314N708K5524M6283M9370M0937L5599J8078m681n859K0417N4126
$$ plain form
7288 340742 406458 453648 471923 489811 535777 584689 600825 573946 512001 444714 402586 389687
7276 389687 394798 411803 423559 410177 372493 336014 314386 298286 289669 303568 350259 412491
7264 412491 460322 474955 471984 483277 494623 479171 453979 435517 433931 447650 460587 488153
7252 488153 550970 632036 702832 739019 731614 700271 671259 648387 622751 609599 647286 725713
7240 725713 796959 834255 837822 824244 810620 796703 786010 802577 836787 847650 840556 815279
7228 815279 753169 665335 580342 534886 554626 620078 691993 749798 788820 802095 784499 747838
7216 747838 687276 604200 515488 428487 342417 244653 152939 116190 146781 209775 249014 238399
7204 238399 209162 203683 242668 310533 385734 461565 540047 609095 649061 665007 672886 678378
$$ packed form
7288C40742O5716M7190J8275J7888M5966M8912J6136k6879o1945o7287m2128j2899
7276C89687N111J7005J1756j3382l7684l6479k1628j6100q617J3899M6691O2232
7264D12491M7831J4633k971J1293J1346j5452k5192j8462j586J3719J2937K7566
7252D88153O2817Q1066P0796L6187p405l1343k9012k2872k5636j3152L7687P8427
7240G25713P1246L7296L567j3578j3624j3917j0693J6567L4210J0863p094k5277
7228H15279o2110q7834q4993m5456J9740O5452P1915N7805L9022J3275j7596l6661
7216G47838o0562q3076q8712q7001q6070r7764r1714l6749L0591O2994L9239j0615
7204B38399k9237n479L8985O7865P5201P5831P8482O9048L9966J5946P879N492
$$ plain form
7192 678378 687553 679654 631031 565182 514273 486870 477149 477620 477766 484230 516967 573113 606705
7179 606705 585953 534456 474347 416664 357879 286494 224526 191930 185573 188209 176932 153781
7167 153781 154336 173179 178754 179364 188926 199359 206078 204383 198328 217848 270142 343776 424059
7154 424059 490542 537096 571004 619062 683904 726890 710909 641658 540654 442150 378126
7143 378126 341673 339297 375110 435140 502695 556055 574162 544631 479634 408330 339851 264616
7131 264616 191977 141437 118572 128824 171890 178352 115023 40844 -17492 -67426 -113373 -146546
7119 -146546 -144169 -76008 42383 126695 141190 137508 147938 162168 194425 254028 315360 349132
7107 349132 354677 346602 330437 282590 201426 142417 122879 113120 77152 19601 9616 59681
$$ packed form
7192F78378R175p899m8623o5849n0909k7403r721M71J46O464L2737N6146L3592
7179F06705k0752n1497o0109n7683n8785p1385o1968l2596o357K636j1277k3151
7167A53781N55J8843N575O10R562J0433O719j695o055J9520N2294P3634Q0283
7154D24059O6483M6554L3908M8058O4842M2986j5981o9251j01004r8504o4024
7143C78126l6453k376L5813O0030O7555N3360J8107k9531o4997p1304o8479p5235
7131B64616p2639n0540k2865J0252M3066O462o3329p4179n8336m9934m5947l3173
7119a46546K377O8161J18391Q4312J4495l682J0430J4230L2257N9603O1332L3772
7107C49132N545q075j6165m7847q1164n9009j9538r759l5968n7551r985N0065
$$ plain form
7095 59681 122915 171154 180606 137766 60084 -26731 -91271 -111344 -71953 23035 123145 181032
7083 181032 196180 202415 222770 251050 268333 263026 217797 137888 68061 56898 90136 103498
7071 103498 58319 -8023 -25885 36530 127680 167070 170978 167880 139687 100571 95325 121503
7059 121503 142489 127965 73618 11137 -19231 -14683 -13561 -46422 -101113 -130588 -114822 -69041
7047 -69041 -31318 -22713 -13298 34736 111441 176349 202648 198999 189364 193074 199875 184654 148243
7034 148243 113406 86237 64818 49255 53614 86511 111225 100967 65795 30292 8021 7601
7022 7601 19592 6001 -43180 -86581 -96285 -76966 -48807 -28337 -6991 30016 102211 237778
7010 237778 382099 447035 428984 387448 345315 295747 255718 246046 278790 338200 384150 404045
$$ packed form
7095E9681O3234M8239R452m2840p7682q6815o4540k0073L9391R4988J00110N7887
7083A81032J5148O235K0355K8280J7283n307m5229p9909o9827j1163L3238J3362
7071A03498m5179o6342j7862O2415R1150L9390L908l098k8193l9116n246K6178
7059A21503K0986j4524n4347o2481l0368M548J122l2861n4691k9475J5766M5781
7047f9041L7723Q605R415M8034P6705O4908K6299l649r635L710O801j5221l6411
7034A48243l4837k7169k1419j5563M359L2897K4714j0258l5172l5503k2271m20
7022G601J1991j3591m9181m3401r704J9319K8159K0470K1346L7007P2195J35567
7010B37778J44321O4936j8051m1536m2133m9568m0029r672L2744N9410M5950J9895
$$ plain form
6998 404045 396841 355856 300620 247617 215891 205228 185274 130199 61361 10748 -21347 -65684
6986 -65684 -140931 -227738 -277677 -218689 -57643 130136 281142 366182 366471 289627 202177 175962
6974 175962 199723 217157 206243 201991 245802 322729 374697 386662 402694 440862 467986 467544
6962 467544 463086 475000 484338 472538 477635 530887 598557 629116 619748 596896 569200 538986
6950 538986 532124 553849 573510 558114 522888 520582 575777 665450 749301 815494 896862 1003456
6938 1003456 1101914 1158576 1159341 1129861 1097059 1067521 1044594 1017190 989688 999064 1050373 1095256
6926 1095256 1116580 1140240 1170509 1215113 1321345 1506530 1731145 1951354 2136403 2298671
6916 2298671 2481400 2689503 2902999 3111205 3314349 3508460 3665676 3767114 3842645 3904785
$$ packed form
6998D04045p204m0985n5236n3003l1726j0663j9954n5075o8838n0613l2095m4337
6986f5684p5247q6807m9939N8988J61046J87779J51006Q5040K89p6844q7450k6215
6974A75962K3761J7434j0914m252M3811P6927N1968J1965J6032L8168K7124m42
6962D67544m458J1914R338j1800N097N3252O7670L0559r368k2852k7696l0214
6950E38986o862K1725J9661j5396l5226k306N5195Q9673Q3851O6193Q1368J06594
6938A003456R8458N6662P65k9480l2802k9538k2927k7404k7502R376N1309M4883
6926A095256K1324K3660L0269M4604J06232J85185K24615K20209J85049J62268
6916B298671J82729K08103K13496K08206K03144J94111J57216J01438P5531O2140
$$ plain form
6906 3904785 3926800 3895460 3830447 3765855 3734091 3739432 3718830 3616915 3447304 3288744 3207967
6895 3207967 3174748 3125178 3034916 2888488 2682351 2433712 2191626 1991038 1828491 1698072
6885 1698072 1589405 1462122 1297807 1141526 1031628 981983 1003526 1050867 1066705 1048372
6875 1048372 1027932 1002445 927693 809667 691294 588424 501640 463599 493936 557469 598956
6864 598956 578772 505032 430967 392742 389564 385077 352632 306195 289097 314783 351926 371845
6852 371845 369995 333902 270988 215347 184943 180827 213188 270894 305783 288416 233312 169035
6840 169035 108351 61711 36826 26298 24800 34261 62355 102717 132348 147185 139716 97810
6828 97810 25723 -46863 -73705 -51505 -28484 -35944 -64671 -86538 -103898 -131961 -159847 -171778
$$ packed form
6906C904785K2015l1340o5013o4592l1764N341k0602j01915j69611j58560q0777
6895C207967l3219m9570r0262j46428k06137k48639k42086k00588j62547j30419
6885A698072j08667j27283j64315j56281j09898m9645K1543M7341J5838j8333
6875A048372k0440k5487p4752j18026j18373j02870q6784l8041L0337O3533M1487
6864E98956k0184p3740p4065l8225l178m487l2445m6437j7098K5686L7143J9919
6852C71845j850l6093o2914n5641l0404m116L2361N7706L4889j7367n5104o4277
6840A69035o0684m6640k4885j0528j498R461K8094M0362K9631J4837p469m1906
6828I7810p2087p2586k6842K2200K3021p460k8727k1867j7360k8063k7886j1931
$$ plain form
6816 -171778 -167025 -157973 -155027 -162858 -176753 -183046 -166713 -151031 -143718 -119397 -71237 -22983 -16811
6803 -16811 -57415 -127367 -214760 -296143 -334711 -299874 -214497 -131012 -90598 -113939 -177573 -221695
6791 -221695 -217363 -186410 -164747 -156918 -132283 -84114 -39330 -6710 47135 137518 230078 296390
6779 296390 314127 279149 212539 127158 38163 -32189 -66564 -70626 -60327 -22680 67655 200226
6767 200226 323390 384176 377633 367998 406297 471195 518974 509039 432971 331343 245130 182764
6755 182764 141799 137115 176929 243425 292364 297507 285401 282310 283712 287101 300819 337873 405616
6742 405616 470315 486604 476661 493859 531512 575083 636019 724634 813407 859723 871769 862314
6730 862314 842934 882920 981761 1052331 1043999 944920 768557 583273 487041 542605 729614
$$ packed form
6816a71778M753R052K946p831j3895o293J6333J5682P313K4321M8160M8254O172
6803a6811m0604o9952q7393q1383l8568L4837Q5377Q3485M0414k3341o3634m4122
6791b21695M332L0953K1663P829K4635M8169M4784L2620N3845R0383R2560O6312
6779B96390J7737l4978o6610q5381q8995p0352l4375m062J0299L7647R0335J32571
6767B00226J23164O0786o543r635L8299O4898M7779r935p6068j01628q6213o2366
6755A82764m0965m684L9814O6496M8939N143j2106l091J402L389J3718L7054O7743
6742D05616O4699J6289r943J7198L7653M3571O0936Q8615Q8773M6316J2046r455
6730H62314j9380L9986R8841P0570q332r9079j76363j85284r6232N5564J87009
$$ plain form
6719 729614 945171 1103930 1199814 1266636 1327519 1387208 1465836 1586646 1742313 1920618 2129234
6708 2129234 2360014 2569069 2729772 2864988 3008417 3158867 3296919 3421618 3549927 3689108
6698 3689108 3823199 3948427 4100939 4329532 4644032 5013663 5415881 5849743 6313233 6794803
6688 6794803 7240254 7562421 7705335 7646601 7419143 7102961 6773755 6469913 6175794 5845553
6678 5845553 5448258 5011983 4612402 4306328 4108239 3992920 3892480 3756770 3590721 3408918
6668 3408918 3207216 2972718 2730565 2534341 2395313 2290109 2204828 2130346 2049449 1970891
6658 1970891 1925838 1921604 1932976 1918757 1866501 1807916 1772912 1792456 1875670 1980054 2059165
6647 2059165 2089656 2055584 1967710 1878211 1823594 1801376 1770863 1705480 1632100 1573123 1523205
$$ packed form
6719G29614K15557J58759R5884O6822O0883N9689P8628J20810J55667J78305K08616
6708B129234K30780K09055J60703J35216J43429J50450J38052J24699J28309J39181
6698C689108J34091J25228J52512K28593L14500L69631M02218M33862M63490M81570
6688F794803M45451L22167J42914n8734k27458l16182l29206l03842k94119l30241
6678E845553l97295m36275l99581l06074j98089j15319j00440j35710j66049j81803
6668C408918k01702k34498k42153j96224j39028j05204q5281p4482q0897p8558
6658A970891m5053m234J1372j4219n2256n8585l5004J9544Q3214J04384P9111
6647B059165L0491l4072q7874q9499n4617k2218l0513o5383p3380n8977m9918
$$ plain form
6636 1523205 1447515 1326945 1162388 987576 866078 838679 889602 957883 994939 997958 969236
6625 969236 921642 848493 742632 662061 661971 731183 812226 859621 865386 853913 871178 932165
6613 932165 996212 1013776 971593 891336 804673 736830 695591 674827 683790 716410 767752 841620
6601 841620 919672 975611 987113 963208 913769 832246 742789 694973 694247 712486 700785 626548
6589 626548 539655 508344 532590 566953 594117 621560 637931 634496 623200 614681 611430 600704
6577 600704 560974 481474 369048 252253 171399 136971 133321 166822 229061 269613 287134
6566 287134 318139 362160 417660 499851 602859 683540 705259 689598 680859 676763 656667 626885
6554 626885 587208 536991 468446 376364 294667 244635 221687 203253 182027 155218 133675 138540
$$ packed form
6636A523205p5690j20570j64557j74812j21498k7399N0923O8281L7056L019k8722
6625I69236m7594p3149j05861q0571r0O9212Q1043M7395N765j1473J7265O0987
6613I32165O4047J7564m2183q0257q6663o7843m1239k0764Q963L2620N1342P3868
6601H41620P8052N5939J1502k3905m9439q1523q9457m7816p26J8239j1701p4237
6589F26548q6893l1311K4246L4363K7164K7443J6371l435j1296q519l251j0726
6577F00704l9730p9500j12426j16795q0854l4428l650L3501O2239M0552J7521
6566B87134L1005M4021N5500Q2191J03008Q0681K1719j5661q739m096k0096k9782
6554F26885l9677n0217o8545r2082q1697n0032k2948j8434k1226k6809k1543M865
$$ plain form
6542 138540 149169 149537 139068 115401 58276 -31855 -104028 -149411 -175960 -161171 -122966 -111045
6530 -111045 -135349 -152668 -122198 -51094 57746 200925 334572 409648 421284 397511 361875
6519 361875 332780 320442 329238 347542 340084 318091 303794 250453 138908 41280 -4125 -4888
6507 -4888 31536 65220 51279 -1019 -68400 -135316 -179263 -190576 -178392 -165165 -158801 -158224 -174599
6494 -174599 -191920 -151474 -48838 51040 120118 165291 200018 240017 287330 320594 320980 294707
6482 294707 259252 237528 231439 207200 129390 -1193 -134717 -218639 -237984 -203208 -145560
6471 -145560 -113616 -133049 -182320 -181425 -64544 146985 348448 441511 438272 410085 386214 365189
6459 365189 332750 292086 287121 315313 330095 314834 261204 173607 70459 -23026 -68915 -42579
$$ packed form
6542A38540J0629L68j0469k3667n7125r0131p2173m5383k6549J4789L8205J1921
6530a11045k4304j7319L0470P1104J08840J43179J33647P5076J1636k3773l5636
6519C61875k9095j2338Q796J8304p458k1993j4297n3341j11545r7628m5405p63
6507d888L6424L3684j3941n2298o7381o6916m3947j1313J2184J3227O364N77j6375
6494a74599j7321M0446J02636R9878O9078M5173L4727L9999M7313L3264L86k6273
6482B94707l5455k1724o089k4239p7810j30583j33524q3922j9345L4776N7648
6471a45560L1944j9433m9271Q95J16881K11529K01463R3063l239k8187k3871k1025
6459C65189l2439m0664m965K8192J4782j5261n3630q7597j03148r3485m5889K6336
$$ plain form
6447 -42579 38719 131998 204032 253631 287045 307058 339437 415873 518961 592419 616233 605883
6435 605883 581389 541657 499160 489904 507179 513044 510456 530303 566583 587849 586588 557004
6423 557004 500396 468155 497217 575080 647555 629064 532893 457599 457974 536865 653131 723623
6411 723623 713186 656996 606419 580090 576740 587771 592259 556472 458406 342895 271428 245980
6399 245980 247809 275962 347408 460147 552944 594361 648212 762203 910837 1040935 1111916
6388 1111916 1120454 1099255 1075533 1077813 1110205 1144162 1176033 1209343 1235424 1259528 1288097 1298438
6376 1298438 1264766 1217513 1168592 1108098 1057822 1032793 1031715 1071739 1159027 1257455 1331681 1371932
6364 1371932 1373859 1348881 1340448 1370572 1417896 1465284 1520321 1586009 1662209 1766348 1890257
$$ packed form
6447d2579Q1298R3279P2034M9599L3414K0013L2379P6436J03088P3458K3814j0350
6435F05883k4494l9732m2497r256J7275N865k588J9847L6280K1266j261k9584
6423E57004n6608l2241K9062P7863P2475j8491r6171p5294L75P8891J16266P0492
6411G23623j0437n6190n0577k6329l350J1031M488l5787r8066j15511p1467k5448
6399B45980J829K8153P1446J12739R2797M1417N3851J13991J48634J30098P0981
6388A111916Q538k1199k3722K280L2392L3957L1871L3310K6081K4104K8569J0341
6376A298438l3672m7253m8921o0494n0276k5029j078M0024Q7288R8428P4226M0251
6364A371932J927k4978q433L0124M7324M7388N5037O5688P6200J04139J23909
$$ plain form
6353 1890257 1999066 2075850 2105494 2078907 2024706 1987568 1963300 1919493 1841723 1739932 1624294
6342 1624294 1523418 1496998 1538495 1590445 1611116 1598567 1594465 1624641 1661865 1673008 1677419 1710869
6330 1710869 1770742 1836170 1910290 2001253 2096114 2176087 2233457 2258805 2230738 2149990 2058109
6319 2058109 1980295 1940051 1949805 1976767 1993983 1992992 1990498 1999805 1983479 1939501 1927320 1969605
6307 1969605 2029476 2088072 2151526 2214159 2254442 2273275 2285862 2289296 2276344 2277800 2322294 2370727
6295 2370727 2364277 2310129 2270245 2280345 2306669 2290679 2247485 2241382 2287569 2377496 2478010 2523461
6283 2523461 2513486 2509026 2543605 2602314 2670950 2726522 2746021 2757538 2784446 2765487 2643553 2461286
6271 2461286 2296932 2187798 2121466 2076257 2040560 2012168 1991402 1974894 1979639 2018900 2092093
$$ packed form
6353A890257J08809P6784K9644k6587n4201l7138k4268m3807p7770j01791j15638
6342A624294j00876k6420M1497N1950K0671j2549m102L0176L7224J1143M411L3450
6330A710869N9873O5428P4120R0963R4861P9973N7370K5348k8067q0748r1881
6319B058109p7814m0244R754K6962J7216r91k494R307j6326m3978j2181M2285
6307A969605N9871N8596O3454O2633M0283J8833J2587L434j2952J456M4494M8433
6295B370727o450n4148l9884J0100K6324j5990m3194o103M6187Q9927J00514M5451
6283B523461r975m460L4579N8709O8636N5572J9499J1517K6908j8959j21934j82267
6271B461286j64354j09134o6332m5209l5697k8392k0766j6508M745L9261P3193
$$ plain form
6260 2092093 2182244 2267177 2363008 2463210 2512878 2475273 2355017 2190918 2036636 1920046
6250 1920046 1856274 1832136 1810203 1770704 1711524 1652204 1602262 1535154 1431812 1315412 1221305
6239 1221305 1172272 1177618 1178867 1118190 1038269 1002323 997901 960711 883981 830160 829364 859171
6227 859171 871065 854135 825864 771058 703060 647811 609880 573939 538433 542821 573226 582524
6215 582524 579605 592086 620970 645506 649310 628653 613759 620282 610514 567227 534688 536657 555443
6202 555443 574987 580604 560959 525337 512906 549597 629003 706483 746627 768585 808194 883699
6190 883699 964499 1005573 993156 930015 867315 861727 911050 998853 1085775 1127526 1128633 1098915
6178 1098915 1029492 953933 931051 967280 1021329 1057040 1079247 1115852 1167307 1190375 1172800
$$ packed form
6260B092093R0151Q4933R5831J00202M9668l7605j20256j64099j54282j16590
6250A920046o3772k4138k1933l9499n9180n9320m9942o7108j03342j16400r4107
6239A221305m9033N346J249o0677p9921l5946m422l7190p6730n3821p96K9807
6227H59171J1894j6930k8271n4806o7998n5249l7931l5941l5506M388L0405R298
6215E82524k919J2481K8884K4536L804k0657j4894O523r768m3287l2539J969J8786
6202E55443J9544N617j9645l5622j2431L6691P9406P7480M0144K1958L9609P5505
6190H83699Q0800M1074j2417o3141o2700n588M9323Q7803Q6922M1751J107k9718
6178A098915o9423p5559k2882L6229N4049L5711K2207L6605N1455K3068j7575
$$ plain form
6167 1172800 1157958 1152410 1120988 1054223 960244 861110 779302 706574 637983 620481 688037 818797
6155 818797 964995 1085250 1193394 1340799 1499873 1591663 1595465 1526866 1422564 1317603
6145 1317603 1229180 1166768 1143897 1177264 1255502 1360792 1464225 1522614 1529930 1504097 1442936
6134 1442936 1366569 1292443 1190792 1078166 990538 930536 898485 901893 909384 874831 794718
6123 794718 700233 631954 608378 620177 661008 744261 873928 1015908 1127879 1212992 1293668
6112 1293668 1357750 1382133 1371265 1325889 1264223 1178950 1046134 925942 875765 864911 835844
6101 835844 771472 700079 654844 641189 644492 626931 530507 362903 179697 13838 -112655
6090 -112655 -175800 -181975 -161773 -142393 -128487 -95000 -49870 -13711 8174 28633 49918 52138
$$ packed form
6167A172800j4842n548l1422o6765r3979r9134q1808p2728o8591j7502O7556J30760
6155H18797J46198J20255J08144J47405J59074R1790L802o8599j04302j04961
6145A317603q8423o2412k2871L3367P8238J05290J03433N8389P316k5833o1161
6134A442936p6367p4126j01651j12626q7628o0002l2051L408P491l4553q0113
6123G94718r4485o8279k3576J1799M0831Q3253J29667J41980J11971Q5113Q0676
6112A293668O4082K4383j0868m5376o1666q5273j32816j20192n0177j0854k9067
6101H35844o4372p1393m5235j3655L303j7561r6424j67604j83206j65859j26493
6090a12655o3145o175K0202J9380J3906L3487M5130L6159K1885K0459K1285K220
$$ plain form
6078 52138 37866 36700 46725 49248 36647 17808 13614 57807 151246 251846 327403 351580
6066 351580 319223 275473 264576 283647 294313 271209 229037 191057 152451 112240 98197 117852
6054 117852 130454 119441 114197 134797 160356 160150 130284 69467 5647 -15088 7787 47893
6042 47893 90494 141497 228925 320918 357366 361269 373816 375816 345580 296828 261914 250289
6030 250289 223378 168577 119699 102896 117989 143272 175922 220291 266667 316052 377541 441318
6018 441318 499270 556042 593329 574208 509412 441375 389746 389466 467224 580363 659121 702699
6006 702699 755247 823100 901644 980900 1034398 1056708 1069027 1079843 1075630 1035320 952148 857683
5994 857683 807607 809176 827805 831070 784363 684711 568405 475225 419283 382218 336893 293823
$$ packed form
6078E2138j4272j166J0025K523j2601j8839m194M4193R3439J00600P5557K4177
6066C51580l2357m3750j0897J9071J0666k3104m2172l7980l8606m0211j4043J9655
6054A17852J2602j1013n244K0600K5559k06k9866o0817o3820k0735K2875M0106
6042D7893M2601N1003Q7428R1993L6448L903J2547K000l0236m8752l4914j1625
6030B50289k6911n4801m8878j6803J5093K5283L2650M4369M6376M9385O1489O3777
6018D41318N7952N6772L7287j9121o4796o8037n1629k80P7758J13139P8758M3578
6006G02699N2548O7853P8544P9256N3498K2310J2319J0816m213m0310q3172r4465
5994H57683n0076J569J8629L265m6707r9652j16306r3180n5942l7065m5325m3070
$$ plain form
5982 293823 282616 294254 305417 329257 370004 401432 414106 415207 393710 326537 226055 146083
5970 146083 112474 112142 113317 107241 110735 115895 115658 124863 134486 111460 29038 -99694 -217337
5957 -217337 -274464 -271511 -251920 -236844 -216109 -185992 -139922 -95483 -83045 -85886 -84086 -102125
5945 -102125 -163939 -246345 -316762 -365695 -394023 -396406 -357474 -281442 -200617 -131092 -54199 25405
5933 25405 90125 152762 217563 279471 341802 404845 435206 428342 423049 427093 422817 402652 366338
5920 366338 312791 255579 204392 164077 133603 83609 13502 -37457 -27694 76545 228002
5909 228002 326313 336216 296423 262200 249128 255410 282341 289447 243494 168659 84137 3750
5897 3750 -62974 -116751 -157498 -189419 -201801 -188909 -162678 -139184 -123541 -108421 -106110 -130104
$$ packed form
5982B93823j1207J1638J1163K3840M0747L1428J2674J101k1497o7173j00482p9972
5970A46083l3609l32J175o076L494N160k37R205R623k3026q2422j28732j17643
5957b17337n7127K953J9591J5076K0735L0117M6070M4439J2438k841J800j8039
5945a02125o1814q2406p0417m8933k8328k383L8932P6032Q0825O9525P6893P9604
5933B5405O4720O2637O4801O1908O2331O3043L0361o864n293M044m276k0165l6314
5920C66338n3547n7212n1187m0315l0474m9994p0107n0959R763J04239J51457
5909B28002R8311R903l9793l4223j3072O282K6931P106m5953p4835q4522q0387
5897C750o6724n3777m0747l1921j2382J2892K6231K3494J5643J5120K311k3994
$$ plain form
5885 -130104 -187793 -277688 -370717 -422657 -400839 -294978 -141079 -23140 5497 -37581 -119252
5874 -119252 -194949 -212902 -172885 -120790 -89607 -76688 -51756 10382 101583 189900 231380 174807
5862 174807 43565 -72649 -133811 -172373 -204753 -209712 -184742 -159836 -163668 -204663 -273593 -349706
5850 -349706 -408601 -438857 -439208 -412301 -381663 -371224 -388629 -403737 -401918 -432378 -512702 -592594
5838 -592594 -630970 -621840 -594925 -587237 -607987 -652247 -711332 -750227 -722992 -618812 -463666 -316850
5826 -316850 -235897 -207540 -184298 -140752 -87638 -52703 -45752 -58990 -83637 -119333 -165799 -220531
5814 -220531 -292152 -357399 -361935 -311721 -255742 -205434 -140152 -82574 -70810 -88696 -113412 -144037
5802 -144037 -162111 -146981 -127346 -123527 -116860 -101989 -102294 -88746 -23489 56799 104098 122733
$$ packed form
5885a30104n7689q9895r3029n1940K1818J05861J53899J17939K8637m3078q1671
5874a19252p5697j7953M0017N2095L1183J2919K4932O2138R1201Q8317M1480n6573
5862A74807j31242j16214o1162l8562l2380m959K4970K4906l832m0995o8930p6113
5850c49706n8895l0256l51K6907L0638J0439j7405j5108J819l0460q0324p9892
5838e92594l8376R130K6915P688k0750m4260n9085l8895K7235J04180J55146J46816
5826c16850Q0953K8357K3242M3546N3114L4935O951j3238k4647l5696m6466n4732
5814b20531p1621o5247m536N0214N5979N0308O5282N7578J1764j7886k4716l0625
5802a44037j8074J5130J9635L819O667J4871l05J3548O5257Q0288M7299J8635
$$ plain form
5790 122733 142838 156494 155018 154254 126206 41086 -65587 -148106 -188219 -190363 -206172 -257261
5778 -257261 -304026 -337524 -342690 -269785 -126006 23736 135727 207386 236382 223055 193028
5767 193028 150736 87735 -5551 -127870 -239298 -296323 -298508 -292205 -318275 -366612 -417195 -453633
5755 -453633 -462518 -441256 -399196 -373749 -355691 -315484 -261165 -196181 -152486 -153160 -186369 -247344
5743 -247344 -316482 -361627 -369001 -334388 -251518 -135171 -17723 77095 132534 139861 97532 10587
5731 10587 -94220 -177817 -223762 -247696 -262024 -246699 -200526 -148580 -105880 -72854 -62228 -69696
5719 -69696 -58393 -24061 6032 -7384 -79265 -173862 -250402 -299937 -340300 -401349 -465176 -486901
5707 -486901 -470976 -434255 -352344 -228699 -136644 -115944 -112589 -92386 -84316 -92697 -105138 -131975
$$ packed form
5790A22733K0105J3656j476p64k8048q5120j06673q2519m0113k144j5809n1089
5778b57261m6765l3498n166P2905J43779J49742J11991P1659K8996j3327l0027
5767A93028m2292o3001r3286j22319j11428n7025k185O303k6070m8337n0583l6438
5755d53633q885K1262M2060K5447J8058M0207N4319O4984M3695o74l3209o0975
5743b47344o9138m5145p374L4613Q2870J16347J17448R4818N5439P327m2329q6945
5731A0587j04807q3597m5945k3934j4328J5325M6173N1946M2700L3026J0626p468
5719f9696J1303L4332L0093j3416p1881r4597p6540m9535m0363o1049o3827k1725
5707d86901J5925L6721Q1911J23645R2055K0700L355K0203Q070q381j2441k6837
$$ plain form
5695 -131975 -167879 -197921 -219038 -227974 -230681 -239662 -263249 -273255 -239999 -173706 -113384 -91271
5683 -91271 -102729 -126548 -124484 -60384 61070 185520 240267 227795 190168 131381 74758 56780
5671 56780 67991 52164 -13582 -65306 -54082 -883 50750 82133 86050 59249 4589 -70021
5659 -70021 -145240 -209798 -257575 -291001 -303641 -281817 -238433 -198632 -171803 -159137 -159751 -177796
5647 -177796 -206963 -240106 -279226 -311072 -324071 -326268 -311706 -262465 -180819 -105099 -82014 -112997
5635 -112997 -166376 -219425 -264962 -299836 -300718 -278329 -297359 -376102 -455734 -484386 -448044 -359919
5623 -359919 -247485 -160875 -139267 -154395 -157658 -155454 -181577 -229873 -283254 -320483 -337468 -351064
5611 -351064 -380098 -394408 -347558 -261521 -176228 -117537 -97869 -110264 -120060 -99381 -63012 -23190
$$ packed form
5695a31975l5904l0042k1117q936k707q981k3587j0006L3256O6293O0322K2113
5683i1271j1458k3819K064O4100J21454J24450N4747j2472l7627n8787n6623j7978
5671E6780J1211j5827o5746n1724J1224N3199N1633L1383L917k6801n4660p4610
5659g0021p5219o4558m7777l3426j2640K1824M3384L9801K6829J2666o14j8045
5647a77796k9167l3143l9120l1846j2999k197J4562M9241Q1646P5720K3085l0983
5635a12997n3379n3049m5537l4874q82K2389j9030p8743p9632k8652L6342Q8125
5623c59919J12434Q6610K1608j5128l263K204k6123m8296n3381l7229j6985j3596
5611c51064k9034j4310M6850Q6037Q5293N8691J9668j2395r796K0679L6369L9822
$$ plain form
5599 -23190 22096 68141 117909 154698 144609 86335 19467 -17263 -21161 -9745 -6344 -42620
5587 -42620 -126597 -230763 -326268 -381798 -380125 -346899 -334112 -361681 -408931 -472329 -539597 -578043
5575 -578043 -578831 -537538 -469816 -414391 -393593 -382203 -353381 -306874 -234866 -154583 -112712 -116241
5563 -116241 -138989 -174459 -206125 -195217 -151086 -117618 -86029 -22019 58404 112239 125714 128072
5551 128072 148271 171529 165486 89238 -24811 -78932 -64813 -30908 4420 22353 5324 -33679
5539 -33679 -90995 -143576 -138646 -82882 -8355 65221 115836 101893 -17068 -208795 -395490
5528 -395490 -523657 -578965 -581970 -534545 -423103 -280025 -171398 -137602 -167524 -217542 -261619
5517 -261619 -282937 -276141 -264895 -259894 -246452 -210670 -148471 -87825 -51170 -34849 -24131 -11213
$$ packed form
5599b3190M5286M6045M9768L6789j0089n8274o6868l6730l898J1416L401l6276
5587d2620q3977j04166r5505n5530J673L3226J2787k7569m7250o3398o7268l8446
5575e78043p88M1293O7722N5425K0798J1390K8822M6507P2008Q0283M1871l529
5563a16241k2748l5470l1666J0908M4131L3468L1589O4010Q0423N3835J3475K358
5551A28072K0199K3258o043p6248j14049n4121J4119L3905L5328J7933j7029l9003
5539c3679n7316n2581M930N5764P4527P3576N0615j3943j18961j91727j86695
5528c95490j28167n5308l005M7425J11442J43078J08627L3796k9922n0018m4077
5517b61619k1318O796J1246N001J3442L5782O2199O0646L6655J6321J0718J2918
$$ plain form
5505 -11213 -11643 -28269 -47633 -50179 -24618 -10005 -69072 -180338 -256122 -263021 -253736 -272514 -316122
5492 -316122 -378254 -442532 -479553 -475548 -437565 -396948 -388720 -403142 -408843 -391093 -360655 -321718
5480 -321718 -253826 -174545 -132916 -145358 -191158 -241370 -285464 -316668 -292700 -177960 -20903
5469 -20903 96434 145494 155628 137802 54988 -64242 -144459 -172683 -196397 -240388 -274036
5458 -274036 -271245 -261755 -272160 -305238 -351606 -392948 -405511 -378350 -318959 -242775 -166062 -111697
5446 -111697 -91307 -86520 -84424 -86777 -70853 -5707 87974 168050 208216 200209 157694 117188
5434 117188 78020 27526 -6233 -8772 8874 14984 -1567 -21222 -32539 -48263 -67253 -75285
5422 -75285 -88367 -113064 -147827 -179608 -197902 -216758 -230520 -237851 -239002 -213681 -153009 -87484
$$ packed form
5505a1213m30j6626j9364k546K5561J4613n9067j11266p5784o899R285j8778m3608
5492c16122o2132o4278l7021M005L7983M0617Q228j4422n701J7750L0438L8937
5480c21718O7892P9281M1629j2442m5800n0212m4094l1204K3968J14740J57057
5469b0903J17337M9060J0134j7826q2814j19230q0217k8224k3714m3991l3648
5458b74036K791R490j0405l3078m6368m1342j2563K7161N9391P6184P6713N4365
5446a11697K0390M787K096k353J5924O5146R3681Q0076M0166q007m2515m0506
5434A17188l9168n0494l3759k539J7646O110j6551j9655j1317j5724j8990q032
5422g5285j3082k4697l4763l1781j8294j8856j3762p331j151K5321O0672O5525
$$ plain form
5410 -87484 -64220 -79821 -78083 -32934 3297 -2659 -17960 -35722 -74167 -120685 -162271 -205201
5398 -205201 -241046 -267320 -282031 -290596 -319107 -352537 -353707 -336166 -335154 -354374 -380835 -404624
5386 -404624 -414392 -374657 -278001 -182077 -122080 -107929 -131799 -151638 -157235 -157142 -144738 -123712 -115969
5373 -115969 -116280 -131593 -154213 -139669 -85957 -44115 -30423 1979 43790 44528 21812 11289
5361 11289 -674 -40830 -99285 -137651 -124444 -71630 -17696 21899 36746 20267 995 10033
5349 10033 30281 32620 8501 -33483 -59447 -47517 -8319 41354 110602 179683 178042 107956
5337 107956 41268 27020 53039 68924 75767 101324 125258 118817 86473 54203 18808 -13805
5325 -13805 -14266 9529 -5400 -84826 -199020 -309375 -393932 -470132 -522698 -511560 -461475 -442223
$$ packed form
5410h7484K3264j5601J738M5149L6231n956j5301j7762l8445m6518m1586m2930
5398b05201l5845k6274j4711q565k8511l3430j170J7541J012j9220k6461k3789
5386d04624r768L9735R6656R5924N9997J4151k3870j9839n597R3J2404K1026P743
5373a15969l11j5313k2620J4544N3712M1842J3692L2402M1811P38k2716j0523
5361A1289j1963m0156n8455l8366J3207N2814N3934L9595J4847j6479j9272R038
5349A0033K0248K339k4119m1984k5964J1930L9198M9673O9248O9081j641p0086
5337A07956o6688j4248K6019J5885O843K5557K3934o441l2344l2270l5395l2613
5325a3805m61K3795j4929p9426j14194j10355q4557p6200n2566J1138N0085J9252
$$ plain form
5313 -442223 -467230 -493901 -499822 -509442 -554247 -592710 -534770 -376194 -195788 -65116 16069
5302 16069 77477 106125 98034 76202 54055 36914 37457 72541 116650 129754 104165 54293
5290 54293 20746 17297 25368 47621 81971 87375 52164 -793 -42912 -34519 25586 98314 148570
5277 148570 158747 150002 173709 219170 213292 150833 89323 47415 25758 30311 45648 36059
5265 36059 -18043 -101811 -187004 -246627 -249735 -213663 -189168 -200546 -256190 -325103 -374830 -385804
5253 -385804 -362033 -346358 -345786 -331087 -293537 -274567 -309196 -367168 -401410 -400322 -377707 -354749
5241 -354749 -340389 -326954 -323676 -336997 -340609 -323437 -311661 -328326 -373478 -421094 -445751 -449964
5229 -449964 -452963 -459564 -474086 -500640 -513312 -499621 -488150 -501153 -516589 -511505 -493627 -465409
$$ packed form
5313d42223k5007k6671n921r620m4805l8463N7940J58576J80406J30672Q1185
5302A6069O1408K8648q091k1832k2147j7141N43L5084M4109J3104k5589m9872
5290E4293l3547l449Q071K2253L4350N404l5211n2957m2119Q393O0105P2728N0256
5277A48570J0177q745K3707M5461n878o2459o1510m1908k1657M553J5337r589
5265C6059n4102q3768q5193n9623l108L6072K4495j1378n5644o8913m9727j0974
5253c85804K3771J5675N72J4699L7550J8970l4629n7972l4242J088K2615K2958
5241c54749J4360J3435L278j3321l612J7172J1776j6665m5152m7616k4657m213
5229d49964k999o601j4522k6554j2672J3691J1471j3003j5436N084J7878K8218
$$ plain form
5217 -465409 -434053 -418012 -398657 -348676 -299433 -267773 -238890 -216829 -215027 -234607 -256234 -265529
5205 -265529 -272564 -304297 -364265 -423985 -456026 -425022 -350850 -301131 -303733 -342435 -362196 -331143
5193 -331143 -263803 -175100 -83367 -20307 -6075 -38992 -93627 -140903 -178669 -220518 -261678 -287121
5181 -287121 -304997 -322664 -311876 -274015 -250852 -270740 -316750 -352823 -351308 -314866 -285291 -274862
5169 -274862 -267006 -257747 -255263 -274121 -318467 -366775 -368743 -326792 -289202 -269399 -278653 -340886 -441302
5156 -441302 -524682 -562668 -552152 -503650 -457424 -431252 -400395 -346435 -289221 -219060 -104684
5145 -104684 15456 68735 47502 4399 -26634 -11369 68308 146014 157930 113899 68364
5134 68364 55367 51773 53639 74069 89211 79016 43318 2422 -45415 -137843 -256221 -332421
$$ packed form
5217d65409L1356J6041J9355M9981M9243L1660K8883K2061J802j9580k1627r295
5205b65529p035l1733n9968n9720l2041L1004P4172M9719k602l8702j9761L1053
5193c31143O7340Q8703R1733O3060J4232l2917n4635m7276l7766m1849m1160k5443
5181b87121j7876j7667J0788L7861K3163j9888m6010l6073J515L6442K9575J0429
5169b74862P856R259K484j8858m4346m8308j968M1951L7590J9803r254o2233j00416
5156d41302q3380l7986J0516M8502M6226K6172L0857N3960N7214P0161J14376
5145a04684J20140N3279k1233m3103l1033J5265P9677P7706J1916m4031m5535
5134F8364j2997l594J866K0430J5142j0195l5698m0896m7837r2428j18378p6200
$$ plain form
5122 -332421 -353771 -327662 -262604 -180550 -89312 -11053 24933 40922 56915 51156 9052 -31496
5110 -31496 -24888 19682 55057 48340 12717 4356 57472 122016 141200 108907 41723 -34090
5098 -34090 -96155 -139895 -184496 -215766 -224955 -246886 -290213 -335884 -361528 -370099 -368920 -346627
5086 -346627 -298292 -236030 -170653 -107462 -52537 -10512 -5508 -64146 -178264 -312961 -417807
5075 -417807 -438617 -379439 -303324 -259836 -286392 -392787 -534640 -642854 -663869 -597598 -508529
5064 -508529 -447386 -415939 -399027 -400651 -411858 -413730 -403865 -363619 -271255 -162814 -105204 -119618
5052 -119618 -169912 -218925 -262620 -293793 -307043 -310335 -305355 -284949 -255171 -212350 -125885 -28034
5040 -28034 29228 56235 71245 82002 82611 39079 -41264 -114697 -166699 -201440 -217647 -205926
$$ packed form
5122c32421k1350K6109O5058Q2054R1238P8259L5986J5989J5993n759m2104m0548
5110c1496O608M4570L5375o717l5623q361N3116O4544J9184l2293o7184p5813
5098c4090o2065m3740m4601l1270r189k1931m3327m5671k5644q571J179K2293
5086c46627M8335O2262O5377O3191N4925M2025N004n8638j14118j34697j04846
5075d17807k0810N9178P6115M3488k6556j06395j41853j08214k1015O6271Q9069
5064e08529O1143L1447J6912j624j1207j872R865M0246R2364J08441N7610j4414
5052a19618n0294m9013m3695l1173j3250l292M980K0406K9778M2821Q6465R7851
5040b8034N7262K7007J5010J0757O09m3532q0343p3433n2002l4741j6207J1721
$$ plain form
5028 -205926 -153740 -96082 -70841 -49111 -12182 40552 90655 94779 42467 -14569 -24124 -1851
5016 -1851 8069 -5730 -42448 -104294 -180175 -248932 -276009 -238859 -149095 -55318 -6999 -26704
5004 -26704 -111532 -202183 -228445 -178220 -88717 -13777 12809 -1408 -29124 -66973 -116372 -177019
4992 -177019 -244130 -297404 -315448 -305493 -285977 -286021 -331207 -374994 -340659 -209279 -26375 154490
4980 154490 300462 389377 442294 494172 537073 546861 542920 571245 658895 846656 1125848
4969 1125848 1412772 1664688 1930139 2234794 2444963 2404156 2115666 1716020 1329258 1012638
4959 1012638 791453 637358 504910 382317 284369 230454 235065 286118 324646 299062 214386
4948 214386 131808 99531 107912 123398 114479 83971 42828 -7207 -59371 -108541 -141289 -158106
$$ packed form
5028b05926N2186N7658K5241K1730L6929N2734N0103M124n2312n7036r555K2273
5016a851R920j3799l6718o1846p5881o8757k7077L7150Q9764R3777M8319j9705
5004b6704q4828r0651k6262N0225Q9503P4940K6586j4217k7716l7849m9399o0647
4992a77019o7111n3274j8044R955J9516m4m5186m3787L4335J31380J82904J80865
4980A54490J45972Q8915N2917N1878M2901R788l941K8325Q7650J87761K79192
4969A125848K86924K51916K65451L04655K10169m0807k88490l99646l86762l16620
4959A012638k21185j54095j32448j22593r7948n3915M611N1053L8528k5584q4676
4948B14386q2578l2277Q381J5486q919l0508m1143n0035n2164m9170l2748j6817
$$ plain form
4936 -158106 -159245 -116204 -10616 95621 151293 194309 263372 336985 373682 363956 311837 229003
4924 229003 148176 95281 69259 60561 44123 18321 14279 28022 25696 -855 -42227 -81593
4912 -81593 -103165 -105390 -104768 -116107 -145276 -189894 -219928 -220580 -212048 -197687 -190790 -213368 -218632
4899 -218632 -163436 -80597 91 65454 98297 86367 22505 -83588 -197854 -294589 -344173
4888 -344173 -321419 -242207 -164732 -138415 -153273 -177942 -198648 -216299 -221910 -217550 -210065 -200572
4876 -200572 -191492 -175040 -176520 -229478 -292375 -306788 -251677 -166116 -124808 -134311 -177847 -254068
4864 -254068 -340969 -415228 -471021 -508908 -532693 -540719 -548617 -596413 -646513 -631581 -553046 -442877
4852 -442877 -364238 -373483 -432262 -454213 -416962 -367094 -312184 -244505 -218772 -270887 -363610 -447103
$$ packed form
4936a58106j139M3041J05588J06237N5672M3016O9063P3613L6697r726n2119q2834
4924B29003q0827n2895k6022q698j6438k5802m042J3743k326k6551m1372l9366
4912h1593k1572k225O22j1339k9169m4618l0034o52Q532J4361O897k2578n264
4899b18632N5196Q2839Q0688O5363L2843j1930o3862j06093j14266r6735m9584
4888c44173K2754P9212P7475K6317j4858k4669k0706j7651n611M360P485R493
4876b00572R080J6452j480n2958o2897j4413N5111Q5561M1308r503m3536p6221
4864b54068q6901p4259n5793l7887k3785q026p898m7796n0100J4932P8535J10169
4852d42877P8639r245n8779k1951L7251M9868N4910O7679K5733n2115r2723q3493
$$ plain form
4840 -447103 -490735 -507904 -524338 -517392 -463207 -374568 -275860 -194435 -147275 -124507 -124048 -164156
4828 -164156 -223251 -265632 -305482 -332840 -312582 -245582 -173906 -144552 -156189 -165453 -171076 -195074
4816 -195074 -198891 -142118 -58210 7941 47792 77331 127627 192150 234997 234022 187241 101438
4804 101438 -405 -84023 -137232 -159071 -127609 -38649 48141 59057 -19318 -153462 -283153
4793 -283153 -372292 -433131 -461853 -457927 -426445 -379406 -333378 -283568 -219786 -167997 -155715 -170691
4781 -170691 -191012 -208356 -222053 -241762 -269580 -294343 -317159 -356494 -401240 -411010 -385721 -343043
4769 -343043 -293937 -264609 -298085 -384585 -446160 -414743 -304432 -193288 -131150 -127617 -155552
4758 -155552 -186420 -212132 -221800 -201989 -156103 -113243 -91265 -113068 -165694 -187509 -160705 -118022
$$ packed form
4840d47103m3632j7169j6434O946N4185Q8639R8708Q1425M7160K2768M59m0108
4828a64156n9095m2381l9850k7358K0258O7000P1676K9354j1637r264n623k3998
4816a95074l817N6773Q3908O6151L9851K9539N0296O4523M2847r75m6781q5803
4804A01438j01843q3618n3209k1839L1462Q8960Q6790J0916p8375j34144j29691
4793b83153q9139o0839k8722L926L1482M7039M6028M9810O3782N1789J2282j4976
4781a70691k0321j7344j3697j9709k7818k4763k2816l9335m4746r770K5289M2678
4769c43043M9106K9328l3476q6500o1575L1417J10311J11144O2138L533k7935
4758a55552l0868k5712r668J9811M5886M2860K1978k1803n2626k1815K6804M2683
$$ plain form
4746 -118022 -95589 -110658 -127322 -84587 21715 152495 262962 308778 295402 260292 211053
4735 211053 152092 91258 8435 -98673 -206714 -288967 -335190 -354075 -344893 -320953 -298915
4724 -298915 -303639 -351436 -411748 -455980 -467827 -431601 -357613 -279938 -226930 -212451 -246314 -321294
4712 -321294 -398018 -434838 -427505 -415496 -422881 -430154 -414870 -394897 -394120 -412583 -449334 -490018 -523090
4699 -523090 -519813 -474617 -421964 -378952 -349008 -332652 -326648 -336517 -364993 -395039 -409670 -383642
4687 -383642 -331250 -304969 -315278 -351985 -392688 -414391 -403292 -353685 -284531 -250843 -274276 -288178
4675 -288178 -250198 -211306 -190154 -168101 -177450 -224853 -238493 -174361 -61088 51378 116569
4664 116569 107519 48896 15746 52369 128458 193141 214576 197295 178749 180729 188920 154607
$$ packed form
4746a18022K2433j5069j6664M2735J06302J30780J10467M5816j3376l5110m9239
4735B11053n8961o0834q2823j07108j08041q2253m6223j8885R182K3940K2038
4724b98915m724m7797o0312m4232j1847L6226P3988P7675N3008J4479l3863p4980
4712c21294p6724l6820P333J2009p385p273J5284J9973P77j8463l6751m0684l3072
4699e23090L277M5196N2653M3012K9944J6356O004r869k8476l0046j4631K6028
4687c83642N2392K6281j0309l6707m0703k1703J1099M9607O9154L3688k3433j3902
4675b88178L7980L8892K1152K2053r349m7403j3640O4132J13273J12466O5191
4664A16569r050n8623l3150L6623P6089O4683K1435j7281j8546J980Q191l4313
$$ plain form
4652 154607 79418 4733 -63120 -105924 -111096 -101744 -85197 -57260 -23808 7655 31259 33705
4640 33705 14575 6626 11583 -7541 -47472 -57027 -11529 74769 171294 233021 247019 218442
4628 218442 137974 34042 -55966 -120291 -158075 -186412 -233288 -287741 -322817 -349763 -354929 -324158
4616 -324158 -264320 -193666 -132682 -81502 -44648 -16917 11884 18758 -11887 -69439 -134494 -189681
4604 -189681 -210596 -174486 -92949 19621 138624 215093 229794 196632 141123 73371 9360
4593 9360 -16070 -10806 2967 16163 14945 3827 2522 22725 76263 134691 142186 107927 94212
4580 94212 113480 127833 114360 82204 35460 -26187 -73081 -90715 -92904 -93807 -105621 -128403
$$ packed form
4652A54607p5189p4685o7853m2804n172R352J6547K7937L3452L1463K3604K446
4640C3705j9130p949M957j9124l9931r555M5498Q6298R6525O1727J3998k8577
4628B18442q0468j03932r0008o4325l7784k8337m6876n4453l5076k6946n166L0771
4616c24158N9838P0654O0984N1180L6854K7731K8801O874l0645n7552o5055n5187
4604a89681k0915L6110Q1537J12570J19003P6469J4701l3162n5509o7752o4011
4593I360k5430N264J3773J3196j218j1118j305K0203N3538N8428P495l4259j3715
4580I4212J9268J4353j3473l2156m6744o1647m6894j7634k189r03j1814k2782
$$ [...]
##END NTUPLES=NMR SPECTRUM
##END=
