##TITLE=C13_SR163_k_TFA
 DMSO-d6, 17468 sc

 15.1.2023
##JCAMPDX= 6.0         $$ Bruker NMR JCAMP-DX V2.0
##DATA TYPE= NMR SPECTRUM
##DATA CLASS= NTUPLES
##ORIGIN= UXNMR, Bruker Analytische Messtechnik GmbH
##OWNER= root
$$ XWIN-NMR		Version 3.5
$$ Thu Feb 16 13:44:30 2023 Russian Standard Time (UT+4h)  she@DPX200
##.OBSERVE FREQUENCY= 50.327896
##.OBSERVE NUCLEUS= ^13C
##.ACQUISITION MODE= SIMULTANEOUS
##.ACQUISITION SCHEME= undefined
##.AVERAGES= 17468
##.DIGITISER RES= 17
##SPECTROMETER/DATA SYSTEM= spect
##.PULSE SEQUENCE= zgpg30
##.SOLVENT NAME= CDCl3
##.SHIFT REFERENCE= (INTERNAL, CDCl3, 0, 222.653)
##AUDIT TRAIL= $$ (NUMBER, WHEN, WHO, WHERE, WHAT)
$$ ##TITLE= Audit trail, XWIN-NMR		Version 3.5
$$ ##JCAMPDX= 5.01
$$ ##ORIGIN= Bruker BioSpin GmbH
$$ ##OWNER= she
$$ F:/spectra/data/she/nmr/c13/1/pdata/1/auditp.txt
$$ ##AUDIT TRAIL=  $$ (NUMBER, WHEN, WHO, WHERE, WHAT)
(   1,<2023-02-16 09:11:52.92 +0400>,<she>,<DPX200>,
      <created by zg, POWCHK disabled, PULCHK disabled
       terminated by command 'halt'
       configuration hash MD5:
       00 E9 B6 7A A2 85 ED C7 34 08 36 98 17 FE 4E 26
       data hash MD5: 32K
       45 88 EF 98 32 7F AA AB 37 89 AF 58 CC B1 A7 23>)
(   2,<2023-02-16 13:41:21.81 +0400>,<she>,<DPX200>,
      <Start of raw data processing
       efp BC_mod = 2 LB = 2 FT_mod = 6 PKNL = 1 PHC0 = -302.7392 PHC1 = 12.38446 SI = 32K 
       data hash MD5: 32K
       37 7A 04 99 47 EA 19 BB F2 4E A0 B8 32 14 70 FB>)
(   3,<2023-02-16 13:41:45.39 +0400>,<she>,<DPX200>,
      <pk PHC0 = -18.26649 PHC1 = 18.2 
       data hash MD5: 32K
       91 18 D2 79 CC B8 2F D1 BB CB 55 1E 65 5B A9 42>)
(   4,<2023-02-16 13:41:50.84 +0400>,<she>,<DPX200>,
      <abs ABSG = 5 
       data hash MD5: 32K
       14 54 69 B5 59 57 3E 0F 4A FF 94 4C BF 00 D2 2D>)
$$ ##END=
$$ 
$$ hash MD5
$$ 76 60 0A 16 83 35 56 01 70 AE A3 11 CA ED 7E 92
##$RELAX= 
##$RELAX= 
##$RELAX= 
##$RELAX= 
##$RELAX= 
##$RELAX= 
##$RELAX= 
##$RELAX= 
$$ Bruker specific parameters
$$ --------------------------
##$DU= <F:/spectra>
##$EXPNO= 1
##$NAME= <c13>
##$PROCNO= 1
##$TYPE= <nmr>
##$USER= <she>
##$AMP= (0..31)
100 100 100 100 100 100 100 100 100 100 100 100 100 100 100 100 100 100 
100 100 100 100 100 100 100 100 100 100 100 100 100 100 
##$AQSEQ= 0
##$AQ_mod= 1
##$AUNM= <au_zg>
##$AUTOPOS= <>
##$BF1= 50.322709
##$BF2= 200.13
##$BF3= 50.322709
##$BF4= 500.13
##$BF5= 500.13
##$BF6= 500.13
##$BF7= 500.13
##$BF8= 500.13
##$BYTORDA= 1
##$CFDGTYP= 0
##$CFRGTYP= 5
##$CHEMSTR= <none>
##$CNST= (0..31)
1 1 145 1 1 1 1 1 1 1 1 1 1 1 1 1 1 1 1 1 1 1 1 1 1 1 1 1 1 1 1 1 
##$CPDPRG= <waltz16>
##$CPDPRG1= <>
##$CPDPRG2= <waltz16>
##$CPDPRG3= <>
##$CPDPRG4= <mlev>
##$CPDPRG5= <mlev>
##$CPDPRG6= <mlev>
##$CPDPRG7= <mlev>
##$CPDPRG8= <mlev>
##$CPDPRGB= <>
##$CPDPRGT= <>
##$D= (0..31)
0 2 0.00345 0 0 0 0 0 0 0 0 0.03 2e-05 3e-06 0 0 0 0 0 0 0 0 0 0 0 0 0 
0 0 0 0 0 
##$DATE= 1676464652
##$DBL= (0..7)
120 120 120 120 120 120 120 120 
##$DBP= (0..7)
150 150 150 150 150 150 150 150 
$$ [...]
##$SUBNAM4= <"">
##$SUBNAM5= <"">
##$SUBNAM6= <"">
##$SUBNAM7= <"">
##$SUBNAM8= <"">
##$SUBNAM9= <"">
##$SW= 239.972175391363
##$SWIBOX= (0..15)
0 1 3 0 0 0 0 0 0 0 0 0 0 0 0 0 
##$SW_h= 12077.2946859903
##$TD= 32768
##$TD0= 1
##$TE= 0
##$TE2= 300
##$TE3= 300
##$TEG= 300
##$TL= (0..7)
120 120 120 120 120 120 120 120 
##$TP= (0..7)
150 150 150 150 150 150 150 150 
##$TP07= 0
##$TPNAME0= <>
##$TPNAME1= <>
##$TPNAME2= <>
##$TPNAME3= <>
##$TPNAME4= <>
##$TPNAME5= <>
##$TPNAME6= <>
##$TPNAME7= <>
##$TPOAL= (0..7)
0.5 0.5 0.5 0.5 0.5 0.5 0.5 0.5 
##$TPOFFS= (0..7)
0 0 0 0 0 0 0 0 
##$TUNHIN= 0
##$TUNHOUT= 0
##$TUNXOUT= 0
##$USERA1= <user>
##$USERA2= <user>
##$USERA3= <user>
##$USERA4= <user>
##$USERA5= <user>
##$V9= 5
##$VALIST= <valist>
##$VCLIST= <CCCCCCCCCCCCCCC>
##$VD= 0
##$VDLIST= <DDDDDDDDDDDDDDD>
##$VPLIST= <PPPPPPPPPPPPPPP>
##$VTLIST= <TTTTTTTTTTTTTTT>
##$WBST= 1024
##$WBSW= 4
##$XGAIN= (0..3)
0 0 0 0 
##$XL= 0
##$YL= 0
##$YMAX_a= 117070437
##$YMIN_a= -41863628
##$ZGOPTNS= <>
##$ZL1= 120
##$ZL2= 120
##$ZL3= 120
##$ZL4= 120
##$ABSF1= 222.6533
##$ABSF2= -17.34351
##$ABSG= 5
##$ABSL= 3
##$ALPHA= 0
##$AQORDER= 0
##$ASSFAC= 0
##$ASSFACI= 0
##$ASSFACX= 0
##$ASSWID= 0
##$AUNMP= <proc_1d>
##$AZFE= 0.1
##$AZFW= 0.5
##$BCFW= 0
##$BC_mod= 2
##$BYTORDP= 0
##$COROFFS= 0
##$CY= -3
##$DATMOD= 1
##$DC= 0
##$DFILT= <>
##$DTYPP= 0
##$F1P= 0
##$F2P= 0
##$FCOR= 0.5
##$FTSIZE= 32768
##$FT_mod= 6
##$GAMMA= 0
##$GB= 0
##$INTBC= 1
##$INTSCL= 4.134877e-10
##$ISEN= 128
##$LB= 2
##$LEV0= 0
##$LPBIN= 0
##$MAXI= 10000
##$MC2= 0
##$MEAN= 0
##$ME_mod= 0
##$MI= 0.1934396
##$NCOEF= 0
##$NC_proc= 3
##$NLEV= 6
##$NOISF1= 120.0001
##$NOISF2= 80.00006
##$NSP= 0
##$NTH_PI= 0
##$NZP= 0
##$OFFSET= 222.6533
##$PC= 1.4
##$PHC0= -321.0057
##$PHC1= 30.58446
##$PH_mod= 1
##$PKNL= yes
##$PPARMOD= 0
##$PSCAL= 0
##$PSIGN= 0
##$REVERSE= no
##$SF= 50.322730123286
##$SI= 32768
##$SIGF1= 140
##$SIGF2= 120
##$SINO= 11.81781
##$SIOLD= 32768
##$SREGLST= <13C.CDCl3>
##$SSB= 0
##$STSI= 32768
##$STSR= 0
##$SW_p= 12077.2946859903
##$SYMM= 0
##$S_DEV= 0
##$TDeff= 32768
##$TDoff= 0
##$TI= <>
##$TILT= no
##$TM1= 0
##$TM2= 0
##$TOPLEV= 0
##$USERP1= <user>
##$USERP2= <user>
##$USERP3= <user>
##$USERP4= <user>
##$USERP5= <user>
##$WDW= 1
##$XDIM= 32768
##$YMAX_p= 397234344
##$YMIN_p= -903032
$$ End of Bruker specific parameters
$$ ---------------------------------
##NTUPLES= NMR SPECTRUM
##VAR_NAME=  FREQUENCY,     SPECTRUM/REAL,   SPECTRUM/IMAG
##SYMBOL=    X,             R,               I
##VAR_TYPE=  INDEPENDENT,   DEPENDENT,       DEPENDENT
##VAR_FORM=  AFFN,          ASDF,            ASDF
##VAR_DIM=   32768,         32768,           32768
##UNITS=     HZ,            ARBITRARY UNITS, ARBITRARY UNITS
##FACTOR=    0.368581032318806, 1,           1
##FIRST=     11204.5221812756, 0,            0
##LAST=      -872.772504714734, 0,           0
##MIN=       -872.772504714734, -903032,     0
##MAX=       11204.5221812756, 397234344,    0
$$ Real data points
##PAGE= N=1
##DATA TABLE= (X++(R..R)), XYDATA
$$ [...]
11046a49504j1245r438l0469m4005M467N1596M8022L1585O095k4663k6933O222
11034a48270L1957L4977M1229N1871O1132N3952K3228r749j858L5885L8472O241
11022B19067m367k16j6412l5679k8157j6580k1713j9271J3125M2222M3711M7131
11010B22861L5665J0709O911J2640J5921k253l8192n1009m2709l4093l7830n3822
10998D4799n8187n7451n9393n1247l1760l366L2471O8460O5757M0633L9882M1586
10986G2184L8772M1090J9548m2982r5459j11134j04825p0005p646L8513P3796
10975a48148R9510O6008k0729r7503r9561n7649m2789k3361L1054P6020P6137
10964a41011N3769J9525j840O687K0795J4842P472M6637P0412K6634l7769q4148
$$ plain form
11046 -149504 -160749 -170187 -200656 -244661 -240194 -188598 -140576 -108991 -102896 -127559 -154492 -148270
11034 -148270 -116313 -81336 -40107 11764 72896 126848 150076 140327 138469 174354 212826 219067
11022 219067 214700 214484 198072 162393 134236 117656 95943 76672 89797 132019 175730 222861
11010 222861 258526 269235 276146 288786 304707 302454 264262 213253 170544 136451 98621 44799
10998 44799 -13388 -70839 -130232 -181479 -213239 -216605 -184134 -115674 -49917 -9284 30598 72184
10986 72184 110956 152046 171594 128612 33153 -77981 -182806 -252811 -260457 -221944 -148148
10975 -148148 -48638 17370 -3359 -100862 -200423 -258072 -300861 -324222 -293168 -217148 -141011
10964 -141011 -87242 -67717 -69557 -62870 -42075 -27233 -19761 26876 97288 123922 86153 2005
10952B005r2795p2220o5688p1373m7685j1209K094J4753K9935K2485K1035N2600
10940b16063P2280M6881K294j5755j2354k8K2764L2441K9183K4759J184l1960
10928d4374m8695l7039j0868J356R293J4692K98j6229j7572k972K0864J2784j6725
10915a35187k8323k0969L208L1300L1019q997l8467j9403J9043M5753M7820K9501
10903d3702o517o1993q7575n8098k4171k1240k6613j1123K7063O2248Q0855O9770
10891a01096K5058j7907m1418m1183l4892n1879o6083n1274j7322K3966N5065
10880c18965O5410N2222M4234N1493L7450L563j3562j4192k5471l5376j0395L1771
10868a31818M3414J1918l531R65p321j2076M526K2830L1683K7895Q043M157K4304
$$ plain form
10952 2005 -90790 -163010 -228698 -300071 -347756 -358965 -356871 -342118 -312183 -289698 -268663 -216063
10940 -216063 -143783 -96902 -94608 -110363 -122717 -122745 -99981 -67540 -38357 -13598 -12414 -44374
10928 -44374 -93069 -130108 -140976 -139620 -130327 -115635 -115337 -131566 -149138 -152110 -131246 -118462 -135187
10915 -135187 -163510 -184479 -181271 -149971 -118952 -127949 -166416 -185819 -166776 -121023 -73203 -43702
10903 -43702 -50219 -112212 -199787 -257885 -282056 -303296 -329909 -341032 -313969 -251721 -170866 -101096
10891 -101096 -76038 -93945 -135363 -176546 -211438 -263317 -329400 -380674 -397996 -374030 -318965
10880 -318965 -253555 -201333 -157099 -105606 -68156 -64593 -78155 -92347 -117818 -153194 -163589 -131818
10868 -131818 -88404 -76486 -80017 -79052 -86373 -98449 -93923 -71093 -39410 -11515 -3472 685 24989
10855B4989J4600k2648j7244J1674j9512q4222r8300l2971M6184M8308J599j1746
10843a39289p426j4834p70M0135N8051M0590J1584k5399m7547l6611j8307j4833
10831a54656j41K7104K4726N585j993J708p782m9464r7488j15892o1131K6114
10819d03310N3262L0386J8604K8805L6666K4640M021k987L808K2412L4668M3026
10807a05999O1425P7781O1774L9246M5368P0659J01496Q3444J4815m6984q6114
10796C16911r7569q7334o5605m5628l2793J71M1274M2623K5480L2755L7885J1509
10784A79679l9240n7815k0752L1153O0861P8040P1959J7360l4388l3483k2090
10773B31284k3772k4547k0865k3992k9426l5146m9396o0349o3346n2255m6242
$$ plain form
10855 24989 39589 16941 -303 11371 -8141 -92363 -190663 -223634 -177450 -129142 -127543 -139289
10843 -139289 -146715 -161549 -162319 -122184 -64133 -23543 -11959 -37358 -84905 -121516 -139823 -154656
10831 -154656 -154797 -127693 -102967 -97382 -99375 -97667 -105449 -154913 -252401 -368293 -429424 -403310
10819 -403310 -350048 -319662 -301058 -272253 -235587 -210947 -206926 -209913 -206105 -183693 -149025 -105999
10807 -105999 -44574 33207 94981 134227 179595 250254 351750 435194 450009 403025 316911
10796 316911 219342 132008 66403 20775 -12018 -11847 29427 72050 97530 130285 168170 179679
10784 179679 140439 82624 61872 93025 153886 231926 303885 321245 286857 253374 231284
10773 231284 207512 182965 162100 138108 108682 73536 24140 -36209 -99555 -151810 -198052
10762a98052n5603n8434n6782m0851Q065O0109R3087J18229J38069J68653J73377
10751C49867J40947J01876M9827l6402j34697k00353k23935k03492j32741l5863
10741c24966L1506K7244l1024p1312n2566n249L7469N9213P3256R8271J10069
10730d8089J15555J22297J01073N2662J1520k214K749P699j636j5402j4977j5546
10718C15691l1505l2513J150M1695K7963l6889p4171o4993k8966J300J6156N3170
10706A88088P6482M8866M179k8929l9598l4239m7306q5675q7491m2961j1758Q57
10694e9485K4107M4089L7965L2756M8414N8682O1526P2840Q9008P9749K1657n2542
10682D58766j08514j40211j47062j17594o1704k9860k3708n06M0991P4486Q2265
$$ plain form
10762 -198052 -253655 -312089 -368871 -409722 -401657 -341548 -248461 -130232 7837 176490 349867
10751 349867 490814 592690 642517 606115 471418 271065 47130 -156362 -289103 -324966
10741 -324966 -293460 -266216 -297240 -368552 -421118 -426367 -388898 -329685 -256429 -158158 -48089
10730 -48089 67466 189763 290836 343498 355018 352804 355553 363252 361616 346214 331237 315691
10718 315691 284186 251673 252823 294518 322481 285592 211421 146428 117462 118762 134918 188088
10706 188088 264570 313436 317615 288686 249088 214849 167543 81868 -5623 -48584 -60342 -59485
10694 -59485 -35378 8711 46676 79432 127846 186528 248054 320894 409902 489651 511308 458766
10682 458766 350252 210041 62979 -54615 -116319 -146179 -169887 -170393 -129402 -54916 27349
10671B7349N8756J9096n189k6529m7199k0094L2738M0127q087o5645p8325m6443
10659a19445k547K7965K5084o239n2967q4452p1787l2513J0479M3529M2912J6863
10647b03118J0946K1316k842o4136j07966j00109o8457m4169k0724K2384N7738
10636d99137O5034O2599P2620O3543J8531l5748n7737k9955J3569L7579N1514
10625b37588O4499O9259O5443M6816M2909N7646N0553L4379K5708J1485P560K4199
10613B62868N1523O5874N1360K3715m733l1903n5468p5792q2698p4852p3710o7261
10601a1077n3414m7044l0945q685P782K5170M3974N9445P2606Q1626P9866N4284
10589B73588K146k2939R063M6233N3760M1912L080n3098j01439j23224j05388
$$ plain form
10671 27349 86105 105201 100012 73483 26284 6190 38928 79055 70968 5323 -73002 -119445
10659 -119445 -121992 -94027 -68943 -75182 -128149 -212601 -284388 -316901 -306422 -262893 -219981 -203118
10647 -203118 -192172 -170856 -173698 -237834 -345800 -445909 -514366 -558535 -579259 -556875 -499137
10636 -499137 -434103 -371504 -298884 -235341 -216810 -252558 -310295 -340250 -326681 -289102 -237588
10625 -237588 -173089 -103830 -38387 8429 51338 108984 159537 193916 219624 231109 238669 262868
10613 262868 314391 380265 431625 455340 450607 418704 363236 287444 204746 129894 56184 -11077
10601 -11077 -64491 -111535 -142480 -151165 -143383 -118213 -74239 -14794 57812 139438 219304 273588
10589 273588 275734 252795 261858 308091 361851 403763 406843 353745 252306 129082 23694
10578B3694o7085m2216k5541p353o388P292L9489M1253K2671N488j374L174J7477
10565A0581M0217N1749K9523k6468p3347q9125q6863q5793o2885j006M4816K7632
10553b20969j8953l0829m367K0904K9668L1258K2158L0842Q0237J25422J11838
10542A77209K7564p0654j09830p2027j445J7268k8852n4370n8068o3801l0806
10531b67812K0394K5242N090Q158J0004j1139r978L4739Q2031Q6472M0971j1460
10519A2712j7152J1175L9890L1277j3970m2990l2685j2996M928K5338J6993j6605
10507E915j8158K5651M6492K1836q754p109J2225R731k554k8086o7577o9541j0036
10494h9965K8206P443j1717M65L909K319J8531K4161J3095j94O809K3221j453
$$ plain form
10578 23694 -43391 -85607 -111148 -118501 -124889 -117597 -78108 -36855 -14184 -8696 -10070 -6896 10581
10565 10581 50798 102547 132070 105602 32255 -56870 -143733 -229526 -292411 -293417 -248601 -220969
10553 -220969 -239922 -270751 -275118 -254214 -224546 -193288 -171130 -140288 -60051 65371 177209
10542 177209 204773 134119 24289 -47738 -49183 -31915 -60767 -115137 -173205 -237006 -267812
10531 -267812 -247418 -222176 -217086 -208928 -198924 -210063 -220041 -185302 -103271 -16799 24172 12712
10519 12712 -4440 6735 46625 77902 63932 20942 -11743 -24739 -19811 5527 22520 5915
10507 5915 -12243 13408 59900 81736 72982 65873 78098 87829 85275 57189 -10388 -79929 -89965
10494 -89965 -61759 -54316 -66033 -65568 -61659 -59340 -40809 -16648 -3553 -3747 3062 26283 24830
10481B4830l6130m6983n6851l2400J5653K2815j0005m3523l5629J6111N2366O5147
10469f4599O2269K6320n320j6710l0043m5449m8085j9868N604k457j3461k3255
10457a75054k6968o035j5j0698J0796L5009L6622K6862M077k8592p5601j07789
10445c17386q1794l0569J3302L4404K0081n196j1980N511L0226L9421K0136j4649
10433b98493l4792l4472l8562j9497L3291N9417M9933M3480J8367l6752n2423
10422c10503j0321J5843J7467L3458N5714N7746K0655k8022m9928n0754k8405
10411b77050N245L0578N1810N1726K5406n306j0970J1769J2734j7158m6200n6946
10399b24362n2581m6484m2706l2912k2733j1283K0292O0401R0502R7908Q0967
$$ plain form
10481 24830 -11300 -58283 -115134 -147534 -131881 -109066 -119071 -162594 -198223 -182112 -129746 -64599
10469 -64599 -2330 23990 18670 1960 -28083 -73532 -121617 -141485 -135881 -138338 -151799 -175054
10457 -175054 -202022 -208057 -208072 -218770 -207974 -172965 -136343 -109481 -105404 -133996 -209597 -317386
10445 -317386 -399180 -429749 -416447 -382043 -361962 -367158 -379138 -373627 -343401 -303980 -283844 -298493
10433 -298493 -333285 -367757 -406319 -425816 -392525 -333108 -283175 -239695 -221328 -258080 -310503
10422 -310503 -320824 -304981 -287514 -254056 -198342 -140596 -119941 -147963 -197891 -248645 -277050
10411 -277050 -271805 -241227 -189417 -137691 -112285 -117591 -128561 -116792 -104058 -121216 -167416 -224362
10399 -224362 -276943 -323427 -366133 -399045 -421778 -433061 -412769 -352368 -261866 -163958 -82991
10388h2991N6547L2761J2066k253M308K2732J8589k0752o9702j05974r5264l7515
10376b67448K8853N4283K4745k0952m2122l3477k0886j1696r639N661K8839K2443
10364b41396J0640L2951P3960Q5458L4678l2853n8991m8605k2722j8436l3334
10353b18650j1884L0145M8329L9241J0529j8381m6002o1820o7674n4336q259L6056
10341c22706N5503N9656L5349j7087m4373j1814M8429O0223M905m1782k7091L1732
10329a69056Q3513O6943N529l4486l1220n077Q068N297J8270M1390L0548J1387
10317C1106J0602M091k759M486J0402Q198O394K5041M3137K2782j7640n4108n9088
10304C2644l3113k9261l9934k9683k1027k1331k680J029j3420k4328l9492l2588
$$ plain form
10388 -82991 -26444 6317 18383 16130 20438 43170 61759 41007 -28695 -134669 -229933 -267448
10376 -267448 -238595 -184312 -159567 -180519 -222641 -256118 -277004 -288700 -298339 -292678 -263839 -241396
10364 -241396 -230756 -197805 -123845 -38387 -3709 -36562 -95553 -144158 -166880 -185316 -218650
10353 -218650 -230534 -200389 -152060 -112819 -102290 -120671 -166673 -228493 -296167 -350503 -358762 -322706
10341 -322706 -267203 -207547 -172198 -189285 -233658 -245472 -197043 -136820 -131915 -173697 -200788 -169056
10329 -169056 -85543 -18600 -13071 -47557 -78777 -83854 -75786 -70489 -52219 -10829 19719 31106
10317 31106 41708 45799 43040 47526 57928 66126 72520 97561 140698 163480 145840 91732 32644
10304 32644 -469 -29730 -69664 -99347 -120374 -141705 -144385 -143356 -156776 -181104 -220596 -253184
10292b53184O452K8402n41m0282m7798l871M0331L7990J8353J2965J4018J1969
10280a75196J9800J6668n527l1591l2659j0571M222K2264N7102Q5551P3150K9240
10268E2453k2386m5948l1637J2790O1453P6281L0667k8054n3660n4292m8648l4166
10256h5147k337K2616K9507J8276j9153n7325p2779o2120q818N4121P4239M8119
10244f0801J136k4582j5703m86J5529N6431R2739Q9310P8389O5815J5916l6460
10232B77233k9321q66j6817m3718m0127j3866J0067J0838K390j4697m8672p6974
10220A5470p1087m3853m1770m2791k4028J033K7007K7016L806j3149j749M7090
10208a17005P0287M4385J5714n189k3908m3886n6454m7709k0958J232J3231J2040
$$ plain form
10292 -253184 -246732 -218330 -218871 -259153 -306951 -310822 -270491 -232501 -214148 -201183 -187165 -175196
10280 -175196 -155396 -138728 -144255 -175846 -208505 -219076 -214854 -192590 -135488 -49937 23213 52453
10268 52453 30067 -15881 -47518 -34728 26725 103006 133673 105619 51959 -2333 -50981 -85147
10256 -85147 -87484 -64868 -35361 -17085 -36238 -93563 -166342 -228462 -237280 -183159 -108920 -60801
10244 -60801 -59665 -84247 -99950 -100436 -84907 -28476 64263 153573 231962 297777 313693 277233
10232 277233 247912 247046 230229 186511 146384 132518 142585 153423 155813 141116 92444 15470
10220 15470 -55617 -99470 -141240 -184031 -208059 -207026 -180019 -153003 -149197 -162346 -164095 -117005
10208 -117005 -46718 -2333 13381 8192 -15716 -59602 -116056 -163765 -184723 -183491 -170260 -158220
10196a58220n132j9685J4801P6130J01452P7890K4122m5198j03868j27098j10916
10185b75722n8426n981J5682M0384P1328P0573M1148J6722N674j2022l0404n4574
10173a75618o6047j7443O5900J22012J09525L0577n2279q1239p5366n1932j8217
10162b10127q073k8495l6793j6646N012R308J1266K6930L1854K2683k820l8339
10150b34240l6399Q095L7353M2139M8949N7279O5576N1054l320p2469j22778j27962
10138b86723o9577J7150P1163Q0603P6878O8208N3278L5370Q113l6176q2786p9055
10126a43554n0751m4396k6768J5914M1882N3091P5827P4595M0316J9599Q146k4683
10114C9218p5314j11984j21556j03794n1193O381K3716J2261K0242M5326O1781
$$ plain form
10196 -158220 -163352 -183037 -168236 -92106 9346 87236 111358 66160 -37708 -164806 -275722
10185 -275722 -334148 -340129 -324447 -284063 -212735 -142162 -101014 -84292 -78618 -90640 -121044 -175618
10173 -175618 -241665 -259108 -193208 -71196 38329 68906 16627 -64612 -139978 -191910 -210127
10162 -210127 -218200 -246695 -283488 -300134 -295122 -285814 -274548 -247618 -215764 -193081 -195901 -234240
10150 -234240 -270639 -262544 -225191 -183052 -134103 -76824 -11248 39806 36486 -35983 -158761 -286723
10138 -286723 -356300 -339150 -267987 -187384 -110506 -42298 10980 46350 54463 18287 -64499 -143554
10126 -143554 -194305 -238701 -265469 -249555 -207673 -154582 -78755 -4160 36156 55755 63901 39218
10114 39218 -36096 -148080 -269636 -373430 -424623 -418242 -394526 -382265 -362023 -316697 -254916
10103b54916M5024L935n092K6578N9833Q1078P3948L0729j8117m9975m1327N431
10091d2871L0399N259k3218M66O0841R5846O1622Q050J810M1256J11693J73635
10079E24788J76006J09122L1678o958j9833l9605o0181p1054r0455j05596r4883
10068C53029p4965n8828n9815m9250J4320R2184J29051J32132J21075R2027J1853
10057G02813j04673j77167j75082j09326l8213j1184O61K9806N1007L9207J4139
10046B21988J4812K7871K5907K9791L5595K8682N1k6732j4148O805J0360J9813
10034C80795K8664J7153j3788l6789m3340m5433m6643l5376o709K8126N4175N7216
10022C38051K7363k5144o9737q4945q0390o7137k1052K9360J7772j5491o202N010
$$ plain form
10103 -254916 -209892 -205957 -211049 -184471 -124638 -43560 30388 61117 43000 -6975 -48302 -42871
10091 -42871 -12472 -7213 -30431 -29965 30876 126722 188344 196394 198204 239460 351153 524788
10079 524788 700794 809916 841594 834636 814803 775198 715017 643963 553508 447912 353029
10068 353029 278064 219236 159421 110171 124491 216675 345726 477858 598933 690960 702813
10057 702813 598140 420973 245891 136565 98352 87168 87829 117635 168642 207849 221988
10046 221988 236800 264671 290578 320369 355964 384646 384697 357965 343817 350622 360982 380795
10034 380795 409459 426612 412824 376035 332695 287262 240619 205243 198534 226660 280835 338051
10022 338051 365414 340270 270533 185588 105198 38061 17009 46369 64141 48650 42448 47458
10010D7458j3076k5422k3053j9886m877K8924N8739N5206L5662J5941k5067o4880
9998F5669o6214m4224l4549p081O7299J14620Q8460M3176J4614k484k7274o3487
9986A48525p9840q0470p8782n4275N926O6864Q3635M0922l1777o9970n8354l7346
9974a44942k5899k4546n071L5626O2678O3517O4372O9750P8548Q8038N3298k2803
9962B92566n3728k1038O801J3980K0795J7177k1394n0723l3147q898m364k3161
9950A34866n3597p2910p2671m9682k0125j6407j4339M0455R7976R0550L1532k6021
9938F9627o0170r0138q0699j3609O0438R1479Q5913R3016P8710o536r6420j30531
9926A080j21208q1050k8299J7054K6772L474m254O041J7437L660k6420k4368K8542
$$ plain form
10010 47458 34382 8960 -14093 -33979 -38856 -9932 48807 104013 139675 155616 130549 65669
9998 65669 -545 -44769 -79318 -86399 -19100 95520 183980 227156 241770 239286 212012 148525
9986 148525 68685 -11785 -90567 -144842 -138916 -72052 11583 52505 20728 -49242 -107596 -144942
9974 -144942 -170841 -195387 -200458 -164832 -102154 -38637 25735 95485 174033 262071 315369 292566
9962 292566 238838 217800 224601 238581 259376 276553 255159 204436 171289 162391 158027 134866
9950 134866 81269 8359 -64312 -113994 -134119 -150526 -164865 -124410 -26434 64116 95648 69627
9938 69627 9457 -80681 -161380 -174989 -114551 -23072 62841 155857 234567 228031 131611 1080
9926 1080 -120128 -201178 -229477 -212423 -185651 -182177 -186431 -180390 -162953 -159293 -185713 -210081 -181539
9913a81539J04025J30459R2250M2360Q625J472L287k0597m8119l8842j0176O16
9901H3821j986L873j068k7578n4829o2932m3473p065M2740O8924N0371J5962p181
9888E9579J244L3178N2995L9211J3319j6416n6726q2914q0455o7177o2219m8579
9876b14960q824K0239L120l7484o4748o0580l5880j0499Q65j0143l1558l9470
9864d89922k9454m406K1751K0906K756M190L5552N3700M6080M1435M1508N1927
9852b03977O6056P3707O8756M6258J4165m286j9545o1870j08925j23136j06088
9841c58885q0262m5971j399N6974J02103R3484N5380M3340N5593N7230L7447J0823
9829B5857k1348n1669l2228J7199L9432K0968J2342J8502L52L345N9465R4220
$$ plain form
9913 -181539 -77514 52945 145195 187555 196180 197652 200939 180342 132223 93381 83205 83821
9901 83821 81835 85708 84640 57062 2233 -60699 -104172 -111237 -68497 427 50798 66760 59579
9888 59579 60823 94001 146996 186207 199526 183110 126384 43470 -36985 -104162 -166381 -214960
9876 -214960 -223784 -203545 -200425 -237909 -302657 -363237 -399117 -409616 -408751 -418894 -450452 -489922
9864 -489922 -519376 -523782 -502031 -481125 -478369 -474179 -438627 -384927 -338847 -297412 -255904 -203977
9852 -203977 -137921 -64214 4542 50800 64965 60679 41134 -20736 -129661 -252797 -358885
9841 -358885 -439147 -485118 -486517 -429543 -327440 -233956 -178576 -135236 -79643 -22413 15034 25857
9829 25857 4509 -47160 -79388 -62189 -22757 -1789 10553 29055 29407 32752 92217 186437
9817A86437M3040k5851o9996j13095j01640j3496O7319P3470K6707j9367o5215
9806a1687r2430n8469N600N3426P4822O9760M7381K8911J2183q823M047N1538
9794A76259J01738J06396L6310n2655j03813j00315m8974J4471N1349N2338M0395
9783B73499J2541k8633o4807p7392o7715n4275l0950j7456j8054k4281n5766p7299
9771b30588m1828J6768N1495N8343N5943L5863p323k7806j7230j0500k7590o4905
9759b09358p9341m3917P423M2504M7631K5414L3621P5821R5007Q0900M6638p235
9747A15108n4943n6517k7326R131K4662K8114M2235M7824M8758N3196K7591k4899
9735B32934n5493p3708r1181r1900o5119l4689m8485p0391l3652L6788R1175R4587
$$ plain form
9817 186437 229477 203626 133630 20535 -81105 -94601 -27282 46188 72895 53528 -11687
9806 -11687 -104117 -162586 -156986 -103560 -28738 41022 88403 117314 129497 120674 124721 176259
9794 176259 277997 384393 420703 368048 264235 163920 114946 129417 180766 233104 273499
9783 273499 286040 257407 192600 115208 47493 -6782 -37732 -55188 -73242 -97523 -153289 -230588
9771 -230588 -272416 -255648 -204153 -145810 -89867 -54004 -61327 -89133 -106363 -116863 -144453 -209358
9759 -209358 -288699 -332616 -325193 -282689 -235058 -209644 -176023 -100202 -5195 75705 122343 115108
9747 115108 60165 3648 -23678 -14547 10115 38229 80464 128288 177046 230242 257833 232934
9735 232934 177441 103733 12552 -79348 -144467 -179156 -227641 -298032 -331684 -294896 -203721 -109134
9723a09134M0702j8660l4581k6232m3849r9451j34626j03500m9057j2971J4565
9712e76794L7555M8521K9984J8360L8147M3740K2330Q108N914R720K1572M7419
9700b45424O8457N2123L571m1883n7355n8721k8819K2366N3316M4518k047n4418
9688b44316o5374m1466k2258k4301m3148l7263J1813M5280K9348J4451K4287N4265
9676b98682P1411M8502M181j1242J5417J6028k9873o2142n4042k3446O978K9720
9664b87190M1619L0872Q012Q74J5247L5418L0434m029m8276r9245j18208o1960
9652d56432L0655R0360J03955J03789J07114R8979O3636O477m1736n3292l2675
9641B0830j3678j0878j8942l2414n5371o3366k3750K0179L0763O1444J00697P8766
$$ plain form
9723 -109134 -68432 -87092 -121673 -147905 -191754 -291205 -425831 -529331 -578388 -591359 -576794
9712 -576794 -539239 -490718 -460734 -442374 -404227 -360487 -338157 -330049 -324135 -314415 -292843 -245424
9700 -245424 -176967 -124844 -121273 -163156 -220511 -279232 -308051 -285685 -232369 -187851 -189898 -244316
9688 -244316 -309690 -351156 -373414 -397715 -440863 -478126 -466313 -421033 -391685 -377234 -352947 -298682
9676 -298682 -227271 -178769 -174588 -185830 -170413 -154385 -184258 -246400 -300442 -323888 -316910 -287190
9664 -287190 -245571 -214699 -206687 -205813 -190566 -155148 -124714 -128743 -177019 -276264 -394472 -456432
9652 -456432 -425777 -335417 -231462 -127673 -20559 78420 142056 148533 106797 53505 20830
9641 20830 7152 -3726 -22668 -55082 -110453 -173819 -197569 -177390 -146627 -85183 15514 94280
9629I4280M280o4081r2751q3560m9375j908L3296M8695N1263M2955L0417K6331
9617C9842J4768k8656q4703j02940p4007l4105N017L5696N6256N4178J8318k1656
9605a21992k7029j015J9079K0870J7861O212k9089n3280m0726j1547P363j565
9593b14858m5303q0387p0076m2608j9928P205M0342P2731Q7034P7120O9345P4860
9581d4523N7468L1115J1957j1917k5869k1781j2583o645K4191P2071Q7028N3530
9569B14042n572m4377m2266l3635m1759o1437p0255o2308m3447k7659j0992L373
9557b26292l263k8070m0683l0494k6293j7613K2404O0522O2336L1420N64j7130
9545b12592j1317N416l239m8191q0950n3999k2561k5154k5803M28M1202O7574
$$ plain form
9629 94280 98560 34479 -58272 -141832 -191207 -193115 -159819 -111124 -59861 -16906 13511 39842
9617 39842 54610 25954 -58749 -161689 -235696 -269801 -264784 -229088 -172832 -118654 -100336 -121992
9605 -121992 -149021 -150036 -130957 -110087 -92226 -86014 -115103 -168383 -209109 -220656 -213293 -214858
9593 -214858 -260161 -340548 -410624 -453232 -473160 -465955 -425613 -352882 -265848 -188728 -119383 -44523
9581 -44523 12945 44060 56017 44100 18231 -3550 -16133 -22778 1413 73484 160512 214042
9569 214042 208470 164093 121827 88192 46433 -15004 -85259 -147567 -191014 -218673 -229665 -226292
9557 -226292 -229555 -257625 -298308 -328802 -355095 -372708 -350304 -289782 -227446 -196026 -195462 -212592
9545 -212592 -223909 -218493 -221732 -269923 -350873 -404872 -427433 -452587 -478390 -477962 -436760 -369186
9533c69186N5974K7518k857l2000m2903k0037m917j9102l8698m0669j8750P490
9521d98137M7989R8569J25488J27626J17532P9720L2387r37j7775k7233l7307
9510D7922m7347m3661m5643p3799p9090m0777k11K6836M7423M4319L2477L7233
9498i4318K0467l414m144l405j867l516O817L8525M1028J6921O012J083j1880
9485H309k5510k6377k8780k3823L855J9937N204l4841o2124l7170K4312O6619
9473a10389L2163l9158o1867l0273J4236K8413m124p7592j44416j47321q2858
9462f23186J2823O3453M0197n14k2180j5317k1930o2972o0621Q505P1276R6896
9450e13570P3131R791j2781K2265O4366Q2326Q8658Q6887N2166p489k3908K1257
$$ plain form
9533 -369186 -313212 -285694 -288551 -320551 -363454 -383491 -388408 -407510 -446208 -486877 -505627 -498137
9521 -498137 -450148 -351579 -226091 -98465 19067 98787 131174 130237 112462 85229 47922
9510 47922 575 -43086 -88729 -162528 -241618 -282395 -282606 -255770 -208347 -164028 -131551 -94318
9498 -94318 -73851 -77265 -81409 -84814 -86681 -90197 -83380 -44855 -3827 13094 19106 20189 8309
9485 8309 -17201 -43578 -72358 -96181 -92326 -72389 -67185 -102026 -164150 -201320 -177008 -110389
9473 -110389 -78226 -117384 -179251 -209524 -195288 -166875 -170999 -248591 -393007 -540328 -623186
9462 -623186 -610363 -546910 -506713 -507227 -529407 -544724 -566654 -629626 -690247 -681742 -610466 -513570
9450 -513570 -440439 -430648 -443429 -421164 -356798 -274472 -185814 -98927 -46761 -54250 -78158 -56901
9438e6901O6371O3827K1090k573J220j1846k8841j2861O724J6096L8977N4561
9426A55844M3465K5471n614n4480q4620p7190n0322j4757J8538J8582M232P013
9414a3838k460l9308p4211o6111j3682K6917M9876P0092P0915N2271J2649m1044
9402C2066p5138n9512j0127J3979j4673n2616p1482o4028k709P4027Q4701J3732
9390a31780o3555p8100k2339L5776K0517j5247J67K0448J4736P538R011K9210
9378a73618N0600K8222k0023m3859n4723m8714l0299k7025j2777J5108M6584P9424
9366a91100P6740P0452Q4128Q4069O1032K3459j0806m6264o3508l4301p30J2053
9354F5224N246k5023n5167o6704o4430n7903l2448q925N007J6747K8751M7182
$$ plain form
9438 -56901 9470 73297 94387 91814 93034 81188 52347 39486 46210 62306 101283 155844
9426 155844 199309 224780 219166 164686 80066 2876 -47446 -62203 -43665 -25083 -20851 -13838
9414 -13838 -16298 -55606 -129817 -195928 -209610 -182693 -132817 -62725 8190 60461 73110 32066
9402 32066 -43072 -102584 -112711 -98732 -113405 -166021 -237503 -301531 -304240 -230213 -145512 -131780
9390 -131780 -195335 -273435 -295774 -259998 -239481 -254728 -254561 -234113 -219377 -211839 -202828 -173618
9378 -173618 -123018 -94796 -114819 -158678 -213401 -262115 -292414 -319439 -332216 -317108 -270524 -191100
9366 -191100 -114360 -43908 40220 124289 185321 208780 197974 151710 88202 53901 53171 65224
9354 65224 70470 45447 -9720 -76424 -140854 -198757 -231205 -240130 -235123 -218376 -189625 -142443
9342a42443M4105N318k1471k1825j7741j5072j3928O017M1157N0829K9709K6136
9330b9209M4171M6694O950m0313n7469m5394j4005k193j4734o499L0332N0521
9318c1148J6091k6146q082L6013N0938M1367L5908K7447Q193k056j2230m0138
9306I6157o2346p5536q6666q7694q0182n4802j1317M1782O9164N3976L6517L5070
9294a25877L5421L9619M1199K4880j3212l0812q444R276J761j3000k4408l8770
9282a02367n2943m2840j6487n779q21J4830P527l6695n9028l4103m703j1351n2416
9269c97176n3352R170P8964J22629J30490J02363N4796K2610J9038K5575O1555
9258A76662R5842M8220l4116p2171o8137m0621j504K4625L1733K0198R245J8403
$$ plain form
9342 -142443 -98338 -93020 -114491 -136316 -154057 -169129 -183057 -177040 -135883 -85054 -55345 -29209
9330 -29209 14962 61656 68606 28293 -29176 -74570 -88575 -90768 -105502 -112001 -81669 -31148
9318 -31148 -15057 -41203 -49285 -13272 37666 79033 114941 142388 150581 148525 136295 96157
9306 96157 33811 -41725 -128391 -216085 -296267 -351069 -362386 -320604 -251440 -197464 -160947 -125877
9294 -125877 -90456 -50837 -9638 15242 2030 -28782 -37226 -27950 -26189 -39189 -63597 -102367
9282 -102367 -155310 -198150 -214637 -220416 -221237 -206407 -198880 -235575 -294603 -328706 -333409 -344760 -397176
9269 -397176 -450528 -441358 -362394 -239765 -109275 -6912 47884 70494 89532 115107 176662
9258 176662 272504 320724 286608 214437 146300 105679 104175 128800 160533 180731 189976 208379
9246B08379J9051j5874m0177j5923J4275K5833L0981M4999K7031l0941n7299k2543
9234A87792Q831j045l3685o0761o5870n7723l8496j5296Q804K6214L0909L6064
9222B5738L6828J3871k3593m7336k7591K7454N9817K8437j7328k7241q932J6635
9210E6759M3159M2124J193k0100N380M5613O1362L9560J2471k237j7932l2278
9198B35074k2445o697j2030j5994J3707N0475O4687N2731N1454O7767O8317M4541
9186E91587J9832k379l9826o7762o7397o1553m6645j5248K4959M7146L4733M55
9174D17902k1180j7232j3495j2649j0482j1379j5691l5393n8630m7702j0549K864
9162A66384L498K4781L7342K3887j926k9972n7031o0948m5123k5567r026n558
$$ plain form
9246 208379 227430 211556 171379 155456 169731 195564 226545 271544 298575 267634 210335 187792
9234 187792 196623 195578 161893 101132 35262 -22461 -60957 -76253 -67449 -41235 -10326 25738
9222 25738 62566 76437 52844 5508 -22083 5371 65188 93625 76297 49056 40124 56759
9210 56759 99918 142042 143235 123135 128515 174128 235490 275050 287521 285284 267352 235074
9198 235074 212629 205932 193902 177908 191615 242090 306777 359508 410962 478729 547046 591587
9186 591587 611419 609040 569214 501452 434055 372502 325857 310609 335568 382714 417447 417902
9174 417902 396722 379490 365995 353346 342864 331485 315794 280401 221771 174069 163520 166384
9162 166384 169882 194663 232005 255892 253966 223994 166963 106015 60892 35325 26299 20741
9150B0741j6899k6575l5668m6891l6133J7592Q3843R9800P1746L4505Q045J2865
9138A86971K7137J3431j3179k5417j7026j0650l27K5560K9323m961k9259o902
9126A74701L7346P6982P8744K7689k6510m7054o4065r7078j26426j40423j31729
9115b37823j01031p4383n5098m4550l7129L467P0773J12121J12909R3710P0787
9104h6247M9829L2501K5544L6351M3225L8656K5694r046n0281p4298p8298q4750
9092a31120o7517m7482o0012n8511j9617K2348N2099O3615M0755p735m3560o4362
9080c21099q7385q4035j3016P4952R7226O1165L5680M2360K8519m58l920P682
9068a62329m236k9671m8301m9785l3211k7823j8519R751M6117Q5604R2428O2616
$$ plain form
9150 20741 3842 -22733 -58401 -105292 -141425 -123833 -39990 59810 131556 166061 174106 186971
9138 186971 214108 227539 214360 188943 171917 161267 160940 186500 215823 210862 181603 174701
9126 174701 212047 289029 367773 395462 368952 321898 257833 160755 34329 -106094 -237823
9115 -237823 -338854 -413237 -468335 -512885 -550014 -546547 -475774 -363653 -250744 -157034 -86247
9104 -86247 -36418 -3917 21627 57978 101203 139859 165553 156507 106226 31928 -46370 -131120
9092 -131120 -198637 -246119 -306131 -364642 -384259 -361911 -309812 -246197 -205442 -213177 -256737 -321099
9080 -321099 -408484 -492519 -505535 -430583 -333357 -272192 -236512 -194152 -165633 -166091 -170011 -162329
9068 -162329 -166565 -196236 -244537 -294322 -327533 -355356 -373875 -364124 -318007 -232403 -139975 -77359
9056g7359N0380O6084P7106O4805J5272m4687q1273r6747r0568m9575j0546l2320
9044b09428n8758k7449K6835N8139N1415L3091K3984K5655M6806Q2707R5258O9962
9032B18217M1559K8111j713m1659o1062m1960r25O780j9435k9757j7288J538J5923
9019I8329K2718K0914J4527Q294l584m1025o4824m9988j0571K5245K4048R04j2210
9006C2777j4885k4298n6343p1597k9678L2710N7839M4697L8733L0319k2055q0905
8994f2686q9904m7785J5380N5086N1817K7769j1284l4043k1625J3050M6880L6551
8982b0794L99l0973o7605j01237q5532j1099M9409M3015N100q475j1595k7759
8970b67146l2691j1658Q291l018j1191K0279N4778N0271M5477N2198L2457r437
$$ plain form
9056 -77359 -26979 39105 116211 181016 196288 151601 70328 -26419 -116987 -166562 -177108 -209428
9044 -209428 -268186 -295635 -268800 -210661 -159246 -126155 -102171 -76516 -29710 52997 148255 218217
9032 218217 259776 287887 286174 244515 183453 141493 140568 147348 127913 98156 80868 82406 98329
9019 98329 121047 141961 156488 164782 161198 120173 55349 5361 -5210 20035 44083 44987 32777
9006 32777 17892 -6406 -62749 -134346 -164024 -131314 -73475 -28778 9955 40274 18219 -62686
8994 -62686 -152590 -200375 -184995 -129909 -78092 -50323 -61607 -95650 -117275 -104225 -57345 -20794
8982 -20794 -20395 -51368 -118973 -220210 -305742 -316841 -267432 -224417 -219317 -227792 -239387 -267146
8970 -267146 -299837 -311495 -303204 -306222 -317413 -297134 -242356 -192085 -146608 -94410 -61953 -71390
8958g1390k2232K3072R0621J23247J10751J07627J01439L8606j7203j3407j7302
8947D53829o7199j03168p8912l7426m612J2154o859l0254l7514k5984K108J5669
8935I1832j492k8916m0416j5854L8253Q3013P6763L0546j7892m3095o8915j09037
8923e210j32316j06253l5062M6129R2962Q3510O0815M3356J7562L770j098r251
8911E8914j287K6302N6444P7328Q2870O7668O0777N7834K6575j1606j9432M645
8899D87032K0632J6495K709N10J9707L9178L5276J7900L678R379K8013K0216n140
8886F95585k0191j9943k1124l4430k7089n360m519O356L9404Q8486J28249J23067
8874I48491R8131P9046O7374P1508R3448J15494J18490J16974J31240J54044J54381
$$ plain form
8958 -71390 -93622 -70550 20071 143318 254069 361696 463135 501741 484538 471131 453829
8947 453829 386630 283462 204550 167124 162512 174666 167807 137553 100039 74055 76163 91832
8935 91832 90340 61424 21008 5154 43407 126420 203183 233729 215837 172742 103827 -5210
8923 -5210 -137526 -243779 -278841 -232712 -139750 -56240 4575 47931 65493 69263 68165 58914
8911 58914 57627 83929 140373 217701 300571 368239 429016 486850 513425 501819 482387 487032
8899 487032 507664 524159 526868 527378 547085 586263 621539 639439 643117 652496 680509 700725 695585
8886 695585 675394 655451 634327 599897 572808 567448 562929 569285 608689 697175 825424 948491
8874 948491 1046622 1125668 1193042 1264550 1357998 1473492 1591982 1708956 1840196 1994240 2148621
8863B148621J10218N2730K1068j1805p1748j14845j10836j03806j28838j46865
8853A643894j17980n9782q405K5670L9822N1190P0380Q5372P0097L8925K8118
8842A867301J8792m631j8556k9471o9891j32882j84931k01824j83371j49566j28945
8831G82025j19070r8273p4377o8212p0087p7843p8789n3749p750K9401K7452K2206
8819B12934L5992L3307Q587k0439m2585n3466m9624l1115J0110M3211L6421K5072
8807B08405K3345P004j8376m4709n1547j6962K1035J5211j8685l4104l3548n2796
8795D273o9698m4732K598N6282P4351K7204m6893o8177j9900L8368O1889N5825
8783G1390O3402Q9861Q5111K3621m2290n8020k2065J2860K2032R203K531K805
$$ plain form
8863 2148621 2258839 2311569 2332637 2320832 2249084 2134239 2023403 1919597 1790759 1643894
8853 1643894 1525914 1466132 1457727 1483397 1523219 1574409 1644789 1730161 1800258 1839183 1867301
8842 1867301 1886093 1881462 1862906 1833435 1763544 1630662 1445731 1243907 1060536 910970 782025
8831 782025 662955 564682 490305 422093 352006 274163 195374 141625 133875 163276 190728 212934
8819 212934 248926 282233 290820 270381 227796 174330 124706 93591 103701 146912 183333 208405
8807 208405 231750 238754 220378 175669 124122 107160 128195 143406 124721 90617 57069 4273
8795 4273 -65425 -110157 -107559 -51277 23074 50278 3385 -64792 -84692 -46324 15565 71390
8783 71390 134792 224653 309764 333385 291095 233075 211010 223870 245902 255105 257636 260441
8771B60441k3033n6897n7058l7700j6206L0481P5325O9178J1468n8756j00855
8760I6388q7126n8093l8105k1673l7597o4967n4553m388N1334Q1884Q0011M7932
8748h953N580l0284l9416R843Q0986J03190Q0688K2367m9975r9599j09652r0597
8736a25822o6227n9534n8462m2337p888K8211N4615O2305M3092J6966q325l0954
8724a94360m6372n1091m4262l3531j1496J556P238M7994P2628N0132K8808K5790
8712a46966L1715M0289L6924J5967R763j945l3569m6360m5871o5336q2315m9123
8700c36827K1733Q0628Q2894K8569j4593k7222m2823n7507o5079p7391p8535n3533
8688e39686k2404n670J6544L4953K1808j9626k9136K8052R1974J16427J14292
$$ plain form
8771 260441 237408 180511 123453 85753 69547 100028 175353 244531 255999 197243 96388
8760 96388 9262 -48831 -86936 -108609 -146206 -211173 -265726 -270114 -218780 -136896 -56885 -8953
8748 -8953 -3373 -33657 -73073 -63230 17756 120946 201634 224001 174026 74427 -35225 -125822
8736 -125822 -192049 -251583 -310045 -352382 -360270 -332059 -277444 -215139 -172047 -155081 -163406 -194360
8724 -194360 -240732 -291823 -336085 -369616 -381112 -379556 -372318 -324324 -251696 -201564 -172756 -146966
8712 -146966 -115251 -74962 -38038 -22071 -12308 -14253 -47822 -94182 -140053 -205389 -287704 -336827
8700 -336827 -315094 -234466 -151572 -123003 -137596 -164818 -207641 -265148 -330227 -407618 -486153 -539686
8688 -539686 -562090 -567760 -551216 -516263 -494455 -514081 -543217 -515165 -423191 -306764 -192472
8677a92472R4812N7065N0439P3524P9583M8232J753j4325j6334j3143r123l5056
8665A24955o9076r0010r9910q4247n3395l4873j5856J1618K6926L7627L7843L8590
8653a69808O7463Q2566P5776O9042L9176k2936n5272m6984l6696m2138n5039n2895
8641a47745k7373J0159L2838L7355L7158M0689N1417M9720L3062N050j5169k1982
8629H5179k4412p395J3045K2373P327m2756p5775m5237L3745Q7907R3694N5900
8617B03595j2623l0518J4466L8519J0127k3107j6807K0718M6705N532n2335n4379
8605A49893l8394o0802r0102o7512J785M4203J9038j4222R075O8525J10618J28319
8593B60424J36323J37367J20650J00465J03522J17147R5737M6703K3422K6694
$$ plain form
8677 -192472 -97660 -40595 9844 83368 162951 211183 212936 198611 182277 169134 160011 124955
8665 124955 55879 -34131 -134041 -218288 -271683 -306556 -322412 -310794 -283868 -246241 -208398 -169808
8653 -169808 -102345 -19779 55997 125039 164215 141279 86007 39023 2327 -39811 -94850 -147745
8641 -147745 -175118 -164959 -132121 -94766 -57608 -16919 34498 84218 117280 122330 107161 85179
8629 85179 60767 53372 66417 88790 96117 53361 -22414 -67651 -33906 54001 147695 203595
8617 203595 190972 160454 174920 213439 223566 200459 183652 204370 251075 256607 204272 149893
8605 149893 111499 50697 -39405 -106917 -105132 -60929 -41891 -56113 -47038 21487 132105 260424
8593 260424 396747 534114 654764 755229 858751 975898 1071635 1118338 1141760 1168454
8583A168454M5329J06810J76559K02325J95211J62059R4542L6432P380r428o723
8572B178950j110k1309p2119j24444j44468j34920j19666j13315q9614l5383K1220
8561A343822O0095R5347J22032J26980J26259J12667N7717m5328j48529j83271
8551A667791j38577q5252p6884q9003r9921j00223q0299m0883k8814p8677j26218
8540G23040j13075l8830K6028L0737K377n523K663r549m0318n1741m8636n3548
8528D23625m9727k2406K5k1893p7496j23506j20208r2160n8499k0847j570K079
8516a62583N698N033j4235l6258j5922M5417J08085J38549J23150O8436R656k9752
8504B45274o0545q5278o7374k1906p028k0340j1058K7664L5598n445o0836r2419
$$ plain form
8583 1168454 1213783 1320593 1497152 1699477 1894688 2056747 2151289 2187721 2195101 2185673 2178950
8572 2178950 2177840 2156531 2084412 1959968 1815500 1680580 1560914 1447599 1357985 1322602 1343822
8561 1343822 1403917 1499264 1621296 1748276 1874535 1987202 2044919 1999591 1851062 1667791
8551 1667791 1529214 1443962 1367078 1278075 1178154 1077931 997632 956749 927935 849258 723040
8540 723040 609965 571135 597163 627900 630277 624754 627417 617868 577550 525809 477173 423625
8528 423625 373898 351492 351517 329624 252128 128622 8414 -83746 -142245 -163092 -164662 -162583
8516 -162583 -156885 -151852 -166087 -202345 -218267 -172850 -64765 73784 196934 265370 275026 245274
8504 245274 184729 99451 32077 10171 3143 -17197 -28255 -591 35007 29562 -31274 -123693
8492a23693q4832m1447K4153O3039O9829O7045O1419P1580R4055J06564R4018
8481D01730N8635K3841j4610m0169m8651m7371k0502n694l4470n9109m6382k4480
8469A42768l5357p9211j20978j29300r9624n6867m904L5740M3608K4259J9584
8458b60282N3533Q7303J04371P9107J3918n4880r0034p7681n5471n0172m5725
8447b96013j7476K7495O1095O8605N2624K7196J3827K1340L5877N5670N5102J3925
8435A19267j5482q197o554k9026m4487j8229L0731N3875N2883M5551L5797J9349
8423B35478J8244L7015K8524j8547o3402p6183o0719l4841p031J8258M2204L8742
8411A57742K9662N1921N8983n232q3686j19298j43406j28124l6020N2499Q0477
$$ plain form
8492 -123693 -208525 -249972 -225819 -162780 -92951 -25906 35513 107093 201148 307712 401730
8481 401730 460365 484206 469596 429427 380776 333405 312903 307209 272739 213630 167248 142768
8469 142768 107411 28200 -92778 -222078 -321702 -378569 -383473 -347733 -304125 -279866 -260282
8458 -260282 -206749 -119446 -15075 64032 77950 23070 -66964 -144645 -200116 -250288 -296013
8447 -296013 -313489 -285994 -224899 -156294 -103670 -76474 -62647 -41307 -5430 50240 105342 119267
8435 119267 103785 95588 89034 60008 15521 -2708 28023 81898 134781 180332 216129 235478
8423 235478 253722 290737 319261 300714 237312 161129 100410 65569 58538 76796 119000 157742
8411 157742 187404 239325 298308 293076 209390 90092 -53314 -181438 -217458 -164959 -84482
8400h4482P3813M6660Q424l0355p2024r4525p2122j8934M0339Q3931R7637Q2351
8388F0713N3009L0823J7866K7926N8957O4569K8397k2924n1534m3302k0403p866
8376A96231N814O531k7047n9492n7502l4062j9218k3317k8111j4986m143q55j766
8363f1923P002K3009J6118j254j5196k1807j0116J4183J1204j9081l9253n3259
8351a50373n9864m1398J2034N8745O8428N3600K1151q791L496M9240P1253N1589
8339A29110K2030o492k4386r217K5162N0105N0426L6581J7629N10l12p691j7055
8326B66400j6655j5310n368P204K7292P5373J22100J21516R8307O7323O376n5140
8314F99418p7003n0381L047M3942L8087N852o791n227n36L949j2714k7293l3162
$$ plain form
8400 -84482 -10669 35991 44415 14060 -57964 -152489 -224611 -243545 -203206 -119275 -21638 60713
8388 60713 113722 144545 162411 190337 249294 313863 342260 319336 267802 224500 204097 196231
8376 196231 202045 208576 181529 122037 64535 30473 11255 -12062 -40173 -55159 -59302 -60157 -61923
8363 -61923 -54921 -31912 -15794 -17048 -32244 -54051 -64167 -49984 -38780 -57861 -97114 -150373
8351 -150373 -210237 -251635 -239601 -180856 -112428 -58828 -37677 -46468 -42972 6268 77521 129110
8339 129110 151140 144648 120262 111045 136207 186312 236738 273319 290948 291458 291146 283455 266400
8326 266400 249745 234435 229067 236271 263563 338936 461036 582552 680859 748182 754558 699418
8314 699418 622415 572034 575081 619023 657110 662962 656171 650944 650408 654357 641643 614350 581188
8301E81188m5474l8495q950N884J1053L4801L7068j577j9782Q337J6813j4020
8289E66846l3227q200J3169k386j6891k1414k0075j0930O594L3419L8880O784
8277E52569l7953n7863k9145J1330J7179J550p145J6554N7083O5689M7830L8539
8265F76217M2013L8876K0887j268l9095q0330j00713q4920l9348J7871P4633Q7171
8253F11994O4127O5839Q5275P2661L0289l913j8216l9862p4797q9044q4354p6576
8241E43423m8326j0246p000k5172l9087m0477l0180j6639r002R428M7188P9134
8229D53044Q2394R3120J26566J50203J28352N6876k9358p3479p9301p5169m7712
8218G85536j9895j8393m2865o0967l8107J8918P0756P8139O4262M7244j896o9255
$$ plain form
8301 581188 535714 497219 488269 494153 505206 540007 577075 575498 555716 564053 580866 566846
8289 566846 533619 525419 538588 536202 519311 497897 477822 466892 473486 506905 545785 552569
8277 552569 514616 456753 427608 438938 456117 457667 450522 467076 524159 589848 637678 676217
8265 676217 718230 757106 777993 776725 737630 657300 556587 471667 432319 450190 524823 611994
8253 611994 676121 741960 827235 899896 930185 926272 908056 868194 793397 704353 619999 543423
8241 543423 495097 484851 477851 452679 413592 373115 342935 326296 317294 326722 373910 453044
8229 453044 535438 628558 755124 905327 1033679 1090555 1061197 987718 908417 833248 785536
8218 785536 765641 747248 704383 643416 605309 624227 694983 773122 837384 884628 882732 813477
8206H13477r9186p3018k0583K1942L8578L4358J7942K309o904j1657j4119M080
8194G07219K8016J8008j631P34j5709o1486r6728r5761p4714o3714n0912q230
8182B85092J7868K6773N6418P6315Q0935Q2098P2496N7283M5748K0714k6596n8193
8170G36951l9934J6918N7927L6653k1885o2520n9245j5969K2376J3271M351J0081
8158F98975j0253k1377P927L6825L5066K0948J8281K8494L3650K8902L8014O5050
8146I80502Q9541J08643R1925K9295j3509j0048K9087O7796N6231O789n4977j08297
8134A272978j22662j15368r6811n1725J1607N8327O3825K5880j8671k5841J3851
8123A015390Q8495J42835J25947P6927L6189k756l7080o0752q6978r6839n2717
$$ plain form
8206 813477 714291 641273 620690 642632 681210 715568 733510 735819 728915 717258 703139 707219
8194 707219 735235 753243 751612 752346 736637 675151 578423 482662 407948 344234 293322 285092
8182 285092 302960 329733 386151 462466 543401 625499 697995 755278 801026 821740 795144 736951
8170 736951 697017 713935 771862 808515 786630 724110 664865 648896 671272 684543 688894 698975
8158 698975 688722 667345 675272 712097 747163 768111 786392 814886 848536 877438 915452 980502
8146 980502 1070043 1178686 1270611 1299906 1286397 1276349 1305436 1373232 1429463 1436252 1381275 1272978
8134 1272978 1150316 1034948 938137 886412 898019 956346 1020171 1046051 1027380 1001539 1015390
8123 1015390 1103885 1246720 1372667 1449594 1485783 1483027 1445947 1385195 1298217 1201378 1148661
8112A148661M476L7573N2689L5244j796l1543j8819L8851O9632L6512q456J2321
8100A375345P6424R5841N0748j329k3132l7471n4172n2500N521Q9189J35661J30768
8088A790893Q6843L2048q80j8737j1743j4435n1584n9719k0429K0111J6283j7741
8076A750910m6931o1598m7899N179N5196P4709Q1941P4961O1837O0876L2723l7876
8064B004028q8346p7567m2756j9470j7313k7428k6004K96M1983N8981M4571K7738
8052A878713L5096P9349J22033J36075J12719O2097O232m2839n8752k1195K1158
8041B330686L6638N9543R0615Q3526M9178N1747P4115P1129N0468J5666j0193
8030B903118j5703k4519k9136j2336J1925L3539M0237N1632R8296J42396J25225
$$ plain form
8112 1148661 1153137 1190710 1243399 1278643 1276847 1245304 1226485 1265336 1334968 1371480 1363024 1375345
8100 1375345 1451769 1547610 1598358 1597029 1573897 1536426 1482254 1429754 1435275 1524464 1660125 1790893
8088 1790893 1877736 1909784 1908904 1890167 1878424 1863989 1812405 1752686 1732257 1752368 1768651 1750910
8076 1750910 1703979 1642381 1594482 1599661 1654857 1729566 1811507 1886468 1948305 2009181 2041904 2004028
8064 2004028 1915682 1838115 1795359 1775889 1758576 1731148 1705144 1705440 1747423 1806404 1850975 1878713
8052 1878713 1913809 1993158 2115191 2251266 2363985 2426082 2432314 2389475 2330723 2309528 2330686
8041 2330686 2367324 2426867 2517482 2601008 2650186 2701933 2776048 2847177 2897645 2913311 2903118
8030 2903118 2887415 2862896 2833760 2821424 2833349 2866888 2907125 2958757 3057053 3199449 3324674
8019C324674O6105J5607L858J8869M2178O3126P0775P8419R9997J20583J37890
8008D042081J68256K22401K80451L08904L12282L07667L07423L17956L41442L83436
7998F992299M50710N24118N76670O32488P01243P80305Q67830R71567J092023
7989A3589253J210946J353870J600450J973597K416410K861499L282482L715010
7981C2003517M162753M539089M703051M539670L957547K928130J542849m96j519858
7972E6856252k840784l775909m252166m319733m094187l704008l253725k797235
7964B7818505k353669j951688j588224j286271j056406q64880o88854m94054k89979
7955A7244480j41343n4560j9739k3652k9003N678P1997J39668K23326L19720M23343
$$ plain form
8019 3324674 3390779 3406386 3410244 3429113 3471291 3534417 3605192 3683611 3783608 3904191 4042081
8008 4042081 4210337 4432738 4713189 5022093 5334375 5642042 5949465 6267421 6608863 6992299
7998 6992299 7443009 7967127 8543797 9176285 9877528 10657833 11525663 12497230 13589253
7989 13589253 14800199 16154069 17754519 19728116 22144526 25006025 28288507 32003517
7981 32003517 36166270 40705359 45408410 49948080 53905627 56833757 58376606 58376110 56856252
7972 56856252 54015468 50239559 45987393 41667660 37573473 33869465 30615740 27818505
7964 27818505 25464836 23513148 21924924 20638653 19582247 18717367 18028513 17534459 17244480
7955 17244480 17103137 17048577 17028838 17005186 16976183 16981861 17053858 17193526 17416852 17736572 18159915
7944A8159915N32202O47688P58653Q82558J042878J249276J482249J726357K004053
7935B8485829K343345K771299L277142L833267M457548N189476O046651P039305
7927F3443862Q176369R502068J1021487J2543864J3752745J4311461J3884934
7920A46636790J2178362R068351M725840l10553n234643r307420j2112707j3551470
7912A32092550j3770909j3064674j1768936j0225380q707190p336983o149530
7905F1068948n129006m243336l474537k822166k297402j861641j467647j142887
7897C8630326r29469q07953o96269n32675l65803k02393q642K04880M31476O58037
7887C6381515Q94358J152353J416022J693172J983037K319106K760262L319682
$$ plain form
7944 18159915 18692117 19339805 20098458 20981016 22023894 23273170 24755419 26481776 28485829
7935 28485829 30829174 33600473 36877615 40710882 45168430 50357906 56404557 63443862
7927 63443862 71620231 81122299 92143786 104687650 118440395 132751856 146636790
7920 146636790 158815152 167883503 172609343 172298790 167064147 157756727 145644020 132092550
7912 132092550 118321641 105256967 93488031 83262651 74555461 67218478 61068948
7905 61068948 55939942 51696606 48222069 45399903 43102501 41240860 39773213 38630326
7897 38630326 37700857 36892904 36196635 35663960 35298157 35095764 35087122 35292002 35723478 36381515
7887 36381515 37275873 38428226 39844248 41537420 43520457 45839563 48599825 51919507
7879E1919507L941966M607581N353677O238595P292097Q539768J0044594J1828096
7871A09765881J3888882J6264587J8972339K1893754K4735190K7040901K8170139
7864B60731673K7392943K4057993J7867105R176858r06687j0806167j9070194
7857C08443524k4779154k7658678k8014735k6507332k3890797k0827941j7785070
7850A38979817j5037249j2651011j0578184q812621p364648o168908n132376m230295
7842F9004525l500494k933085k484194k131519j847535j599096j365411j107022
7834E2036169q22233n35629k31983Q5154M29340Q26360J268843J714798K131348
7825E6902167K530874K973748L559450M286249N109416O059344P160071Q399573
$$ plain form
7879 51919507 55861473 60469054 65822731 72061326 79353423 87893191 97937785 109765881
7871 109765881 123654763 139919350 158891689 180785443 205520633 232561534 260731673
7864 260731673 288124616 312182609 330049714 339226572 338319885 327513718 308443524
7857 308443524 283664370 256005692 227990957 201483625 177592828 156764887 138979817
7850 138979817 123942568 111291557 100713373 91900752 84536104 78367196 73234820 69004525
7842 69004525 65504031 62570946 60086752 57955233 56107698 54508602 53143191 52036169
7834 52036169 51213936 50678307 50446324 50531478 50960818 51787178 53056021 54770819 56902167
7825 56902167 59433041 62406789 65966239 70252488 75361904 81421248 88581319 96980892
7817I6980892R825876J1515656J3523444J5892751J8651139K1797579K5214138
7810B13401475K8609011L1437960L2857386L1934361K7943561K0620063J0430527
7803C97234344j369710j3036622k2851626k9629791l2994320l3356534l1568304
7796B32427437k8518263k4920623k1261587j7892576j5013437j2606030j0593076
7789A01621845q913509p486244o264862n238162m401437l732191l187674k735958
7781E9661808k350660k007431j718864j445983j119507p74249m68101j90391Q1440
7772D9668062L59161O71649J040898J448986J881486K360247K913854L535270
7764F3879613M240629N062650N992104P056883Q323117R812788J1548269J3553222
$$ plain form
7817 96980892 106806768 118322424 131845868 147738619 166389758 188187337 213401475
7810 213401475 242010486 273448446 306305832 338240193 366183754 386803817 397234344
7803 397234344 395864634 382828012 359976386 330346595 297352275 263995741 232427437
7796 232427437 203909174 178988551 157726964 139834388 124820951 112214921 101621845
7789 101621845 92708336 85222092 78957230 73719068 69317631 65585440 62397766 59661808
7781 59661808 57311148 55303717 53584853 52138870 51019363 50245114 49777013 49586622 49668062
7772 49668062 50027223 50698872 51739770 53188756 55070242 57430489 60344343 63879613
7764 63879613 68120242 73182892 79174996 86231879 94554996 104367784 115916053 129469275
7756A29469275J5856630J8475654K1325413K4139198K6457034K7603802K6772677
7749B90099683K3330815J7082782Q454587j519933j1423692j9806446k5610555
7742B80607241k8484530k8752555k7177443k4573557k1525971j8432378j5582122
7735A16078685j3100204j0974678r178809p715336o560328n603199m782675m088286
7727E4075170l512529l023680k594224k227952j918235j673341j496757j328440
7719C6300012j138417r38921p11105m49621j86938M8707K66461M93928P23723
7710C4407829R67684J244810J564867J929833K317504K752904L291434L960478
7702E2437343M744970N596704O548053P699145R045299J0499213J1936650J3097826
$$ plain form
7756 129469275 145325905 163801559 185126972 209266170 235723204 263327006 290099683
7749 290099683 313430498 330513280 338967867 337447934 326024242 306217796 280607241
7742 280607241 252122711 223370156 196192713 171619156 150093185 131660807 116078685
7735 116078685 102978481 92003803 82824994 75109658 68549330 62946131 58163456 54075170
7727 54075170 50562641 47538961 44944737 42716785 40798550 39125209 37628452 36300012
7719 36300012 35161595 34222674 33511569 33061948 32875010 32923717 33190178 33684106 34407829
7710 34407829 35375513 36620323 38185190 40115023 42432527 45185431 48476865 52437343
7702 52437343 57182313 62779017 69327070 77026215 86071514 96570727 108507377 121605203
7694A21605203J3598609J3102908J1354627Q230190L922889j049665n972285j0118588
7686A54673888j2983510j4421763j4567444j3754327j2403431j0847326r282198
7679F6413889p841745o604209n560084m657621l892156l305381k877577k533116
7671B9142000k236820j968875j693788j417679j183841j016595q99135p85501
7663A7939766o68693n72860n03940m24437l37343k53882j67822q3161J3521J20225
7653A5061374K27283L41608M62737N81121O96241Q28552J004807J223939J483531
7644B1911193J776183K109269K511165K959392L389349L783244M106497M269915
7636D6816207M150745L608489K604147J213651m05564k010417l336775m232528
$$ plain form
7694 121605203 135203812 148306720 159661347 167891537 171814426 170764761 164792476 154673888
7686 154673888 141690378 127268615 112701171 98946844 86543413 75696087 66413889
7679 66413889 58572144 51967935 46407851 41750230 37858074 34552693 31675116 29142000
7671 29142000 26905180 24936305 23242517 21824838 20640997 19624402 18725267 17939766
7663 17939766 17271073 16698213 16194273 15769836 15432493 15178611 15010789 14927628 14941149 15061374
7653 15061374 15288657 15630265 16093002 16674123 17370364 18198916 19203723 20427662 21911193
7644 21911193 23687376 25796645 28307810 31267202 34656551 38439795 42546292 46816207
7636 46816207 50966952 54575441 57179588 58393239 57987675 55977258 52640483 48407955
7628D8407955m667417m703113m469340m086488l644290l171604k714814k304266
7620A8646623j942562j650079j404195j191965j017970q79379p57830o50558n81832
7611H570253n37949n00454m72465m50927m16458l70255l37490l11244k44036j42114
7601D786861p1352m8795n7614j03191j59542j93960k06427j87851j43391r8541
7591C516197p2540o7506q0915p7889n7399n9859n9081k7764k6108q3345j30007
7580B773784j20401q4422n1499m1752n8580o2908l0127M876J1615Q837J877j3213
7568B338087l2639m1860n0297o4035o5233m1526j6985j5954k4389j979K8945J7914
7556B030049j1761k6337n1908p7408p9760n6288j8565K0418L3107J6106k6989
$$ plain form
7628 48407955 43740538 39037425 34568085 30481597 26837307 23665703 20950889 18646623
7620 18646623 16704061 15053982 13649787 12457822 11439852 10560473 9802643 9152085 8570253
7611 8570253 8032304 7531850 7059385 6608458 6192000 5821745 5484255 5173011 4928975 4786861
7601 4786861 4715509 4666714 4609100 4505909 4346367 4152407 3945980 3758129 3614738 3516197
7591 3516197 3443657 3376151 3295236 3217347 3159948 3100089 3041008 3013244 2987136 2903791 2773784
7580 2773784 2653383 2568961 2517462 2475710 2417130 2354222 2324095 2328971 2340586 2349423 2351300 2338087
7568 2338087 2305448 2263588 2213291 2149256 2084023 2042497 2025512 2009558 1985169 1983190 2012135 2030049
7556 2030049 2018288 1991951 1940043 1862635 1782875 1726587 1708022 1728440 1761547 1777653 1750664
7545A750664o0186m4186j5775j1442k062K6191L0997R221O610J5058j1955o5186
7533A627949r3643o3538j5666N028J1828K5420L9135J8509l5623q3780q7565n9579
7521A288475l3815k9512l5538k283O0211Q2474O3161M8166L3136J6497l059l4699
7509A453214n1905l5279j4435j0615j5144j7377q966n370l8529q6330q1056k7271
7497A060937K3634L9228K9223K1462O595k4773m4237k0187L4878O8623M7453p807
7485A235029n7466q6681j02535j04737r2078o5877k7792K229K4043O3231J08741
7474H96107J22258O7709l8031j11092j31756j23447r7081n7204L171O2952Q8299
7463F81885Q4331P0649N6147L3428J1823L098M679K5608O3570R4556Q8238N0505
$$ plain form
7545 1750664 1690478 1646292 1630517 1619075 1617013 1643204 1674201 1683422 1690032 1705090 1693135 1627949
7533 1627949 1534306 1470768 1455102 1460130 1471958 1497378 1536513 1555022 1519399 1435619 1348054 1288475
7521 1288475 1254660 1225148 1189610 1187327 1247538 1330012 1393173 1441339 1474475 1490972 1487913 1453214
7509 1453214 1401309 1366030 1351595 1340980 1325836 1308459 1299493 1294123 1255594 1169264 1088208 1060937
7497 1060937 1084571 1123799 1153022 1174484 1181079 1156306 1112069 1091882 1126760 1195383 1242836 1235029
7485 1235029 1177563 1090882 988347 883610 791532 725655 697863 700092 724135 787366 896107
7474 896107 1018365 1086074 1048043 936951 805195 681748 584667 527463 530634 593586 681885
7463 681885 766216 836865 893012 926440 938263 941361 946040 971648 1035218 1129774 1218012 1268517
7451A268517L244k6041k8721l4295n4045p6436q9551j01827j00351n9614J5652
7440G16532N6171L4219J0684M449p034l3694l9985k1676j2685j7182j0536L9563
7428G18826J02072J03721M9054Q756j5059n6069r1815j02519o3426J2057N7388
7417G22986L4935k3169m7589k5935L1868R6721J30230R6974J0576l7054k0601
7406I69942j4000l8101n8510n3459j3136K7307N6289O8069O3420N0356K2381o645
7394A073913m276J0611Q194j4736l2080l3817l4503m3535n0160o6020r5154j32852
7382E85585j56272j25708o5569k3460Q44K3938M2707N6450O6297Q0728J05866
7371E91406J04066M7665j7810l0692M992M3560N1971N3078N7568N1148J1336m7872
$$ plain form
7451 1268517 1271761 1245720 1216999 1182704 1128659 1052223 962672 860845 760494 700880 716532
7440 716532 772703 806922 817606 822055 815021 781327 741342 719666 706981 689799 679263 718826
7428 718826 820898 924619 973673 982429 967370 911301 819486 716967 653541 665598 722986
7417 722986 757921 734752 687163 661228 693096 789817 920047 1017021 1027597 990543 969942
7406 969942 955942 917841 859331 805872 792736 820043 876332 944401 1007821 1058177 1080558 1073913
7394 1073913 1069637 1080248 1088442 1073706 1041626 1007809 973306 929771 879611 813591 718437 585585
7382 585585 429313 303605 238036 214576 215420 239358 282065 338515 404812 485540 591406
7371 591406 695472 743137 725327 694635 699627 743187 795158 848236 905804 956952 968288 920416
7359I20416o6149j3490P2815J21356J01247L7009J0585M8371Q1371Q2685N4908
7348A451124J210m5831p0591o4800k6383J0970J0951J8804O5781J18548J43186
7337A612969J58602J86260K02398J81654J71485J99466K27937K47257K49406K38678
7327C676112K43033K73078K98182K74589K12181J41846Q1510O2973P7141J02535
7317E443180J13223R9798R2988R2846P8437L3276m1930j34373k19622k59764k63112
7306E034947k72935k87510k80270k55650k09556j46594j01739p3504l6346J6595
7296C387438P1138J23125J66657J76219J40111J03914R7221Q5327N4937L344k3782
7285D385649r459j326j0019k387k448l6009q0069j23209j67939j96900j84526
$$ plain form
7359 920416 854267 840777 913592 1034948 1136195 1173204 1183789 1232160 1313531 1396216 1451124
7348 1451124 1452334 1406503 1335912 1271112 1244729 1255699 1266650 1285454 1351235 1469783 1612969
7337 1612969 1771571 1957831 2160229 2341883 2513368 2712834 2940771 3188028 3437434 3676112
7327 3676112 3919145 4192223 4490405 4764994 4977175 5119021 5200531 5263504 5340645 5443180
7317 5443180 5556403 5656201 5749189 5842035 5920472 5953748 5911818 5777445 5557823 5298059 5034947
7306 5034947 4762012 4474502 4194232 3938582 3729026 3582432 3480693 3407189 3370843 3387438
7296 3387438 3458576 3581701 3748358 3924577 4064688 4168602 4265823 4351150 4406087 4409431 4385649
7285 4385649 4376190 4374864 4364845 4362458 4360010 4324001 4243932 4120723 3952784 3755884 3571358
7274C571358j75672j84540j72137j50743j37070j37121j48085j38442j17074j18041
7264B092433j31560j35259j11059p7127n7735n0951l6215r620l273k2511o7599
7253A389524j26979j66503j48784p3151j3357j9459l9596l7867l4494k6355j1740
7242F91239k0342k7553J9668P6290Q3973P5766P0462M5803P814k3697m6010o9701
7230H83712j02134j14846q9723m8646j0533K229j4064l601O2412J30599J38588
7219H33993Q3289K2454r473j844M2613R0329J11137J10246J14497J00121L2853
7208A530215l5495o7773p0092k9360L0152N6044P0615R8918J09895Q3084O0084
7197A836287R0408J51996K04595K41881K53842K30967K06136K14814K41285K82195
$$ plain form
7274 3571358 3395686 3211146 3039009 2888266 2751196 2614075 2465990 2327548 2210474 2092433
7264 2092433 1960873 1825614 1714555 1637428 1579693 1528742 1492527 1482907 1479634 1457123 1389524
7253 1389524 1262545 1096042 947258 874107 860750 841291 801695 763828 729334 702979 691239
7242 691239 670897 643344 663012 739302 823275 899041 969503 1015306 1023120 999423 953413 883712
7230 883712 781578 666732 577009 528363 517830 520059 505995 502394 564806 695405 833993
7219 833993 917282 939736 930263 928419 971032 1061361 1172498 1282744 1397241 1497362 1530215
7208 1530215 1494720 1426947 1356855 1327495 1357647 1413691 1484306 1583224 1693119 1776203 1836287
7197 1836287 1926695 2078691 2283286 2525167 2779009 3009976 3216112 3430926 3672211 3954406
7187C954406L24783L32999K99822K32571J65132J32793J19195R2410O0559O5247
7177E779917J16289J56149J49884J27769P8401k0582j15736j32283r9580q7405
7167E952823p5758l9661L3394J14008J49364J03524j0055j28128j90399j86279
7157E722833j58353j24616r8442q2596p2927r9134j65559k41454k91658l05260
7147D082834k63861k12355j91099j68691j58936j83801k17469k39773k41810k15141
7137A989898j87250j61485j09785m5086j0235o982j3343l6838p9531j25893j29636
7126A083834q2256l5259k809K1046K9570J3538l986j1616j8711k9812n6179q1364
7114H25996q7145o0457R192N4548L4149K6964M2772K7137j7474o3514j04819j30180
$$ plain form
7187 3954406 4279189 4612188 4912010 5144581 5309713 5442506 5561701 5654111 5714670 5779917
7177 5779917 5896206 6052355 6202239 6330008 6408409 6387827 6272091 6139808 6040228 5952823
7167 5952823 5877065 5837404 5870798 5984806 6134170 6237694 6227639 6099511 5909112 5722833
7157 5722833 5564480 5439864 5341422 5258826 5185899 5086765 4921206 4679752 4388094 4082834
7147 4082834 3818973 3606618 3415519 3246828 3087892 2904091 2686622 2446849 2205039 1989898
7137 1989898 1802648 1641163 1531378 1486292 1476057 1469075 1455732 1418894 1339363 1213470 1083834
7126 1083834 1001578 966319 963510 984556 1014126 1027664 1023678 1012062 993351 963539 907360 825996
7114 825996 738851 678394 687586 742134 776283 803247 846019 873156 855682 792168 687349 557169
7102E57169j13844p1252l0611J0398M1769M4545J5767r024J4428M9097K8578r761
7090E27259k7183k8453k3227j4531k7585o3690p1280l8819k1637l7515m0518j568
7078A31253L8928L7781K7274N2062Q2957N9048l026k4997j2779k0722l4838m396
7066C28545N4901R4268J01510P8271N4985N5665N2793K4305l800k681K1543L1353
7054H91658J7227j5039n6336q7795r7152p2847l1551n520J9154N2454N6259K5004
7042F95516j2506l1820j5746J1659L8180M2349J1999k1972p5988j36830j33635
7031C71206p6359k8219r271q715k0112j3217J8065K9027O303j5674j0659J3466
7019B55841L5988M5929L3729K3917O708m5173q1956p9050p6597q6180p1542k0609
$$ plain form
7102 557169 443325 372073 341462 351860 393629 438174 453941 444917 459345 508442 537020 527259
7090 527259 500076 471623 448396 433865 406280 342590 271310 232491 210854 173339 132821 131253
7078 131253 170181 207962 235236 287298 370255 429303 426277 401280 388501 367779 332941 328545
7066 328545 383446 477714 579224 657495 712480 768145 820938 845243 841443 838762 860305 891658
7054 891658 908885 893846 837510 749715 652563 579716 548165 542645 561799 614253 670512 695516
7042 695516 683010 651190 635444 647103 685283 727632 739631 717659 641671 504841 371206
7031 371206 294847 266628 257357 248642 228530 215313 233378 262405 268708 253034 242375 255841
7019 255841 291829 337758 371487 395404 402112 356939 274983 195933 119336 33156 -38386 -58995
7007e8995J8518L9947O9347P3123L3164o429j129L0104K7355j6582n3324n5724
6995I9375m1740k9207q68M4446P7224Q2077N6112Q433j8185O172M3804M5197K221
6982C75061k9981j9316p808M374K9740K4718k2856n9343p1936p5150m1181K7017
6970A33339P4442N4251j0550m1021k2653r556k3405n2831p7828q4771q5336p2173
6958b18092k1336K3006L4258L8757M3942M6936K1852j8095k9284p422J7766J7245
6946e0467K70R292N3745P5189O6311M6765K2031k3541q3631j00149n6216N710
6934c4691L4183K9719K0768K8011L6220M6007P0756J01709J04520O9351K0258
6923E26811k696R580K2123N548l0048o3966r8468j28491j35003r7958l1456M0241
$$ plain form
7007 -58995 -40477 -530 68817 141940 175104 168675 167546 197650 225005 208423 155099 99375
6995 99375 57635 28428 27560 72006 149230 231307 287419 295852 277667 283839 327643 372840 375061
6982 375061 345080 325764 317956 322330 352070 376788 353932 294589 222653 147503 106322 133339
6970 133339 207781 262032 251482 210461 187808 178252 154847 102016 24188 -60583 -145919 -218092
6958 -218092 -239428 -216422 -182164 -143407 -99465 -52529 -30677 -48772 -78056 -85478 -67712 -50467
6946 -50467 -50197 -40905 12840 88029 154340 201105 223136 199595 115964 15815 -40401 -34691
6934 -34691 -508 29211 49979 77990 114210 160217 230973 332682 437202 506553 526811
6923 526811 524115 533695 555818 561366 531318 467352 368884 240393 105390 7432 -24024 16217
6911A6217R7617J13916Q5780L9673M161k2549n1204r9929j27852r2133k1294M2352
6899a5245O8847O2205M3318K3075J3572J7821P268k5931m6807m2865l9140m7925
6887A8193k9862K1731N2114M2640K5578J9872K0810K5213J3416n610M396K0999
6875B29490K5748K5081N712l4273n7924l3421j5177m6703q9513j09256j05213
6864b05449p6064k7087L1512Q8738J22285J19997O8682j6825q6412r5887m1487
6853a17997K8571O6226N9792L6274J6708R891J6973K3033J4895n704l2813o0124
6841E5725p9709p6860l7017J8887M1811M8911P2428R7302J05983Q8809M5513j1993
6829C69790n3110o9142n7532j7880K956j094R647J9451K716j6695j4221J099K5690
$$ plain form
6911 16217 113834 227750 313530 353203 357364 334815 283611 183682 55830 -36303 -57597 -15245
6899 -15245 53602 115807 159125 182200 195772 213593 220861 194930 148123 105258 66118 18193
6887 18193 -11669 10062 62176 104816 130394 150266 171076 196289 209705 204095 208491 229490
6875 229490 255238 280319 286031 251758 193834 160413 145236 98533 9020 -100236 -205449
6864 -205449 -281513 -308600 -277088 -188350 -66065 53932 122614 105789 19377 -76510 -117997
6853 -117997 -89426 -23200 36592 72866 89574 99465 116438 139471 154366 148662 115849 55725
6841 55725 -23984 -100844 -137861 -118974 -77163 -28252 44176 141478 247461 336270 381783 369790
6829 369790 316680 247538 190006 172126 175082 173988 183635 203086 205802 189107 174886 175985 201675
6816B01675M5561M1587K5549k507l3157m0893j3869K2587K8734R90l6853m9722
6804A89682l0278p92L3950M8308L0282P639j1813n1504q5730p9531o3483o8006
6792h1276o4620l6243K02L4446P0245R7528R5584Q1073O2697J8470l4282m3275
6780B00549o476K7053K5237n637j7466j1365j8544k4540l0691l0044l1514l2090
6768D4472k5628j4409J7295K9020K2579K2267K2038K5249N0952O5642K3583n4852
6756B28208j21526j58948j56839j08096k8742M1121P8280Q1129O8274O0405N6331
6745C9597M5877J6767k0861k7387L150L1694J9110k8293p0609r3627p7739j4876
6733a77197N5878Q3425O9951O6508P2930M3464l658m1198p7700r1224o4069k7557
$$ plain form
6816 201675 247236 288823 314372 311865 278708 237815 223946 246533 275267 276257 239404 189682
6804 189682 159404 158612 192562 240870 271152 278791 266978 215474 129744 50213 -13270 -81276
6792 -81276 -145896 -182139 -181937 -147491 -77246 20282 115866 196939 259636 278106 243824 200549
6780 200549 194073 221126 246363 240726 223260 211895 193351 168811 138120 108076 76562 44472
6768 44472 18844 4435 21730 50750 73329 95596 117634 142883 193835 259477 283060 228208
6756 228208 106682 -52266 -209105 -317201 -345943 -304822 -226542 -145413 -77139 -16734 39597
6745 39597 85474 102241 81380 53993 57143 88837 107947 79654 9045 -84582 -162321 -177197
6733 -177197 -121319 -37894 32057 98565 171495 214959 211301 170103 92403 1179 -62890 -90447
6721i0447m25K4960L8548M5654N3534N5024M3744L7210M5266N4467L3236m025
6709C36746k0246k3139l0861n5189q6879r6068o7214k5826J0267J1348j3043J71
6697e9933M9228P1774N1706L0638K6769J8562k0612n7666l1970J4221L1613J6102
6685A40432l5073r1023r9732o5556j0495M0457N5430L9245K4506J9558O580j2541
6673A1788m7386q4721p4828k2312K2744L3361L3737K9618K2221K5705L1445K5416
6661F788K7177M2543M1047J2235j3071k5424m9111o2586n4575l0506K4819P0353
6649a0311O2764M1015M8563O9594O6450L1345N006J6835K6517J3529M578K235
6637C78120j2673l1471m4718m6339l6998n1330p2991p6301p8461o1267N16O1228
$$ plain form
6721 -90447 -90872 -65912 -27364 18290 71824 126848 170592 207802 253068 307535 340771 336746
6709 336746 316500 293361 262500 207311 120432 24364 -42850 -68676 -58409 -47061 -60104 -59933
6697 -59933 -10705 61069 112775 143413 170182 188744 168132 110466 78496 92717 124330 140432
6685 140432 105359 14336 -85396 -150952 -161447 -120990 -65560 -26315 -1809 17749 24329 11788
6673 11788 -35598 -120319 -195147 -217459 -194715 -161354 -127617 -97999 -75778 -50073 -18628 6788
6661 6788 33965 76508 117555 129790 116719 91295 42184 -20402 -74977 -105483 -80664 -10311
6649 -10311 52453 93468 142031 211625 278075 309420 314426 331261 357778 371307 375885 378120
6637 378120 365447 333976 289258 242919 205921 154591 81600 5299 -73162 -134429 -133913 -72685
6625g2685R1844J07061J06962O2346L150K81L5672L9930O855k2484n2274p9715
6613B26943p0913n6141n6532k6878K3085M5646L6386J7299P42K938j985k3065
6601A17525k0589M014K5707K3573k425j3118k977l914n473Q60M653j8672o3538
6588D5626q8192p4820k5989K3743L5280J8141N72k2595p4710j10318q6130m0512
6576c99904k054L9499P7412Q8288P1733N0445L5693L5534L6385L1229J2652j9429
6564E7483k7202n958J4932K1234J4744l898k8342l6297k8533k1318m746K6055
6552b1846L6898J9930j8383m4436j6286L5682N0867K2678J077J2226L9576L7625
6540A55608q49k2684p994Q437R688j673m1514q2254q2556n7446j9903J9612L6472
$$ plain form
6625 -72685 19159 126220 233182 295528 298678 298959 334631 374561 381416 358932 306658 226943
6613 226943 156030 99889 43357 16479 39564 85210 121596 138895 139637 142575 140590 117525
6601 117525 96936 100950 126657 150230 147805 134687 131710 127796 122323 123183 127836 109164 45626
6588 45626 -42566 -117386 -143375 -119632 -84352 -66211 -65639 -88234 -162944 -273262 -359392 -399904
6576 -399904 -401958 -362459 -285047 -196759 -125026 -74581 -38888 -3354 33031 64260 76912 57483
6564 57483 30281 24323 39255 60489 75233 71335 42993 6696 -21837 -43155 -47901 -21846
6552 -21846 15052 34982 16599 -27837 -44123 -8441 42426 65104 66181 78407 117983 155608
6540 155608 154759 132075 124081 132518 142206 140533 99019 16765 -65791 -123237 -143140 -123528 -87056
6527h7056O8538J20786J27370R7138P7541N3514J1845j3383j9092k7673k5036
6516C84492j3333k0698m2226p2976j06568j21322r5645l0960L3035N3659M3911
6505A1369K8186m519m5033p0689o8180m5103k2078k0287l9218l1294N092J8930
6493b82824K8357M1543M3001M0322L6045L3624K2322l973k6447m0571m3346l8705
6481a90652k6687q155N128O750J4768K8994L1829L4409M5344M9660K2155j0135
6469C408j4837j7320l4468l2813r513K2043M4961M2046M6336P6768R6298P7347
6457C00256M5165K8475K0818N188k5420m9277m9077m7456n1586m7143j7278K2964
6445A35629M5093M0130K5867K6174M7018P7210O4592O741m5421n9181m9972n1111
$$ plain form
6527 -87056 -18518 102268 229638 326776 404317 457831 469676 456293 437201 409528 384492
6516 384492 371159 350461 308235 235259 128691 7369 -88276 -119236 -86201 -32542 11369
6505 11369 39555 35036 -9997 -80686 -148866 -193969 -216047 -236334 -275552 -306846 -301754 -282824
6493 -282824 -254467 -212924 -169923 -129601 -93556 -59932 -37610 -41583 -68030 -108601 -151947 -190652
6481 -190652 -217339 -225494 -220366 -213616 -198848 -169854 -138025 -103616 -58272 -8612 13543 3408
6469 3408 -11429 -28749 -63217 -96030 -105543 -83500 -38539 3507 49843 126611 222909 300256
6457 300256 345421 373896 394714 399902 374482 325205 276128 228672 177086 129943 112665 135629
6445 135629 180722 220852 246719 272893 319911 397121 461713 468454 423033 363852 313880 262769
6433B62769o1194n8021j6732M9248P5490N1919N750n0615p6381n8967m7560m8924
6421B6782m9182o1030o6407n9176m7005j7503K1298M2283L8473K1373n57p661
6409a58312R242M0520O0377N6349L1914Q888m169l1464n8370n5602k0165K1563
6397i9229L0851J7074L954K260J199k747J9839O7862R3184O5165j402m8337o0935
6384H8738m6371r496r21k9921m8645m0005k0298k814J3007L2156N4425P7441Q9556
6371A56852O2178n366n7668n9754m2195k1107Q242M1335O2165O8462P1434M7785
6359C32363j0894n1439k8939K4775J5563o0784j07627p9115l7865k86N4293Q5023
6347A35068M7291k2808m7082k0538q714j0554J5625N8020O7731L2176L124K84
$$ plain form
6433 262769 201575 143554 126822 176070 251560 303479 309229 258614 182233 123266 75706 26782
6421 26782 -22400 -83430 -149837 -209013 -256018 -273521 -252223 -209940 -171467 -150094 -150651 -158312
6409 -158312 -149070 -108550 -48173 8176 40090 48978 44809 13345 -45025 -100627 -120792 -99229
6397 -99229 -68378 -51304 -47350 -45090 -43891 -46638 -26799 41063 134247 199412 198010 149673 88738
6384 88738 42367 32871 31950 2029 -46616 -86621 -106919 -109733 -96726 -64570 -10145 67296 156852
6371 156852 219030 213664 155996 96242 54047 32940 41182 82517 144682 213144 284578 332363
6359 332363 321469 270030 241091 265866 281429 220645 113018 33903 -3962 -4248 50045 135068
6347 135068 182359 159551 112469 91931 83217 72663 88288 146308 214039 246215 249339 249623
6335B49623o276n455J4069K3810J0323k1802m2028l7602k4187k1429m4190q0715
6323A4141j02690p9605p498N6584P6030P8784Q5407O3793Q9m6933l9015J3476
6311A12563O4661N5970K493k3390j6878J630K5872J1683k0305n112M1983M8110
6299B99280J6918l47k4600n9941p5652m2497L2438O7633L2808q211j8875j6444
6287B02510j3866k1589m4340n4098k6446j721l895q722J0496N1693Q6662Q2995
6275B59679M9538K4343J4190m41j4698j2762j6820m4726m5653k851J9775J0496
6263B40070J4573K4909K6432L3349N3580P1133O3761M4394K2733j0567m3358n5607
6251D85402l3018M294L5112O1682P0206K8116m1452o6574l1517J2233K6121K0326
$$ plain form
6335 249623 243347 237892 251961 275771 286094 264292 222264 184662 160475 139046 94856 14141
6323 14141 -88549 -168154 -175652 -119068 -43038 35746 121153 184946 185035 138102 99087 112563
6311 112563 177224 233194 235687 212297 195419 197049 222921 234604 214299 209187 251170 299280
6299 299280 316198 315851 291251 231310 155658 113161 145599 213232 246040 237829 218954 202510
6287 202510 188644 167055 122715 68617 42171 40450 36555 27833 38329 90022 176684 259679
6275 259679 309217 333560 347750 347309 332611 319849 303029 258303 212650 209799 229574 240070
6263 240070 254643 279552 305984 339333 392913 464046 527807 572201 594934 584367 541009 485402
6251 485402 452384 456678 491790 553472 623678 651794 610342 543768 512251 524484 550605 570931
6239E70931L0694N5018M5427J9965L4137N9902N7810O2824P4316N8200L6456L3946
6227A139626O2665J03998J18290J00610Q7732R4479R3412P7393O3809P8481J22568
6216B143063J63978J59639J33722J26403J03747O4534K2642m2509j26847j89682
6206B558690j73688r0006r694L1961N0949N2607K6858k7602o0630l1838J393N917
6194B334917j3248m9077q4635r9356r3380p2747l2179n369m2358j08755j14606
6183A619207n0349J4637J4862n1575j30492j56461j24924p1702m0105n1665q0780
6172H90653j01901r0643m0162l139M26O042J6179K0630J0798l0145q8048j26497
6160D64193j33307j19036r7994q6065p8393n8195j7164M3403Q6307P1930K1543
$$ plain form
6239 570931 601625 656643 702070 722035 756172 816074 873884 936708 1011024 1069224 1105680 1139626
6227 1139626 1202291 1306289 1424579 1525189 1612921 1707400 1800812 1878205 1942014 2020495 2143063
6216 2143063 2307041 2466680 2600402 2726805 2830552 2895086 2917728 2875219 2748372 2558690
6206 2558690 2385002 2294996 2285302 2317263 2368212 2420819 2447677 2420075 2359445 2327607 2329000 2334917
6194 2334917 2321669 2272592 2187957 2088601 1995221 1922474 1890295 1884926 1842568 1733813 1619207
6183 1619207 1568858 1583495 1598357 1546782 1416290 1259829 1134905 1063203 1023098 971433 890653
6172 890653 788752 698109 657947 654808 655234 661276 677455 698085 708883 678738 590690 464193
6160 464193 330886 211850 113856 27791 -50602 -108797 -125961 -82558 3749 75679 97222
6149I7222o779L457K3811K1349N461j8270k9042j5720O764M1535Q7670R4805M3044
6136C55307j1678j8667o850r874k7747m1343k2996J9549N1360L8784j18l0511
6124B95216k7649j688n803n5390j11623j02555n9466m2109l6012j7148Q937Q664
6112a46626m971K8083R9934J21493Q5462K8111q428L40K1460J3202q512j9468
6100B10080l2743n6945l6721K1867M4085J2252j5013r462K1974N3520N1133O629
6088B70656l1394l2992j1620J3555J6773q210l6276m3139l8680k8786j6093j4783
6076C9011j0476J6191K8721J5651N800K6284L2074L967Q13K8782J5590m2728p8693
6063H0987o7908l4649r053R063K0741K4302L4545M2483L2604M5755Q2979P7688
$$ plain form
6149 97222 90443 93900 117711 139060 144521 126251 97209 81489 88253 129788 217458 312263 355307
6136 355307 343629 324962 318112 308238 280491 239148 216152 235701 287061 325845 325727 295216
6124 295216 267567 265879 260076 204686 93063 -9492 -68958 -111067 -147079 -164227 -155290 -146626
6112 -146626 -151597 -123514 -23580 97913 183375 211486 203058 203398 224858 238060 229548 210080
6100 210080 177337 120392 83671 105538 149623 161875 146862 137400 159374 212894 264027 270656
6088 270656 239262 206270 194650 208205 224978 216768 180492 137353 98673 69887 53794 39011
6076 39011 28535 44726 73447 89098 94898 121182 153256 157223 158036 186818 202408 159680 80987
6063 80987 13079 -21570 -30623 -21560 -819 23483 58028 100511 133115 178870 261849 339537
6051C39537L1923j1294l7915n4555o9901o8351k9494J9096N9828P0919M1530J2619
6039C03942K1502N2147O7992M2410R214L36j1950l4128m1922k3579J1327J4169
6027D11460k2237m5195m4489k5817R959L4449L4521M0489M8537M9932O6296J17883
6015F75788J57717J17810L9386k0700n9402p9350p4676l4433J8602M1091K1612
6004H03445M205K1414N0220Q2598R1408O9363L6179J3165o698l1687k1481J5639
5992A127770K5439M071J1301O3781J23528J39769R7350M9394M4721M7650M4884
5981A779658M6651M8768O1188Q6512J18190J37972J29277J06961P0755L5053K2943
5970B643928m35l0345m0775k2984j6500k3961j2683o313k926P15n703Q160J9693
$$ plain form
6051 339537 371460 360166 322251 267696 197795 129444 99950 119046 178874 249793 291323 303942
6039 303942 325444 377591 445583 487993 497207 497543 485593 451465 409543 385964 397291 411460
6027 411460 389223 344028 299539 273722 283681 318130 352651 393140 441677 491609 557905 675788
6015 675788 833505 951315 990701 970001 910599 831249 756573 722140 740742 781833 803445
6004 803445 807650 829064 879284 961882 1053290 1122653 1158832 1171997 1165299 1133612 1112131 1127770
5992 1127770 1153209 1157280 1168581 1232362 1355890 1495659 1593009 1642403 1687124 1734774 1779658
5981 1779658 1826309 1875077 1936265 2022777 2140967 2278939 2408216 2515177 2585932 2620985 2643928
5970 2643928 2643493 2613148 2572373 2549389 2532889 2508928 2496245 2489932 2487006 2487721 2482018 2490178 2509871
5957B509871j1174n7577r5549j07912j00008j07797j39947j69416j70514j41661
5947A408316j11511q3460p7834q5970n6451k2553l3750n4001l1203Q682K4068
5936H84333J2537j3150l4316m2490k9475j2203k5301m6045n2324n3559m4142k8528
5924E15337N311M0522L0863k65k6231k4142J0626L7914K2173r715k9827k9312
5912E43254j186K4846K2302j3625m3370k5416J2012R848k8500m5218j9688J8230
5900D53489L6178N3559R3363J13509R8717P8164M8719K5041M3394P9893Q6683
5889A210709N5054J6296k2715r5932k00533k39195j74321q8815m5383l2789k5976
5878C56400k7894m0535l0529j3211m443J229M993K842j4027l0544k6166k062K0174
$$ plain form
5957 2509871 2498697 2441120 2345571 2237659 2137651 2029854 1889907 1720491 1549977 1408316
5947 1408316 1296805 1213345 1135511 1049541 993090 970537 936787 882786 851583 860265 884333
5936 884333 896870 883720 849404 806914 777439 765236 739935 693890 641566 588007 543865 515337
5924 515337 520648 561170 592033 591768 565537 541395 552021 589935 612108 602393 572566 543254
5912 543254 542068 566914 589216 575591 532221 506805 518817 528665 500165 454947 435259 453489
5900 453489 489667 543226 636589 750098 848815 926979 975698 1000739 1044133 1124026 1210709
5889 1210709 1265763 1282059 1259344 1163412 962879 723684 549363 460548 415165 382376 356400
5878 356400 328506 287971 257442 244231 239788 241017 246010 248852 234825 204281 178115 176053 196227
5865A96227J9252k720k1444k9856n263J8431J0367L942K7730N3554M4314K8234
5853C42768K4619k5606j24404j72747j60335j32972r7966l1896L0989M1059L1970
5842b74521M3581N2174L7959Q385j0919k69J6153J9584K3958J4628Q094K1366
5830c9827P371l7069o4794n6720j8281J4901r604n0708m2962l281J3577K635J0913
5817b73849M8217Q3097J17759J55411J56478J12909N7222K1892j661l0642m8280
5806C98553l2254p462K477j6639n2422o5882o4551o5971n2593m0078n2829o2317
5794a11968k2120L8065M6435J0788l3448n8340k1808L3585M5302L3137J6418q536
5782c2490k3039k2524j0364R991Q15l3123l8044m625L4717O4460O6258M5729L6348
$$ plain form
5865 196227 215479 212759 191315 161459 156196 174627 184994 188936 216666 270220 314534 342768
5853 342768 367387 341781 217377 44630 -115705 -248677 -346643 -378539 -347550 -306491 -274521
5842 -274521 -230940 -178766 -140807 -132422 -143341 -143610 -127457 -107873 -83915 -69287 -61193 -39827
5830 -39827 -32456 -69525 -134319 -191039 -209320 -194419 -204023 -254731 -297693 -300974 -287397 -284762 -273849
5817 -273849 -225632 -142535 -24776 130635 287113 400022 457244 479136 477475 446833 398553
5806 398553 366299 358837 361314 344675 292253 226371 161820 95849 43256 3178 -49651 -111968
5794 -111968 -134088 -96023 -49588 -38800 -72248 -130588 -152396 -118811 -73509 -40372 -23954 -32490
5782 -32490 -55529 -78053 -88417 -78426 -77611 -110734 -148778 -153403 -118686 -54226 12032 57761 94109
5769I4109L5672J2601j0459k854J3874L0675N0624N8207M1100K5783K8954J0768
5757C89054m7557j00546r5855m8558j5038m203j2989l0972k8041k2460k2397k1193
5745f0755l1075l4870M879N7729N6246K3464J3418J9592N014m9586j09725j08082
5733b13751n4136j379L1995L3568J5416j1143k6682k5909p013L4326Q3599J07839
5721c3270R6052O7688M2012J5102o104j8895l2375l5204m294M6930P4487M6181
5709B58310l868l6650o1485q0846p7878o4016n0356l7315n0067n8949k5758L2985
5697b55893R5017J28878J21551J11815J19251J08797M5718k9641o8893p7408o5923
5686B33269n9950n9601k3391M6894Q8107O2997m782o9400o2495J2675Q1289J07240
$$ plain form
5769 94109 129781 142382 131923 129069 142943 173618 224242 282449 323549 349332 378286 389054
5757 389054 341497 240951 145096 96538 81500 77297 64308 33336 5295 -17165 -39562 -60755
5745 -60755 -91830 -126700 -121821 -64092 -7846 15618 29036 48628 53642 4056 -105669 -213751
5733 -213751 -267887 -269266 -237271 -203703 -188287 -199430 -226112 -252021 -259034 -224708 -141109 -33270
5721 -33270 62782 130470 172482 187584 181480 162585 130210 95006 90712 137642 212129 258310
5709 258310 254442 217792 156307 75461 -2417 -66433 -116789 -154104 -204171 -263120 -288878 -255893
5697 -255893 -160876 -31998 89553 201368 320619 429416 475134 445493 376600 299192 233269
5686 233269 173319 113718 90327 137221 225328 288325 283543 214143 151648 164323 245612 352852
5674C52852J01097Q5945P4557M9246L1519L7771M2756N0665P4051R9210Q0532
5663A080201J4143m0020n2710m6045m8933q8169j27788j14203o4778k4408q461
5652D78829l1970q0757j24821j31703j02564n5638l291L3489L8731K5955N439
5641E1699m5129q5497p1310j7129K8332N0633M9881J9149j5252p867K4882J0809
5629f799m7171r0415q5615k5733N0108Q6633Q1928N5286M2242N9505O9090L8617
5617B27676j4167n3417q1252r9691r2549n0048Q553N5356N9749J7290l3534m8574
5605a04608l3864l6987m9001k5069J3981L5364L7689J7792o441k0635j6043K0791
5593a67031N8558O9881O0775L1611J1154J5611K1582J3361j6939n0617n0183j4590
$$ plain form
5674 352852 453949 539894 614451 663697 695216 732987 775743 826408 900459 999669 1080201
5663 1080201 1094344 1054324 1001614 955569 906636 818467 690679 576476 511698 487290 478829
5652 478829 446859 366102 241281 109578 7014 -48624 -51915 -18426 20305 46260 51699
5641 51699 6570 -78927 -150237 -167366 -139034 -88401 -38520 -19371 -34623 -42490 -17608 -6799
5629 -6799 -53970 -144385 -230000 -255733 -205625 -118992 -37064 18222 60464 119969 189059 227676
5617 227676 213509 160092 78840 -20851 -113400 -163448 -154895 -99539 -39790 -22500 -56034 -104608
5605 -104608 -138472 -175459 -224460 -249529 -235548 -200184 -162495 -144703 -151144 -171779 -187822 -167031
5593 -167031 -108473 -38592 22183 53794 64948 80559 102141 115502 98563 47946 -2237 -16827
5581a6827L8821M8031J1599j4402o824J7891K1808K1358K2469J0633K1260M5828
5569B21645L9612q548o3165p9544k8930M2096M9809J8089J4945M0785O7754P1955
5557C86503M4184N684j9444m0584o3744o9635n4911m0461k9945p882P834J9464
5545A37063M5424N6054M6720M7912J9284l4808o9567r6524j05675o5630j3154
5534c2901J7486L3229K7689j8830p7279r4187p0149m7139l6194m2469m4303k0198
5522d05245R64l590q363L5728J21555J80605J68348J03055L2566n302l4155n7951
5510A28215m0452n515J0026j116n5394j16535j17394p2006j9672L9852N9337J2213
5498a78441n7685r6268l8208P7303J37367J21447O6954J5360j5381k5793j8715
$$ plain form
5581 -16827 21994 70025 81624 67222 60398 78289 100097 121455 143924 154557 175817 221645
5569 221645 261257 252709 189544 110000 81070 123166 172975 191064 206009 246794 314548 386503
5557 386503 430687 436371 416927 376343 312599 242964 188053 147592 117647 109765 117599 137063
5545 137063 182487 238541 285261 333173 352457 317649 248082 151558 45883 -19747 -32901
5534 -32901 -15415 17814 45503 26673 -50606 -144793 -214942 -262081 -298275 -340744 -385047 -405245
5522 -405245 -404281 -407871 -416234 -380506 -258951 -78346 90002 193057 225623 220321 186166 128215
5510 128215 87763 82248 92274 91158 35764 -80771 -198165 -270171 -289843 -249991 -190654 -178441
5498 -178441 -236126 -332394 -370602 -293299 -155932 -34485 32469 47829 32448 6655 -12060
5487a2060j8197l8654n5804o7266q0648p9947m8243M027K6363P031j9564k8743
5475d11705j0950K4985O5493R4100Q7070O5438N7031O7613P4427L3368l4790q2044
5463C0036p8226m0902j0409j425l973J8074N2480O5102O3636L6173j4159o4210
5451E2197r0610p4622m1833l7247o1269o0360M307P0891P7297N0353J7913q094
5439a01077q104Q432P192j4031l3679j0511M8540P8581N9289K0350j6831l5667
5427B484m3092o8235q8752p8021o6930o2515m1673R6M3774Q5074J30639J76614
5415a0537J86812J44117Q1193K8984l486j9674l9697o9558p9734n9459l1872j9215
5403A07874j8222q709N212K8197O6966R9172Q8699K3087n7959j06046r5582m2300
$$ plain form
5487 -12060 -30257 -68911 -124715 -191981 -272629 -352576 -400819 -396792 -370429 -363398 -382962 -411705
5475 -411705 -422655 -397670 -332177 -238077 -151007 -85569 -28538 39075 113502 146870 112080 30036
5463 30036 -48190 -89092 -99501 -100926 -104899 -86825 -34345 30757 94393 130566 116407 52197
5451 52197 -38413 -113035 -154868 -192115 -253384 -313744 -309437 -238546 -161249 -110896 -92983 -101077
5439 -101077 -109181 -100749 -93557 -107588 -141267 -151778 -103238 -24657 34632 54982 38151 2484
5427 2484 -40608 -108843 -197595 -275616 -342546 -405061 -446734 -446638 -402864 -317790 -187151 -10537
5415 -10537 176275 320392 401585 430569 427083 407409 367712 298154 218420 158961 127089 107874
5403 107874 89652 80943 86155 114352 181318 280490 369189 392276 334317 228271 132689 90389
5391I0389P911K2868O614k7633n8646p5150p5027m4536n194J7886L4905L0433
5379g5180L205j4195n576R368J9831M3963N7010K8802j7525k7373k710j609k2352
5366d341m8161n6146j6685L4671N0137N1972L9196P772J560J0483J6209J8830
5354A05497J8611K3437K0991k686k4145k3759l3K8870M6304L9031K9501K3600
5342B85219J2723J2806M1756O2776N8060M8119L0002r150p4092j44074j73191
5331A50954j44674r6551o4771l6543J3894N8724O3201M6109K3048j034j1181j5662
5319a4486k9419o1045o7807l1882Q949P041l6138p2902o3950k2102J1098J5014
5307c57629J3461L2832N8696O3417O2471O8325N6467L7105L6287N1935M8134J3687
$$ plain form
5391 90389 98300 121168 127782 100149 41503 -33647 -108674 -153210 -158404 -140518 -105613 -75180
5379 -75180 -71975 -86170 -91746 -82378 -62547 -18584 38426 67228 49703 22330 19620 18011 -4341
5366 -4341 -52502 -108648 -125333 -90662 -40525 11447 50643 58415 59975 70458 86667 105497
5354 105497 124108 147545 168536 165850 141705 117946 117913 146783 193087 232118 261619 285219
5342 285219 297942 310748 352504 415280 473340 521459 551461 542311 468219 324145 150954
5331 150954 6280 -90271 -155042 -191585 -177691 -118967 -55766 -9657 13391 12357 1176 -14486
5319 -14486 -43905 -104950 -172757 -204639 -195690 -188649 -224787 -297689 -361639 -383741 -372643 -357629
5307 -357629 -344168 -311336 -252640 -189223 -126752 -58427 -1960 35145 71432 123367 171501 185188
5295A85188k9030n2716l6424J150J8575K1074J6208j5623o1305p5419o8152p9905
5283a76379j02218r5907m1674J0351K941l7739n4016l2044J3235M8246M3888K1332
5271c99984Q970K197k792N406L4976N8729N6795N1544N2392M5967K0838N336L3590
5258b6036P9345J00743R5866O9479K3194l1839p1779q3997o4748m4757l8641j4441
5246g611J3747K5811J9046J4651K4722L5987K0751r205k1293m6805n2677K339
5234A9463N4418P4783P3451N0194J9788j07r119q940r518j3631m442J8941J0632
5221B75913l5830n0322l8563n1429p3374o1015j8997P04Q442L9726N3898J8184
5209F7337k6179m6577l5162k8008m5516n6128m3231k5213j4408P435N6344Q6454
$$ plain form
5295 185188 156158 103442 67018 68168 86743 107817 124025 108402 47097 -28322 -96474 -176379
5283 -176379 -278597 -374504 -416178 -405827 -402886 -440625 -494641 -526685 -513450 -465204 -421316 -399984
5271 -399984 -391014 -388817 -391609 -386203 -351227 -292498 -235703 -184159 -131767 -85800 -64962 -59626 -26036
5258 -26036 53309 154052 249918 319397 342591 310752 238973 154976 90228 45471 6830 -7611
5246 -7611 6136 31947 50993 65644 90366 126353 147104 137899 116606 69801 17124 19463
5234 19463 73881 148664 222115 272309 292097 291990 282871 273931 264413 250782 246340 265281 275913
5221 275913 240083 189761 151198 99769 26395 -34620 -53617 -52913 -44471 -4745 49153 67337
5209 67337 41158 -5419 -40581 -68589 -114105 -170233 -213464 -238677 -253085 -245650 -189306 -102852
5197a02852O0758J5554j1730j5776k6464l4984j5633N310K892J715J0768J2115
5185i8327L3168N3201L2242j6986l8483j8437J063j5226n8468q5068q4620n5232
5173c51173j4606K120Q5N368R583P86j317J1083L4138N7291O0539N3131M7702
5160h5270L2376K0351J5209k0746o8308o1944r423K0074M300j7001k442L6671
5148a36153N3793M1039K1330j7024o2134q6112n0060L5214Q7350N9524k1357p8716
5136a53306o1314k3971j1620j8532l7976m9741m6637m7463k0464L9538P0160N5747
5124c05579J7837l9996q6812o8836M310P1893R1315R8612R8747O5152J7654j8861
5112e4564k6250k5724m7053n1519l0621j5096J2314O0641R2390N6578k6241o2732
$$ plain form
5197 -102852 -42094 -26540 -38270 -54046 -80510 -115494 -131127 -125817 -122925 -121210 -110442 -98327
5185 -98327 -65159 -11958 20284 3298 -35185 -53622 -52559 -67785 -126253 -211321 -295941 -351173
5173 -351173 -365779 -363659 -363574 -358206 -348623 -347837 -349154 -338071 -303933 -246642 -186103 -132972 -85270
5160 -85270 -52894 -32543 -17334 -38080 -106388 -168332 -177755 -157681 -153381 -170382 -172824 -136153
5148 -136153 -82360 -41321 -19991 -37015 -99149 -185261 -235321 -200107 -112757 -53233 -74590 -153306
5136 -153306 -214620 -238591 -250211 -268743 -306719 -356460 -403097 -450560 -471024 -431486 -361326 -305579
5124 -305579 -287742 -327738 -414550 -483386 -479076 -407183 -315868 -217256 -118509 -53357 -35703 -54564
5112 -54564 -80814 -106538 -153591 -205110 -235731 -250827 -238513 -177872 -85482 -28904 -55145 -117877
5100a17877l5899j1799j826R339K6826M0188K9314K1320L9474O7099Q5796Q5323
5088B37278N4833J9599K4380M3577L2838K1219K5642L1603K9515J1477l5190q5860
5076D10911r9040r4406r3028o6600j9773K0440L8509K8389K5144L2729K2796J1964
5064B18035M2852R4411R2147L4608k0369l5165k7182k6255k9128k9032m3342p8121
5052A93459r1866n0797q667k6306n5840n5000k5406J1946K8921L2578J0442k4249
5040f0785j8650R992J6970R237j888K0945O4701P0884L8691R444M895J2812J8514
5027A95762M571l1666o9757o7189j9974J4685R848j4316l4624l7722j2499J7678
5015d5203J4438k0146o4843p3374k6262J7918N681m3625q0166q4002o1578k0842
$$ plain form
5100 -117877 -153776 -165575 -167401 -158062 -131236 -91048 -61734 -40414 -940 66159 151955 237278
5088 237278 292111 311710 336090 379667 412505 433724 459366 490969 520484 531961 496771 410911
5076 410911 311871 217465 124437 57837 38064 58504 97013 125402 150546 183275 206071 218035
5064 218035 260887 355298 447445 482053 461684 426519 399337 373082 343954 314922 271580 193459
5052 193459 101593 50796 42129 15823 -40017 -95017 -120423 -108477 -79556 -46978 -36536 -60785
5040 -60785 -79435 -69443 -52473 -43236 -45124 -24179 40522 111406 150097 159541 164436 177248 195762
5027 195762 200333 168667 98910 31721 11747 26432 36280 21964 -12660 -50382 -62881 -45203
5015 -45203 -30765 -50911 -115754 -189128 -215390 -197472 -191791 -235416 -315582 -399584 -461162 -482004
5003d82004K4898M1831K8450K9093N3751O0435N5036O8764Q0626O5364K8735r238
4991D5741n6630r8057r8616n4027K1945P6396O6117J7025j9295n6345p6424n2192
4979b84362K716N8192Q3977Q9252P3795L1295k5777o5577n3785j653M6369Q3074
4967C7516R2344O3870L0972O457j2508L868M7184N3041K8590K8188O1101J05704
4955E46327J32812J03045K1483o2103j03520j12063j18312j03247n6334j7067
4945B31021K908M323N231K1990J9524j52r737n561O824J9872K8585K3704j1394
4932C37138n9741r7409r3602n4529k9564l5103n5306p8557o3829j891L6307J424
4920a94662l4917j8850J8076N9195P2816O4147O7312N9976Q442m3689l9607o701
$$ plain form
5003 -482004 -457106 -415275 -386825 -357732 -303981 -243546 -188510 -119746 -39120 26244 54979 45741
4991 45741 -10889 -108946 -207562 -261589 -239644 -163248 -97131 -80106 -99401 -155746 -232170 -284362
4979 -284362 -281646 -223454 -139477 -50225 23570 54865 29088 -36489 -90274 -91927 -45558 37516
4967 37516 129860 193730 224702 231159 218651 222519 269703 322744 351334 379522 440623 546327
4955 546327 679139 782184 803667 741564 638044 525981 407669 304422 248088 231021
4945 231021 233929 238252 243483 265473 284997 284845 275108 269547 276371 296243 324828 348532 337138
4932 337138 277397 179988 86386 31857 2293 -32810 -88116 -166673 -230502 -232393 -196086 -194662
4920 -194662 -229579 -248429 -230353 -171158 -98342 -34195 33117 93093 101535 57846 18239 11538
4908A1538J8182L5240M0904K8196J1089N987J2475L625j6445k8317k1595k0908
4896G9971k6349j8244j1224j8747m5927p3932n7506R530O0936P0399M1710R28
4884A1545k032J3679J0408n237k3868k1635J8214N9796N1545N182k6119m4209
4872D7269o2621n8561l1046P468M1989M1644J1308j8457k4491k0782j4915K327
4860g8868r42r052n749p738k865J6542L2934K6342J4627p046l1119l2072o108
4847i1114J2571J8837M1725O9345P4158M5879k868l5055l9216l5103m8641n5039
4835d4521l4384k4889l7441l5772q546K3169M0974M0079K2129J8857K4749J2632
4823b964O766Q627P751j9013o8852j06197r5997o5410l4183m385R722J5744O786
$$ plain form
4908 11538 29720 64960 105864 134060 145149 151136 163611 167236 150791 122474 100879 79971
4896 79971 53622 35378 24154 5407 -40520 -114452 -171958 -162428 -101492 -31093 10617 11545
4884 11545 9513 23192 33600 28363 4495 -17140 1074 60870 112415 117597 91478 47269
4872 47269 -15352 -73913 -104959 -97491 -55502 -13858 -2550 -21007 -45498 -66280 -81195 -78868
4860 -78868 -79810 -88862 -94611 -102349 -105214 -88672 -55738 -29396 -14769 -21815 -52934 -85006 -91114
4847 -91114 -78543 -59706 -17981 51364 125522 171401 168533 133478 94262 59159 10518 -44521
4835 -44521 -78905 -103794 -141235 -177007 -185553 -162384 -121410 -81331 -59202 -40345 -15596 -2964
4823 -2964 3802 12429 20180 1167 -67685 -173882 -269879 -335289 -369472 -373857 -364135 -348391 -341605
4810c41605o747k464p937m4005p9375p7167m4628K121L0710K7960K6707L8231
4798d78199N6509O2078M3371K2558K1j9283j1347J5095K1830K2820M5280O2666
4786a56601N5254L3958L245k3859l6477l6652k0296o27J8738K4097M167l3447
4774a68500o6573n0029n588J4988J4102M1413P4758O3297M0277K5185L797l0778
4762d3651o7308q5142o4385k038N8877N6529n48n2988n5757k1344j18j498j3623
4749b92994q562L5246Q4283R0683O5066M5589L5326K4355K392r887M900K9151
4737A05548L6445L3766K8294J8324P906r846k8537l8395l6891j1214J6817L0135
4725A52352K0031L239k649j980l996l514M563j9265n7152n1957j6275J5152J6654
$$ plain form
4810 -341605 -348352 -350816 -358753 -402758 -482133 -559300 -603928 -601807 -571097 -543137 -516430 -478199
4798 -478199 -421690 -359612 -316241 -293683 -293662 -312945 -324292 -309197 -287367 -264547 -219267 -156601
4786 -156601 -101347 -67389 -64144 -88003 -124480 -161132 -181428 -182055 -163317 -139220 -135053 -168500
4774 -168500 -235073 -285102 -290690 -275702 -261600 -220187 -145429 -82132 -41855 -16670 -12873 -43651
4762 -43651 -110959 -196101 -260486 -262524 -203647 -147118 -147666 -200654 -256411 -277755 -277873 -279371 -292994
4749 -292994 -301556 -266310 -182027 -91344 -26278 19311 54637 78992 81384 71497 76397 105548
4737 105548 141993 175759 204053 222377 230283 220437 191900 153505 116614 105400 122217 152352
4725 152352 172383 175622 172973 170993 166997 163483 168046 148781 91629 39672 23397 38549 55203
4712E5203q136l9788o0408n5320k5133j361M135K3001M7883N1047P3008R1496
4700A55627L8092n7289j13525j04719p8648o3928p2242q9318o0757L644N0164
4689c92899O9277R0801J28941J39070J02931N1348K4669J3555K383M713k4322
4678B10467o9460m8332K5832P8320Q1276O3347L9047J2656q247j1080M09J1739
4666C85974K100k805O642K790o920k978Q374J181j4887q109r81k5488m7870l7007
4652B60016o571J5535J2365N721R498Q656J0550L7605M4907Q128m7178j01930
4640B57302j09749o5960m4962o2214o4354m8592n4603p0342n6859k5372J9606
4629c26099N3468M4608L0033L0542K3663K8080O1148P0771N1707L6919J3858l3254
$$ plain form
4712 55203 47067 7279 -53129 -108449 -133582 -134943 -130808 -107807 -59924 -8877 64131 155627
4700 155627 193719 136430 22905 -81814 -160462 -224390 -296632 -385950 -446707 -443063 -392899
4689 -392899 -323622 -232821 -103880 35190 138121 189469 214138 227693 230076 234789 210467
4678 210467 141007 92675 118507 196827 278103 341450 380497 393153 384906 373826 374235 385974
4666 385974 388074 385269 391911 394701 387781 384803 393177 394358 379471 371362 370381 344893 297023 260016
4652 260016 253445 268980 281345 287066 296564 305220 315770 353375 398282 406410 359232 257302
4640 257302 147553 81593 36631 -25583 -89937 -138529 -193132 -263474 -320333 -345705 -326099
4629 -326099 -272631 -228023 -197990 -167448 -143785 -115705 -54557 16214 67921 104840 118698 85444
4617H5444o9725p8024o2424m7223m2774n6861q3735q0460l8971k855j3382l2028
4605e23018r569K1025L7466N4532Q1621R4789O4084R228j2967J8992N7786M3895
4593f2136J4161K1599M7485N8983L4949j3429n4421m2687K1816O4623M6013J195
4581A38151k1089l3034m9595m8338k4539q99J9690L7594L2563O335k5105k8460
4569C274j4173l1349n1854l8783l4764o2370p5344n6323k6907Q558M0035M0149
4557b99851K8930L2274L9950M0884K8883J7726J820j5144j0174K0399O9022R3770
$$ plain form
4617 85444 15719 -62305 -124729 -171952 -214726 -271587 -355322 -435782 -474753 -477608 -490990 -523018
4605 -523018 -532587 -511562 -474096 -419564 -337943 -243154 -179070 -169842 -182809 -163817 -106031 -62136
4593 -62136 -47975 -26376 21109 80092 115041 101612 47191 4504 26320 90943 136956 138151
4581 138151 117062 84028 34433 -13905 -38444 -39343 -19653 17941 50504 56839 31734 3274
4569 3274 -10899 -42248 -94102 -132885 -167649 -230019 -305363 -361686 -388593 -380035 -340000 -299851
4557 -299851 -270921 -238647 -198697 -157813 -128930 -111204 -109384 -124528 -134702 -114303 -45281 48489
$$ [...]
##END NTUPLES=NMR SPECTRUM
##END=
