##TITLE=C13_SR158_k
 CDCl3, 22500 sc

 18.1.2023
##JCAMPDX= 6.0         $$ Bruker NMR JCAMP-DX V2.0
##DATA TYPE= NMR SPECTRUM
##DATA CLASS= NTUPLES
##ORIGIN= UXNMR, Bruker Analytische Messtechnik GmbH
##OWNER= root
$$ XWIN-NMR		Version 3.5
$$ Thu Jan 19 13:38:51 2023 Russian Standard Time (UT+4h)  she@DPX200
##.OBSERVE FREQUENCY= 50.327896
##.OBSERVE NUCLEUS= ^13C
##.ACQUISITION MODE= SIMULTANEOUS
##.ACQUISITION SCHEME= undefined
##.AVERAGES= 17520
##.DIGITISER RES= 17
##SPECTROMETER/DATA SYSTEM= spect
##.PULSE SEQUENCE= zgpg30
##.SOLVENT NAME= CDCl3
##.SHIFT REFERENCE= (INTERNAL, CDCl3, 0, 222.653)
##AUDIT TRAIL= $$ (NUMBER, WHEN, WHO, WHERE, WHAT)
$$ ##TITLE= Audit trail, XWIN-NMR		Version 3.5
$$ ##JCAMPDX= 5.01
$$ ##ORIGIN= Bruker BioSpin GmbH
$$ ##OWNER= she
$$ F:/spectra/data/she/nmr/c13/1/pdata/1/auditp.txt
$$ ##AUDIT TRAIL=  $$ (NUMBER, WHEN, WHO, WHERE, WHAT)
(   1,<2023-01-19 09:10:04.82 +0400>,<she>,<DPX200>,
      <created by zg, POWCHK disabled, PULCHK disabled
       terminated by command 'halt'
       configuration hash MD5:
       00 E9 B6 7A A2 85 ED C7 34 08 36 98 17 FE 4E 26
       data hash MD5: 32K
       D3 D2 8D 9C F3 7A B7 33 E6 3E EA 28 9C A1 C2 74>)
(   2,<2023-01-19 13:36:22.87 +0400>,<she>,<DPX200>,
      <Start of raw data processing
       efp BC_mod = 2 LB = 2 FT_mod = 6 PKNL = 1 PHC0 = -312.9208 PHC1 = 31.38446 SI = 32K 
       data hash MD5: 32K
       C9 69 6E 1C 0D 75 95 75 E1 0D 72 68 F7 50 1C 6C>)
(   3,<2023-01-19 13:36:25.37 +0400>,<she>,<DPX200>,
      <abs ABSG = 5 
       data hash MD5: 32K
       03 F1 04 93 C0 B8 5B 49 25 CD B2 59 9D 4C 93 0D>)
(   4,<2023-01-19 13:36:49.59 +0400>,<she>,<DPX200>,
      <pk PHC0 = 0.1999159 PHC1 = -1.4 
       data hash MD5: 32K
       68 3B 93 D1 C7 ED 6D CB F7 F4 C4 03 F4 FD 84 2B>)
(   5,<2023-01-19 13:36:53.89 +0400>,<she>,<DPX200>,
      <absd ABSG = 5 
       data hash MD5: 32K
       BF 74 72 F9 1A 33 6C 7C 64 52 19 61 4E 4A 0D 4E>)
$$ ##END=
$$ 
$$ hash MD5
$$ C5 3F 43 D6 DB 6D 4C AB 8B DA 20 9B 0F 8C 44 79
##$RELAX= 
##$RELAX= 
##$RELAX= 
##$RELAX= 
##$RELAX= 
##$RELAX= 
##$RELAX= 
##$RELAX= 
$$ Bruker specific parameters
$$ --------------------------
##$DU= <F:/spectra>
##$EXPNO= 1
##$NAME= <c13>
##$PROCNO= 1
##$TYPE= <nmr>
##$USER= <she>
##$AMP= (0..31)
100 100 100 100 100 100 100 100 100 100 100 100 100 100 100 100 100 100 
100 100 100 100 100 100 100 100 100 100 100 100 100 100 
##$AQSEQ= 0
##$AQ_mod= 1
##$AUNM= <au_zg>
##$AUTOPOS= <>
##$BF1= 50.322709
##$BF2= 200.13
##$BF3= 50.322709
##$BF4= 500.13
##$BF5= 500.13
##$BF6= 500.13
##$BF7= 500.13
##$BF8= 500.13
##$BYTORDA= 1
##$CFDGTYP= 0
##$CFRGTYP= 5
##$CHEMSTR= <none>
##$CNST= (0..31)
1 1 145 1 1 1 1 1 1 1 1 1 1 1 1 1 1 1 1 1 1 1 1 1 1 1 1 1 1 1 1 1 
##$CPDPRG= <waltz16>
##$CPDPRG1= <>
##$CPDPRG2= <waltz16>
##$CPDPRG3= <>
##$CPDPRG4= <mlev>
##$CPDPRG5= <mlev>
##$CPDPRG6= <mlev>
##$CPDPRG7= <mlev>
##$CPDPRG8= <mlev>
##$CPDPRGB= <>
##$CPDPRGT= <>
##$D= (0..31)
$$ [...]
##$SUBNAM4= <"">
##$SUBNAM5= <"">
##$SUBNAM6= <"">
##$SUBNAM7= <"">
##$SUBNAM8= <"">
##$SUBNAM9= <"">
##$SW= 239.972175391363
##$SWIBOX= (0..15)
0 1 3 0 0 0 0 0 0 0 0 0 0 0 0 0 
##$SW_h= 12077.2946859903
##$TD= 32768
##$TD0= 1
##$TE= 0
##$TE2= 300
##$TE3= 300
##$TEG= 300
##$TL= (0..7)
120 120 120 120 120 120 120 120 
##$TP= (0..7)
150 150 150 150 150 150 150 150 
##$TP07= 0
##$TPNAME0= <>
##$TPNAME1= <>
##$TPNAME2= <>
##$TPNAME3= <>
##$TPNAME4= <>
##$TPNAME5= <>
##$TPNAME6= <>
##$TPNAME7= <>
##$TPOAL= (0..7)
0.5 0.5 0.5 0.5 0.5 0.5 0.5 0.5 
##$TPOFFS= (0..7)
0 0 0 0 0 0 0 0 
##$TUNHIN= 0
##$TUNHOUT= 0
##$TUNXOUT= 0
##$USERA1= <user>
##$USERA2= <user>
##$USERA3= <user>
##$USERA4= <user>
##$USERA5= <user>
##$V9= 5
##$VALIST= <valist>
##$VCLIST= <CCCCCCCCCCCCCCC>
##$VD= 0
##$VDLIST= <DDDDDDDDDDDDDDD>
##$VPLIST= <PPPPPPPPPPPPPPP>
##$VTLIST= <TTTTTTTTTTTTTTT>
##$WBST= 1024
##$WBSW= 4
##$XGAIN= (0..3)
0 0 0 0 
##$XL= 0
##$YL= 0
##$YMAX_a= 111594128
##$YMIN_a= -25860987
##$ZGOPTNS= <>
##$ZL1= 120
##$ZL2= 120
##$ZL3= 120
##$ZL4= 120
##$ABSF1= 222.6533
##$ABSF2= -17.34351
##$ABSG= 5
##$ABSL= 3
##$ALPHA= 0
##$AQORDER= 0
##$ASSFAC= 0
##$ASSFACI= 0
##$ASSFACX= 0
##$ASSWID= 0
##$AUNMP= <proc_1d>
##$AZFE= 0.1
##$AZFW= 0.5
##$BCFW= 0
##$BC_mod= 2
##$BYTORDP= 0
##$COROFFS= 0
##$CY= -3
##$DATMOD= 1
##$DC= 0
##$DFILT= <>
##$DTYPP= 0
##$F1P= 0
##$F2P= 0
##$FCOR= 0.5
##$FTSIZE= 32768
##$FT_mod= 6
##$GAMMA= 0
##$GB= 0
##$INTBC= 1
##$INTSCL= 4.134877e-10
##$ISEN= 128
##$LB= 2
##$LEV0= 0
##$LPBIN= 0
##$MAXI= 10000
##$MC2= 0
##$MEAN= 0
##$ME_mod= 0
##$MI= 0.1934396
##$NCOEF= 0
##$NC_proc= 2
##$NLEV= 6
##$NOISF1= 120.0001
##$NOISF2= 80.00006
##$NSP= 0
##$NTH_PI= 0
##$NZP= 0
##$OFFSET= 222.6533
##$PC= 1.4
##$PHC0= -312.7209
##$PHC1= 29.98446
##$PH_mod= 1
##$PKNL= yes
##$PPARMOD= 0
##$PSCAL= 0
##$PSIGN= 0
##$REVERSE= no
##$SF= 50.322730123286
##$SI= 32768
##$SIGF1= 140
##$SIGF2= 120
##$SINO= 11.81781
##$SIOLD= 32768
##$SREGLST= <13C.CDCl3>
##$SSB= 0
##$STSI= 32768
##$STSR= 0
##$SW_p= 12077.2946859903
##$SYMM= 0
##$S_DEV= 0
##$TDeff= 32768
##$TDoff= 0
##$TI= <>
##$TILT= no
##$TM1= 0
##$TM2= 0
##$TOPLEV= 0
##$USERP1= <user>
##$USERP2= <user>
##$USERP3= <user>
##$USERP4= <user>
##$USERP5= <user>
##$WDW= 1
##$XDIM= 32768
##$YMAX_p= 295372343
##$YMIN_p= -7589523
$$ End of Bruker specific parameters
$$ ---------------------------------
##NTUPLES= NMR SPECTRUM
##VAR_NAME=  FREQUENCY,     SPECTRUM/REAL,   SPECTRUM/IMAG
##SYMBOL=    X,             R,               I
##VAR_TYPE=  INDEPENDENT,   DEPENDENT,       DEPENDENT
##VAR_FORM=  AFFN,          ASDF,            ASDF
##VAR_DIM=   32768,         32768,           32768
##UNITS=     HZ,            ARBITRARY UNITS, ARBITRARY UNITS
##FACTOR=    0.368581032318806, 1,           1
##FIRST=     11204.5221812756, 0,            0
##LAST=      -872.772504714734, 0,           0
##MIN=       -872.772504714734, -7589523,    0
##MAX=       11204.5221812756, 295372343,    0
$$ Real data points
##PAGE= N=1
##DATA TABLE= (X++(R..R)), XYDATA
$$ [...]
18145 -1365 -66447 -110038 -67498 39304 126868 163951 173583 133428 24913 -89599 -144568
18134 -144568 -141348 -138641 -212213 -322779 -383537 -381635 -298850 -101534 167077 405700 541824
18123 541824 562808 489005 354250 228943 165827 155957 169816 207719 240792 237111 181607
18112 181607 124000 129819 160827 138262 51582 -11223 7096 30791 -37735 -201761 -398822
18101 -398822 -525202 -536755 -470620 -349995 -188650 -53807 38253 113583 129017 76415 -713
18090 -713 -31958 14517 91012 137077 159754 180306 182152 170558 166911 168957 170714 154324 72202
18077 72202 -69200 -246160 -403556 -478750 -508143 -557467 -615934 -600660 -492022 -351626 -269836
18066 -269836 -269890 -269149 -216295 -142020 -89117 -39774 48242 134233 158077 137023 143803 198804 236813
18053 236813 177928 39171 -91979 -186788 -246963 -225412 -90594 121176 350991 539558
18043 539558 623083 554695 360911 191859 159927 233345 339091 427239 482742 512601 522559
18032 522559 467462 340933 201111 149688 196399 195491 84885 -89893 -256886 -333721 -299982
18021 -299982 -183982 -57751 16360 62705 93958 83514 19136 -69047 -120720 -89540 12517
18010 12517 156717 322477 448388 491293 457041 370729 251705 158030 167777 247897 301086
17999 301086 300779 298106 335261 381955 394075 374708 332524 300583 341750 438998 520046 553963
17987 553963 551821 511980 421247 333157 305967 339796 378972 357421 222926 -38206 -340617
17976 -340617 -636589 -912702 -1078748 -1053430 -893254 -713404 -536419 -304644 -47591 117195
17966 117195 201461 304572 389593 319118 92353 -195046 -473167 -685395 -768623 -742873
17956 -742873 -707605 -723386 -766073 -766777 -670011 -501640 -399069 -447305 -599016 -721690 -710334
17945 -710334 -564899 -382165 -249185 -193055 -231808 -363682 -534218 -661700 -730712 -789044
17935 -789044 -829698 -810291 -712847 -585535 -519742 -528452 -536019 -510688 -446980 -334856 -234412
17924 -234412 -184265 -154080 -124367 -115505 -113756 -73456 10012 85444 134925 168280 174050 181231
17912 181231 266859 440869 613520 681091 585183 378341 157698 -20576 -129781 -156047
17902 -156047 -156403 -223280 -369424 -547823 -669720 -639389 -438821 -203760 -70863 -78207 -169787
17891 -169787 -226062 -207797 -156709 -81996 -3999 17946 -4854 -7319 20096 69631 125943 115691
17879 115691 17681 -95900 -188764 -273695 -274262 -90711 196947 413558 500226 512653 524393
17868 524393 599579 742366 901302 1015036 1057605 1041719 962351 813520 649896 568778
17858 568778 632825 763283 810120 721849 593503 492264 354263 136288 -57849 -120102
17848 -120102 -54011 92341 247797 366256 446733 454630 354797 187698 -1414 -178508
17838 -178508 -336083 -462935 -519995 -460022 -328077 -222558 -168756 -148641 -152862 -147285 -82239
17827 -82239 13093 52663 2929 -101157 -224024 -370285 -553352 -737484 -861869 -841664
17817 -841664 -666924 -428002 -167448 102699 334494 510122 658087 772625 829750 837823
17807 837823 790385 684837 558492 440850 316918 181056 84012 49424 20853 -39689
17797 -39689 -128327 -254288 -385906 -456512 -456509 -413066 -328816 -213363 -60585 110084 243235
17786 243235 303728 253188 97511 -124255 -336246 -465205 -518278 -495993 -372726 -153766
17776 -153766 106557 303564 377141 379422 364911 302879 164711 19816 -45391 -11987 122427
17765 122427 346407 624351 901740 1115740 1208431 1148485 960296 755814 649571 643455
17755 643455 660757 601066 486305 402224 357797 314227 221091 91469 -39898 -146374 -205001
17744 -205001 -241593 -282668 -324465 -360809 -404143 -448717 -422237 -313998 -185523 -56852 25750
17733 25750 -13341 -135065 -244078 -305328 -322084 -312259 -285455 -260146 -240612 -205054 -188915
17722 -188915 -247493 -305528 -275282 -214425 -187444 -162708 -109201 -99343 -177176 -249192 -229810 -130400
17710 -130400 33518 249135 385908 323331 140998 43531 115740 267552 399581 495797
17700 495797 589451 691858 772974 839261 898750 898610 849153 874631 960218 998904 1005651 1028510
17688 1028510 1055565 1047260 977191 888427 821534 794679 831221 917396 1012244 1074105 1110221
17677 1110221 1130062 1106043 1070371 1062708 1090749 1143716 1189442 1216290 1229231 1250110 1287150
17666 1287150 1289790 1239627 1187623 1131000 1054856 985484 945735 946229 976597 1033018 1154913 1336934
17654 1336934 1557940 1788134 1979482 2089897 2104520 2099119 2133501 2208114 2318636 2441668
17644 2441668 2542945 2619555 2681945 2722074 2751372 2761604 2733671 2682872 2670856 2791124 3046731
17633 3046731 3365151 3693366 4012590 4366136 4833933 5391404 5955360 6540839 7231033
17624 7231033 8062877 9005433 9989892 10963750 11966643 13076766 14354269 15890649 17757889
17615 17757889 19956817 22484531 25299870 28294657 31341023 34304800 36964528 38999151
17607 38999151 40095088 40077687 38899251 36673492 33724821 30463892 27230903 24186464
17599 24186464 21402925 18976575 16918937 15107258 13438417 11910908 10589511 9511286
17591 9511286 8619104 7846672 7130473 6420343 5789985 5336478 5064351 4833227 4512948
17582 4512948 4139203 3811233 3572086 3372408 3162456 2978649 2855927 2758033 2655068 2533242
17572 2533242 2363697 2100639 1799297 1633636 1682675 1810540 1859793 1825482 1766126 1735642
17562 1735642 1773252 1857762 1902832 1856359 1744128 1570846 1330458 1097565 994785 1030689
17552 1030689 1106939 1136591 1115574 1066320 1004168 975993 1015066 1082579 1098268 1032992 917598
17541 917598 797496 696572 636568 670766 783272 862544 875659 889057 940373 972886 955188
17530 955188 891693 764056 587716 438510 365168 327938 240169 80104 -78507 -149454
17520 -149454 -168117 -194740 -195850 -189848 -197761 -145076 -32041 72338 154783 210404 236301 240696
17508 240696 248637 277608 298565 284070 264743 228674 140011 51533 25573 67363 127315 168595
17496 168595 183505 129770 -19198 -202583 -315639 -354130 -399360 -486805 -617352 -788393
17486 -788393 -917793 -885371 -650391 -312088 -1820 252736 432696 515214 514600 467332 402910
17475 402910 349318 323391 315166 309352 313330 312907 277117 225091 220256 261343 269675 266003 308557
17462 308557 363883 353649 249953 149304 111078 115635 155019 203373 234640 254107 307578
17451 307578 431902 596906 732693 766403 684581 518603 311363 120747 -17903 -112284
17441 -112284 -176211 -195834 -193771 -238100 -335149 -458005 -570729 -591797 -472516 -302088 -216433
17430 -216433 -230877 -309254 -429984 -525212 -541233 -504314 -432016 -299049 -132452 -604 116707
17419 116707 278233 450702 571763 610622 546153 412046 323306 340304 350784 279215 179155
17408 179155 89668 37235 15807 40633 165838 357567 513894 602982 672467 703542 644567
17397 644567 479906 278186 145503 90732 54641 47377 84503 88796 6580 -88969 -80564
17386 -80564 19785 120607 257077 451769 632464 703509 637549 490581 328068 214918
17376 214918 201808 268773 398401 598677 770495 779511 613647 367767 97414 -163814
17366 -163814 -308946 -280071 -146705 37865 235189 342366 311702 205156 112165 78922
17356 78922 81154 99046 122177 142139 182365 221842 203461 160934 106320 -26966 -207609
17345 -207609 -332496 -316638 -159038 24939 112782 66018 -39241 -120885 -181217 -198341 -141870
17334 -141870 -83168 -93171 -131089 -142317 -134165 -122530 -80776 -1116 45143 29762 -6355 -85072
17322 -85072 -151234 -125003 -59021 -60742 -176954 -378099 -599133 -764903 -862798 -910096 -907369
17311 -907369 -871681 -841407 -846748 -890490 -943526 -1000723 -1061701 -1083527 -1059645 -1019971 -978855 -915228
17299 -915228 -779594 -557088 -320590 -157033 -83410 -36508 14276 15626 -17929 -8558 71987
17288 71987 180648 229904 214565 207636 221422 197775 100567 -22101 -86020 -124809 -167746
17277 -167746 -146993 -66980 22671 102042 170098 181203 109287 6782 -22330 85634 259251
17266 259251 390834 485494 571083 600027 573938 539493 495981 441772 344925 159349 -121197
17255 -121197 -442568 -688937 -794143 -803883 -784305 -764549 -749546 -696395 -611513 -559756 -539445
17244 -539445 -479139 -349206 -225398 -128502 -9812 129550 217181 244295 273793 305937 347967
17233 347967 497956 739128 910904 891303 702475 450824 239878 93775 -409 -22869
17223 -22869 -21218 -103605 -247746 -355971 -409043 -430418 -435825 -404627 -311499 -198427 -78871
17212 -78871 89752 332836 609507 839281 984498 1002044 843396 574708 355897 260500
17202 260500 230545 192019 152710 133738 114618 68557 -27744 -176874 -325994 -427392 -477898
17191 -477898 -484607 -450044 -357305 -208452 -48017 59057 48841 -57661 -177627 -237967 -230125
17180 -230125 -224904 -261560 -325778 -399956 -489482 -595260 -680990 -741457 -819039 -874623 -819094
17169 -819094 -688070 -573076 -501926 -453631 -415014 -416298 -454037 -430569 -332829 -242918 -247272
17158 -247272 -340321 -418426 -405226 -303953 -142879 56024 276846 489864 651508 729466
17148 729466 743942 745368 786946 891168 969323 937503 832084 722923 638839 556708 422241
17137 422241 234784 87680 72395 167244 276860 355421 412557 419580 406543 461254 564037
17126 564037 596401 569523 624397 758593 882828 968645 1001573 933775 790402 662660 564874
17115 564874 466314 352807 214274 88160 38831 47916 57744 51209 64280 120106 195385
17104 195385 298350 406691 449260 426653 405024 441473 519216 580086 568905 434427 189619
17093 189619 -104944 -353552 -512584 -629514 -697234 -670990 -602426 -588558 -594347 -528248 -373718
17082 -373718 -228510 -166611 -155990 -125705 -24591 137824 267583 297697 244495 156922 71125
17071 71125 -63648 -225916 -322298 -334878 -296013 -232727 -166531 -184906 -305128 -423455 -506207
17060 -506207 -575734 -613288 -650187 -724981 -757570 -721176 -683701 -676961 -699684 -726741 -748581 -781007
17048 -781007 -789388 -740442 -646596 -555425 -523809 -548796 -529738 -406673 -216405 -32729 64364
17037 64364 39180 -50035 -88691 -31859 61776 120232 157823 204135 210648 131040 -9901 -139508
17025 -139508 -194011 -127457 33985 188499 269452 282927 240520 141660 23503 -66734 -119766
17014 -119766 -117669 -71231 -67560 -146666 -232310 -282392 -352361 -439111 -479812 -461945 -404183 -323246
17002 -323246 -263414 -266875 -287092 -232635 -106938 51581 185196 223248 165147 55323 -51903
16991 -51903 -123960 -173108 -217456 -240256 -221325 -197079 -175970 -118776 -55669 -25184 28116 140387
16979 140387 254229 303618 307173 315463 346593 386798 403566 367150 259085 88890 -93688
16968 -93688 -252067 -342362 -338605 -284654 -250445 -237226 -238938 -263854 -271996 -202374 -55283 55558
16956 55558 71620 82872 86993 10450 -77747 -74115 21343 99158 83103 19482 -15675 17948
16944 17948 108174 201050 232631 168675 28788 -98000 -131495 -56450 38826 54301 -4672
16933 -4672 -40810 33400 212061 460804 722005 889669 898978 820383 728064 632135 517458
16922 517458 388230 236834 56373 -119467 -244759 -312199 -319681 -262443 -170086 -118836 -167522
16911 -167522 -283447 -375967 -397862 -389129 -402742 -464297 -523767 -458673 -228770 64853 308728
16900 308728 500989 660779 755301 733807 593170 412640 274312 185050 149702 207839
16890 207839 356294 517455 610952 645451 670404 699607 691454 601808 461137 349208 356292
16879 356292 483427 637956 750867 834793 884283 842124 713924 566139 491465 535896
16869 535896 630995 704778 758984 800781 835000 868932 927045 1030204 1171246 1329707 1493572
16858 1493572 1657025 1789288 1901636 2027706 2145308 2212746 2255126 2378043 2701609 3227677
16848 3227677 3816546 4368358 4861622 5328586 5818856 6386911 7070554 7865151 8734725
16839 8734725 9637659 10540236 11414799 12200134 12780168 13065169 13009190 12637638 12009797 11154257
16829 11154257 10106189 8960457 7844106 6857084 6034610 5383642 4894350 4553173 4309949
16820 4309949 4041104 3705163 3332539 2963031 2666003 2488894 2391687 2293495 2137054 1954489
16810 1954489 1804495 1738973 1744688 1723353 1608189 1389862 1111650 846711 677560 661810
16800 661810 775006 929462 1046004 1059431 914179 681124 491925 371465 283076 249123
16790 249123 289993 365302 429829 446223 421784 417948 501495 677660 785395 699490 480896
16779 480896 212845 -28560 -182235 -230265 -232896 -241719 -233121 -156907 -14280 171185 360677
16768 360677 481823 511031 522975 560808 571989 468359 286610 184873 257519 414854
16758 414854 470884 404602 308936 211260 124313 67223 29461 -25160 -83342 -128512 -160353
16747 -160353 -180998 -153734 -23814 171971 341199 415395 364421 222837 99022 54547
16737 54547 71580 97251 105528 117671 118061 83442 26828 -7822 -29965 -76644 -135327 -165737
16725 -165737 -137229 -56678 41650 136848 170729 79026 -83230 -191240 -144676 52585 284674
16714 284674 470701 639387 803623 915276 964426 947437 826739 610718 386158 223847
16704 223847 136577 120503 150102 195591 259733 349206 447403 565658 728598 879189 929467
16693 929467 892236 806931 685895 551483 454312 408029 408829 462817 542412 592978 642564
16682 642564 750994 812970 738944 587440 437591 301568 159621 36722 -42499 -34705
16672 -34705 48299 106053 110706 117381 140275 148797 132817 99445 70529 87467 175728 315988
16660 315988 411590 389463 319597 293255 297165 296105 279243 284457 363504 495413 609667 658708
16648 658708 660729 662487 622592 501530 357961 270862 285524 393482 538082 605253 534692
16637 534692 412909 351852 366442 419422 473664 517171 548025 540471 484677 381355 215585
16626 215585 4745 -199151 -369919 -516876 -629633 -683187 -674412 -640719 -634393 -678448 -740187
16615 -740187 -754491 -714183 -641974 -506612 -323152 -192659 -181283 -251976 -312516 -315353 -296514
16604 -296514 -319766 -342808 -310701 -241867 -149239 -29587 75104 135840 213082 338058 472785
16593 472785 568213 569962 450052 285124 150421 -6895 -223007 -432316 -522991 -502315
16583 -502315 -503306 -573819 -584513 -461385 -243187 -9027 163320 219769 149644 -7104 -157286
16572 -157286 -226127 -240300 -255438 -235440 -155748 -87246 -56152 -12650 68528 161940 241477
16561 241477 248322 192743 105581 -12629 -136026 -222959 -256961 -264371 -274023 -294598 -307776 -296861
16549 -296861 -233737 -117344 -1993 60038 78938 132679 220841 276684 264836 176114 60117
16538 60117 15836 60415 106575 96616 54550 -8591 -74170 -111761 -111150 -80426 -64485 -98156
16526 -98156 -138210 -164965 -220727 -282247 -330908 -379936 -402809 -360527 -277523 -164080 -18697
16515 -18697 85165 142021 241677 383286 471065 488459 493921 515227 511510 441865 311101
16504 311101 122747 -91013 -257520 -310451 -260141 -171328 -72307 24257 67565 10566 -131441
16493 -131441 -255734 -258076 -154727 -31624 -2349 -64436 -113231 -100576 -59772 -32764 2177
16482 2177 67472 177505 315131 408916 360793 191389 13597 -106293 -166953 -157541 -90865
16471 -90865 -40645 -36480 -42095 -26544 -30817 -126317 -285353 -407620 -459995 -483163 -523432 -585978
16459 -585978 -651378 -682963 -639170 -553701 -501570 -467720 -398644 -283393 -148349 -35442 10821
16448 10821 -26906 -105080 -185815 -286726 -373438 -434858 -529485 -674851 -850125 -1011678 -1109626
16437 -1109626 -1114220 -1053510 -982044 -930080 -918227 -935747 -926412 -843736 -702322 -586659 -509763
16426 -509763 -394893 -222459 -52245 41433 53706 22713 -20745 -57908 -39788 56613 166672
16415 166672 225092 185367 69944 -44058 -157807 -253680 -267373 -214934 -156825 -138206 -156166
16404 -156166 -172609 -157594 -68862 89672 231766 290374 282134 233526 178290 171499 204227
16393 204227 242138 274646 262678 179509 4936 -242984 -449442 -543568 -547684 -488989 -407787
16382 -407787 -321831 -181860 -22715 28075 -19133 -42792 -41097 -109872 -275450 -478846 -629639
16371 -629639 -668984 -626017 -566395 -582273 -731637 -947719 -1086086 -1053353 -883892 -689261
16361 -689261 -550031 -461565 -387352 -316055 -277240 -305173 -385536 -488427 -597439 -693626 -735139
16350 -735139 -660504 -472695 -280636 -183590 -212412 -291908 -319660 -306603 -282939 -277793 -300824
16339 -300824 -345911 -404840 -497997 -624469 -718589 -780915 -849705 -890984 -888158 -874019 -887870
16328 -887870 -898601 -854958 -783936 -693227 -543172 -369779 -259539 -234623 -248244 -270986 -292276
16317 -292276 -302498 -299723 -245273 -147020 -114962 -200836 -358759 -524702 -631037 -657999 -674664
16306 -674664 -725498 -766297 -754418 -727100 -694679 -602395 -456819 -358231 -359189 -378063 -345390 -252213
16294 -252213 -135689 -99935 -202255 -379976 -570279 -754777 -866759 -828815 -644051 -402280
16284 -402280 -180643 -995 123215 194924 260456 314725 292363 166619 -61080 -328311
16274 -328311 -542352 -647028 -659875 -623029 -549851 -434365 -317265 -241402 -199470 -220961 -323838
16263 -323838 -474329 -612874 -682050 -678075 -626575 -559304 -510140 -477772 -444915 -390963 -293788
16252 -293788 -169981 -75857 -17764 15535 -27663 -166076 -318128 -428343 -504123 -559347 -604396
16241 -604396 -622160 -646647 -684987 -669261 -570402 -439326 -338494 -258871 -153531 -41215 30268
16230 30268 31066 -24998 -129372 -268842 -389478 -457375 -491086 -505730 -495430 -473352 -470872 -483676
16218 -483676 -466309 -419535 -386281 -389527 -449451 -559472 -650551 -723167 -841961 -961522 -1005296
16207 -1005296 -954605 -842845 -735011 -661156 -621171 -615086 -587451 -511627 -465789 -460241 -461072 -493142
16195 -493142 -557998 -598831 -534094 -381399 -208965 -83669 -80132 -196265 -371944 -531307
16185 -531307 -597521 -550586 -451148 -399660 -407219 -397826 -310582 -183942 -89285 -17069 44434 69078
16173 69078 42900 -1148 -61947 -150802 -266169 -388423 -434253 -332416 -141481 2875 50516
16162 50516 49603 10821 -57782 -90494 -51241 32984 84041 64873 12260 -23030 4542 119768
16150 119768 285628 467256 674350 877229 1001595 1023058 975831 911849 837097 726700
16140 726700 601086 517334 486826 489972 467942 351917 166361 785 -60513 -39994 -6083
16129 -6083 18601 12315 -59897 -179245 -295630 -347204 -287042 -160086 -55682 -14310 9748
16118 9748 43298 64996 60275 26540 -23663 -98871 -196883 -285281 -308446 -296308 -340637 -420233
16106 -420233 -470769 -495093 -472696 -398300 -305019 -213850 -119567 -10757 54954 28359 -54759
16095 -54759 -120448 -131794 -103809 -43123 21250 46123 46144 85221 170821 258357 366926 490541
16083 490541 554984 542534 482816 394302 305446 233992 124341 -77582 -293395 -388693 -379596
16072 -379596 -350317 -296853 -197782 -91957 -43472 -78807 -200027 -343078 -371987 -271415 -140856
16061 -140856 -33762 14224 -31433 -129677 -191777 -194184 -178484 -156355 -94462 9257 99418
16050 99418 132726 170181 250149 338581 394343 381333 325378 263855 196137 92397 -37515
16039 -37515 -139682 -210772 -296251 -417188 -487683 -396342 -185219 5308 98422 121878 129542
16028 129542 180426 325402 517526 666823 743244 760106 759015 733210 614995 401980 197511
16017 197511 88331 32529 -59101 -161611 -216740 -218831 -150231 -14663 148441 252564 211837
16006 211837 74845 -15642 25592 112252 72799 -73489 -151699 -122874 -76193 -77839 -147751
15995 -147751 -220452 -217772 -145289 -83686 -115652 -196364 -236094 -215563 -142896 -50748 39571 121030
15983 121030 171536 212046 236114 214423 196234 197188 154469 28957 -132199 -267879 -323508
15972 -323508 -257373 -119207 860 60413 32321 -68773 -182359 -247425 -225219 -154994 -62816
15961 -62816 94965 324575 530703 664086 723722 741399 761185 757181 726770 654018 468753
15950 468753 180028 -76482 -209771 -222278 -210486 -248531 -301892 -326941 -324455 -285318 -225616
15939 -225616 -168003 -90524 11298 118729 231133 346477 416866 384022 245824 70689
15929 70689 -72147 -129106 -70555 54263 160449 182972 149368 123536 108354 71686 -49029
15918 -49029 -213045 -315558 -344770 -313632 -234310 -148081 -76231 -25917 -4424 8447 59833
15907 59833 133737 159145 90612 -41547 -154380 -183059 -123045 -28188 55752 112864 143144
15896 143144 146510 118720 63234 3380 -68948 -189262 -336544 -446621 -496675 -525562 -578860
15885 -578860 -667331 -778346 -875991 -898475 -831712 -724217 -662384 -717322 -856222 -975842 -1027049
15874 -1027049 -1010050 -919054 -749774 -553768 -441803 -452338 -502705 -535161 -551805 -547410 -556631
15863 -556631 -644895 -783434 -893267 -962205 -992404 -960878 -839333 -632433 -395021 -179621
15853 -179621 -16452 65251 33849 -95565 -258404 -368146 -347478 -211827 -96546 -90194
15843 -90194 -178030 -315340 -456451 -552599 -575166 -557931 -564500 -561430 -486707 -380088 -327905
15832 -327905 -331796 -334149 -312425 -253943 -134211 9393 85081 60868 -10649 -94939 -212225
15821 -212225 -338186 -424226 -476567 -522590 -583462 -654159 -699022 -724102 -735596 -694752 -550665
15810 -550665 -358303 -224936 -180606 -231200 -359133 -509501 -587611 -560258 -500996 -498199 -552335
15799 -552335 -562477 -493398 -378044 -218517 -16500 190013 369332 506801 613393 637349
15789 637349 564069 518279 627695 873221 1082849 1119119 1005986 833077 621104 335199
15779 335199 13702 -241506 -377660 -409990 -337473 -179489 -31332 23240 -5449 -29872
15769 -29872 -6339 53193 152335 301578 430929 457563 378837 228754 74072 -41629 -151052
15758 -151052 -268319 -335000 -281699 -154696 -85669 -99591 -132978 -138342 -120257 -134382 -217069
15747 -217069 -321901 -377486 -402213 -432444 -448638 -444027 -434854 -436409 -474302 -494690 -423112 -284351
15735 -284351 -142347 14047 180964 292785 362527 416396 417363 353363 274205 217849 165186
15724 165186 103347 6307 -114396 -184801 -183556 -201521 -303524 -439367 -527862 -526237 -493329
15713 -493329 -502712 -519947 -505490 -485208 -488553 -484171 -442362 -405847 -363800 -254237 -86283 66763
15701 66763 162339 183241 121733 32594 -31218 -59654 -16679 72276 132441 163072 195173 226083
15689 226083 264102 273590 210758 128231 112116 204571 354039 420828 363901 256764 138239
15678 138239 55700 74412 212324 430362 630768 760696 824218 839952 797835 712805 634549
15667 634549 496221 273770 94379 8205 -60345 -115904 -98537 -14340 94450 188670 247562
15656 247562 294347 321176 298733 251687 178578 90090 40019 27936 40559 38151 -38493 -214953
15644 -214953 -457300 -679888 -807512 -821552 -747083 -609188 -472224 -399667 -383708 -370464
15634 -370464 -330884 -257136 -168993 -148528 -225781 -322827 -370492 -368015 -314059 -205106 -95231
15623 -95231 -52359 -104537 -210813 -301555 -326075 -272681 -229131 -291266 -472519 -675334 -733071
15612 -733071 -604791 -374448 -145490 19062 132851 247500 360447 412626 408037 413557
15602 413557 435315 432786 345290 124067 -118967 -217329 -198228 -181858 -198947 -196861 -141282
15591 -141282 -88943 -67456 -33585 42189 134451 199088 207159 141959 2636 -182509 -365303
15580 -365303 -484734 -490633 -403134 -305191 -232712 -188492 -210124 -268709 -261393 -181584 -84971 -3634
15568 -3634 72634 207955 444173 685751 777879 693744 547079 420452 319403 257504 251222
15557 251222 277960 342331 474942 659788 819813 879874 842211 739564 565134 324494
15547 324494 100054 -36747 -95531 -107132 -83258 -44750 -223 36627 38748 4528 -68958
15536 -68958 -173781 -270162 -301724 -252097 -147148 -19097 103256 180534 187381 150289 134380
15525 134380 174086 200462 130368 -13917 -150268 -228033 -269129 -301187 -338603 -393851 -419393
15514 -419393 -355329 -245982 -172192 -140619 -147097 -185193 -276130 -411819 -542074 -618800 -613769
15503 -613769 -559688 -495134 -402709 -289001 -222950 -262779 -351944 -414791 -406949 -282262 -44131
15492 -44131 226156 405260 411885 304573 203154 175256 216450 270601 246542 91752 -99282
15481 -99282 -198181 -216983 -256924 -372892 -501535 -524529 -440140 -363819 -360863 -371694 -324092
15470 -324092 -227211 -151033 -128332 -118950 -115033 -148861 -238611 -361492 -458768 -496535 -468028 -379920
15458 -379920 -286349 -279569 -366439 -467341 -549531 -604497 -592591 -470647 -272888 -86477 74695
15447 74695 211415 274323 225389 57138 -194804 -445932 -638220 -758816 -790456 -705744
15437 -705744 -562200 -445625 -368530 -293433 -193466 -108696 -67313 -26232 -113 -27755 -103842
15426 -103842 -218982 -386814 -573132 -680852 -666889 -591509 -500558 -381056 -235440 -74275
15416 -74275 81653 178119 199545 193351 167010 91110 -7972 -27498 59093 170127 229715
15405 229715 254315 277264 276885 224791 143393 87469 69544 58327 20816 -18612 -34193 -51670
15393 -51670 -92007 -146618 -199327 -236677 -287738 -406457 -582244 -714516 -745487 -697012 -618308
15382 -618308 -517713 -376039 -230990 -144893 -126044 -109938 -51490 18069 45931 47183 59618
15371 59618 60760 43310 41160 25644 -74682 -202286 -223508 -96404 107092 308522 453054
15360 453054 529614 567309 565224 505619 367976 194675 70262 35225 48881 75642 157104
15349 157104 288357 393042 382705 192990 -113656 -395293 -569774 -630392 -589284 -497728
15339 -497728 -446773 -460196 -487312 -466058 -395173 -328131 -308307 -325398 -352393 -395846 -440946
15328 -440946 -479144 -519799 -554911 -556291 -503418 -413149 -313471 -230774 -158513 -94441 -38710 -1927
15316 -1927 18462 34743 66464 115933 138364 121707 147052 267371 475966 733184 966760
15305 966760 1081377 1058420 990908 932708 868998 810353 782733 753846 703279 626084 495651
15294 495651 313281 140886 14719 -63140 -112366 -157626 -218198 -279309 -315200 -349146 -397506
15283 -397506 -407970 -297402 -82487 151187 361616 508188 546583 507186 453288 361214
15273 361214 186859 -47040 -257254 -385123 -405677 -304498 -94548 174685 385340 458376
15263 458376 428386 341225 215760 73187 1716 68821 201990 283800 268263 166195 -17957
15252 -17957 -258359 -439637 -472787 -422834 -448066 -604686 -827854 -1026443 -1154598 -1201849
15242 -1201849 -1151116 -1029436 -918782 -867237 -860902 -850070 -806741 -739938 -642644 -538557 -474753
15231 -474753 -436328 -430279 -468617 -504473 -475111 -366159 -200784 6591 222897 367886 388025
15220 388025 297954 169498 46409 -114045 -322508 -509699 -605026 -568298 -424004 -250016
15210 -250016 -98704 4391 74439 143026 201340 238944 246784 218097 183390 178330 209087
15199 209087 269890 329361 377886 436967 457552 364896 175742 -34634 -233222 -382433 -430157
15188 -430157 -419955 -473091 -589188 -663221 -678267 -697733 -722919 -716225 -685662 -625735 -529816
15177 -529816 -453965 -412799 -348808 -273603 -206397 -131286 -71199 -78659 -144542 -210093 -234113 -202539
15165 -202539 -153279 -101670 -49934 -22176 -47903 -102804 -136533 -151571 -162661 -172114 -161081 -84032
15153 -84032 35806 120580 139269 125385 99992 110525 189259 278914 301181 196919 21361
15142 21361 -99997 -107329 -24406 7134 -105085 -260297 -282810 -151345 -12 127592 251167
15131 251167 334665 372663 419002 469441 454715 366332 236708 114897 75726 101308 122671
15120 122671 113885 48582 -61156 -186871 -321836 -447386 -557647 -666702 -755469 -786390
15110 -786390 -732038 -591396 -373412 -83330 166688 262480 218011 105978 13900 -11137
15100 -11137 3864 3592 -12207 10453 94268 193498 258863 287746 305540 336633 338119 259270
15088 259270 133391 20218 5638 120602 279717 402633 445818 382808 247195 118851
15078 118851 64520 93559 158868 185727 146665 67300 -31658 -129929 -197956 -226527 -204660
15067 -204660 -99350 57457 156922 100800 -113543 -331536 -390167 -327853 -281761 -306483 -336154
15056 -336154 -289829 -193063 -147391 -196449 -296671 -409201 -490970 -500210 -446352 -364658 -277037
15045 -277037 -206891 -153909 -73984 5811 29759 49004 140644 247294 263501 173338 63632
15034 63632 23290 412 -24688 42810 205596 378576 484718 458640 297552 81602 -97810
15023 -97810 -193773 -175943 -73166 2193 -6991 -78984 -179461 -290653 -371528 -363569 -295178
15012 -295178 -205963 -131224 -137236 -231762 -332269 -357170 -257479 -62730 100971 118197 -2325
15001 -2325 -151645 -246689 -269659 -247410 -220629 -234311 -295810 -367782 -424981 -462586 -490080 -534823
14989 -534823 -544186 -441109 -254337 -97291 -50139 -84283 -121481 -104329 -19142 117004 262122
14978 262122 356338 396969 387565 291563 121155 -67718 -248907 -405102 -503721 -554851 -610680
14967 -610680 -688112 -714171 -658149 -554980 -455863 -403273 -386824 -406456 -511369 -662733 -726546
14956 -726546 -671027 -574284 -489683 -420501 -349920 -281943 -216118 -146713 -107891 -91367 -65819
14945 -65819 -58887 -110875 -197056 -216991 -101656 101156 286450 348910 222871 -22621 -280980
14934 -280980 -494543 -586655 -527470 -410075 -319022 -248170 -217264 -259988 -331056 -405786 -488119
14923 -488119 -536239 -533958 -519851 -513575 -502252 -532190 -637101 -732733 -709717 -545713 -326603
14912 -326603 -160417 -82209 -46371 -18816 -46207 -140111 -257480 -337775 -386986 -415391 -409608
14901 -409608 -355208 -260608 -145872 -15272 94409 139610 103494 46303 70351 198731 395636
14890 395636 593459 705905 712980 638668 509769 382028 288905 277665 359893 395547 266041
14879 266041 282 -314067 -659906 -1018494 -1282697 -1351860 -1228541 -986839 -707978 -529587
14869 -529587 -535616 -642190 -725408 -748733 -719350 -657650 -597402 -547924 -493255 -388818 -221206
14858 -221206 -46673 61412 88613 66257 24154 36395 121325 201448 228276 244031 292477
14847 292477 335602 297079 145258 -81705 -319340 -531560 -701559 -810819 -876445 -890953
14837 -890953 -832717 -738509 -619876 -469365 -317021 -180270 -57333 59514 159470 244556
14827 244556 347697 428554 416562 373106 378381 425707 459073 456575 468843 486539 454226 368935
14815 368935 283553 224892 169997 85389 -52037 -260919 -523446 -771765 -955555 -1037108
14805 -1037108 -1006137 -887933 -736592 -557354 -355021 -234566 -205817 -166274 -137352 -164865
14795 -164865 -183429 -149200 -87596 -26672 47113 156592 251114 275105 234985 165796 126254
14784 126254 144150 212063 314255 373586 324012 276924 354267 462094 456105 370437 369633 478282
14772 478282 553283 519812 472043 472831 445956 328568 151784 -15022 -94246 -88314 -86016 -112343
14760 -112343 -134537 -160745 -218551 -319015 -413394 -476878 -529654 -555672 -520830 -395072 -216098
14749 -216098 -52331 87536 218338 305443 303212 212807 73605 -65123 -187708 -304568
14739 -304568 -418111 -528579 -602875 -597225 -541395 -504202 -470651 -440959 -480510 -567981 -603184
14728 -603184 -523588 -356250 -202200 -128732 -173390 -332943 -538830 -736367 -872622 -893711
14718 -893711 -799054 -636988 -449782 -287808 -227668 -272873 -300934 -194749 11820 194601
14708 194601 283714 260031 128626 -55936 -250624 -388194 -377061 -247222 -95215 27805
14698 27805 122855 167701 134726 37397 -82025 -144313 -48770 156101 305540 329933 287815
14687 287815 233796 143457 -26921 -245568 -416972 -473741 -403512 -311372 -329586 -478765 -700308
14676 -700308 -930736 -1115335 -1218133 -1281577 -1335394 -1327344 -1216898 -1037826 -862936 -712057
14666 -712057 -542439 -388328 -283481 -149129 53882 227126 237904 80090 -123933 -259690
14656 -259690 -279758 -219832 -142193 -79322 -41184 -15055 -51459 -165815 -340287 -553203 -752236
14645 -752236 -907578 -1011951 -1030686 -977796 -900856 -842960 -851095 -937429 -1028616 -1019873 -873720
14634 -873720 -647247 -433453 -303150 -255996 -202655 -92527 15384 20064 -68678 -166907 -240888
14623 -240888 -294801 -288451 -195285 -103050 -102512 -159690 -198894 -188581 -101499 48009 160213 152581
14611 152581 36815 -128879 -295815 -444937 -600037 -761717 -903901 -986726 -973429 -892425
14601 -892425 -785858 -676480 -587396 -522160 -480538 -442763 -397655 -365782 -335180 -269053 -194483
14590 -194483 -139557 -130315 -193937 -288919 -366534 -410990 -460124 -564035 -647135 -640573 -605351 -613942
14578 -613942 -679914 -742474 -723304 -601368 -393579 -177131 -35798 -4123 -76650 -216157
14568 -216157 -376439 -475295 -466356 -379811 -254822 -109333 47292 214351 379471 504049
14558 504049 546453 442154 187859 -78975 -244548 -312497 -300775 -189907 -5778 169265
14548 169265 297353 370240 382266 345335 292352 249091 222332 213370 218875 238912 242369 189050
14536 189050 74663 -69426 -232837 -428006 -645100 -802508 -816368 -733711 -615659 -464649
14526 -464649 -309269 -196171 -164578 -245838 -424707 -638171 -842024 -983295 -1001321 -915362
14516 -915362 -802162 -718557 -677005 -627006 -519703 -402515 -354783 -372476 -357217 -287159 -243357
14505 -243357 -235193 -207338 -121687 22849 217689 431073 607681 691115 666830 584728 523621
14494 523621 511133 516007 483406 386357 295522 282985 312750 333210 343259 340768 316117 283960
14482 283960 213868 62787 -125114 -261714 -271078 -174049 -82757 -54434 -79803 -128280 -152131
14471 -152131 -135019 -114931 -174447 -337331 -512976 -593062 -544737 -421038 -289301 -206960 -190258
14460 -190258 -190218 -110272 61904 220244 306298 359358 447610 562752 619746 580015 433424
14449 433424 223303 37854 -78954 -139383 -182222 -244353 -333488 -448052 -579370 -631723
14439 -631723 -554925 -429859 -350544 -323151 -291703 -235592 -184197 -141059 -124035 -164387 -227023
14428 -227023 -288798 -321933 -328363 -382795 -471301 -533734 -529716 -452528 -341247 -264106 -238186 -215546
14416 -215546 -169078 -65224 107720 301502 457417 522510 512901 462467 362494 224642 121433
14405 121433 115215 176014 206209 190356 201864 209758 164024 88158 -16866 -150100 -225397
14394 -225397 -153890 14442 113259 66225 -17395 -54089 -86820 -142814 -190454 -189137 -126898
14383 -126898 -70033 -69364 -106786 -148520 -166500 -136346 -45820 43075 73129 47390 -2638 -25530
14371 -25530 27264 178913 366412 492519 550573 596522 636629 622891 541032 454374 425562
14360 425562 436368 410104 305968 146901 21676 8749 55004 83230 114616 191869 279218
14349 279218 326430 308088 244251 209493 245636 296438 299651 267834 187875 37643 -124996
14338 -124996 -228300 -266445 -276922 -261413 -183796 -53121 70219 156756 201764 211206 247783
14327 247783 386183 578531 688735 648611 530223 460279 443629 407093 361352 365773 430868
14316 430868 506297 532630 508526 459245 359431 194314 21803 -103693 -164656 -134353 -9906
14305 -9906 161097 335365 487679 578722 551463 423573 314341 257270 209104 148262 109396
14294 109396 102429 94026 73307 3111 -115734 -227884 -309445 -393605 -491457 -564337 -559999 -489007
14282 -489007 -398304 -334000 -262372 -167939 -113125 -98200 -72374 7206 121961 213049 296814
14271 296814 384430 415660 349266 225574 131497 102278 123983 173286 230747 278327 304411
14260 304411 286545 191453 34890 -113809 -230785 -279771 -204606 -72746 48542 152203
14250 152203 187986 108361 -37237 -156806 -211596 -258782 -359650 -454142 -437880 -313933 -181205
14239 -181205 -109260 -120874 -208671 -304052 -325681 -311047 -342855 -422453 -477479 -434770 -317943
14228 -317943 -222119 -167348 -137636 -170999 -298206 -445972 -529003 -570721 -572454 -537836 -510974
14217 -510974 -513568 -519037 -477849 -390513 -275149 -124673 67277 259102 350220 302068 204833
14206 204833 174576 254266 358856 375047 262075 83182 -82614 -192155 -202568 -105118
14196 -105118 41640 163447 221175 250135 323455 398713 377173 283510 180483 124547 168110
14185 168110 279825 384368 441148 455166 432775 350519 189990 -3241 -158183 -239669
14175 -239669 -245878 -180752 -23374 199790 407349 548205 616488 603729 549021 504102 499168
14164 499168 494229 377075 147286 -71383 -207305 -259059 -227757 -159114 -137650 -130937 -68367
14153 -68367 7510 13817 -43857 -89065 -58954 44358 129466 143139 120225 94112 90918 119618
14141 119618 154609 149596 68711 -117573 -359749 -534757 -580586 -525482 -426232 -310833 -170566
14130 -170566 -21758 94671 152905 175162 232267 325524 376537 350016 275781 201615 143520
14119 143520 82948 24806 -15327 -33226 -51496 -102622 -189146 -282665 -361686 -441367 -530679
14108 -530679 -592173 -560933 -413371 -227505 -97283 -34850 37922 146943 236660 247012 169536
14097 169536 53147 12906 120089 277959 340622 263909 89465 -78431 -129430 -51566
14087 -51566 81091 204764 299316 344920 310364 248388 231930 291915 419105 551657 636721
14076 636721 663034 619213 476570 273918 120864 19321 -114014 -291487 -425904 -467950
14066 -467950 -437341 -349899 -238619 -136299 -37064 60360 133369 151580 139740 177453 249195
14055 249195 252726 151022 -14227 -184375 -369204 -583242 -777309 -875807 -833427 -675786
14045 -675786 -486039 -341867 -288718 -323701 -401712 -480445 -520642 -502001 -468989 -460772 -437699
14034 -437699 -375937 -350795 -395268 -476206 -576586 -623233 -540636 -403121 -300524 -246008 -236754
14023 -236754 -267094 -309626 -332716 -318892 -257823 -148563 8492 155436 200388 112362 -40224
14012 -40224 -115796 -103882 -150239 -246010 -245768 -104731 68517 163847 189378 194803 185726 174314
14000 174314 141423 35088 -126542 -273489 -334406 -313140 -278714 -264722 -267371 -258336 -193355
13989 -193355 -59763 113048 273548 402437 487443 478595 410825 397149 456787 514566 528853
13978 528853 508001 470510 417333 354263 318263 295767 231315 118121 -2833 -85093 -152687
13967 -152687 -251231 -407237 -592526 -703778 -726937 -717606 -681188 -605461 -516910 -460809 -418398
13956 -418398 -375009 -378370 -415947 -438943 -431272 -374163 -279281 -177904 -75276 1926 61650
13945 61650 187320 333751 367353 255975 78177 -41833 -46105 541 42430 113496 227180
13934 227180 344527 425946 440809 411520 375739 348440 331030 308453 279855 222752 124570
13923 124570 9682 -124805 -256974 -361145 -409453 -374769 -276031 -159148 -97454 -146875
13913 -146875 -257757 -367314 -451950 -510854 -517587 -397075 -186924 -39613 9765 22179 19608
13902 19608 22839 50577 103570 147799 145025 111013 60260 -12327 -115937 -268210 -441238
13891 -441238 -563145 -627359 -618716 -535159 -427546 -358662 -361584 -421189 -531309 -653093 -726095
13880 -726095 -769784 -837713 -900321 -875847 -721940 -476238 -270617 -231959 -339094 -478149
13870 -478149 -523676 -453316 -309507 -93225 155990 332412 391922 399113 421171 425871 317408
13859 317408 84629 -204246 -466470 -637575 -708249 -705403 -674211 -666791 -710951 -742057 -704568
13848 -704568 -617958 -502668 -367342 -230210 -152371 -172060 -258906 -316888 -287922 -174186 -49895
13837 -49895 -13365 -51857 -110561 -191072 -283122 -351347 -375594 -359711 -310366 -172103 56427
13826 56427 281686 428173 448687 354953 205225 39629 -132908 -292494 -429292 -551700
13816 -551700 -654480 -720196 -681405 -565336 -518197 -552916 -526145 -412652 -309639 -247454 -200176
13805 -200176 -121889 -26100 10417 -2530 228 42026 108425 166143 200512 222306 235338 220179
13793 220179 175706 143871 105292 -3768 -125425 -150615 -121612 -117285 -155250 -245630 -379440
13782 -379440 -499043 -565009 -562292 -455391 -272832 -82889 68251 167863 221888 231185 236574
13771 236574 269448 286721 238455 139448 36139 -43082 -106906 -149095 -148476 -115662 -80092 -40720
13759 -40720 40128 115204 127275 118896 118960 109130 64670 -17951 -120932 -239048 -365377 -447658
13747 -447658 -417830 -282353 -131697 -47822 -87167 -215603 -345633 -436539 -461082 -345613
13737 -345613 -85167 157788 274209 269476 243871 300296 417601 521597 555713 544407 550782
13726 550782 560308 512067 408948 309090 261089 251798 259446 260182 217176 105769 -25175 -69943
13714 -69943 -5706 88210 120428 63131 -63651 -191909 -275556 -339828 -417333 -505533 -584162
13703 -584162 -597552 -524159 -421586 -339813 -247998 -129814 -69182 -104404 -146006 -85006 22708
13692 22708 77784 68698 11772 -40336 -56530 -80516 -156881 -273322 -369840 -390735 -358319 -301658
13680 -301658 -236502 -201728 -203943 -218562 -218339 -177180 -71343 108029 295446 395282 370651
13669 370651 279993 221609 256158 351919 438879 484590 485947 490491 546583 611570 608407 526470
13657 526470 420043 337937 308307 325156 338697 304082 221944 133498 55842 10366 19640
13646 19640 63270 96907 75384 -12334 -148933 -318544 -494173 -638403 -692590 -589993 -342391
13635 -342391 -72048 100315 153037 132760 79193 -169 -78071 -119587 -149107 -212587 -273262
13624 -273262 -291154 -255350 -162458 -78066 -56032 -46786 53429 275170 524102 702025 809419
13613 809419 861564 862655 842701 813863 769048 781296 890426 985625 1001759 998895 1018737 1034670
13601 1034670 1004972 871693 628158 386800 255527 235605 229342 184135 168029 222570 263173
13590 263173 234836 183109 150804 145171 136521 113116 91452 52340 -21712 -133755 -238817
13579 -238817 -265519 -209153 -85298 75846 175318 130765 -26263 -236615 -471042 -706893
13569 -706893 -906996 -1013930 -1018225 -950601 -851845 -771909 -724242 -662813 -547475 -394496 -230481
13558 -230481 -66882 85618 212035 290883 307030 265568 200966 108180 4409 -45367 -7786
13547 -7786 92504 226030 378721 526348 603937 552937 432876 343802 272746 168112 8427
13536 8427 -185709 -341080 -368032 -233661 -10384 190055 314237 392747 461033 534072 588285
13525 588285 603186 561082 420485 200738 18592 -45812 -45446 -90149 -195078 -321573 -418581
13514 -418581 -458691 -488995 -567636 -688824 -786755 -790467 -684907 -517467 -330671 -118479 97479
13503 97479 282430 379814 304342 74569 -182642 -370633 -430779 -379906 -267885 -87557
13493 -87557 126134 257898 238226 119353 -20918 -151412 -264155 -366964 -431961 -425954
13483 -425954 -377131 -333384 -324493 -318343 -259391 -156616 -65359 -2478 8883 -40463 -124050 -210393
13471 -210393 -284434 -331921 -321144 -218544 -36983 129813 189477 164269 148531 180611 218557
13460 218557 249519 273039 267489 207876 95441 -23185 -104097 -148882 -171186 -155178 -92704
13449 -92704 -17456 76013 186770 248800 198135 59675 -75094 -112575 -57151 -2467 24912
13438 24912 57495 101995 129224 157853 198992 207784 135424 -35660 -254672 -428157 -509551
13427 -509551 -537988 -583582 -607565 -562750 -511251 -503788 -517853 -549811 -594176 -622681 -656839 -716790
13415 -716790 -797195 -825846 -766088 -666888 -551943 -430729 -326598 -213330 -50311 136772
13405 136772 347223 557821 694237 710508 596359 370197 92597 -132539 -216251 -211444
13395 -211444 -255667 -358000 -426682 -401867 -292016 -128477 63090 248654 376089 383547
13385 383547 311555 276255 319517 417500 556770 692051 738119 697899 675752 734440 858934
13374 858934 971863 980928 877878 739367 628107 556066 512781 469756 407855 327044 236552
13363 236552 178600 206574 330317 502694 669179 770791 790745 778645 758367 743599 761345
13352 761345 819655 895721 984222 1082683 1120253 1014723 776902 481500 205426 -36087
13342 -36087 -230057 -323920 -301189 -176348 15742 225581 432053 619193 738063 765427
13332 765427 751110 771354 829801 839935 750082 595659 429829 333175 364318 507466 698821
13321 698821 818002 821528 831466 887569 893756 803937 701202 669312 701227 720625 707776 734653
13309 734653 812747 886124 937015 928384 830595 689658 556675 424064 286448 194885 176509
13298 176509 182807 176039 156028 128441 107502 91642 75599 80311 167781 349163 549815 716473
13286 716473 796316 731575 543120 322526 172337 161321 307708 548354 759652 865472
13276 865472 889529 913283 983638 1032937 1031440 1018574 996031 965031 944954 922269 890340 899796
13264 899796 965400 1062285 1173957 1272168 1335151 1381614 1412719 1429918 1478774 1553511 1589086
13253 1589086 1574962 1553386 1524960 1446169 1330639 1252772 1228612 1191251 1131818 1057975 942640
13242 942640 795964 665813 607450 595008 594218 599374 600792 634107 710668 834182 967284
13231 967284 1052797 1135798 1248547 1365774 1441493 1450177 1435605 1432153 1412681 1367681 1347455
13220 1347455 1376843 1389341 1352829 1263088 1111335 958611 857040 749564 591837 458154
13210 458154 418825 472065 553869 595951 636021 718804 818003 901347 984197 1068971 1134017
13199 1134017 1198062 1265755 1278269 1213429 1113815 1011863 885998 706032 522846 436025
13189 436025 462112 551826 662243 740414 742863 694490 675391 721973 860606 1075206 1266347
13178 1266347 1393537 1468090 1435240 1297972 1136766 1005014 914736 876019 905768 966781
13168 966781 992470 953727 858699 741519 597360 416253 266700 210625 239007 285834 291443
13157 291443 277724 321331 424435 541304 689458 885842 1077461 1232430 1359228 1437121
13147 1437121 1453803 1436925 1391859 1290128 1137259 998670 959873 1060321 1262833 1438991
13137 1438991 1465908 1362562 1225297 1104047 1008995 965942 995717 1089613 1193015 1262456
13127 1262456 1331255 1408386 1492572 1625264 1776613 1841169 1806092 1762671 1740968 1719510 1728591
13116 1728591 1818936 1934616 1983885 1956791 1894952 1817187 1727133 1607779 1431127 1197382
13106 1197382 941195 774883 761732 816947 869884 980662 1176091 1386284 1551272 1659090
13096 1659090 1715598 1653129 1449564 1205002 1027441 976963 1073758 1280990 1501691 1663524
13086 1663524 1746400 1763612 1790757 1837297 1808633 1708699 1578456 1421511 1311113 1338939 1448376
13075 1448376 1488769 1448670 1398767 1396545 1444093 1510450 1593336 1693584 1807751 1937692 2060363
13064 2060363 2097544 2015996 1901461 1877919 1946198 2011278 1997064 1919027 1863254 1853762 1854887
13053 1854887 1886546 1987700 2127528 2256704 2366379 2506728 2672505 2812569 2944050 3078162
13043 3078162 3167263 3228498 3339157 3498508 3630482 3711552 3757848 3815534 3974013 4234575
13033 4234575 4504864 4719952 4839563 4864389 4835027 4776116 4709948 4669190 4660284 4664898 4668253
13022 4668253 4663140 4703626 4856463 5061241 5183942 5223153 5271152 5345958 5435164 5554658 5723644
13011 5723644 5952417 6261582 6632622 7007409 7358775 7687879 8004960 8303155 8585394
13002 8585394 8919690 9336786 9778875 10171572 10496292 10802588 11186247 11717552 12382478
12993 12382478 13146988 14024975 14988225 15956629 16944355 18054558 19352852 20834062 22507424
12984 22507424 24424709 26657363 29267692 32349477 35979873 40253030 45345351 51438888
12976 51438888 58715251 67407442 77805065 90303388 105402478 123674712 145746930
12969 145746930 172085034 202543067 235515669 266543965 287912722 291857310 276361460
12962 276361460 247033802 212524244 179315044 150381822 126355257 106811979 91019083
12955 91019083 78233055 67819956 59312496 52285308 46376948 41373002 37106974 33498868
12947 33498868 30479757 27921932 25734665 23827778 22118606 20623392 19403719 18437860
12939 18437860 17658483 16971133 16271057 15529415 14793117 14092085 13451839 12924239 12515830
12930 12515830 12173719 11851600 11575962 11400779 11288415 11158797 11037364 10963694 10876832 10744616
12920 10744616 10616436 10601466 10820220 11225116 11633314 11981353 12377015 12891945 13447540
12911 13447540 13978184 14563605 15320163 16284201 17414031 18555418 19485466 20114645 20524307
12902 20524307 20911589 21507945 22441287 23730056 25372511 27397182 29790521 32555215
12894 32555215 35795326 39656202 44234483 49601679 55916730 63416217 72370753 83088802
12886 83088802 95977652 111605801 130691484 153962652 181804369 213758098 247544597
12879 247544597 277615421 295372343 293648754 272660445 239938741 204292825 171327516
12872 171327516 143218794 120148454 101504817 86505336 74448986 64701476 56686229
12865 56686229 50012792 44459951 39848744 35972201 32656608 29796679 27309505 25116741
12857 25116741 23189932 21508225 19985625 18533048 17223313 16157334 15322112 14633488
12849 14633488 14063628 13653155 13362707 13086769 12760860 12380311 11983455 11651694 11438926
12840 11438926 11293806 11107014 10878956 10733692 10777761 10981753 11209429 11345679 11399748 11400510
12830 11400510 11372373 11333929 11305469 11320458 11360408 11413967 11545101 11804887 12158717 12575555
12820 12575555 13117755 13859581 14765036 15717920 16673754 17702245 18896804 20323367 22010940
12811 22010940 23947469 26133916 28611164 31501136 34907204 38908627 43641485 49270968
12803 49270968 55982667 63947511 73377555 84626506 98221165 114740033 134760466
12796 134760466 158824483 187218014 219257529 251978025 278971176 291723427 284855159
12789 284855159 260685995 227232914 192464503 161010510 134424363 112717208 95265939
12782 95265939 81240920 69898536 60600029 52850493 46304745 40738859 36062403 32194456
12774 32194456 28971252 26172791 23645280 21344164 19302765 17564271 16032195 14615559
12766 14615559 13335583 12229291 11324012 10589208 9905536 9186506 8465168 7833589 7357530
12757 7357530 7049586 6854829 6691245 6500913 6274951 6007537 5695582 5347532 4982881
12748 4982881 4666810 4461053 4396274 4438672 4488675 4477694 4407442 4321931 4237722 4113216 3906512
12737 3906512 3642328 3426979 3273363 3099137 2903061 2729440 2618956 2575778 2585813 2606155
12727 2606155 2568964 2453043 2312316 2224891 2182821 2108541 1943925 1717916 1510634 1377537
12717 1377537 1343416 1404964 1508564 1600919 1676220 1747082 1795115 1805077 1757417 1676931 1636714
12706 1636714 1621054 1600322 1593928 1601228 1620519 1626847 1564508 1430224 1276283 1161620 1131803
12695 1131803 1175469 1267783 1392358 1446281 1347496 1191964 1141742 1225116 1340332 1373197 1259031
12684 1259031 1042079 868743 822838 893133 1041154 1206218 1351762 1456330 1484279 1424802
12674 1424802 1303005 1147454 1016148 965442 969431 931408 842153 794228 797412 793074 736494
12663 736494 657381 660469 723266 768095 781604 787249 801483 813019 853858 970673 1091277
12652 1091277 1117000 1062884 982447 886805 798655 706448 573494 383710 146129 -75837
12642 -75837 -225872 -275900 -212385 -60153 127471 268586 311388 281251 197415 76082 -53809
12631 -53809 -196071 -376540 -572388 -685303 -675182 -595898 -494622 -411143 -369817 -361577 -345958
12620 -345958 -288008 -192055 -101903 -100318 -190059 -302840 -405729 -455312 -384179 -222691 -111142
12609 -111142 -87410 -82102 -66489 -42100 14802 130243 302163 485178 613233 714786 828890
12598 828890 917593 929897 849886 703310 593152 584654 571261 463528 286532 111354 -41482
12587 -41482 -190955 -329656 -495012 -692220 -825594 -827881 -748746 -652737 -538620 -414606
12577 -414606 -290471 -146004 -2232 60769 34728 17445 50933 118402 209278 280501 270761
12566 270761 169441 29744 -60812 -12720 131264 232030 262467 240786 146073 25843
12556 25843 -30113 39027 222259 414338 498371 438392 305539 220739 178524 90779 -597
12545 -597 -4249 43706 53379 -6575 -115766 -186143 -117673 79804 289764 403856 419410 370852
12533 370852 260080 153748 112513 94691 27841 -87536 -169852 -158881 -68310 35510 98162
12522 98162 97631 68160 31152 -47639 -206476 -413006 -562881 -585526 -520728 -433135 -310085
12511 -310085 -103226 179507 450302 623828 645911 534628 386002 264487 154825 31578
12501 31578 -101447 -202649 -257649 -304276 -361762 -429858 -503846 -553799 -537687 -476083 -418877
12490 -418877 -357302 -295794 -216046 -63702 130532 296906 417231 491089 505865 478709 457060
12479 457060 495486 637033 811478 901241 899177 874859 856947 839246 790191 699557 633464
12468 633464 626558 627564 537489 337593 123471 -42985 -96320 1526 154615 240598 276294
12457 276294 333812 420387 498901 531103 533545 518319 469045 340304 141043 -33594 -88127
12446 -88127 -40181 42661 98579 77561 5757 -68348 -127038 -145500 -158157 -217018 -278331 -280255
12434 -280255 -220948 -149432 -92090 -22205 41825 105943 239415 402503 497103 534619 541866
12423 541866 512042 486262 488807 495229 512899 566351 613826 595500 506641 351609 144330
12412 144330 -45452 -146202 -141296 -57398 59262 139188 120815 15866 -115676 -184630 -156423
12401 -156423 -61166 57363 155270 213542 219651 194450 180534 184900 185985 195095 207011 172888
12389 172888 82268 7314 29399 115779 159428 118532 15109 -149343 -344564 -489331 -520384
12378 -520384 -445446 -371432 -386353 -454932 -526489 -573464 -557451 -488073 -403487 -328958 -277848
12367 -277848 -275137 -291460 -231704 -65304 159219 336082 400508 363361 291848 216701 152453
12356 152453 139135 165351 166527 76285 -55194 -112738 -84082 9041 117095 174436 151484
12345 151484 48357 -100122 -248650 -349173 -340236 -248293 -206020 -274239 -333344 -279402 -149676
12334 -149676 5101 142567 204644 162766 79041 24269 11203 44356 114995 188626 258244
12323 258244 284527 231107 169713 218812 351933 389020 230378 -51843 -327733 -454470
12313 -454470 -383742 -232264 -137261 -142903 -193333 -218904 -189501 -126488 -71551 -39460 -52963
12302 -52963 -128505 -270788 -420697 -482410 -473102 -461892 -435293 -367552 -306171 -302728 -327556 -308207
12290 -308207 -195484 4349 210544 317657 305437 175655 -5255 -114665 -158892 -230309
12280 -230309 -321261 -369715 -412048 -472965 -485797 -438284 -396037 -403423 -454323 -537216 -633034 -706108
12268 -706108 -715707 -682521 -653306 -644097 -628165 -548973 -400953 -228940 -97865 -74043 -179176
12257 -179176 -343933 -473668 -553349 -624266 -686294 -759276 -860327 -927897 -935851 -937567 -910162
12246 -910162 -811963 -668661 -566725 -541898 -512018 -466409 -488458 -576741 -662599 -714707 -720872
12235 -720872 -709762 -732214 -775090 -765097 -657214 -495923 -372948 -274934 -156427 -37522 29644
12224 29644 -2321 -85239 -114942 -40463 98927 251547 406040 539609 600729 544845 390178
12213 390178 234716 162216 151489 132705 68832 -35967 -167449 -297170 -363496 -405661 -473765
12202 -473765 -510458 -474029 -390618 -281248 -183852 -159835 -204718 -252340 -266418 -252414 -201395
12191 -201395 -134844 -99968 -128463 -174865 -207081 -286913 -392035 -378183 -204030 238 115559
12180 115559 123043 93265 99350 126429 133402 127477 107611 49578 -73294 -240231 -377606 -428902
12168 -428902 -384667 -289953 -195309 -126903 -97702 -137631 -288626 -528957 -744097 -828412 -768080
12157 -768080 -619594 -453605 -288383 -101700 91671 243162 342365 413116 428332 370011
12147 370011 284560 229812 215980 229675 261167 271665 225593 138399 34963 -41725 -60808
12136 -60808 -61979 -116216 -233327 -350266 -397258 -395592 -372714 -282411 -130642 -2179 35662
12125 35662 10722 -41348 -104999 -159433 -200162 -222506 -214993 -184984 -126897 -28938 34626 -28809
12113 -28809 -153212 -221114 -177113 -30272 121920 196409 176912 65611 -103110 -250208
12103 -250208 -304499 -242059 -98630 51938 152620 185632 188100 206635 226207 214514 207026
12092 207026 274462 354261 328914 189301 49049 -3317 -6039 -38912 -115647 -201341 -238154
12081 -238154 -191423 -73204 74315 181925 195155 125041 27919 -65293 -163658 -260683 -335238
12070 -335238 -383369 -441176 -531363 -606561 -613752 -558940 -488059 -435695 -397225 -322955 -195710
12059 -195710 -62961 63426 244260 474164 718573 923009 1037341 1054392 975203 863404
12049 863404 776912 710662 610245 448777 241714 44277 -78325 -127781 -133972 -122051 -101621
12038 -101621 -75658 -51130 -28214 -16488 19520 112792 241904 371685 455972 473645 442787
12027 442787 384377 324569 293428 274298 219808 90559 -85358 -225345 -315293 -398071 -477531
12016 -477531 -517281 -493687 -463482 -451995 -403821 -321263 -220359 -118439 -48264 14360 109141
12005 109141 207524 279601 299289 253309 210945 223615 285887 384833 506383 585950 569487
11994 569487 483545 337154 149647 14110 4806 138731 352880 542597 583276 471182
11984 471182 363720 300802 195024 40878 -118455 -252630 -302388 -249124 -140798 -18384
11974 -18384 120476 284213 477789 650126 708854 600685 355592 73428 -188385 -406475
11964 -406475 -549629 -582559 -523253 -438144 -377306 -358769 -387274 -436174 -478593 -532679 -594784
11953 -594784 -632517 -655025 -662554 -652947 -627249 -558581 -412497 -207793 -17042 55093 -3336
11942 -3336 -34964 60571 207744 334072 419671 448253 382827 216941 29879 -91159 -130844
11931 -130844 -119887 -110555 -154702 -242310 -351642 -477023 -566352 -542791 -460845 -442212 -456744
11920 -456744 -394456 -259312 -140854 -79086 -59746 -62578 -72291 -114714 -192673 -271670 -320710
11909 -320710 -331053 -280491 -134583 59700 210025 309461 363013 324890 201682 50710
11899 50710 -59349 -72854 -7965 93072 161411 127020 15584 -78048 -69201 37394 146552
11888 146552 219890 297961 373197 444416 535007 635514 726498 786373 815248 870800 1050075
11877 1050075 1359832 1726399 2087607 2398256 2621680 2806648 3086732 3521889 4106199
11868 4106199 4816137 5651301 6679752 7959685 9503218 11292217 13233297 15172703
11860 15172703 16819731 17826352 18072609 17732388 17112288 16386491 15483808 14276829 12782308
11851 12782308 11165294 9607100 8202690 7007857 6016957 5163296 4391100 3684616 3095747
11842 3095747 2643167 2278079 1958958 1707765 1536332 1389208 1229506 1069891 951466
11833 951466 916258 980849 1112167 1219621 1235600 1205248 1185729 1142732 1057627 960625 863787
11822 863787 771323 686268 613728 548968 524637 558260 659073 857117 1073021 1188506 1180613
11811 1180613 1094665 1012338 957110 888498 818728 765356 701494 623221 527387 438310 402383
11800 402383 411014 446935 503123 563959 575438 547594 521997 505819 516985 567655 652379 764302
11788 764302 923444 1147563 1406843 1674567 1949399 2204245 2371156 2449997 2532340 2680858
11778 2680858 2952746 3440411 4139056 4924973 5730303 6619127 7698391 9037773 10670686
11769 10670686 12639196 14999740 17833751 21183405 25042685 29279029 33404505 36464247
11761 36464247 37391022 35715864 31943080 27224646 22538255 18363322 14882611 12151610
11753 12151610 10088162 8522512 7323477 6353538 5488058 4708500 4104621 3714044 3487254
11744 3487254 3338498 3154136 2907987 2667108 2455196 2257478 2067760 1890154 1742786
11735 1742786 1638037 1561662 1514261 1499092 1499843 1545039 1675736 1932518 2300834 2715491 3150090
11724 3150090 3543855 3694466 3472920 3020200 2549151 2166275 1849030 1528920 1216596
11715 1216596 992800 878849 815813 766282 732758 687926 563992 353045 142133 1221
11705 1221 -109908 -282909 -460391 -515132 -453345 -365991 -294522 -199494 -63327 42317 22714
11694 22714 -84597 -182243 -207245 -157233 -78894 -59652 -163141 -345714 -481288 -487567 -386638
11683 -386638 -229593 -110128 -116984 -224896 -344425 -398168 -349640 -218465 -81657 -3652
11673 -3652 17835 31592 40895 13736 -42104 -106974 -133539 -26647 170853 324625 403304
11662 403304 404939 330420 231784 172865 166462 209466 295722 372399 374030 269939 125212 51169
11650 51169 121222 290894 469677 633453 774565 859766 830521 713459 624623 606654 596231
11639 596231 516802 348469 146180 -21085 -142911 -238163 -315702 -355015 -329147 -241752 -127917
11628 -127917 -41707 -38660 -92425 -118869 -146554 -219839 -286812 -304626 -280484 -233664 -192441 -171223
11616 -171223 -157122 -146735 -136610 -105608 -77075 -88387 -110297 -91796 -34436 2224 -45740
11605 -45740 -176082 -351436 -496449 -556469 -552024 -500017 -382248 -240554 -134979 -29596
11595 -29596 84957 164977 220133 264670 292530 313706 324155 305285 256401 160476 -14295
11584 -14295 -187288 -217432 -131303 -33512 74137 179217 225826 230710 231861 212827 172450
11573 172450 130721 82080 33079 -16265 -107603 -244652 -349542 -374073 -321116 -244772 -190919
11562 -190919 -145265 -83874 -2974 102476 222045 299146 299028 211629 69659 -20169 5578
11551 5578 111853 226096 276897 260653 186861 39481 -193273 -475019 -688619 -781707 -828691
11540 -828691 -913742 -993667 -932660 -670941 -293016 64009 272758 314278 260687 149114
11530 149114 5748 -116904 -197458 -238080 -224074 -170265 -157622 -273100 -475769 -625237
11520 -625237 -627953 -495925 -300163 -127075 -52709 -111995 -231337 -301690 -271011 -171493 -95879
11509 -95879 -80094 -90216 -122291 -228499 -401770 -564541 -643812 -593629 -454277 -340903 -293032
11498 -293032 -267489 -266517 -309111 -367937 -377276 -268725 -43814 205479 398047 490620 502962
11487 502962 509881 534195 525472 460302 382648 360778 430075 501853 467149 359482 292320 287613
11475 287613 288131 275708 287274 328223 377947 430662 471232 474917 436040 370652 322307 303634
11463 303634 239413 82678 -60706 -109810 -41016 162294 379844 422403 268305 69047
11453 69047 -95053 -215262 -321972 -415457 -430572 -324203 -126850 61918 143377 112600
11443 112600 31071 -11143 45665 184269 328255 446676 537985 552336 479412 425905 475477
11432 475477 580563 655810 692019 719649 700764 667545 704031 802512 896824 972653 1025497
11421 1025497 1032029 969326 818296 597990 397974 311493 319776 343065 363207 420951 457437
11410 457437 392807 323214 342667 384793 386890 342773 230647 94175 -5199 -66544 -103953
11399 -103953 -160724 -215154 -223173 -194236 -162494 -185956 -293679 -451465 -608097 -735311 -846662
11388 -846662 -935176 -965104 -912232 -797192 -690454 -619395 -543638 -416225 -286154 -256433 -313724
11377 -313724 -340257 -254659 -51824 187168 347759 391256 345548 272166 249371 290624 353136
11366 353136 375140 326870 246153 208815 295020 491946 688690 780934 770882 682093 533912
11355 533912 402654 334743 302627 236315 117590 36220 91925 266087 397149 369964 234294
11344 234294 53654 -133865 -288710 -409779 -518788 -607149 -634609 -597054 -494221 -346122
11334 -346122 -224849 -123211 2630 127733 167602 94914 4555 -40597 -50307 -39499 -25978
11323 -25978 -2908 44336 82650 116417 198883 274089 271816 269760 323233 360773 300725 145379
11311 145379 -31646 -176390 -258719 -298424 -338695 -366392 -360432 -359902 -404249 -437002 -372884 -253651
11299 -253651 -168288 -151598 -175409 -218801 -276399 -320093 -315377 -247254 -133588 -14454 67445
11288 67445 45095 -75944 -213359 -309103 -318143 -230054 -104950 -11499 38241 81513 127392
11277 127392 141550 154906 182354 104168 -147007 -406181 -468821 -346342 -159302 -22656
11267 -22656 -22452 -125692 -227909 -295534 -347660 -394630 -417857 -387572 -324840 -262167 -189558 -134001
11255 -134001 -110780 -63362 36977 153609 208520 178101 112889 57151 53518 96940 128994
11244 128994 133950 113606 58669 -45333 -178980 -243764 -195716 -111584 -66261 -88895 -177691
11233 -177691 -290737 -352446 -336165 -301101 -272886 -196976 -56252 69448 105260 41599 -94765
11222 -94765 -253974 -347717 -348600 -354680 -419654 -519632 -602502 -615571 -542953 -439247 -369807 -345790
11210 -345790 -313174 -222901 -59412 124522 285338 439792 580389 617957 440185 111062
11200 111062 -160104 -288456 -284974 -164707 5688 124543 123745 27685 -95372 -193559 -249301
11189 -249301 -261027 -254358 -275263 -304746 -283888 -210110 -105711 47065 281020 572463 827462
11178 827462 933814 837691 615106 402865 225786 4027 -210526 -317037 -290409 -161148
11168 -161148 -19945 77252 98663 51270 8343 8731 69240 175575 284243 360789 399374
11157 399374 380965 315179 246546 197134 210492 332721 524582 706570 793111 771464 736500
11146 736500 748260 770026 743604 664246 523056 312018 99848 -37913 -142505 -257785
11136 -257785 -351953 -387138 -378247 -357477 -290726 -118986 147035 412046 546332 493901 317554
11125 317554 141957 33928 -27513 -79713 -105228 -85167 -49157 -7007 77829 186074 280513
11114 280513 317957 269665 181832 95210 29348 -37986 -158422 -314905 -437944 -474501 -451343
11103 -451343 -415353 -366207 -333362 -347814 -372419 -371278 -369703 -387451 -437289 -507915 -556103 -529676
11091 -529676 -430263 -332235 -315583 -381376 -485629 -555543 -550105 -523827 -517095 -551925 -645871 -767598
11079 -767598 -841435 -817883 -701271 -578560 -542552 -606929 -733015 -865107 -903865 -794955
11069 -794955 -620039 -489702 -463492 -487783 -428148 -245928 -29630 111721 155039 136979
11059 136979 59244 -53454 -114913 -93228 -60112 -88307 -107302 -26163 88247 134152 119569
11048 119569 123292 179679 281177 381042 460697 524868 529902 440175 298814 156338 7591
11037 7591 -130675 -207918 -212930 -170145 -105887 -65625 -51645 -24591 15810 70128 124731 120166
11025 120166 63109 5727 -24948 -1409 125288 324132 465016 494135 436760 327818 216643
11014 216643 79286 -127349 -334397 -430054 -425755 -406921 -381968 -297756 -140545 23043 96557
11003 96557 55642 -16548 -49991 -27389 40237 139110 267253 384155 437973 412958 346443
10992 346443 305472 295875 238186 95499 -50719 -141455 -225131 -360090 -495151 -555513 -572856
10981 -572856 -607544 -697219 -817276 -938590 -1049810 -1123018 -1162812 -1192628 -1142467 -974372 -764935
10970 -764935 -578885 -451487 -437100 -508652 -562402 -553534 -515693 -501803 -505730 -470735 -385529
10959 -385529 -261330 -87756 103381 211386 169746 36297 -66252 -84462 -49549 5615
10949 5615 50786 83057 102072 101338 83248 60153 40745 39544 60097 86604 112235 149559
10937 149559 221280 287191 297744 271395 219945 74237 -168751 -371181 -433805 -396602 -329393
10926 -329393 -253982 -246222 -380062 -555997 -622907 -558737 -432858 -317792 -252483 -261923 -348739
10915 -348739 -490459 -630122 -701055 -677738 -584664 -499448 -458647 -451336 -474308 -506257 -531603
10904 -531603 -574491 -600503 -511700 -366206 -320423 -384057 -455758 -477654 -433327 -356027 -297522
10893 -297522 -251483 -175562 -115412 -118871 -173402 -261149 -382079 -510322 -573424 -501774 -332607
10882 -332607 -219702 -245739 -306757 -277606 -96177 211295 516830 691164 703600 604446
10872 604446 451799 295621 157378 2661 -173348 -323435 -413018 -499848 -615051 -684520
10862 -684520 -693530 -696418 -743423 -834536 -932772 -988776 -963988 -860202 -684824 -437800 -158111
10851 -158111 128737 392258 514283 450831 295641 162985 141537 193215 197964 186405 256813
10840 256813 386936 467867 420074 271875 131027 80617 140867 296767 463796 534580
10830 534580 464102 316835 189033 74150 -81905 -261691 -395802 -450725 -462561 -475573
10820 -475573 -485261 -491266 -497884 -458718 -419179 -427589 -465325 -506960 -570215 -653618 -683479 -653786
10808 -653786 -561338 -399858 -255007 -166611 -117471 -131156 -169690 -215603 -310008 -455132 -629022
10797 -629022 -778015 -846783 -832890 -775833 -702898 -664016 -728383 -895155 -1071698 -1139648 -1034389
10786 -1034389 -830924 -597891 -317486 -49366 111146 146748 44125 -182359 -385136 -446813
10776 -446813 -430170 -429691 -454860 -478806 -450635 -375006 -277575 -171221 -135508 -207498 -318071
10765 -318071 -405515 -477859 -539095 -606166 -680031 -735369 -775973 -799819 -773845 -732489 -745534
10754 -745534 -743330 -646236 -502905 -372246 -275735 -211947 -204589 -252748 -286866 -273369 -232067
10743 -232067 -159004 -47990 64855 148295 172858 122152 33017 -42878 -99396 -161814 -243062
10732 -243062 -315038 -307118 -219580 -125504 -43569 10761 9161 -34010 -105005 -199650 -238517 -183850
10720 -183850 -124004 -139857 -214605 -284480 -338353 -402030 -478297 -548186 -612707 -695053 -753133
10709 -753133 -736155 -661240 -588514 -568912 -588329 -610348 -654562 -675132 -584410 -458986 -401888
10698 -401888 -402882 -438284 -508359 -559579 -537917 -461756 -396562 -397886 -445626 -490286 -512846 -553684
10686 -553684 -645850 -749648 -808531 -785708 -703920 -631297 -622724 -646426 -638952 -621374 -613817 -587582
10674 -587582 -533539 -467273 -406726 -326593 -227157 -184693 -191422 -171240 -126644 -79306 -39429 -28411
10662 -28411 -67692 -73135 80751 335222 550245 672438 708806 671403 564499 437266 327085
10651 327085 258517 271278 354390 396098 328669 203833 65873 -39003 -55433 -9881 42661
10640 42661 115698 215936 295610 306939 254614 187953 101800 -71984 -317151 -516022 -648921
10629 -648921 -787659 -908781 -969770 -992840 -975769 -947587 -929331 -884252 -784351 -650131 -556711
10618 -556711 -532367 -566804 -626710 -645074 -579401 -439566 -253555 -26348 156994 198471 116335
10607 116335 -4115 -59697 -8340 70645 66155 -44624 -203124 -312839 -303718 -191376 -41679
10596 -41679 63388 95229 71476 12834 2019 87594 211364 289387 290807 236027 159206
10585 159206 57807 -71218 -203799 -370059 -616748 -915471 -1175163 -1294775 -1256649 -1094098
10575 -1094098 -838598 -555939 -289533 -45676 119706 165563 130669 64636 -21930 -117875
10565 -117875 -174553 -158248 -130259 -138030 -155002 -191436 -251075 -271971 -208539 -130216 -169934 -325600
10553 -325600 -508438 -640606 -687821 -712670 -769419 -831542 -811946 -657973 -411891 -157047
10543 -157047 3766 18581 -85590 -236655 -347927 -387500 -406545 -436249 -448682 -424209 -356350
10532 -356350 -220189 -48923 47182 18634 -88371 -194683 -258361 -349382 -503588 -676076
10522 -676076 -822443 -925508 -975674 -991984 -1024805 -1077322 -1092777 -1049645 -1007140 -1002201 -1029420
10511 -1029420 -1036167 -956789 -780075 -545914 -330249 -218037 -237020 -312213 -370728 -404548 -416477
10500 -416477 -390907 -327761 -240786 -193674 -255759 -349558 -360195 -306063 -239766 -141139 8942
10489 8942 180637 310090 340914 294317 215435 101283 -46250 -183696 -281755 -284561 -160301
10478 -160301 1334 76881 34170 -84443 -246203 -377345 -369308 -228743 -49710 93847
10468 93847 142994 96753 11758 -63640 -128641 -174817 -153785 -88988 -37439 -36187 -97982 -208148
10456 -208148 -372639 -559960 -660151 -621303 -511890 -383328 -243341 -136527 -96791 -100926
10446 -100926 -116821 -129926 -123090 -49047 57624 103818 44215 -143404 -387658 -560109 -612717
10435 -612717 -588595 -522213 -398598 -234171 -95875 -33126 -9872 15933 8507 -71493 -234564
10424 -234564 -483634 -719025 -834001 -839748 -815069 -815716 -896236 -1060653 -1197244 -1136242 -860550
10413 -860550 -551638 -334008 -221775 -190335 -169673 -109412 -55828 9237 146239 292662
10403 292662 343693 325567 334275 353378 330211 272569 219036 143857 50963 3018 19538 67764
10391 67764 123124 213667 353312 470626 512129 477670 374197 222986 89900 -57 -92729
10380 -92729 -180211 -193741 -161264 -211720 -353436 -476762 -524905 -546873 -610641 -704890 -784398
10369 -784398 -824834 -811659 -736123 -631245 -540363 -471828 -385407 -290919 -284045 -340246 -333135 -221410
10357 -221410 -34042 125637 186771 198140 225467 269884 278107 231571 175312 157025 156711 133407
10345 133407 47094 -135956 -326178 -461341 -595313 -712374 -778911 -831321 -866288 -829023
10335 -829023 -756656 -746675 -784625 -754519 -626472 -484548 -402677 -358370 -306975 -240760 -126824
10324 -126824 52938 215099 282129 290727 282131 265436 250765 247828 221630 118339 -22775
10313 -22775 -122560 -145422 -119999 -111949 -143510 -160890 -86454 74607 258038 411295 500404
10302 500404 534890 517593 427186 245746 24631 -138801 -181815 -118487 12974 172400
10292 172400 277586 279671 239089 238184 322082 450068 553648 627669 685583 707762 713193 754728
10280 754728 787313 715362 524911 291012 91362 -24573 -39064 25665 138314 242111
10270 242111 233117 116057 10295 -11611 72265 217869 366777 476035 483982 425583 403727
10259 403727 430160 449512 441252 402042 312786 182396 63854 11909 34181 107534 234476
10248 234476 409637 561437 625463 568867 389830 187851 92066 122696 178387 185689 157498
10237 157498 164813 254297 382107 428620 344942 173660 -9858 -141447 -210124 -246004 -248196
10226 -248196 -197021 -116668 -21076 90307 170454 146377 2085 -160371 -206491 -166909 -119591
10215 -119591 -61303 7552 72161 117552 172708 274053 378870 447640 478132 467151 427737
10204 427737 417754 445861 482959 528905 586118 634596 636962 573942 451440 293935 171780
10193 171780 164727 249724 326488 356697 387278 459333 601342 794591 957614 1051233 1075707
10182 1075707 987191 815443 675177 633868 662365 706184 724356 717361 743037 814155 870242
10171 870242 884786 873928 874279 945570 1020186 1000602 897188 757310 629117 542795 511334
10160 511334 551075 631710 711086 766839 769027 704685 629654 590810 555498 496380 438442 410432
10148 410432 432733 505187 616356 690545 669665 532566 260382 -94939 -379062 -507327
10138 -507327 -509467 -416293 -270450 -121463 4068 94051 143476 171348 200056 236827 280299
10127 280299 311302 329939 334522 341917 380002 439591 484567 470964 414258 409173 509616 636243
10115 636243 693299 657514 565144 459267 361285 302228 281071 254437 212536 196079 219563
10104 219563 234866 195652 83592 -75612 -209212 -249921 -163499 1755 147887 238091
10094 238091 285857 298182 274978 255180 308172 473025 682972 825007 860909 856067 920895
10083 920895 1086059 1290650 1486151 1577684 1483719 1302508 1133232 969742 828957 751405
10073 751405 751997 811046 924138 1042590 1103312 1126624 1174668 1271497 1364034 1373013 1316856 1274022
10061 1274022 1241564 1206125 1224808 1294747 1334514 1294376 1175804 1020375 902640 902653 996680
10050 996680 1084800 1136973 1163780 1135889 1050042 985608 942635 808232 593406 443197 416087
10039 416087 475975 542512 543170 486321 436530 403401 366148 333257 305645 303827 353045 455633
10027 455633 583920 687662 729134 714756 682980 616200 495260 355507 211760 81846
10017 81846 59809 218502 490926 728529 848498 852968 756103 596469 466110 417119 436843
10006 436843 457686 400674 275734 142704 37528 -47162 -128395 -167893 -113622 1690 77044
9995 77044 54704 11361 32500 94291 129720 147960 207325 319519 420011 448425 409012
9984 409012 305634 157649 -3473 -144082 -234175 -277406 -277324 -249527 -208477 -154350 -112264
9973 -112264 -110057 -147612 -199934 -246775 -255986 -155755 60802 314035 497161 584239 652063
9962 652063 674655 544519 315903 166903 152873 186195 193598 191709 216537 281792 349334
9951 349334 370930 366569 389364 442262 485948 490761 435099 315301 154664 13527 -57878
9940 -57878 -45047 55885 237955 415312 470693 376333 244321 214029 290406 399461 532735
9929 532735 701074 846879 922001 931085 884959 790567 676702 548294 416443 356586 357379
9918 357379 327083 272266 270707 312590 348082 375631 440248 574398 709386 775528 756255
9907 756255 678266 649522 740076 885521 978832 913729 712379 542532 498497 594078 813408
9896 813408 1068154 1252003 1323552 1319870 1301993 1332106 1379089 1366166 1308250 1219798 1062697
9885 1062697 884575 766152 700721 697080 783523 934965 1065294 1131694 1148376 1141257 1132784
9874 1132784 1102665 976715 718629 409347 211964 229680 390767 552187 691039 874873
9864 874873 1124899 1360272 1455739 1416530 1335769 1266713 1221689 1198514 1156717 1069876 960066
9853 960066 858562 798457 814671 906165 1004016 1034367 1002132 918676 793350 657624 586430
9842 586430 602925 623006 563019 435771 333955 319583 389372 518064 674778 781740 806158
9831 806158 793092 770657 745351 694526 604705 545342 555690 618159 721296 843475 963632
9820 963632 1055198 1078228 1044460 1035812 1117353 1242891 1277525 1156515 955270 765443 665199
9809 665199 677568 733581 799843 914818 1045973 1100550 1116846 1168666 1173876 1102010 1045386
9798 1045386 1063289 1102830 1085592 999150 882786 797862 820858 975415 1194232 1358620 1397994
9787 1397994 1348053 1237610 1112163 1069194 1177681 1379348 1563462 1676070 1697382 1623464
9777 1623464 1505721 1467868 1536664 1586763 1560230 1531901 1567856 1655957 1734872 1777455 1785523
9766 1785523 1744766 1706499 1722470 1789553 1855778 1854869 1789252 1731623 1717036 1685361 1600249 1489148
9754 1489148 1375770 1275306 1232481 1272235 1351932 1402468 1420752 1430450 1416521 1367487 1299328
9743 1299328 1207106 1074229 929645 815681 768166 818416 946056 1092678 1240553 1392660
9733 1392660 1542664 1681147 1777399 1804450 1795772 1798427 1772361 1666765 1495266 1299334 1142832
9722 1142832 1056658 1000310 941671 890208 876005 925176 985497 1009219 1019902 1020417 979906 854499
9710 854499 704137 654116 692144 733264 746995 738045 703800 668366 674554 707795 730259 741164
9698 741164 731592 673669 574381 455709 342354 255817 208474 206944 197943 144179 93939 94241
9686 94241 92660 50206 9566 -19974 -39752 -13531 72990 179245 229646 224405 212662 178407
9674 178407 130453 112870 136541 193395 246227 258444 275118 352056 424841 381846 234583
9663 234583 79859 -42926 -131765 -197446 -285289 -393136 -466386 -477336 -468499 -479416 -484535
9652 -484535 -463016 -441732 -423484 -375201 -276436 -144414 -22008 70241 127968 187760 264887
9641 264887 282137 200685 93862 43168 52077 89690 156333 243356 292736 317950 358591 402047
9629 402047 451766 518583 558005 515026 421541 384061 425327 508808 593892 644545 670104 699609
9617 699609 742042 788031 835496 865719 850348 796085 702007 565212 435335 357046 330394
9606 330394 346399 393324 464704 546388 634592 747076 814850 787645 728807 716670 758660
9595 758660 815996 879599 948641 974118 915959 802132 694519 615485 537712 446221 388972
9584 388972 415681 504705 586196 628565 707117 851608 937538 906860 833621 808849 889973
9573 889973 1008546 1036475 968893 922971 934465 939053 951954 1021584 1140170 1274211 1362463
9562 1362463 1384304 1368465 1311350 1195528 1032260 893554 888421 1033855 1194861 1248143 1210619
9551 1210619 1181940 1184152 1121902 961256 775272 578976 364505 187519 138685 190824 224022
9540 224022 229910 248036 274451 283562 290341 373239 567518 794086 930793 941481 914987 904497
9528 904497 858859 733805 560662 410886 335933 374044 510020 686960 876814 1038933
9518 1038933 1088805 984439 803058 615333 438477 320724 341610 492705 682608 910161
9508 910161 1166859 1355281 1427976 1454027 1508047 1604830 1762263 1960988 2119508 2162093 2030960
9497 2030960 1775591 1518247 1342756 1272420 1284260 1327479 1378593 1470211 1615557 1740572
9487 1740572 1796677 1783188 1705489 1598501 1512286 1458861 1388361 1271923 1142468 1051181 1033920
9476 1033920 1088025 1181737 1256330 1258480 1208449 1141766 1117186 1226835 1468623 1741147 1960791
9465 1960791 2073767 2055863 1954694 1833150 1724415 1618725 1485706 1333644 1191298 1070907
9455 1070907 973490 914847 893957 866260 783129 651728 564003 609386 771984 952011 1050520
9444 1050520 1061617 1065064 1101762 1140961 1161891 1172287 1158501 1070221 899837 692109 518303
9433 518303 376495 222864 87242 29310 40085 54495 70342 108273 132097 147380 178731
9422 178731 195542 171647 114294 68448 61194 57533 22287 -19974 -30583 25642 151318 282758
9410 282758 318996 240115 152993 83107 -12075 -154934 -291010 -332996 -276173 -192620 -128294
9399 -128294 -94889 -105885 -154237 -187975 -143903 -47944 -17053 -117140 -277153 -438476 -608199
9388 -608199 -744943 -781691 -703920 -589407 -514937 -475692 -454480 -412815 -353314 -336183 -397098
9377 -397098 -498774 -541492 -472957 -335707 -203205 -107605 -42987 -41675 -171752 -416162 -646843
9366 -646843 -767104 -765424 -667902 -543222 -507944 -615527 -804274 -948208 -999150 -1018073 -1060291
9355 -1060291 -1145331 -1245723 -1287314 -1216956 -1100879 -1020829 -927552 -750199 -491451 -197692
9345 -197692 55818 165039 96150 -56551 -159048 -177015 -180569 -223468 -262248 -237384 -137025
9334 -137025 32466 209041 277199 159832 -95353 -311797 -327798 -136152 139827 353775
9324 353775 467262 523302 522858 465994 360912 202946 20378 -146021 -286710 -396694 -443205
9313 -443205 -418566 -377456 -340374 -239948 -47031 178143 369118 470764 473156 425289 349564
9302 349564 202762 -12747 -238814 -409823 -452911 -374303 -278268 -230927 -253919 -311231 -321558
9291 -321558 -266623 -206606 -195218 -243933 -347207 -454624 -537279 -650027 -817586 -1003017 -1114346
9280 -1114346 -1048621 -846167 -651863 -580329 -593117 -569524 -459486 -309824 -188173 -117650
9270 -117650 -72087 -67664 -108464 -135119 -135232 -146643 -190729 -246272 -233557 -116807 53673 192858
9258 192858 266330 312638 373437 418552 386421 289569 144572 -70061 -313682 -551908 -740933
9247 -740933 -828502 -833140 -799530 -754984 -739279 -779829 -811707 -773550 -668250 -528490 -393295
9236 -393295 -289189 -252677 -288346 -319380 -298033 -234523 -147157 -18367 131725 251176 320544
9225 320544 351985 389534 433249 460010 486861 499165 431826 293096 171917 108593 57412
9214 57412 2517 -20875 -22002 -27667 -28376 -7629 33741 63909 36358 -65084 -168633 -183758
9202 -183758 -97594 15732 50958 8928 -28512 -51393 -84043 -98483 -71861 -17650 46624
9191 46624 92624 100668 93749 96856 121745 170072 208241 195230 118144 -3544 -127491 -235452
9179 -235452 -356847 -484892 -575410 -619424 -678875 -797357 -918446 -1013972 -1105904 -1159318 -1147736
9168 -1147736 -1110771 -1085960 -1054839 -978426 -826718 -608904 -438392 -405710 -437972 -461081 -484317
9157 -484317 -515443 -572135 -619266 -603316 -547425 -511320 -521235 -553292 -574617 -580923 -547359 -461007
9145 -461007 -394513 -419394 -482431 -494277 -448161 -418859 -480784 -611015 -694456 -627674 -464377
9134 -464377 -288631 -106402 48194 74927 -36161 -174845 -292455 -393276 -444669 -445846
9124 -445846 -454624 -468339 -406113 -262918 -102051 55377 163044 184415 158813 149804 178134
9113 178134 217917 245794 261715 275998 271270 169625 -61169 -348974 -555389 -620732 -611022
9102 -611022 -571703 -541634 -543537 -540222 -522809 -495440 -445899 -411345 -387649 -295811 -138748 -4816
9090 -4816 34718 -34350 -151043 -229200 -244680 -186731 -59414 54510 60356 4482 32740 171611
9078 171611 316789 388827 360644 257333 163822 98284 25266 -29493 -90922 -211620 -361106
9067 -361106 -428665 -349709 -186623 -50364 12261 -16080 -124823 -225958 -261445 -247737 -249862
9056 -249862 -333328 -457156 -556376 -616819 -656374 -658688 -598275 -497090 -359685 -219005 -147128
9045 -147128 -187685 -332104 -478584 -494322 -392671 -299814 -240297 -143997 -21290 86838 164562
9034 164562 213926 224338 182593 117263 37216 -75265 -231250 -390444 -503324 -594920 -669992
9023 -669992 -692868 -687589 -718835 -742930 -704547 -645600 -568756 -452229 -309822 -157534 -33329
9012 -33329 12308 3983 31448 92607 85655 -26511 -188225 -346038 -469314 -555948 -598329
9001 -598329 -604754 -600818 -597298 -567177 -432608 -210841 -39644 2142 -38343 -82870 -148016 -254049
8989 -254049 -326081 -295886 -199502 -114353 -69534 -61236 -59790 -20018 71115 162898 216561 253820
8977 253820 297980 343588 355710 303261 214000 151446 138591 116235 50282 -14809 -69896 -139375
8965 -139375 -206317 -236113 -232415 -212668 -193864 -182467 -142056 -39047 103233 221377 288031
8954 288031 321649 315778 235634 98104 -7762 -53461 -53542 -37821 -38017 -59929 -111451 -200655
8942 -200655 -296076 -326709 -278412 -205938 -153516 -154485 -220406 -297041 -358629 -429328 -496734 -525353
8930 -525353 -489259 -346373 -102290 197038 476043 629812 584170 375748 143437 -309
8920 -309 -33344 -13819 11519 26920 4442 -82855 -218984 -336612 -411262 -469615 -516983 -516325
8908 -516325 -452314 -373215 -311274 -256791 -197269 -167832 -185286 -157539 -81951 -62266 -72511 -52189
8896 -52189 -18434 -13208 5933 82162 200215 350472 550419 793181 1064119 1325432 1445878
8885 1445878 1314870 996592 648016 373801 246247 300956 476263 604595 572725 427604
8875 427604 285627 260932 361776 486772 571130 591471 506357 355117 267080 262640 264086
8864 264086 238551 225913 244224 287009 325094 313235 259987 192372 133332 97593 55909 -32897
8852 -32897 -151771 -236874 -250220 -233927 -259675 -340329 -449533 -593568 -763904 -899467 -929812
8841 -929812 -852903 -732986 -609957 -474093 -327076 -163033 -18669 22124 -46300 -130017
8831 -130017 -148528 -81395 46615 165903 254663 267069 145529 -23115 -93918 -53182 39522
8820 39522 131657 208363 301996 401128 464125 471670 476173 533194 620158 691884 743996 786582
8808 786582 771961 697971 607738 474150 270773 77000 -20781 -26302 30953 91241 98158
8797 98158 63057 53405 107874 189680 285640 384793 466679 506300 469615 393303 392298 493090
8785 493090 602384 649062 585402 421988 261010 195673 214231 240498 230774 212039 221968
8774 221968 211401 128358 1350 -73239 -62935 -45886 -87625 -182093 -273122 -286366 -232889
8763 -232889 -204074 -264995 -390539 -524058 -644775 -772752 -875174 -863850 -725303 -546187
8753 -546187 -387874 -294417 -297303 -332759 -383448 -474184 -552131 -552865 -505903 -474934 -474148 -507761
8741 -507761 -564936 -666907 -773623 -811688 -792821 -754945 -745615 -782171 -811436 -792516 -740426
8730 -740426 -685810 -676465 -712378 -745556 -715323 -597940 -448791 -304136 -164324 -58926 -26076
8719 -26076 -41076 -29439 46515 99115 50561 -54453 -152868 -250850 -336217 -336838 -235045 -72276
8707 -72276 106226 272084 366529 370955 311103 218665 105161 -34762 -143615 -203634 -260178
8696 -260178 -279254 -235110 -212568 -315773 -494287 -614842 -638970 -607068 -538654 -433544 -346807
8685 -346807 -332933 -397135 -465076 -460249 -371307 -188291 70836 281009 332016 260053 168848
8674 168848 122235 111676 101094 63395 18429 8437 -18166 -114343 -181227 -133429 21317 231132
8662 231132 399789 452201 400513 261301 37559 -201298 -364779 -426118 -388655 -266655
8652 -266655 -89648 78594 195115 271555 299657 260597 184667 115226 26580 -107158 -259009
8641 -259009 -371274 -374309 -266204 -107041 62951 189906 244417 253879 272662 283231 216261
8630 216261 118606 41669 -34463 -120667 -189059 -206511 -165318 -93785 -28659 6457 -3379 -57952
8618 -57952 -138713 -240684 -367852 -481898 -557544 -623422 -731673 -892040 -1039858 -1070335 -942976
8607 -942976 -749021 -616358 -588492 -620455 -634769 -584125 -477751 -353160 -283293 -307751 -358913
8596 -358913 -355282 -344953 -392987 -462651 -536955 -622741 -673736 -665372 -605693 -539643 -526350 -550521
8584 -550521 -581556 -573799 -470134 -274993 -103222 -67698 -161378 -274213 -310093 -293207 -304887
8573 -304887 -338414 -336820 -319818 -303995 -284523 -277768 -249519 -166266 -31898 172362 415375
8562 415375 586344 587817 407439 139679 -48335 -67213 36106 168404 272469 323170
8552 323170 306934 263443 232205 237875 313770 432853 509120 512862 431199 258116 53125
8541 53125 -113214 -231016 -340664 -435001 -461304 -413332 -355345 -339401 -382077 -442730 -464835
8530 -464835 -469232 -489979 -493779 -448029 -325079 -120669 139266 408526 567733 535840 370583
8519 370583 193438 78485 53944 90788 121927 183084 294780 400419 449819 451280 436326
8508 436326 382620 265059 152444 141356 227470 311387 358324 353295 191757 -119243 -447595
8497 -447595 -695763 -826833 -829543 -710375 -535323 -422628 -415842 -432281 -428372 -422526 -429468 -423614
8485 -423614 -365653 -236034 -54748 98786 166580 175978 174132 209458 316028 420223 444742
8474 444742 425897 384977 343751 336945 327421 266674 137245 -48699 -241073 -382254 -443567
8463 -443567 -418047 -358388 -341303 -388796 -451898 -479839 -483384 -493523 -526031 -570935 -604700 -641161
8451 -641161 -676809 -659748 -581140 -466547 -301550 -123287 -19402 -16611 -75201 -169875 -295661
8440 -295661 -409375 -477641 -549468 -642897 -668329 -558527 -388453 -237832 -106250 6774
8430 6774 68260 37667 -45820 -73603 -21039 70434 144304 130910 51464 20121 71480 148331
8418 148331 200690 227757 268459 306666 284482 239604 228453 226277 221587 203582 124566 -15936
8406 -15936 -156508 -224922 -238985 -289279 -399807 -521661 -623272 -695260 -678884 -516143 -222822
8395 -222822 130357 458382 707929 888189 1039636 1158132 1211955 1178532 1099965 1026949
8385 1026949 964283 903409 819614 677341 464852 231916 78585 92791 235875 370711
8375 370711 431982 450446 444770 415961 388553 344236 297535 302312 354336 411959 402310 275602
8363 275602 62924 -158435 -324101 -390208 -345611 -233773 -112943 -37769 -23454 -48285 -107249
8352 -107249 -199852 -343731 -504247 -576035 -532610 -475483 -475293 -472743 -403312 -300781 -222525 -192821
8340 -192821 -200569 -179574 -127989 -136009 -215090 -287200 -343226 -403131 -434070 -411458 -339944 -270373
8328 -270373 -258685 -306862 -353056 -328035 -230984 -91381 76519 216397 235319 112261 -69681
8317 -69681 -190315 -221213 -216242 -188754 -127299 -44943 -25573 -103718 -233409 -348419 -400079
8306 -400079 -375404 -330161 -354243 -451199 -522726 -497933 -395811 -311876 -363067 -515577 -610026
8295 -610026 -539667 -374385 -259901 -239047 -249791 -201026 -102920 -30051 -4318 -27934 -134713
8284 -134713 -310123 -485212 -563379 -499035 -351409 -242294 -235895 -276091 -335662 -419726 -530296
8273 -530296 -643032 -699735 -692927 -657012 -602051 -504769 -338692 -135210 21750 91393 107589
8262 107589 95595 95109 130554 172794 176925 138548 91558 77431 105514 147956 165687 156001
8250 156001 135180 81822 -9033 -76860 -55644 42893 162398 257497 293004 222243 63175
8239 63175 -87946 -153387 -142238 -101665 -62506 -68506 -140810 -238562 -342355 -438567 -475789 -445779
8227 -445779 -460626 -588526 -705339 -724340 -700842 -684987 -661989 -611147 -548900 -458054 -355651
8216 -355651 -285486 -268506 -279915 -252484 -196090 -179930 -251143 -313304 -245307 -100858 22176
8205 22176 94172 87893 -18908 -177753 -329614 -451391 -503998 -491869 -492629 -499683 -447130 -346385
8193 -346385 -269961 -258196 -279030 -300749 -340158 -464410 -656213 -806005 -805592 -624650 -397300
8182 -397300 -288386 -309076 -374036 -441038 -464295 -376221 -208746 -75046 -34493 -45520 -47907
8171 -47907 -35343 -37972 -96808 -244267 -408596 -482606 -469770 -425711 -331210 -176855 -37680
8160 -37680 45030 83510 93353 82313 44479 -41452 -172644 -315066 -429528 -452343 -378059
8149 -378059 -286321 -210417 -109556 13586 65423 -38929 -263169 -434544 -454988 -416622 -411422
8138 -411422 -386088 -287513 -178959 -143023 -212220 -314428 -357748 -303236 -216201 -181012 -218661
8127 -218661 -309152 -375467 -353233 -252680 -130029 -29984 -46129 -222362 -445686 -567003
8117 -567003 -542713 -393092 -182966 -22200 5919 -56016 -118536 -149231 -172034 -211895 -241748
8106 -241748 -263193 -301646 -339268 -384574 -449161 -508677 -528552 -509965 -494034 -488497 -454337 -400741
8094 -400741 -425535 -538693 -582237 -477133 -325378 -234100 -257898 -373675 -514148 -653946
8084 -653946 -788058 -892441 -957305 -952338 -836960 -646287 -463122 -296230 -132180 20408
8074 20408 164394 283283 331955 269135 122009 -1844 -39824 -9885 70639 169300 240575
8063 240575 258816 207388 119254 44550 32947 107618 212031 261284 200993 74374 -39722
8052 -39722 -133231 -189145 -174971 -98907 -2660 49432 73451 130879 252278 393743 470123
8041 470123 464898 384773 254237 144675 127335 210319 286442 243296 121029 52520 62109
8030 62109 89658 94821 68867 -2470 -134203 -263246 -293084 -244018 -201340 -201926 -226374 -225929
8018 -225929 -207717 -219727 -315801 -425278 -419940 -313999 -198944 -78025 102676 295384 379625
8007 379625 304372 122520 -75767 -236908 -328176 -305225 -185056 -63079 -17931 -30250 -77922
7996 -77922 -161048 -224986 -175881 39157 348665 558042 557695 383505 149407 -1758 -29068
7985 -29068 46602 168387 220104 131116 -57647 -262346 -418236 -496806 -483740 -406327 -353153
7974 -353153 -369576 -424482 -469528 -466517 -434479 -453143 -549335 -657119 -708794 -719154 -717468 -681704
7962 -681704 -600434 -507727 -422848 -315700 -173715 -60513 -23616 -100698 -299682 -488666 -560698
7951 -560698 -605247 -694227 -776684 -790738 -699990 -492197 -276340 -168663 -153783 -220138 -373845
7940 -373845 -552489 -666171 -674284 -560435 -366747 -198775 -91327 -10670 37375 54235 47205
7929 47205 10767 -6586 5389 -40359 -150881 -248651 -283680 -335435 -475580 -654790 -802685
7918 -802685 -879474 -919557 -963793 -1020626 -1096449 -1201211 -1317700 -1417372 -1438563 -1349022 -1249466
7907 -1249466 -1216602 -1204823 -1208148 -1243389 -1272305 -1281077 -1252385 -1133374 -902631 -635948 -432164
7896 -432164 -319242 -248108 -157205 -45369 29706 6221 -46834 -32892 2777 -27716 -131192
7885 -131192 -266568 -440135 -621524 -725329 -748481 -741761 -702102 -623997 -527040 -403014 -233364
7874 -233364 -94151 -78658 -142386 -217556 -306372 -371014 -347612 -222324 -25171 187714 364515
7863 364515 476807 463039 307154 92038 -121850 -316715 -484039 -604574 -663583 -671423
7853 -671423 -639993 -613832 -625011 -668762 -702911 -707032 -712719 -697671 -633358 -583012 -606375 -643394
7841 -643394 -660713 -696047 -722292 -687817 -614846 -505941 -377827 -284602 -244520 -251172 -269365
7830 -269365 -268752 -269140 -267218 -209723 -122016 -92425 -121968 -185730 -278021 -335918 -320333 -267501 -263372
7817 -263372 -372148 -553828 -721590 -812783 -829134 -812011 -788023 -836920 -976486 -1087785 -1071010
7806 -1071010 -962042 -879131 -862714 -888771 -968683 -1098868 -1219571 -1226641 -1065764 -792681 -557042
7795 -557042 -478623 -519343 -564788 -583012 -618756 -663565 -675362 -662998 -613304 -482066 -290019
7784 -290019 -103315 48383 139248 131482 51064 -12827 34471 165672 222786 123032 -57691
7773 -57691 -182169 -182149 -118712 -107297 -167687 -218177 -239829 -257213 -245963 -204773 -188530 -240732
7761 -240732 -311931 -352444 -400735 -478653 -497509 -423436 -352753 -353077 -407163 -472918 -543276 -582665
7749 -582665 -553783 -469468 -361997 -266207 -184637 -130687 -147957 -198212 -198242 -76807 128368 283070
7737 283070 331928 327199 304809 305961 398014 557772 679240 690256 658489 670119 696344 685049
7725 685049 631375 533926 362343 145234 -10087 -35757 51817 194161 266489 212908 128491
7714 128491 65260 -25689 -148205 -249077 -295070 -247596 -102450 63147 200131 316081
7704 316081 373042 328517 216510 124362 71847 -11044 -186715 -421335 -638464 -773711 -755632
7693 -755632 -589664 -380214 -195671 -77002 -50549 -79249 -152002 -299476 -481036 -628574
7683 -628574 -693906 -628479 -474329 -346996 -313899 -327413 -280359 -143341 3322 55361 -17706
7672 -17706 -158736 -300221 -387767 -380786 -304760 -241065 -245777 -280944 -279705 -287614 -360400 -450495
7660 -450495 -484441 -449635 -393876 -348818 -331500 -355845 -448238 -615620 -759676 -737285 -539351
7649 -539351 -288576 -108820 -32582 -13887 13569 70500 88987 59433 21714 -30496 -93734
7638 -93734 -201880 -385988 -558371 -640973 -644882 -662223 -790693 -987496 -1158246 -1266045 -1329272
7627 -1329272 -1304860 -1130860 -861377 -571318 -312039 -138714 -24416 87778 202818 281372
7617 281372 314919 332340 315682 238851 115340 -36714 -194145 -334117 -407419 -378930 -335439
7606 -335439 -391851 -538063 -659559 -734034 -796868 -838698 -799483 -644637 -408524 -146685 86164
7595 86164 211865 165059 -5966 -157858 -180987 -98191 9258 81776 109626 120492 151482
7584 151482 231940 313757 354577 350105 280085 170711 57354 -19297 -19094 28417 87844 166218
7572 166218 274932 344310 291326 114650 -122841 -335595 -454817 -481591 -500877 -592815 -750041
7561 -750041 -863737 -837706 -718048 -582067 -437792 -290194 -149857 -6529 100351 138701
7551 138701 105568 56210 69653 140108 197061 178271 99906 45417 22583 -15827 -119236
7540 -119236 -278401 -408350 -468640 -463323 -375256 -216400 -75567 -58362 -138309 -195233 -141046
7529 -141046 4774 169924 309787 405342 477538 538113 541370 457748 309542 126804 -55597
7518 -55597 -205486 -309080 -361255 -341635 -284486 -280972 -366831 -489444 -579091 -614364 -621598 -579141
7506 -579141 -453710 -260426 -48914 132418 240435 258678 223588 183747 128996 33289 -63102
7495 -63102 -100419 -63965 5042 33425 33249 42155 63027 140162 264651 358445 392268 361165
7483 361165 290759 231337 193292 173416 151827 93772 37726 27971 -2615 -89292 -173140 -229143
7471 -229143 -266499 -307337 -379683 -448793 -447426 -370435 -295945 -283504 -335534 -446572 -588535
7460 -588535 -699624 -691371 -588322 -513209 -521326 -600398 -691288 -720103 -708108 -710239 -744867 -800085
7448 -800085 -831478 -826253 -829071 -902760 -1037654 -1171423 -1250487 -1246060 -1160761 -1021504 -855904
7437 -855904 -688406 -559603 -441866 -274218 -53374 187810 440450 674598 830514 844382
7427 844382 741378 634345 538929 399478 224748 51467 -107499 -245831 -346759 -411358
7417 -411358 -461880 -514948 -500415 -370699 -211940 -107718 -60605 -106915 -260970 -392348 -399012
7406 -399012 -308599 -221866 -201319 -211815 -169454 -68666 -19759 -118927 -342034 -584403 -770714
7395 -770714 -889123 -943530 -951061 -920445 -843840 -737423 -639344 -565764 -504362 -463468 -465519 -497076
7383 -497076 -499335 -440553 -351920 -258354 -170027 -100816 -63265 -66819 -59093 -13044 9923 -3170
7371 -3170 -47635 -145610 -248531 -288356 -278921 -268165 -281164 -283192 -248241 -188449 -97584 -20586
7359 -20586 -17980 -60756 -75816 -55313 -80675 -182319 -272270 -277800 -242932 -199873 -169647 -149246
7347 -149246 -78405 32651 94056 102419 141032 203396 226848 200582 161683 166577 221178 260372
7335 260372 218495 108275 -3394 -83422 -183721 -336540 -441553 -392603 -195487 66599
7325 66599 292689 440733 579280 755847 899304 924670 835845 701502 601532 529054 459855
$$ [...]
##END NTUPLES=NMR SPECTRUM
##END=
