##TITLE=C13_SR158H3
 D2O, 22200 sc

 20.4.2023
##JCAMPDX= 6.0         $$ Bruker NMR JCAMP-DX V2.0
##DATA TYPE= NMR SPECTRUM
##DATA CLASS= NTUPLES
##ORIGIN= UXNMR, Bruker Analytische Messtechnik GmbH
##OWNER= root
$$ XWIN-NMR		Version 3.5
$$ Fri Apr 21 13:41:16 2023 Russian Standard Time (UT+4h)  she@DPX200
##.OBSERVE FREQUENCY= 50.327896
##.OBSERVE NUCLEUS= ^13C
##.ACQUISITION MODE= SIMULTANEOUS
##.ACQUISITION SCHEME= undefined
##.AVERAGES= 22201
##.DIGITISER RES= 17
##SPECTROMETER/DATA SYSTEM= spect
##.PULSE SEQUENCE= zgpg30
##.SOLVENT NAME= CDCl3
##.SHIFT REFERENCE= (INTERNAL, CDCl3, 0, 222.624)
##AUDIT TRAIL= $$ (NUMBER, WHEN, WHO, WHERE, WHAT)
$$ ##TITLE= Audit trail, XWIN-NMR		Version 3.5
$$ ##JCAMPDX= 5.01
$$ ##ORIGIN= Bruker BioSpin GmbH
$$ ##OWNER= she
$$ F:/spectra/data/she/nmr/c13/1/pdata/1/auditp.txt
$$ ##AUDIT TRAIL=  $$ (NUMBER, WHEN, WHO, WHERE, WHAT)
(   1,<2023-04-21 13:38:54.64 +0400>,<she>,<DPX200>,
      <created by zg, POWCHK disabled, PULCHK disabled
       terminated by command 'halt'
       configuration hash MD5:
       00 E9 B6 7A A2 85 ED C7 34 08 36 98 17 FE 4E 26
       data hash MD5: 32K
       E3 14 66 74 C4 00 A9 EA 32 E4 0F 27 C7 5B 2B 75>)
(   2,<2023-04-21 13:38:56.85 +0400>,<she>,<DPX200>,
      <Start of raw data processing
       efp BC_mod = 2 LB = 2 FT_mod = 6 PKNL = 1 PHC0 = -300.3603 PHC1 = 25.48503 SI = 32K 
       data hash MD5: 32K
       FC 38 55 3B 42 2F D8 07 FF 46 C4 40 96 D8 EA DA>)
(   3,<2023-04-21 13:38:59.64 +0400>,<she>,<DPX200>,
      <abs ABSG = 5 
       data hash MD5: 32K
       23 64 5E 91 97 AD ED 31 D3 F0 08 C6 97 0C 2F 5A>)
(   4,<2023-04-21 13:39:31.62 +0400>,<she>,<DPX200>,
      <pk PHC0 = -34.96206 PHC1 = 31.79999 
       data hash MD5: 32K
       E8 53 0B 86 B1 1D 32 F7 80 12 65 53 75 1B B1 48>)
(   5,<2023-04-21 13:39:34.64 +0400>,<she>,<DPX200>,
      <abs ABSG = 5 
       data hash MD5: 32K
       6C 37 EC 44 77 4A 0A 24 6F F7 84 38 A0 FA 6B DC>)
(   6,<2023-04-21 13:40:34.45 +0400>,<she>,<DPX200>,
      <pk PHC0 = 0.9462727 PHC1 = -1.399814 
       data hash MD5: 32K
       39 73 1C F1 73 26 87 87 0B DF CE 74 2D 10 2A 82>)
$$ ##END=
$$ 
$$ hash MD5
$$ F2 2C 51 0D 67 DE F6 98 EC 6A 6E DD 4F 3B 79 DB
##$RELAX= 
##$RELAX= 
##$RELAX= 
##$RELAX= 
##$RELAX= 
##$RELAX= 
##$RELAX= 
##$RELAX= 
$$ Bruker specific parameters
$$ --------------------------
##$DU= <F:/spectra>
##$EXPNO= 1
##$NAME= <c13>
##$PROCNO= 1
##$TYPE= <nmr>
##$USER= <she>
##$AMP= (0..31)
100 100 100 100 100 100 100 100 100 100 100 100 100 100 100 100 100 100 
100 100 100 100 100 100 100 100 100 100 100 100 100 100 
##$AQSEQ= 0
##$AQ_mod= 1
##$AUNM= <au_zg>
##$AUTOPOS= <>
##$BF1= 50.322709
##$BF2= 200.13
##$BF3= 50.322709
##$BF4= 500.13
##$BF5= 500.13
##$BF6= 500.13
##$BF7= 500.13
##$BF8= 500.13
##$BYTORDA= 1
##$CFDGTYP= 0
##$CFRGTYP= 5
##$CHEMSTR= <none>
##$CNST= (0..31)
1 1 145 1 1 1 1 1 1 1 1 1 1 1 1 1 1 1 1 1 1 1 1 1 1 1 1 1 1 1 1 1 
##$CPDPRG= <waltz16>
##$CPDPRG1= <>
##$CPDPRG2= <waltz16>
##$CPDPRG3= <>
$$ [...]
##$SUBNAM4= <"">
##$SUBNAM5= <"">
##$SUBNAM6= <"">
##$SUBNAM7= <"">
##$SUBNAM8= <"">
##$SUBNAM9= <"">
##$SW= 239.972175391363
##$SWIBOX= (0..15)
0 1 3 0 0 0 0 0 0 0 0 0 0 0 0 0 
##$SW_h= 12077.2946859903
##$TD= 32768
##$TD0= 1
##$TE= 0
##$TE2= 300
##$TE3= 300
##$TEG= 300
##$TL= (0..7)
120 120 120 120 120 120 120 120 
##$TP= (0..7)
150 150 150 150 150 150 150 150 
##$TP07= 0
##$TPNAME0= <>
##$TPNAME1= <>
##$TPNAME2= <>
##$TPNAME3= <>
##$TPNAME4= <>
##$TPNAME5= <>
##$TPNAME6= <>
##$TPNAME7= <>
##$TPOAL= (0..7)
0.5 0.5 0.5 0.5 0.5 0.5 0.5 0.5 
##$TPOFFS= (0..7)
0 0 0 0 0 0 0 0 
##$TUNHIN= 0
##$TUNHOUT= 0
##$TUNXOUT= 0
##$USERA1= <user>
##$USERA2= <user>
##$USERA3= <user>
##$USERA4= <user>
##$USERA5= <user>
##$V9= 5
##$VALIST= <valist>
##$VCLIST= <CCCCCCCCCCCCCCC>
##$VD= 0
##$VDLIST= <DDDDDDDDDDDDDDD>
##$VPLIST= <PPPPPPPPPPPPPPP>
##$VTLIST= <TTTTTTTTTTTTTTT>
##$WBST= 1024
##$WBSW= 4
##$XGAIN= (0..3)
0 0 0 0 
##$XL= 0
##$YL= 0
##$YMAX_a= 123267936
##$YMIN_a= -34584013
##$ZGOPTNS= <>
##$ZL1= 120
##$ZL2= 120
##$ZL3= 120
##$ZL4= 120
##$ABSF1= 222.624
##$ABSF2= -17.3728
##$ABSG= 5
##$ABSL= 3
##$ALPHA= 0
##$AQORDER= 0
##$ASSFAC= 0
##$ASSFACI= 0
##$ASSFACX= 0
##$ASSWID= 0
##$AUNMP= <proc_1d>
##$AZFE= 0.1
##$AZFW= 0.5
##$BCFW= 0
##$BC_mod= 2
##$BYTORDP= 0
##$COROFFS= 0
##$CY= -3
##$DATMOD= 1
##$DC= 0
##$DFILT= <>
##$DTYPP= 0
##$F1P= 0
##$F2P= 0
##$FCOR= 0.5
##$FTSIZE= 32768
##$FT_mod= 6
##$GAMMA= 0
##$GB= 0
##$INTBC= 1
##$INTSCL= 4.134877e-10
##$ISEN= 128
##$LB= 2
##$LEV0= 0
##$LPBIN= 0
##$MAXI= 10000
##$MC2= 0
##$MEAN= 0
##$ME_mod= 0
##$MI= 0.1934396
##$NCOEF= 0
##$NC_proc= -2
##$NLEV= 6
##$NOISF1= 120.0001
##$NOISF2= 80.00006
##$NSP= 0
##$NTH_PI= 0
##$NZP= 0
##$OFFSET= 222.624
##$PC= 1.4
##$PHC0= -334.3761
##$PHC1= 55.8852
##$PH_mod= 1
##$PKNL= yes
##$PPARMOD= 0
##$PSCAL= 0
##$PSIGN= 0
##$REVERSE= no
##$SF= 50.3227315983092
##$SI= 32768
##$SIGF1= 140
##$SIGF2= 120
##$SINO= 11.81781
##$SIOLD= 32768
##$SREGLST= <13C.CDCl3>
##$SSB= 0
##$STSI= 32768
##$STSR= 0
##$SW_p= 12077.2946859903
##$SYMM= 0
##$S_DEV= 0
##$TDeff= 32768
##$TDoff= 0
##$TI= <>
##$TILT= no
##$TM1= 0
##$TM2= 0
##$TOPLEV= 0
##$USERP1= <user>
##$USERP2= <user>
##$USERP3= <user>
##$USERP4= <user>
##$USERP5= <user>
##$WDW= 1
##$XDIM= 32768
##$YMAX_p= 269827262
##$YMIN_p= -24924305
$$ End of Bruker specific parameters
$$ ---------------------------------
##NTUPLES= NMR SPECTRUM
##VAR_NAME=  FREQUENCY,     SPECTRUM/REAL,   SPECTRUM/IMAG
##SYMBOL=    X,             R,               I
##VAR_TYPE=  INDEPENDENT,   DEPENDENT,       DEPENDENT
##VAR_FORM=  AFFN,          ASDF,            ASDF
##VAR_DIM=   32768,         32768,           32768
##UNITS=     HZ,            ARBITRARY UNITS, ARBITRARY UNITS
##FACTOR=    0.368581032318806, 1,           1
##FIRST=     11203.0474430531, 0,            0
##LAST=      -874.247242937185, 0,           0
##MIN=       -874.247242937185, -24924305,   0
##MAX=       11203.0474430531, 269827262,    0
$$ Real data points
##PAGE= N=1
##DATA TABLE= (X++(R..R)), XYDATA
$$ [...]
##PAGE= N=2
##DATA TABLE= (X++(I..I)), XYDATA
$$ plain form
9358 206164669 204848680 203415734 201904445 200924977 201638919 203401099 204828538 205696541
9350 205696541 206473792 207620413 209403123 212083477 215317052 217850714 218566603 217177414
9342 217177414 214571318 211956323 209866368 208336044 207395617 206681229 205649765 204542057
9334 204542057 203509912 202847192 203062198 204005876 205336385 206645134 207671474 208487891 208875827
9325 208875827 208562710 207799673 206813807 205528462 204348316 203946871 203967460 204440200 205805292
9316 205805292 207260401 208353859 209760956 211553025 213069569 213775316 213126117 211360606
9308 211360606 210178950 210403945 211527606 212382586 211471598 208363793 204204564 200856205
9300 200856205 199827699 200836071 202963654 206078810 209544044 212148570 213622063 214211979
$$ packed form
9358B06164669j315989j432946j511289r79468P13942J762180J427439Q68003
9350B05696541P77251J146621J782710K680354L233575K533662P15889j389189
9342B17177414k606096k614995k089955j530324r40427p14388j031464j107708
9334B04542057j032145o62720K15006R43678J330509J308749J026340Q16417L87936
9325B08875827l13117p63037r85866j285345j180146m01445K0589M72740J365092
9316B05805292J455109J093458J407097J792069J516544P05747o49199j765511
9308B11360606j181656K24995J123661Q54980r10988l107805m159229l348359
9300B00856205j028506J008372K127583L115156L465234K604526J473493N89916
$$ plain form
9292 214211979 213094072 209980325 206075873 202476375 200137790 199867911 200976083 202186974
9284 202186974 203147821 204537007 206870281 208649364 208977681 207942619 205554115 202540188
9276 202540188 199414626 196195280 193492042 192315974 192403491 192873282 193801020 195786921 198654768
9267 198654768 200942612 202217602 203903985 206550027 209039890 209728584 208180828 205972672
9259 205972672 204317499 203454589 203053460 201717639 199146654 196843671 195633116 195079648
9251 195079648 194613396 194870612 197137338 201284880 205860784 210007929 214108474 218423320
9243 218423320 221930637 222764483 220687095 217202524 213607576 210782757 209142542 208483485
9235 208483485 208226430 207768606 207029688 206346717 205977181 205816619 206202587 207645979 209903004
$$ packed form
9292B14211979j117907l113747l904452l599498k338585k69879J108172J210891
9284B02186974R60847J389186K333274J779083L28317j035062k388504l013927
9276B02540188l125562l219346k703238j176068Q7517M69791R27738J985901K867847
9267A98654768K287844J274990J686383K646042K489863O88694j547756k208156
9259B05972672j655173q62910m01129j335821k570985k302983j210555n53468
9251A95079648m66252K57216K266726M147542M575904M147145M100545M314846
9243B18423320L507317Q33846k077388l484571l594948k824819j640215o59057
9235B08483485k57055m57824p38918o82971l69536j60562L85968J443392K257025
$$ plain form
9226 209903004 212398428 214683984 215916054 215018995 212426305 209792929 207667793 206098058
9218 206098058 205237859 204824266 203988367 202903901 202879147 203540421 203976561 204857909 206591423
9209 206591423 208073533 207929063 206290839 204398918 202674381 200926880 199826495 200372117
9201 200372117 202767169 206509843 209889180 210839432 208917446 205209996 202358031 202182107
9193 202182107 203631797 205121361 206152452 206548054 206457615 205659695 204084651 202374990 201214452
9184 201214452 201478595 202532903 203409018 204001904 203813857 203185806 202819638 203156072 204253334
9175 204253334 205818968 208006486 210053448 211628355 213914441 217457264 221197929 223935546
9167 223935546 224706421 222939846 219474113 215957542 212945777 210186641 208515335 208382612
$$ packed form
9226B09903004K495424K285556J232070q97059k592690k633376k125136j569735
9218B06098058q60199m13593q35899j084466k4754O61274M36140Q81348J733514
9209B06591423J482110j44470j638224j891921j724537j747501j100385N45622
9201B00372117K395052L742674L379337R50252j921986l707450k851965j75924
9193B02182107J449690J489564J031091L95602r0439p97920j575044j709661j160538
9184B01214452K64143J054308Q76115N92886j88047o28051l66168L36434J097262
9175B04253334J565634K187518K046962J574907K286086L542823L740665K737617
9167B23935546P70875j766575l465733l516571l011765k759136j671306j32723
$$ plain form
9159 208382612 208867025 209395740 210194094 211031370 210952342 209658922 207762599 205933536 205057489
9150 205057489 205296601 206154400 207351342 208234550 207944694 205575166 201337407 197219299 194546208
9141 194546208 193585999 194410021 196914660 200281595 203430487 205917255 207772242 209164197
9133 209164197 209960275 210132185 210973532 213632476 216798025 218957042 220673932 222182459
9125 222182459 222310201 220638020 218418816 216579780 215349789 215148468 215788506 216304254 216150232
9116 216150232 215459086 214138066 212514987 211611119 212053834 213159015 214057280 214344270 214012450
9107 214012450 213677696 214060141 214220681 212507468 209777699 207822957 207288552 207698889 207799178
9098 207799178 207704471 208863412 211365411 214128543 216152899 217033822 217337815 217745525 218393800
$$ packed form
9159B08382612M84413N28715P98354Q37276p9028j293420j896323j829063q76047
9150B05057489K39112Q57799J196942Q83208k89856k369528m237759m118108k673091
9141A94546208r60209Q24022K504639L366935L148892K486768J854987J391955
9133B09164197P96078J71910Q41347K658944L165549K159017J716890J508527
9125B22182459J27742j672181k219204j839036j229991k01321O40038N15748j54022
9116B16150232o91146j321020j623079r03868M42715J105181Q98265K86990l31820
9107B14012450l34754L82445J60540j713213k729769j954742n34405M10337J00289
9098B07799178r4707J158941K501999K763132K024356Q80923L03993M07710O48275
$$ plain form
9089 218393800 218868149 219086826 218370658 215863557 212046275 208680006 207183775 206718375 205950739
9080 205950739 205743576 208042065 212862732 217085054 218557783 218773203 218946960 217872393
9072 217872393 215283557 212658776 210737098 208899778 207248092 207338233 209121354 211165714
9064 211165714 213027284 213934448 213077289 211383056 209244993 206799640 204783513 203549310
9056 203549310 203065697 203212960 203396654 202730682 201513944 201097527 202484530 205258492 207210569
9047 207210569 206296702 203544360 201374329 200837676 202262053 205320252 208879509 211598160
9039 211598160 212998671 213203857 212608225 211335543 209388511 207684827 207244415 207721246 208156292
9030 208156292 207977321 206437215 203464688 200118426 197632172 196224918 195809253 196282541
$$ packed form
9089B18393800M74349K18677p16168k507101l817282l366269j496231m65400p67636
9080B05950739k07163K298489M820667M222322J472729K15420J73757j074567
9072B17872393k588836k624781j921678j837320j651686R0141J783121K044360
9064B11165714J861570R07164q57159j694233k138063k445353k016127j234203
9056B03549310m83613J47263J83694o65972j216738m16417J387003K773962J952077
9047B07210569r13867k752342k170031n36653J424377L058199L559257K718651
9039B11598160J400511K05186n95632j272682j947032j703684m40412M76831M35046
9030B08156292j78971j540106k972527l346262k486254j407254m15665M73288
$$ plain form
9022 196282541 197424254 199291919 202387565 206313545 210122230 213606507 216818712 218438759
9014 218438759 217102198 213267805 209100463 206276958 204182886 201750071 199525202 198064631
9006 198064631 197178178 197469892 198959371 201447493 204835303 208441535 211368425 212857469
8998 212857469 213004955 212333912 211087461 209580875 208323148 208240330 209310688 210216550 211650013
8989 211650013 215031650 219201330 221747242 222486130 222633263 222550576 221703236 219866327 218243592
8980 218243592 217010106 215480491 214303739 213792684 213350477 212760044 211936192 211273062 211307667
8971 211307667 211805846 212775308 215173506 218288474 220796739 222923782 224307711 223839624
8963 223839624 221444735 217783242 214522288 213214349 214058511 216115423 217716096 217693903
$$ packed form
9022A96282541J141713J867665L095646L925980L808685L484277L212205J620047
9014B18438759j336561l834393m167342k823505k094072k432815k224869j460571
9006A98064631q86453K91714J489479K488122L387810L606232K926890J489044
8998B12857469J47486o71043j246451j506586j257727q2818J070358R05862J433463
8989B11650013L381637M169680K545912P38888J47133q2687q47340j836909j622735
8980B18243592j233486j529615j176752n11055m42207n90433q23852o63130L4605
8971B11307667M98179R69462K398198L114968K508265K127043J383929m68087
8963B23839624k394889l661493l260954j307939Q44162K056912J600673k2193
$$ plain form
8955 217693903 216685085 216540502 217969874 219372335 219068683 216930286 213710587 210222188
8947 210222188 207502653 206744546 208475470 211762186 214831161 216272526 216031849 215356871
8939 215356871 215250988 215026321 214128446 212734540 210807262 208277074 205515092 203194919
8931 203194919 201115009 199555901 199268723 199593387 199410890 199366938 200299333 201811198 203885727
8922 203885727 207077789 211473274 216669247 221027481 223169572 223487018 223218989 223281202 222746380
8913 222746380 220605760 217935488 215723209 213901341 212071648 209813896 206974019 204190519
8905 204190519 202012424 200763445 200994217 202859480 205849446 208709119 209934709 209530217
8897 209530217 208619122 207840529 207263763 206789360 206560675 206807590 207560018 208355723 208909663
$$ packed form
8955B17693903j008818j44583J429372J402461l03652k138397l219699l488399
8947B10222188k719535p58107J730924L286716L068975J441365k40677o74978
8939B15356871j05883k24667q97875j393906j927278k530188k761982k320173
8931B03194919k079910j559108k87178L24664j82497m3952R32395J511865K074529
8922B03885727L192062M395485N195973M358234K142091L17446k68029O2213n34822
8913B22746380k140620k670272k212279j821868j829693k257752k839877k783500
8905B04190519k178095j248979K30772J865263K989966K859673J225590m04492
8897B09530217r11095p78593n76766m74403k28685K46915P52428P95705N53940
$$ plain form
8888 208909663 209922640 211936084 213986341 215006927 215709043 216472247 216107899 214184183
8880 214184183 212638800 212502615 213219660 214172803 214893149 215025469 214261892 212798250 210488702
8871 210488702 207413987 203996725 201334107 200151566 200416767 202204230 205006697 207495591
8863 207495591 209097517 210639375 213046050 215467201 216585516 216782119 216828385 216621665 215670326
8854 215670326 214449883 213422316 212279142 211294286 211029407 211416495 212358334 213723515 215369264
8845 215369264 217339505 218915144 218547910 215584270 211514639 209015016 209995937 213718241
8837 213718241 217844952 220310002 220417951 219072641 217222026 215038623 212734830 210746462
8829 210746462 208701158 206078691 204202926 204715155 207031257 209077898 209456167 208149768
$$ packed form
8888B08909663J012977K013444K050257J020586P02116P63204l64348j923716
8880B14184183j545383j36185P17045R53143P20346J32320p63577j463642k309548
8871B10488702l074715l417262k662618j182541K65201J787463K802467K488894
8863B07495591J601926J541858K406675K421151J118315J96603M6266k06720r51339
8854B15670326j220443j027567j143174r84856k64879L87088R41839J365181J645749
8845B15369264J970241J575639l67234k963640m069631k499623R80921L722304
8837B13718241M126711K465050J07949j345310j850615k183403k303793j988368
8829B10746462k045304k622467j875765N12229K316102K046641L78269j306399
$$ plain form
8821 208149768 205989644 204650842 204576395 204761170 205263350 206713197 208088209 207810043 206047366
8812 206047366 203765266 201646152 200308985 200163165 201065465 202518014 204254098 206314136
8804 206314136 208479032 209511839 208587867 206657764 204869940 203538185 202266435 200619984
8796 200619984 199751510 200609916 202365098 204378180 206511501 208747212 210990124 212783461
8788 212783461 213956709 214233381 213715572 212966367 212242523 211154259 209693154 208382504 206938520
8779 206938520 205232653 203728551 202878889 202591780 202545402 203316920 205144664 206455617 206371530
8770 206371530 205731181 204626899 202764664 201527078 201547135 201484426 200866316 201134930 202898849
8761 202898849 205004193 207006524 209083484 210363799 210371119 210311027 210564587 210700022 211466073
$$ packed form
8821B08149768k160124j338802p4447J84775N02180J449847J375012k78166j762677
8812B06047366k282100k119114j337167j45820R02300J452549J736084K060038
8804B06314136K164896J032807r23972j930103j787824j331755j271750j646451
8796B00619984q68474Q58406J755182K013082K133321K235711K242912J793337
8788B12783461J173248K76672n17809p49205p23844j088264j461105j310650j443984
8779B06938520j705867j504102q49662k87109m6378P71518J827744J310953q4087
8770B06371530o40349j104282j862235j237586K0057o2709o18110K68614J763919
8761B02898849K105344K002331K076960J280315P320o0092K53560J35435P66051
$$ plain form
8752 211466073 213831531 217102477 218667625 216801864 212215221 206480645 200751183 196813137
8744 196813137 196414139 199376040 204616749 210686456 215123747 216310735 215490625 214851371
8736 214851371 215154987 215432396 215551930 216329641 217185958 216950726 215616722 214291824 214200350
8727 214200350 215098688 215286465 214426435 213370151 213166455 214128380 215977675 218168520 219512416
8718 219512416 219439059 218853709 218939646 219795941 221323941 223664533 225929531 227032029 226628710
8709 226628710 224980482 222602106 220195421 218240428 216648011 215170488 213749159 213273535
8701 213273535 213000511 211478665 210209838 211009473 212621121 213755663 215334555 217356107
8693 217356107 218470880 218792507 219397122 220115190 220447923 221216958 221847418 220201791 216572956
$$ packed form
8752B11466073K365458L270946J565148j865761m586643n734576n729462l938046
8744A96813137l98998K961901N240709O069707M437291J186988q20110o39254
8736B14851371L03616K77409J19534P77711Q56317k35232j334004j324898r1474
8727B14200350Q98338J87777q60030j056284k03696R61925J849295K190845J343896
8718B19512416p3357n85350Q5937Q56295J528000K340592K264998J102498m03319
8709B26628710j648228k378376k406685j954993j592417j477523j421329m75624
8701B13273535k73024j521846j268827P99635J611648J134542J578892K021552
8693B17356107J114773L21627O04615P18068L32733P69035O30460j645627l628835
$$ plain form
8684 216572956 212707491 209553213 207798859 207615564 208242147 208031964 206699038 205976463 207090560
8675 207090560 209548086 211534554 211801981 210710223 209808919 210035044 210999310 211891798 212127155
8666 212127155 211888878 212010128 213227238 214974509 216379696 216998724 217056677 216986222 216761842
8657 216761842 216410234 215565631 214550976 213770372 213004294 212141742 211719427 212896335 215625257
8648 215625257 218756753 220569690 220414842 219233776 217926466 217258291 217197833 217062028 216662349
8639 216662349 216311055 216542007 216848184 216425125 216157840 216995684 219192171 222512773 225933103
8630 225933103 228079652 228532967 228655110 229253250 229283442 227792312 224921027 221093943 217260742
8621 217260742 215629126 216352476 216721705 214463343 210893377 209244597 210923801 214540815
$$ packed form
8684B16572956l865465l154278j754354j83295O26583k10183j332926p22575J114097
8675B07090560K457526J986468K67427j091758r01304K26125R64266Q92488K35357
8666B12127155k38277J21250J217110J747271J405187O19028N7953p0455k24380
8657B16761842l51608q44603j014655p80604p66078q62552m22315J176908K728922
8648B15625257L131496J812937j54848j181066j307310o68175o0458j35805l99679
8639B16662349l51294K30952L06177m23059k67285Q37844K196487L320602L420330
8630B25933103K146549M53315J22143N98140L0192j491130k871285l827084l833201
8621B17260742j631616P23350L69229k258362l569966j648780J679204L617014
$$ plain form
8613 214540815 218142990 220991129 223584226 226484424 228839448 229355453 227802833 224824688
8605 224824688 221326923 218513873 216888721 216448037 217122261 218233579 219235728 219747384
8597 219747384 219164577 217536511 215527523 213601346 211954778 210530302 209204678 207760521
8589 207760521 205928031 204508764 204407464 205708541 207437106 208452219 208647223 208358636
8581 208358636 207355935 206218731 205856702 205532136 204191838 202115770 200275836 200157921
8573 200157921 201956142 204435282 206582783 207715880 208112720 209059030 211335032 213836296
8565 213836296 214894017 215203192 216031718 216409186 215351553 213713970 213376618 214908263 216510323
8556 216510323 217103714 217634078 218430096 218707791 217441028 214463772 211015365 209550450 210913498
$$ packed form
8613B14540815L602175K848139K593097K900198K355024N16005j552620k978145
8605B24824688l497765k813050j625152m40684O74224J111318J002149N11656
8597B19747384n82807j628066k008988j926177j646568j424476j325624j444157
8589B07760521j832490j419267j01300J301077J728565J015113J95004k88587
8581B08358636j002701j137204l62029l24566j340298k076068j839934j17915
8573B00157921J798221K479140K147501J133097L96840R46310K276002K501264
8565B13836296J057721L09175Q28526L77468j057633j637583l37352J531645J602060
8556B16510323N93391N30364P96018K77695j266763k977256l448407j464915J363048
$$ plain form
8547 210913498 212682061 213239495 213553212 214236835 214868083 215504015 215726502 214984754 214508442
8538 214508442 214741376 214506122 213824599 213944734 215092552 215799903 215271112 213888861 211940112
8529 211940112 209798206 208194979 208166767 210577613 214781654 218658693 220472756 219670493
8521 219670493 216852633 213865776 212707272 213840327 216135707 218249309 220003070 221927653
8513 221927653 223384106 223375971 222088792 220425632 219667724 220010953 220090070 219066856 217803372
8504 217803372 217575659 217993820 217935646 216594775 213441472 209237853 206095207 205484723 206936250
8495 206936250 209272673 211752301 213647153 214675881 215522897 216967476 218908097 220339592
8487 220339592 219981368 217542272 214782484 213073217 211796568 210472386 209383403 208726983
$$ packed form
8547B10913498J768563N57434L13717O83623O31248O35932K22487p41748m76312
8538B14508442K32934k35254o81523J20135J147818P07351n28791j382251j948749
8529B11940112k141906j603227k8212K410846M204041L877039J814063q02263
8521B19670493k817860k986857j158504J133055K295380K113602J753761J924583
8513B21927653J456453q135j287179j663160p57908L43229P9117j023214j263484
8504B17803372k27713M18161n8174j340871l153303m203619l142646o10484J451527
8495B06936250K336423K479628J894852J028728Q47016J444579J940621J431495
8487B20339592l58224k439096k759788j709267j276649j324182j088983o56420
$$ plain form
8479 208726983 208853222 210207029 211432021 210297357 207400173 205198095 204611735 205208219
8471 205208219 206531779 207478727 207815472 208656347 210429047 213282616 216965959 220232105
8463 220232105 222471852 223701691 223965342 223732960 223545529 223066168 221358057 219204893 218027248
8454 218027248 217795428 217667185 217236252 217281136 218315349 219270930 219321307 219388581 219972133 220115521
8444 220115521 219261242 218857245 220049302 222121673 224151952 225388799 225967025 226607717 227426059
8435 227426059 227740808 227162907 226681862 226598495 226305779 226448188 227845638 229161525 228462432
8426 228462432 226355847 224598754 223492724 222138742 220541406 219993618 221315036 223652079
8418 223652079 224889730 224293545 223022843 222199147 222386773 222829934 223021306 223681365 225323867
$$ packed form
8479B08726983J26239J353807J224992j134664k897184k202078n86360N96484
8471B05208219J323560R46948L36745Q40875J772700K853569L683343L266146
8463B20232105K239747J229839K63651k32382j87431m79361j708111k153164j177645
8454B18027248k31820j28243m30933M4884J034213R55581N0377O7274N83552J43388
8444B20115521q54279m03997J192057K072371K030279J236847N78226O40692Q18342
8435B27426059L14749n77901m81045q3367k92716J42409J397450J315887o99093
8426B28462432k106585j757093j106030j353982j597336n47788J321418K337043
8418B23652079J237651n96185j270702q23696J87626M43161J91372O60059J642502
$$ plain form
8409 225323867 227636026 228853858 227520517 224009331 220420684 219225905 220699031 223085970
8401 223085970 225242197 226811702 227680607 228318750 229423602 231128953 232387239 231694132
8393 231694132 228877137 225397417 222797121 222127313 223209779 224522862 225057775 225077899 224972066
8384 224972066 224754786 224280484 222870315 220337230 218088322 218376767 221913471 227152812
8376 227152812 231326381 232958511 232497239 230921013 228596892 225523498 222691524 221406042
8368 221406042 221338325 221341437 220726428 219819536 219658743 220315704 221308505 221903758 221142977 218726122
8358 218726122 215144507 211631810 209765709 210151229 211749580 213104154 213803917 214500988
8350 214500988 215380974 215817517 215697029 215304078 214960340 215450803 216561991 217022260 215619489
$$ packed form
8409B25323867K312159J217832j333341l511186l588647j194779J473126K386939
8401B23085970K156227J569505Q68905O38143J104852J705351J258286o93107
8393B31694132k816995l479720k600296o69808J082466J313083N34913K0124j05833
8384B24972066k17280m74302j410169k533085k248908K88445L536704N239341
8376B27152812M173569J632130m61272j576226k324121l073394k831974j285482
8368B21406042o7717L112o15009r06892j60793O56961R92801N95253p60781k416855
8358B18726122l581615l512697j866101L85520J598351J354574O99763O97071
8350B14500988Q79986M36543j20488l92951l43738M90463J111188M60269j402771
$$ plain form
8341 215619489 212756808 210730354 210866958 211662475 211555894 210868857 210282571 209321941 207914070
8332 207914070 207525481 208735600 211456757 215028959 218367278 221465772 224517758 226650971
8324 226650971 227801792 228338353 228192763 227377127 226542249 225513786 223820430 222300527 221611933
8315 221611933 221831575 222388434 222098285 220830603 219466070 218369199 218038902 219439328 222612118
8306 222612118 225768782 227601772 227819811 226283907 223336251 220472392 219204460 219283884
8298 219283884 219830690 219886000 219228548 218486967 218946063 221565698 224995578 227667816 229088702
8289 229088702 228819400 226989638 224485301 222685550 221637535 219964035 217030260 212596258
8281 212596258 207679961 204960316 205782456 209407531 213229592 215424398 216398259 217304157
$$ packed form
8341B15619489k862681k026454J36604P95517j06581o87037n86286r60630j407871
8332B07914070l88589J210119K721157L572202L338319L098494L051986K133213
8324B26650971J150821N36561j45590q15636q34878j028463j693356j519903o88594
8315B21611933K19642N56859k90149j267682j364533j096871l30297J400426L172790
8306B22612118L156664J832990K18039j535904k947656k863859j267932P9424
8298B19283884N46806N5310o57452p41581M59096K619635L429880K672238J420886
8289B29088702k69302j829762k504337j799751j048015j673500k933775m434002
8281B12596258m916297k719645Q22140L625075L822061K194806R73861R05898
$$ plain form
8273 217304157 218603034 219772083 219830780 218338198 216049190 213915114 213345320 215143229
8265 215143229 217955747 219845747 219780789 218012027 215780032 213851117 212043964 209850679
8257 209850679 206881644 203929171 202717315 203219651 204109430 204867766 205295797 206104217 208496894
8248 208496894 211129078 212499050 213373327 214400571 215587967 216842754 218356811 220427548
8240 220427548 222260542 222649622 221897438 221451734 221134970 218965291 215020821 211716430 210608061
8231 210608061 211562752 212813029 213332629 214182300 215198555 215734421 216701031 218551244 220543039
8222 220543039 221978011 222277106 221435490 220374896 220277736 221566305 223593207 225651897 226344934
8213 226344934 224618143 221886197 220252493 219611945 218360129 216042317 213328015 211357036
$$ packed form
8273B17304157J298877J169049N8697j492582k289008k134076n69794J797909
8265B15143229K812518J890000o4958j768762k231995j928915j807153k193285
8257B09850679k969035k952473j211856N02336Q89779P58336M28031Q08420K392677
8248B08496894K632184J369972Q74277J027244J187396J254787J514057K070737
8240B20427548J832994L89080p52184m45704l16764k169679l944470l304391j108369
8231B10608061R54691J250277N19600Q49671J016255N35866R66610J850213J991795
8222B20543039J434972K99095q41616j060594r7160J288569K026902K058690O93037
8213B26344934j726791k731946j633704o40548j251816k317812k714302j970979
$$ plain form
8205 211357036 211017930 212607078 215259916 217775212 219714980 220748064 220400490 219228710
8197 219228710 218019917 216419617 214412726 213032808 213407313 214720089 215704099 216111359
8189 216111359 215711544 215212359 215689940 216526734 216790591 216471796 216486540 217737418 220053511
8180 220053511 222800881 225043591 225675327 225497841 226057339 227495067 229023163 230411865
8172 230411865 231998458 233049888 232799548 231302704 229085529 226399193 223468201 220649622
8164 220649622 217847763 215369948 213650187 212628401 212767266 214056402 216034552 218682224
8156 218682224 221534318 224170780 226440862 227522708 227360395 226178917 224099933 222166226
8148 222166226 221999031 222996346 223348223 223050961 222809765 223126395 224270166 225284768 225050803
$$ packed form
8205B11357036l39106J589148K652838K515296J939768J033084l47574j171780
8197B19228710j208793j600300k006891j379918L74505J312776R84010M07260
8189B16111359l99815m99185M77581Q36794K63857l18795J4744J250878K316093
8180B20053511K747370K242710O31736j77486N59498J437728J528096J388702
8172B30411865J586593J051430k50340j496844k217175k686336k930992k818579
8164B20649622k801859k477815j719761j021786J38865J289136J978150K647672
8156B18682224K852094K636462K270082J081846j62313j181478k078984j933707
8148B22166226j67195R97315L51877k97262k41196L16630J143771J014602k33965
$$ plain form
8139 225050803 224324227 223783787 222881767 221814884 220830135 219241891 216811144 214556352 214309363
8130 214309363 216679049 220591835 225124690 229729222 233467068 235569163 235932572 234483598
8122 234483598 231900762 228512403 224787531 221952198 220600598 220422502 220872908 221412264
8114 221412264 221416428 221314439 221520652 221440201 221286649 222212047 223697155 224835976 226270652
8105 226270652 229214024 233045613 235733706 236215350 234592296 232312346 230941287 230063011
8097 230063011 228468016 225000078 219812417 215314543 213400662 213638945 215116274 217083818
8089 217083818 218601778 218853180 217734223 215817448 213966695 212747573 212244944 213028124
8081 213028124 214862261 216190547 216640393 217452858 219149515 220964971 222902902 225310490
$$ packed form
8139B25050803p26576n40440r02020j066883r84749j588244k430747k254792k46989
8130B14309363K369686L912786M532855M604532L737846K102095L63409j448974
8122B34483598k582836l388359l724872k835333j351600j78096M50406N39356
8114B21412264M164j01989K06213q0451j53552R25398J485108J138821J434676
8105B26270652K943372L831589K688093M81644j623054k279950j371059q78276
8097B30063011j594995l467938n187661m497874j913881K38283J477329J967544
8089B17083818J517960K51402j118957j916775j850753j219122n02629P83180
8081B13028124J834137J328286M49846Q12465J696657J815456J937931K407588
$$ plain form
8073 225310490 227661237 228993994 228884524 228052461 226610529 224197796 221177698 218670723
8065 218670723 218175422 219581878 221367027 222216814 222766137 223853075 224654176 224586608 223748741
8056 223748741 222241782 220591007 218818667 216835851 215110616 213529692 211607162 209936026
8048 209936026 209222624 209577596 210653701 211646713 212476021 213987458 216014585 217952129 219890257
8039 219890257 222038287 224251535 225974332 225973464 223460061 220193505 218223780 218031490 219376841
8030 219376841 221101974 221381230 220437653 219977552 219605964 218310879 216918024 215698265 214602716
8021 214602716 214384550 215623810 218676660 222876192 226655016 228935397 229564984 228697919
8013 228697919 226982740 225323642 224822078 225961536 227592462 228807715 229643430 229742172 228902660
$$ packed form
8073B25310490K350747J332757j09470q32063j441932k412733l020098k506975
8065B18670723m95301J406456J785149Q49787N49323J086938Q01101o7568q37867
8056B23748741j506959j650775j772340j982816j725235j580924j922530j671136
8048B09936026p13402L54972J076105R93012Q29308J511437K027127J937544J938128
8039B19890257K148030K213248J722797q68k513403l266556j969725j92290J345351
8030B19376841J725133K79256r43577m60101l71588j295085j392855j219759j095549
8021B14602716k18166J239260L052850M199532L778824K280381O29587q67065
8013B28697919j715179j659098n01564J139458J630926J215253Q35715R8742q39512
$$ plain form
8004 228902660 226886430 223944030 221398798 220744773 221966477 223554651 225184614 227602303
7996 227602303 230076621 231149601 230815471 230035305 228806289 226432484 223930595 222789489
7988 222789489 223482172 224926405 225683184 225992480 226522309 226935494 226727810 225501395 224408742
7979 224408742 225205818 227267823 228907707 229098541 227923701 226276099 224823472 223885133
7971 223885133 223922686 225186270 226662288 227385826 227209163 226403097 226464931 228626466 231778578
7962 231778578 234129451 235366023 236270552 237265406 237703915 237154828 236183193 234979355 233233468
7953 233233468 231507454 229694014 227239972 225844051 226899650 229433211 231886267 233170243
7945 233170243 232797523 231532932 230722523 230723303 230849396 231182917 231837854 231815878 230974190 229679271
$$ packed form
8004B28902660k016230k942400k545232o54025J221704J588174J629963K417689
7996B27602303K474318J072980l34130p80166j229016k373805k501889j141106
7988B22789489O92683J444233P56779L09296N29829M13185k07684j226415j092653
7979B24408742P97076K062005J639884J90834j174840j647602j452627r38339
7971B23885133L7553J263584J476018P23538j76663q06066O1834K161535L152112
7962B31778578K350873J236572R04529R94854M38509n49087r71635j203838j745887
7953B33233468j726014j813440k454042j395921J055599K533561K453056J283976
7945B33170243l72720j264591q10409P80J26093L33521O54937k1976q41688j294919
$$ plain form
7935 229679271 228316262 227241893 226832758 227229258 228340327 229735159 230367442 229817355 228820258
7926 228820258 227912113 226486116 224387807 222580007 221380641 220584449 221780551 225920303
7918 225920303 231745658 237414561 241500046 243414942 243174932 242463448 242694902 242702675 241542301
7909 241542301 239973603 238136858 235939497 233622193 230745311 226974142 223245265 221507487
7901 221507487 222147958 223206807 223470694 223525417 224248972 226166733 228475188 229937767 230513400
7892 230513400 230868238 230842907 229783286 227979618 226335906 225029128 223809645 223021597 223584427
7883 223584427 225410464 227380283 229616021 231736783 232961043 232917583 231112270 228579006
7875 228579006 227110354 227206332 227107804 225025133 221993888 219973820 218947252 218150222 218072108
$$ packed form
7935B29679271j363009j074369m09135L96500J111069J394832O32283n50087r97097
7926B28820258r08145j425997k098309j807800j199366p96192J196102M139752
7918B25920303N825355N668903M085485J914896k40010p11484K31454P773j160374
7909B41542301j568698j836745k197361k317304k876882l771169l728877j737778
7901B21507487O40471J058849K63887N4723P23555J917761K308455J462579N75633
7892B30513400L54838k5331j059621j803668j643712j306778j219483p88048N62830
7883B23584427J826037J969819K235738K120762J224260m3460j805313k533264
7875B28579006j468652R5978r8528k082671l031245k020068j026568p97030p8114
$$ plain form
7866 218072108 218867759 219810279 220377989 219821047 217827694 216333415 216640413 217448602 217845007
7857 217845007 217941729 218038603 218852409 220160506 221062658 221586531 222279123 223123549 223995544
7848 223995544 225382359 227328871 229286746 229963908 228478332 225428547 222155229 219896558
7840 219896558 218913954 218926865 220282082 221812626 221635834 219523274 217006885 216209590 217615272
7831 217615272 219843511 222138128 224503545 227046084 229034331 229745353 229739032 229754627 230037639
7822 230037639 230161026 229897776 229484980 229209160 229505568 230265402 230379533 229454292 228125159
7813 228125159 227341430 227569541 228001127 227693998 227327231 227350655 227418258 228115326 229726276
7804 229726276 231553081 231957225 229749541 226663995 225370951 226800391 229335885 230760612
$$ packed form
7866B18072108P95651R42520N67710n56942j993353j494279L06998Q08189L96405
7857B17845007R6722R6874Q13806J308097R02152N23873O92592Q44426Q71995
7848B23995544J386815J946512J957875O77162j485576l049785l273318k258671
7840B19896558r82604J2911J355217J530544j76792k112560k516389p97295J405682
7831B17615272K228239K294617K365417K542539J988247P11022o321J5595K83012
7822B30037639J23387k63250m12796k75820K96408P59834J14131r25241j329133
7813B28125159p83729K28111M31586l07129l66767K3424O7603O97068J610950
7804B29726276J826805M04144k207684l085546j293044J429440K535494J424727
$$ plain form
7796 230760612 230562801 229710016 229625379 230763989 231736787 231390442 229763757 227002005 223735204
7787 223735204 220882747 218756369 217511911 217722529 218986972 220256789 221133181 221519271
7779 221519271 221346414 220713185 220059056 219912401 220379342 221168387 221963380 223014804 224664829
7770 224664829 227061465 229619633 231242215 231491411 230995889 230294253 229345329 229392966 231405377
7761 231405377 234546385 237385881 238728261 237666446 234271986 230174709 227314494 226493622
7753 226493622 226786425 226835760 226220059 225871870 226539201 227609742 228648989 229833406 231371011
7744 231371011 233212635 234570726 234026719 231731632 229330283 227937867 228245115 229903046
7736 229903046 231651019 232301876 231925021 231351075 230880146 230928714 232124358 234605652 237864781
$$ packed form
7796B30760612j97811q52785q4637J138610R72798l46345j626685k761752l266801
7787B23735204k852457k126378j244458K10618J264443J269817Q76392L86090
7779B21519271j72857o33229o54129j46655M66941P89045P94993J051424J650025
7770B24664829K396636K558168J622582K49196m95522p01636r48924M7637K012411
7761B31405377L141008K839496J342380j061815l394460m097277k860215q20872
7753B26493622K92803M9335o15701l48189O67331J070541J039247J184417J537605
7744B31371011J841624J358091n44007k295087k401349j392416L07248J657931
7736B29903046J747973O50857l76855n73946m70929M8568J195644K481294L259129
$$ plain form
7727 237864781 240575926 241473491 240227708 237567021 234325995 230682075 227654826 226040235
7719 226040235 225502690 225057050 224276992 223649055 223781378 225526478 229097801 233672490 237548176
7710 237548176 239180281 239451477 240600140 243421336 247264052 250173756 250820334 249334644
7702 249334644 246457909 243484338 241524046 241059643 241192441 241089080 241205567 240885012 239285981
7693 239285981 237252780 236378246 237085693 238777630 240649685 240929686 237916385 232146220
7685 232146220 225494360 219719638 216485962 215833665 217059715 219983138 223617545 227148478
7677 227148478 230474949 233450027 236254888 238948127 241304648 243007788 243636641 244029966
7669 244029966 244633225 244472748 243812710 243211945 242924160 242937324 242780990 241928714 240302970
$$ packed form
7727B37864781K711145Q97565j245783k660687l241026l643920l027249j614591
7719B26040235n37545m45640p80058o27937J32323J745100L571323M574689L875686
7710B37548176J632105K71196J148663K821196L842716K909704O46578j485690
7702B49334644k876735k973571j960292m64403J32798j03361J16487l20555j599031
7693B39285981k033201q74534P07447J691937J872055K80001l013301n770165
7685B32146220o651860n774722l233676o52297J226050K923423L634407L530933
7677B27148478L326471K975078K804861K693239K356521J703140O28853L93325
7669B44029966O03259j60477o60038o00765k87785J3164j56334q52276j625744
$$ plain form
7660 240302970 238405107 237069102 236487800 235891287 234643048 232406558 229460597 226887404
7652 226887404 224867812 223196546 222786955 224914167 229209305 234136434 237688273 238780509
7644 238780509 238525503 238306951 237760313 236617458 236028732 236720909 238037135 239328354 240412299
7635 240412299 240492818 239379942 237874316 236697784 235652379 234491155 234149871 234227911 233626130
7626 233626130 232034926 229842038 227730714 226243058 225432743 225173988 225778140 227109748
7618 227109748 228796104 231094596 233486529 234460744 233675931 232177882 230899174 230109807
7610 230109807 229721280 230267833 232625472 236125862 239092659 240547804 240423642 239342313
7602 239342313 237512208 234415759 230866747 228411076 227579618 228005846 228822457 229432798 229136129
$$ packed form
7660B40302970j897863j336005n81302n96513j248239k236490k945961k573193
7652B26887404k019592j671266m09591K127212M295138M927129L551839J092236
7644B38780509k55006k18552n46638j142855n88726O92177J316226J291219J083945
7635B40412299Q0519j112876j505626j176532j045405j161224l41284P8040o01781
7626B33626130j591204k192888k111324j487656q10315k58755O04152J331608
7618B27109748J686356K298492K391933R74215p84813j498049j278708p89367
7610B30109807l88527N46553K357639L500390K966797J455145j24162j081329
7602B39342313j830105l096449l549012k455671q31458M26228Q16611O10341k96669
$$ plain form
7593 229136129 227921107 227075979 227262716 228704981 231473475 234361254 235825007 235688818
7585 235688818 234651962 233466259 232394382 231498480 230648689 229747729 229229835 228809919 227665055
7576 227665055 225549280 223585466 222287495 220824955 220134162 221660394 225226697 229927795
7568 229927795 233611284 234270306 232580749 231229582 232413722 235604603 238754443 240984885
7560 240984885 242907102 244436151 245240235 245732595 246378205 246321830 244836990 242339294 239977449
7551 239977449 238691300 238719613 239113184 239007814 238487979 237514292 236116556 234860293 234094652
7542 234094652 233459609 232901831 232817913 233425375 234016519 233411132 231779699 230301109 229338382
7533 229338382 228771916 228698842 229357548 230651482 231877755 232548454 232567118 231587949 229973134
$$ packed form
7593B29136129j215022q45128J86737J442265K768494K887779J463753j36189
7585B35688818j036856j185703j071877q95902q49791r00960n17894m19916j144864
7576B27665055k115775j963814j297971j462540o90793J526232L566303M701098
7568B29927795L683489O59022j689557j351167J184140L190881L149840K230442
7560B40984885J922217J529049Q04084M92360O45610n6375j484840k497696k361845
7551B39977449j286149K8313L93571j05370n19835r73687j397736j256263p65641
7542B34094652o35043n57778q3918O07462N91144o05387j631433j478590r62727
7533B29338382n66466p3074O58706J293934J226273O70699J8664r79169j614815
$$ plain form
7524 229973134 229245871 229980010 230770012 230146977 228886213 228537307 228817594 229144914 229474578
7515 229474578 229187221 227413355 225007290 224071211 225765135 229032321 232227013 235228389
7507 235228389 237398648 237055573 234308877 230940226 228230456 226573525 225466238 224049443
7499 224049443 222814431 223164024 225600311 228998130 231746940 233497102 235066541 237560516
7491 237560516 241202911 245505634 249102839 250338895 248856505 246778251 245864778 245096422
7483 245096422 242712165 239052751 235982783 234252535 233333191 233281456 234418328 236168451
7475 236168451 237422937 237939056 238117675 237630830 236221674 234014464 231855214 230888268 231507255
7466 231507255 233481147 236168600 238347313 239150925 239149410 240190269 242561480 244928124 246912424
$$ packed form
7524B29973134p27263P34139P90002o23035j260764l48906K80287L27320L29664
7515B29474578k87357j773866k406065r36079J693924L267186L194692L001376
7507B35228389K170259l43075k746696l368651k709770j656931j107287j416795
7499B24049443j235012L49593K436287L397819K748810J750162J569439K493975
7491B37560516L642395M302723L597205J236056j482390k078254r13473p68356
7483B45096422k384257l659414l069968j730248r19344n1735J136872J750123
7475B36168451J254486N16119J78619m86845j409156k207210k159250r66946O18987
7466B31507255J973892K687453K178713Q03612j515J040859K371211K366644J984300
$$ plain form
7457 246912424 248727708 249958234 250444879 250179305 249025640 248149551 247840877 246580142 243957379
7448 243957379 241891487 242256192 244865945 248216691 251156066 253016864 253923261 254226042
7440 254226042 254295276 254564560 254740510 254514739 253615129 251989458 250318104 249888496 250783793
7431 250783793 251435365 251256578 250773990 249930605 248217948 246184711 245258977 245480070 246010440
7422 246010440 245676989 243568863 239925218 236278013 234100072 233064395 231869099 230226167
7414 230226167 228289353 227510124 228511410 229042556 228025793 227394999 228768332 231529225
7406 231529225 234298861 235879443 235799451 234493236 232720520 230874836 229151985 227583677
7398 227583677 226611395 226821744 227791048 228556225 228795415 228697628 228579292 228870578 230833193
$$ packed form
7457B46912424J815284J230526M86645k65574j153665q76089l08674j260735k622763
7448B43957379k065892L64705K609753L350746K939375J860798R06397L02781
7440B54226042O9234K69284J75950k25771q99610j625671j671354m29608Q95297
7431B50783793O51572j78787m82588q43385j712657k033237r25734K21093N30370
7422B46010440l33451k108126l643645l647205k177941j035677j195296j642932
7414B30226167j936814p79229J001286N31146j016763o30794J373333K760893
7406B31529225K769636J580582p9992j306215j772716j845684j722851j568308
7398B27583677r72282K10349R69304P65177K39190r7787j18336K91286J962615
$$ plain form
7389 230833193 234391878 238006485 240288523 240406416 238852511 236850211 236327199 238605763
7381 238605763 242685655 245740888 245795281 243799245 241772890 240126136 237792067 235039148
7373 235039148 233782215 235228389 237916005 239716052 239823570 239108874 239326483 240738917
7365 240738917 242414752 243168760 243041370 243037566 243507425 243804586 243181931 241812548 240066917
7356 240066917 238147413 236371703 235671266 236970757 239906496 243108028 244966893 244979407
7348 244979407 244298162 244394079 246425592 250308860 254422648 257023580 258927947 261499705
7340 261499705 263215678 263170603 262371013 261149498 260141803 260378343 261324811 261205584 258991500
7331 258991500 255306725 251565678 248508848 245824336 243661412 242545044 242613155 243570101
$$ packed form
7389B30833193L558685L614607K282038J17893j553905k002300n23012K278564
7381B38605763M079892L055233N4393j996036k026355j646754k334069k752919
7373B35039148j256933J446174K687616J800047J07518p14696K17609J412434
7365B40738917J675835P54008j27390l804M69859K97161o22655j369383j745631
7356B40066917j919504j775710p00437J299491K935739L201532J858865J2514
7348B44979407o81245R5917K031513L883268M113788K600932J904367K571758
7340B61499705J715973m5075p99590j221515j007695K36540R46468j19227k214084
7331B58991500l684775l741047l056830k684512k162924j116368O8111R56946
$$ plain form
7323 243570101 245021945 246986585 249375835 251989241 254131500 254543869 252993474 250785276
7315 250785276 249129977 248579222 249157158 249985334 250504653 251027796 251874764 252853125 254374233
7306 254374233 255823240 255417510 252824449 248854679 244417707 242302240 244626321 249912384
7298 249912384 254905639 256942654 256177917 254553923 253304399 253221209 254459308 255908990
7290 255908990 256297524 255366758 253479236 251341901 249321472 247081235 245157127 244291794
7282 244291794 244045910 243898001 244124464 245165347 246956691 248549312 249180745 249121091 248640870
7273 248640870 248805156 250483634 252787907 254553041 255044743 255129461 256374032 257926785 258077870
7264 258077870 257566279 258289590 260660177 263365220 264385582 262570867 259911172 259486611
$$ packed form
7323B43570101J451844J964640K389250K613406K142259M12369j550395k208198
7315B50785276j655299n50755N77936Q28176N19319N23143Q46968R78361J521108
7306B54374233J449007m05730k593061l969770m436972k115467K324081N286063
7298B49912384M993255K037015p64737j623994j249524q3190J238099J449682
7290B55908990L88534r30766j887522k137335k020429k240237j924108q65333
7282B44291794k45884j47909K26463J040883J791344J592621O31433n9654m80221
7273B48640870J64286J678478K304273J765134M91702Q4718J244571J552753J51085
7264B58077870n11591P23311K370587K705043J020362j814715k659695m24561
$$ plain form
7256 259486611 260974078 262122435 261689793 260458770 259955920 260417973 260870110 261502902 262642051
7247 262642051 263346807 263047763 261877656 259563821 256171121 253067757 252026558 252933941
7239 252933941 254519602 256393143 258215156 259218567 258804195 258054663 258313959 259705845
7231 259705845 261290532 262358463 263258351 263384432 262187439 260678927 260001871 259993664 260218095
7222 260218095 260790390 261450498 261135657 260022168 259182171 258412651 256820959 253193693 247801350
7213 247801350 242511084 238729983 237272459 237891724 239083122 239703202 239716523 239951192 241496137
7204 241496137 243811187 244831245 243622111 241723733 240922204 241508372 243286626 246642922
7196 246642922 251165873 254844628 256669445 257470584 258482308 260449669 263007750 264859123
$$ packed form
7256B59486611J487467J148357m32642j231023n02850M62053M52137O32792J139149
7247B62642051P04756k99044j170107k313835l392700l103364j041199R07383
7239B52933941J585661J873541J822013J003411m14372p49532K59296J391886
7231B59705845J584687J067931Q99888J26081j196993j508512o77056q207K24431
7222B60218095N72295O60108l14841j113489q39997p69520j591692l627266n392343
7213B47801350n290266l781101j457524O19265J191398O20080J3321K34669J544945
7204B41496137K315050J020058j209134j898378q01529N86168J778254L356296
7196B46642922M522951L678755J824817Q01139J011724J967361K558081J851373
$$ plain form
7188 264859123 264867857 263543957 263367970 266045138 270612112 274647355 276414174 275569101 273583718
7179 273583718 271932478 269995386 266563096 262613583 259708741 258393751 258244785 259015871
7171 259015871 260660363 262935114 265159517 266243245 265839479 264903813 264726455 266532775
7163 266532775 270964505 276090700 279543462 281674888 283137131 283643914 283300216 282661974
7155 282661974 281890426 279824736 275447382 269606820 264811987 262304711 260721484 259058481
7147 259058481 257206141 254851156 251706435 248877637 247514890 247965241 249031931 249390452
7139 249390452 249620133 250215673 250339929 249408345 247233338 244237933 242261509 242860196 246104245
7130 246104245 251510867 257901689 263530005 267515152 270312547 272735842 274844960 276508225
$$ packed form
7188B64859123Q734j323900j75987K677168M566974M035243J766819q45073j985383
7179B73583718j651240j937092l432290l949513k904842j314990j48966P71086
7171B59015871J644492K274751K224403J083728m03766r35666j77358J806320
7163B66532775M431730N126195L452762K131426J462243N06783l43698o38242
7155B82661974p71548k065690m377354n840562m794833k507276j583227j663003
7147B59058481j852340k354985l144721k828798j362747M50351J066690L58521
7139B49390452K29681N95540J24256r31584k175007k995405j976424N98687L244049
7130B46104245N406622O390822N628316L985147K797395K423295K109118J663265
$$ plain form
7122 276508225 277878480 278997778 279561044 278945618 276813830 273993135 271791060 270334599
7114 270334599 269290597 269070359 269761864 270796997 272097580 273935855 275621987 275859295
7106 275859295 274307016 271846054 269550568 268010305 267332745 267351210 267055799 265060188 261430696
7097 261430696 257504498 253807686 250377001 248318857 248738282 250830964 253508825 256605652
7089 256605652 259633698 262298897 264840806 267108155 269692770 272573271 274876888 276196161
7081 276196161 277072857 278541945 280811240 282482067 282851958 283066412 284012865 284926634 285174877
7072 285174877 285233292 286083225 288296388 291470544 294298156 296507524 298787236 300295531
7064 300295531 300296865 299980675 300602732 301391396 301572297 302265044 303570385 304078695 303428186
$$ packed form
7122B76508225J370255J119298N63266o15426k131788k820695k202075j456461
7114B70334599j044002k20238O91505J035133J300583J838275J686132K37308
7106B75859295j552279k460962k295486j540263o77560J8465k95411j995611l629492
7097B61430696l926198l696812l430685k058144M19425K092682K677861L096827
7089B56605652L028046K665199K541909K267349K584615K880501K303617J319273
7081B76196161Q76696J469088K269295J670827L69891K14454R46453R13769K48243
7072B85174877N8415Q49933K213163L174156K827612K209368K279712J508295
7064C00295531J334l16190O22057P88664J80901O92747J305341N08310o50509
$$ plain form
7055 303428186 302345595 301765912 301938190 302908813 304673625 306192443 306409640 305795943 305346462
7046 305346462 305754632 307427695 310572603 314655854 319217285 323303584 325726644 326995265
7038 326995265 328514895 331013172 334419386 338048173 341190334 343114181 344076963 345062679
7030 345062679 346573494 348878441 351900066 355577475 359942174 364625197 369099057 373009194
7022 373009194 376676290 381190690 386644789 390630106 390059075 384153502 376195848 370548296
7014 370548296 369153471 371747477 377308073 385038429 393540795 400592334 402958462 396960647
7006 396960647 382009369 360657664 335703033 309707398 284763219 263054545 247530623
6999 247530623 239327512 237089601 239437502 244480135 248011289 245370602 234347750 215831559
$$ packed form
7055C03428186j082591n79683J72278R70623J764812J518818K17197o13697m49481
7046C05346462M08170J673063L144908M083251M561431M086299K423060J268621
7038C26995265J519630K498277L406214L628787L142161J923847R62782R85716
7030C45062679J510815K304947L021625L677409M364699M683023M473860L910137
7022C73009194L667096M514400N454099L985317n71031n905573p957654n647552
7014C70548296j394825K594006N560596P730356Q502366P051539K366128n997815
7006C96960647j4951278k1351705k4954631k5995635k4944179k1708674j5523922
6999B47530623q203111k237911K347901N042633L531154k640687j1022852j8516191
$$ plain form
6991 215831559 193152987 171223726 155348168 148570537 149745870 155039345 160580132 164550105
6983 164550105 167536997 171024340 176491917 184515928 193454297 200686209 205291246 207636750
6975 207636750 208862381 210854324 215085347 220849231 225600195 228328609 229887710 230345525
6967 230345525 229851674 229369370 230457030 234381378 241388514 250247616 259340264 268236113
6959 268236113 276054803 281775937 285902042 288968943 291177791 292860448 293839763 293372274
6951 293372274 290035274 282192320 269666609 252700436 231304611 206096643 178903426
6944 178903426 151754150 126767566 106413265 92285704 84516412 82140790 83656221
6937 83656221 87405520 93243987 101493792 111254681 120778360 128640917 135372351 142272027
$$ packed form
6991B15831559k2678572k1929261j5875558o777631J175333N293475N540787L969973
6983A64550105K986892L487343N467577Q024011Q938369P231912M605037K345504
6975B07636750J225631J991943M231023N763884M750964K728414J559101M57815
6967B30345525m93851m82304J087660L924348P007136Q859102R092648Q895849
6959B68236113P818690N721134M126105L066901K208848J682657R79315m67489
6951B93372274l337000p842954j2525711j6966173k1395825k5207968k7193217
6944A78903426k7149276k4986584k0354301j4127561p769292k375622J515431
6937H3656221L749299N838467Q249805R760889R523679P862557O731434O899676
$$ plain form
6929 142272027 149350513 155986643 161562620 165125504 165483963 162691756 159133582 157069925
6921 157069925 157996597 162625029 169004172 174980415 180034634 183687812 186104188 188396476
6913 188396476 191615804 195694282 199584439 202471066 203337972 202091682 199222968 193934566
6905 193934566 185665637 175111982 163551060 152780937 145152186 142154644 142410106 143662666
6897 143662666 144444143 144322385 144291302 145203429 147438158 150619509 153592792 156244620 159809880
6888 159809880 164512210 169424157 174148018 178926230 183235014 186058754 187243305 187941737
6880 187941737 189781714 193636272 198372530 201803499 203417753 204108233 205278151 208022150
6872 208022150 211428361 213990927 215872149 218220699 220721054 223165394 226856656 232899116
$$ packed form
6929A42272027P078486O636130N575977L562884L58459k792207l558174k063657
6921A57069925R26672M628432O379143N976243N054219L653178K416376K292288
6913A88396476L219328M078478L890157K886627Q66906j246290k868714n288402
6905A93934566q268929j0553655j1560922j0770123p628751k997542K55462J252560
6897A43662666P81477j21758l1083R12127K234729L181351K973283K651828L565260
6888A59809880M702330M911947M723861M778212M308784K823740J184551O98432
6880A87941737J839977L854558M736258L430969J614254O90480J169918K743999
6872B08022150L406211K562566J881222K348550K500355K444340L691262O042460
$$ plain form
6864 232899116 240966669 249361977 256952980 263191674 268291919 272808915 277194056 280822504
6856 280822504 281708915 277285007 265549096 247546177 225224410 199435473 171256828
6849 171256828 142962966 117192357 95949562 79636643 67373803 59859080 58313789
6842 58313789 61750535 67937124 74976611 81508777 87356282 93537112 99905001 106017204
6834 106017204 112437529 119282106 125802663 131529285 136926127 141866647 145202998 146636764
6826 146636764 147157931 147840048 149123797 150185766 150667148 151304552 152518130 153846220 154757293
6817 154757293 155034915 155411082 157015150 160080166 163558514 166555445 169160673 170837583
6809 170837583 171635966 172745367 173867372 173564962 172114456 170985444 170757181 171817931
$$ packed form
6864B32899116Q067553Q395308P591003O238694N100245M516996M385141L628448
6856B80822504Q86411m423908j1735911j8002919k2321767k5788937k8178645
6849A71256828k8293862k5770609k1242795j6312919j2262840p514723j545291
6842E8313789L436746O186589P039487O532166N847505O180830O367889O112203
6834A06017204O420325O844577O520557N726622N396842M940520L336351J433766
6826A46636764N21167O82117J283749J061969M81382O37404J213578J328090R11073
6817A54757293K77622L76167J604068L065016L478348K996931K605228J676910
6809A70837583P98383J109401J122005l02410j450506j129012k28263J060750
$$ plain form
6801 171817931 173574373 173924814 172742903 172321292 173657872 175083733 175429615 175543976 176566936
6792 176566936 178164849 179755824 180798365 181136523 182267484 185160512 188730032 191378401
6784 191378401 192126130 190923651 189179721 188334544 187877660 187035530 185841301 184595323 183388849
6775 183388849 182447959 182214710 183057192 185206598 188097664 191013761 193674216 195814112
6767 195814112 197045175 197566555 197060257 195663507 195309841 196855063 198640530 200011901
6759 200011901 202110264 204692153 206586772 208356961 210662662 212879544 213590113 211891607
6751 211891607 208369730 204318545 200783103 198326312 197229035 198302175 200662794 201887227
6743 201887227 202240165 202843032 203756561 204638876 205290766 206864460 210449488 215469353 219607512
$$ packed form
6801A71817931J756442L50441j181911m21611J336580J425861L45882J14361J022960
6792A76566936J597913J590975J042541L38158J130961K893028L569520K648369
6784A91378401P47729j202479j743930q45177m56884q42130j194229j245978j206474
6775A83388849r40890k33249Q42482K149406K891066K916097K660455K139896
6767A95814112J231063N21380n06298j396750l53666J545222J785467J371371
6759B00011901K098363K581889J894619J770189K305701K216882P10569j698506
6751B11891607l521877m051185l535442k456791j097277J073140K360619J224433
6743B01887227L52938O02867R13529Q82315O51890J573694L585028N019865M138159
$$ plain form
6734 219607512 221253249 220271708 217356947 214051291 211784827 211476456 213094321 215740171
6726 215740171 218872151 222400829 225719551 228353688 229964139 230616521 230660041 229756312 227726062
6717 227726062 225118247 222094993 218997687 217088128 216625250 217272385 218840792 220407281
6709 220407281 221646646 222797350 223514034 223872012 223951602 223872121 224592149 226486644 228803398
6700 228803398 230930958 232215487 232391836 232119699 232058145 232596234 234142230 236608487 238674938
6691 238674938 238155080 235204230 232122925 229435943 225609418 219815872 213375349 208781645
6683 208781645 206931677 206739004 207007840 207698471 209506107 211646090 213208065 214891667
6675 214891667 216604099 217305837 216876194 214945147 209889699 202090211 194816282 190447033
$$ packed form
6734B19607512J645737r81541k914761l305656k266464l08371J617865K645850
6726B15740171L131980L528678L318722K634137J610451O52382M3520r03729k030250
6717B27726062k607815l023254l097306j909559m62878O47135J568407J566489
6709B20407281J239365J150704P16684L57978P9590p9481P20028J894495K316754
6700B28803398K127560J284529J76349k72137o1554N38089J545996K466257K066451
6691B38674938n19858k950850l081305k686982l826525n793546o440523m593704
6683B08781645j849968j92673K68836O90631J807636K139983J561975J683602
6675B14891667J712432P01738m29643j931047n055448p799488p273929m369249
$$ plain form
6667 190447033 189729942 192001669 195438540 198989922 202684388 206325977 209963264 214527218
6659 214527218 220419224 225838635 229107751 230819316 231920521 231363802 227504696 220502527
6651 220502527 210672989 198642675 186048469 173445748 160723851 148927927 140324757
6644 140324757 136021911 135319130 136581084 138040864 139186878 141192423 145034414 149519192
6636 149519192 152379039 153144426 153282835 153861911 154347646 154951057 156949435 160398890 164767693
6627 164767693 169519185 173038703 175223318 177756071 179851986 179856315 178737407 177964803 177514054
6618 177514054 177293319 177386958 177623936 178598917 180221626 181449383 182299935 183643165 185829437
6609 185829437 188089917 189908449 191604326 192609694 192703232 192933148 193202532 193046283 192347649
$$ packed form
6667A90447033p17091K271727L436871L551382L694466L641589L637287M563954
6659B14527218N892006N419411L269116J711565J101205n56719l859106p002169
6651B20502527r829538j2030314j2594206j2602721j2721897j1795924q603170
6644A40324757m302846p02781J261954J459780J146014K005545L841991M484778
6636A49519192K859847P65387J38409N79076M85735O03411J998378L449455M368803
6627A64767693M751492L519518K184615K532753K095915M329j118908p72604m50749
6618A77514054k20735R3639K36978R74981J622709J227757Q50552J343230K186272
6609A85829437K260480J818532J695877J005368R3538K29916K69384j56249o98634
$$ plain form
6600 192347649 190942945 189171322 188265537 189181899 191974647 195806195 199149892 200774018
6592 200774018 201207607 202173533 204332733 206888044 209138420 210437870 210115337 208220548
6584 208220548 205565838 202947133 200605961 199288709 199311087 200148510 201349155 203220736
6576 203220736 205800857 207893107 208226853 207106036 205175545 202476129 199882441 198617007
6568 198617007 199452520 202089399 205262424 207815347 209664858 211236507 212837781 214255989
6560 214255989 214723486 213838117 211579911 208382734 205195101 202471192 199799736 197096980
6552 197096980 194824906 192956639 191067915 189571979 189372081 190015185 191088609 192867989
6544 192867989 194630801 194904251 193392850 191531866 190800001 190998070 191406140 191736561 191664567
$$ packed form
6600A92347649j404704j771623r05785R16362K792748L831548L343697J624126
6592B00774018M33589R65926K159200K555311K250376J299450l22533j894789
6584B08220548k654710k618705k341172j317252K2378Q37423J200645J871581
6576B03220736K580121K092250L33746j120817j930491k699416k593688j265434
6568A98617007Q35513K636879L173025K552923J849511J571649J601274J418208
6560B14255989M67497q85369k258206l197177l187633k723909k671456k702756
6552A97096980k272074j868267j888724j495936j99898O43104J073424J779380
6544A92867989J762812K73450j511401j860984p31865J98069M08070L30421p1994
$$ plain form
6535 191664567 191878325 192717024 193500631 194131236 195403564 197366757 198660240 198433028 196864353
6526 196864353 194266713 191459407 189772191 189998648 191264340 191901311 191887386 192049566 192530883
6517 192530883 193203995 193910814 194358324 195165516 197275347 200011744 201749784 202429171 203188640
6508 203188640 203549533 202478473 200297943 197734656 194855074 191903604 190110739 190271749
6500 190271749 191247849 191985807 192520165 192206935 191089473 191078342 192945761 195199999 196172548
6491 196172548 195593907 194362540 193779242 194438254 195729900 196962315 197980299 198326549 198191103
6482 198191103 198574343 199455302 200888919 202602865 203211400 202818676 202438776 202594465 202730526
6473 202730526 202100473 201672454 202182885 202084601 200946481 200955803 203254536 206868263 210077008
$$ packed form
6535A91664567K13758Q38699P83607O30605J272328J963193J293483k27212j568675
6526A96864353k597640k807306j687216K26457J265692O36971j3925J62180M81317
6517A92530883O73112P06819M47510Q07192K109831K736397J738040O79387P59469
6508B03188640L60893j071060k180530k563287k879582k951470j792865J61010
6500A90271749R76100P37958N34358l13230j117462j1131J867419K254238R72549
6491A96172548n78641j231367n83298O59012J291646J232415J017984L46250j35446
6482A98191103L83240Q80959J433617J713946O08535l92724l79900J55689J36061
6473B02730526o30053m28019N10431r8284j138120R322K298733L613727L208745
$$ plain form
6464 210077008 212177939 213418895 214204681 214816502 215002456 214390022 213345899 212635868 212893009
6455 212893009 213993861 214868791 215010417 214693582 213451880 210614347 207355758 204938765
6447 204938765 203799202 204108558 205351939 207076146 208985833 211116857 212848028 212856894 210570374
6438 210570374 206749707 203060202 201385229 202846744 207286876 212324673 215098674 215461723
6430 215461723 214675406 213667357 213309021 214463306 217024210 219818493 221686893 222374226
6422 222374226 222353070 222293610 222811834 224426217 225966266 226026179 225336256 225113242 225657523
6413 225657523 226481880 227044501 227152463 226638370 225665967 225096988 225310624 225455245 225000640
6404 225000640 224008692 222573835 221169253 220088772 218510075 216021034 214423274 214441120
$$ packed form
6464B10077008K100931J240956P85786O11821J85954o12434j044123p10031K57141
6455B12893009J100852Q74930J41626l16835j241702k837533l258589k416993
6447B04938765j139563L09356J243381J724207J909687K131024J731171Q866k286520
6438B10570374l820667l689505j674973J461515M440132N037797K774001L63049
6430B15461723p86317j008049l58336J154285K560904K794283J868400O87333
6422B22374226k1156n9460N18224J614383J540049N9913o89923k23014N44281
6413B25657523Q24357N62621J07962n14093r72403n68979K13636J44621m54605
6404B25000640r91948j434857j404582j080481j578697k489041j597760J7846
$$ plain form
6396 214441120 214230231 213094216 211673114 210333186 208922909 208012300 208590422 209780518
6388 209780518 210493949 211327125 212408036 212860118 212091916 209767196 206694080 204063438 202875078
6379 202875078 203800471 205594578 207399349 209721383 212378951 214561026 216060418 217333478
6371 217333478 218747729 219741691 219552921 218127629 215301312 211719504 208814955 206603236
6363 206603236 205027480 205083323 206317455 207017013 207296533 208952530 211838117 214066213 214848397
6354 214848397 214881602 214760121 215174520 217341281 220965081 224555656 227210722 229003188 230943693
6345 230943693 233279661 235624032 237708155 237799074 234690976 229705437 224852574 221840048
6337 221840048 220566924 220138639 220016587 219912798 219840914 219156830 218262299 218621260 219986780
$$ packed form
6396B14441120k10889j136015j421102j339928j410277r10609N78122J190096
6388B09780518P13431Q33176J080911M52082p68202k324720l073116k630642j188360
6379B02875078R25393J794107J804771K322034K657568K182075J499392J273060
6371B17333478J414251R93962j88770j425292k826317l581808k904549k211719
6363B06603236j575756N5843J234132O99558K79520J655997K885587K228096P82184
6354B14848397L3205j21481M14399K166761L623800L590575K655066J792466J940505
6345B30943693K335968K344371K084123R0919l108098m985539m852863l012526
6337B21840048j273124m28285j22052j03789p1884o84084q94531L58961J365520
$$ plain form
6328 219986780 221330508 221914162 221830067 222257496 223753269 225713441 226820710 225630625 221768650
6319 221768650 217061427 213579465 211949742 211337601 210881167 210442509 210579727 212075401 214622274
6310 214622274 217635440 220621850 223283117 225388094 225973697 224685361 222474617 219842329
6302 219842329 216937694 214594009 212990421 211216673 209667073 208745208 207996094 207907312 209167942
6293 209167942 210557878 210871213 210719945 210851105 211386308 212407053 214064982 216492948 219288401
6284 219288401 221197294 221025570 218736609 215247320 211690903 208961476 207643536 207893095
6276 207893095 208838191 209133439 208903378 209333334 210342057 211607733 213217874 214731429 216052217
6267 216052217 217017496 217380343 217804979 218268351 218219590 218024401 218185935 219124794 220243014
$$ packed form
6328B19986780J343728N83654q4095M27429J495773J960172J107269j190085l861975
6319B21768650m707223l481962j629723o12141m56434m38658J37218J495674K546873
6310B14622274L013166K986410K661267K104977N85603j288336k210744k632288
6302B19842329k904635k343685j603588j773748j549600r21865p49114q8782J260630
6293B09167942J389936L13335j51268J31160N35203J020745J657929K427966K795453
6284B19288401J908893j71724k288961l489289l556417k729427j317940K49559
6276B07893095R45096K95248k30061M29956J008723J265676J610141J513555J320788
6267B16052217R65279L62847M24636M63372m8761j95189J61534R38859J118220
$$ plain form
6258 220243014 220907399 221576853 222854714 224505373 225564188 225577510 224252826 222453155 221125177
6249 221125177 219900862 217911461 215505634 214431651 215315977 216791231 217171289 216319598
6241 216319598 216539623 219248764 223037258 225740056 226435540 225519522 223660316 221945328
6233 221945328 221741339 223175995 224788801 224732527 222686743 220102043 217753009 215698011
6225 215698011 214418732 214300409 215367808 216815888 217462246 217574338 218162552 218975106 219662128
6216 219662128 220579123 220728511 218903419 215780291 213439341 213442105 215275613 216728010 216185257
6207 216185257 214956289 214638709 215066469 215639183 216257977 216850473 217648607 219374147 222047891
6198 222047891 224632278 226223255 226757584 226327022 225337271 224696933 225489030 227813784 230587909
$$ packed form
6258B20243014O64385O69454J277861J650659J058815J3322j324684j799671j327978
6249B21125177j224315j989401k405827j073983Q84326J475254L80058q51691
6241B16319598K20025K709141L788494K702798O95484r16018j859206j714988
6233B21945328k03989J434656J612806n6274k045784k584700k349034k054998
6225B15698011j279279j18323J067399J448080O46358J12092N88214Q12554O87022
6216B19662128R16995J49388j825092l123128k340950K764J833508J452397n42753
6207B16185257j228968l17580M27760N72714O18794N92496P98134J725540K673744
6198B22047891K584387J590977N34329m30562r89751o40338P92097K324754K774125
$$ plain form
6189 230587909 233395539 235853082 236515121 235167255 233529871 233021883 233050871 232562963 232075183
6180 232075183 232474330 234257895 237353807 240143441 241415904 241520189 240566129 238542571
6172 238542571 235999304 233492538 231864622 231913440 233311895 235377486 236901732 236486779
6164 236486779 234470421 232749936 232436386 233237454 234779794 236631952 237697816 236842917
6156 236842917 234908469 232852712 230346455 228313848 228307951 229120608 228976829 228092450 227436726
6147 227436726 227912733 229369522 230626044 230857569 229654252 227815104 227223085 228017904 228441515
6138 228441515 227653938 226819437 227191717 228851695 230584408 230750901 228645329 225911943 225527454
6129 225527454 227405708 228871093 228845044 228770064 229726498 231017731 231907883 232550550 232838568
$$ packed form
6189B30587909K807630K457543O62039j347866j637384n07988K8988m87908m87780
6180B32075183L99147J783565L095912K789634J272463J04285r54060k023558
6172B38542571k543267k506766j627916M8818J398455K065591J524246m14953
6164B36486779k016358j720485l13550Q01068J542340J852158J065864q54899
6156B36842917j934448k055757k506257k032607n897Q12657j43779q84379o55724
6147B27436726M76007J456789J256522K31525j203317j839148n92019P94819M23611
6138B28441515p87577q34501L72280J659978J732713J66493k105572k733386l84489
6129B25527454J878254J465385k6049p4980R56434J291233Q90152O42667K88018
$$ plain form
6120 232838568 232065427 230580012 229204587 228237511 228000949 229071747 231441323 233579979
6112 233579979 234388399 233879969 233085274 233293432 233752123 232735400 230462172 228852299 228878348
6103 228878348 230204435 231592845 232346875 232804449 232968397 233434402 234146289 234226322 233758515
6094 233758515 232944293 231771034 230669892 230582238 231826728 234679753 238569969 241162411
6086 241162411 240980818 239686417 240062940 242852395 246082663 247450127 247944276 249385416
6078 249385416 250501672 249497427 246776793 244285012 244042299 245953338 248741750 252299006
6070 252299006 257543721 264193079 270272160 274076045 275204830 274463400 272765843 270868209
6062 270868209 270187854 271397821 273156363 273832991 272908300 271358725 270300569 270385776 271452249
$$ packed form
6120B32838568p73141j485415j375425r67076k36562J070798K369576K138656
6112B33579979Q08420n08430p94695K08158M58691j016723k273228j609873K6049
6103B28878348J326087J388410P54030M57574J63948M66005P11887Q0033m67807
6094B33758515q14222j173259j101142q7654J244490K853025L890216K592442
6086B41162411j81593j294401L76523K789455L230268J367464M94149J441140
6078B49385416J116256j004245k720634k491781k42713J911039K788412L557256
6070B52299006N244715O649358O079081L803885J128785p41430j697557j897634
6062B70868209o80355J209967J758542O76628r24691j549575j058156Q5207J066473
$$ plain form
6053 271452249 272456933 272633559 272215233 272765948 275266963 278813771 282168069 285129561
6045 285129561 287902891 290909304 294686826 298277327 300113814 299982943 297173387 288673332
6037 288673332 272282573 250392996 227479921 206972950 192142532 185019217 184772196
6030 184772196 189497259 197278838 205898327 213677561 220477807 226652008 232326014 237325500
6022 237325500 241802271 246032486 249195030 250854822 252093248 253324950 251697055 242776500
6014 242776500 226098949 206021229 186408967 168258864 152097217 139620535 131784929
6007 131784929 128206533 128979955 133172255 138445536 143348151 148007630 152695962 157320966
5999 157320966 162015761 166857462 171310761 174658884 176701027 177791275 178766062 180177076
$$ packed form
6053B71452249J004684J76626m18326N50715K501015L546808L354298K961492
6045B85129561K773330L006413L777522L590501J836487j30871k809556q500055
6037B88673332j6390759k1889577k2913075k0506971j4830418p123315k47021
6030A84772196M725063P781579Q619489P779234O800246O174201N674006M999486
6022B37325500M476771M230215L162544J659792J238426J231702j627895q920555
6014B42776500j6677551k0077720j9612262j8150103j6161647j2476682p835606
6007A31784929l578396P73422M192300N273281M902615M659479M688332M625004
5999A57320966M694795M841701M453299L348123K042143J090248R74787J411014
$$ plain form
5991 180177076 181217923 181093093 181304113 183275500 186425850 189553891 191806691 193547843
5983 193547843 195479961 198072633 201124718 203514599 204909172 206051831 207629284 209644334
5975 209644334 211334312 212067766 211297037 208779057 205927791 204424116 204360517 204057319 201738187
5966 201738187 197569389 193593375 191241184 190254878 189584844 188979700 189432227 192227018 197045359
5957 197045359 201793846 204600301 205463554 205456290 205025964 204411066 204110048 204290808 205039115
5948 205039115 206345597 207577014 207748047 206689099 205210619 203439034 201437340 200017831
5940 200017831 198713612 197019597 195752866 195516473 196124072 197126902 197319567 195833220
5932 195833220 194183658 194776326 197733250 201543950 205131244 207685890 208928799 209214316
$$ packed form
5991A80177076J040847j24830K11020J971387L150350L128041K252800J741152
5983A93547843J932118K592672L052085K389881J394573J142659J577453K015050
5975B09644334J689978P33454p70729k517980k851266j503675o3599l03198k319132
5966B01738187m168798l976014k352191r86306o70034o05144M52527K794791M818341
5957A97045359M748487K806455Q63253p264m30326o14898l01018J80760P48307
5948B05039115J306482J231417J71033j058948j478480j771585k001694j419509
5940B00017831j304219j694015j266731k36393O07599J002830J92665j486347
5932A95833220j649562N92668K956924L810700L587294K554646J242909K85517
$$ plain form
5924 209214316 208606489 207763462 207812053 208091742 208157192 209252776 211775402 214447097 215885312
5915 215885312 215946887 215115849 213765950 212667051 212143960 211714438 211423370 212281227 215264878
5906 215264878 219736781 223538650 224861244 223291225 219190542 214253681 210916371 209654848
5898 209654848 209369850 210071446 212501075 216188989 219387287 220492032 219632393 217863074
5890 217863074 215238358 211967107 209118948 207950382 209140342 212004687 214953897 216019881
5882 216019881 215385909 214841822 214495380 213189689 211049495 208720154 207061722 207543958 210452257
5873 210452257 213673848 214983129 214411910 213036968 211916913 211307421 211027117 210955152 210889799
5864 210889799 210425015 209904604 210089852 211094787 212639673 215048333 217877967 218800132 217752012
$$ packed form
5924B09214316o07827q43027M8591K79689O5450J095584K522626K671695J438215
5915B15885312O1575q31038j349899j098899n23091m29522k91068Q57857K983651
5906B15264878M471903L801869J322594j570019m100683m936861l337310j261523
5898B09654848k84998P01596K429629L687914L198298J104745q59639j769319
5890B17863074k624716l271251k848159j168566J189960K864345K949210J065984
5882B16019881o33972n44087l46442j305691k140194k329341j658432M82236K908299
5873B10452257L221591J309281n71219j374942j120055o09492k80304p1965o5353
5864B10889799m64784n20411J85248J004935J544886K408660K829634R22165j048120
$$ plain form
5855 217752012 216449148 215192416 214139913 213915664 214404075 214899503 215347057 215492930 215449748
5846 215449748 216076203 217144878 217027550 214967092 212432183 211389233 211565678 212102520 213973978
5837 213973978 216953163 219134282 220211579 220747667 221309458 222754093 225087084 227900959
5829 227900959 230792480 233275991 234578742 234578040 234184854 233648950 233624759 235380209 237988722
5820 237988722 239079465 237670975 234516368 230756765 226448996 222253394 218927631 216419594
5812 216419594 214980841 214707855 216245633 219887534 224497776 228954327 232251813 233614563
5804 233614563 233418482 232937952 232610212 232055141 231163697 229777390 227962554 226309540 225070877
5795 225070877 224764892 226835748 231625262 237455849 242787256 247140517 249941713 250861818
$$ packed form
5855B17752012j302864j256732j052503k24249M88411M95428M47554J45873m3182
5846B15449748O26455J068675j17328k060458k534909j042950J76445N36842J871458
5837B13973978K979185K181119J077297N36088N61791J444635K332991K813875
5829B27900959K891521K483511J302751p02l93186n35904k4191J755450K608513
5820B37988722J090743j408490l154607l759603m307769m195602l325763k508037
5812B16419594j438753k72986J537778L641901M610242M456551L297486J362750
5804B33614563j96081m80530l27740n55071q91444j386307j814836j653014j238663
5795B25070877l05985K070856M789514N830587N331407M353261K801196R20105
$$ plain form
5787 250861818 249855464 247611842 244888246 241944401 239081593 236959849 235704882 235163936
5779 235163936 235948412 237183110 237329624 236763115 236222326 235629834 235101490 234467160 233478036
5770 233478036 233383199 234823607 236623928 237766604 238598515 240220983 243136488 245948003
5762 245948003 246799996 245650816 243948301 242964220 243245188 244858427 247424652 250139203
5754 250139203 251929002 252581949 253401953 255470408 257907219 259980602 262625547 266879614
5746 266879614 272147661 277279088 281988492 286193284 289380367 291311846 291562869 288907280
5738 288907280 282802924 274407800 265668574 257617264 250994993 246686308 245061924 246001544
5730 246001544 249256665 253027866 255728219 257070141 256309639 252207782 242897985 227620371
$$ packed form
5787B50861818j006354k243622k723596k943845k862808k121744j254967n40946
5779B35163936P84476J234698J46514n66509n40789n92492n28344o34330r89124
5770B33478036r4837J440408J800321J142676Q31911J622468K915505K811515
5762B45948003Q51993j149180j702515r84081K80968J613239K566225K714551
5754B50139203J789799O52947Q20004K068455K436811K073383K644945M254067
5746B66879614N268047N131427M709404M204792L187083J931479K51023k655589
5738B88907280o104356q395124q739226q051310o622271m308685j624384R39620
5730B46001544L255121L771201K700353J341922p60502m101857r309797j5277614
$$ plain form
5722 227620371 208558432 190679101 178971718 174431632 175407776 179878369 184783679 188336351
5714 188336351 191081891 193377213 194813958 194439541 191195175 184719681 176641908 169709688
5706 169709688 166046285 165601910 166503791 167671484 169921449 172957907 175183660 176581487
5698 176581487 178253080 180482265 182824964 185057635 186933226 188782535 191130191 193370966
5690 193370966 194729031 194586294 192476606 189620970 188076773 188977597 191739291 194424979
5682 194424979 195647745 195720384 195637417 195950643 196635876 196867968 196618745 196590200 196442382 196412516
5672 196412516 197109774 198233601 200147872 203516740 207440573 210020785 210553419 209385375
5664 209385375 206839380 203371188 199721921 197022177 195739033 195265417 195219892 195783116 197316943
$$ packed form
5722B27620371j9061939j7879331j1707383m540086R76144M470593M905310L552672
5714A88336351K745540K295322J436745l74417l244366o475494q077773o932220
5706A69709688l663403m44375R01881J167693K249965L036458K225753J397827
5698A76581487J671593K229185K342699K232671J875591J849309K347656K240775
5690A93370966J358065j42737k109688k855636j544197R00824K761694K685688
5682A94424979J222766P2639q2967L13226O85233K32092k49223k8545j47818k9866
5672A96412516O97258J123827J914271L368868L923833K580212N32634j168044
5664B09385375k545995l468192l649267k699744j283144m73616m5525N63224J533827
$$ plain form
5655 197316943 199518503 201540482 202682505 203824175 205744616 207329237 208130814 208577528
5647 208577528 209345643 210696583 212321899 213625447 213937498 213816370 213570129 213231010 214522549
5638 214522549 217868119 220977451 222625605 223694627 224550391 224141552 222060029 218862971
5630 218862971 215585546 213259426 212091600 211947944 213067421 215335942 217190980 216873791
5622 216873791 215247393 214915451 215910218 216541581 216252314 215909320 216595470 218249101 219363710
5613 219363710 218241025 214963131 211757423 210060129 209260805 209020951 209496972 210447321 211038358
5604 211038358 209896993 207576694 206910470 208937637 211578979 212796535 212627017 212317664
5596 212317664 212173274 211945526 212103311 213271627 215182972 216247948 215555254 214266200 213809010
$$ packed form
5655A97316943K201560K021979J142023J141670J920441J584621Q01577M46714
5647B08577528P68115J350940J625316J303548L12051j21128k46241l39119J291539
5638B14522549L345570L109332J648154J069022Q55764m08839k081523l197058
5630B18862971l277425k326120j167826j43656J119477K268521J855038l17189
5622B16873791j626398l31942R94767O31363k89267l42994O86150J653631J114609
5613B19363710j122685l277894l205708j697294p99324k39854M76021R50349N91037
5604B11038358j141365k320299o66224K027167K641342J217556j69518l09353
5596B12317664j44390k27748J57785J168316J911345J064976o92694j289054m57190
$$ plain form
5587 213809010 213541874 212470523 211879982 213041061 215075692 217034439 218928379 220746452
5579 220746452 222865817 226118816 230058812 233420635 235766191 237314851 238006800 237660167
5571 237660167 236488530 234130708 230627956 227288166 225228389 225108395 226103733 226140522 225105519
5562 225105519 223290575 220905098 219430787 220321937 223278809 226527808 228841250 230127610
5554 230127610 230614151 230523707 230136534 228929316 226590283 224147930 222495771 221786989 222114034
5545 222114034 223611729 224993298 225183386 224388436 222733207 219775635 215244437 210402762
5537 210402762 206851432 205386855 205563037 205750642 204753890 202971421 202071207 203582320 206950905
5528 206950905 210262298 212633003 214938835 217921194 220874405 222975683 224538498 226050309
$$ packed form
5587B13809010k67136j071351n90541J161079K034631J958747J893940J818073
5579B20746452K119365L252999L939996L361823K345556J548660O91949l46633
5571B37660167j171637k357822l502752l339790k059777j19994R95338L6789j035003
5562B25105519j814944k385477j474311Q91150K956872L248999K313442J286360
5554B30127610M86541r0444l87173j207218k339033k442353j652159p08782L27045
5545B22114034J497695J381569J90088p94950j655229k957572m531198m841675
5537B10402762l551330j464577J76182J87605r96752j782469r00214J511113L368585
5528B06950905L311393K370705K305832K982359K953211K101278J562815J511811
$$ plain form
5520 226050309 226586599 225471658 223974653 223562536 224149919 225245605 226541664 227928857
5512 227928857 229109576 229391148 228497032 227008142 225980457 225441972 225252046 225717779 226522036
5503 226522036 226763245 225722688 223688767 221653477 220509536 220443429 220975285 221371591 221514658
5494 221514658 221552241 221938008 223282577 225236966 227084549 228619664 229699881 230519154 232105916
5485 232105916 234888603 237774813 239063002 238248935 236372221 234547356 233609235 233656273 233789191
5476 233789191 233387617 232604400 232320129 233024783 233764424 233567430 232584938 231617510 231062380
5467 231062380 230094141 228410230 226191958 223940822 222138935 221355655 221810677 222745715 223439604
5458 223439604 223863098 223830990 222481599 220056292 217885223 215936704 213661489 212244343
$$ packed form
5520B26050309N36290j114941j497005m12117N87383J095686J296059J387193
5512B27928857J180719K81572q94116j488890j027685n38485j89926M65733Q04257
5503B26522036K41209j040557k033921k035290j143941o6107N31856L96306J43067
5494B21514658L7583L85767J344569J954389J847583J535115J080217Q19273J586762
5485B32105916K782687K886210J288189q14067j876714j824865r38121M7038J32918
5476B33789191m01574p83217k84271P04654P39641j96994r82492r67428n55130
5467B31062380r68239j683911k218272k251136j801887p83280M55022R35038O93889
5458B23439604M23494l2108j349391k425307k171069j948519k275215j417146
$$ plain form
5450 212244343 213063965 216463592 221483001 226326239 229718734 230640970 228651988 225131791
5442 225131791 221949190 219641741 217774944 217174503 218762778 221959241 225849693 229720452
5434 229720452 233169804 235602263 236696146 236782387 236330357 235920792 235082736 232773759 229516632
5425 229516632 226614614 223761065 220559191 217178952 214145426 212108945 211763166 213788198
5417 213788198 217214623 219499564 219283683 217886795 216349490 214924132 214821014 216676854
5409 216676854 219389861 220961532 220862301 219860311 218584922 216986006 214703692 212826330
5401 212826330 212884192 215180762 218564874 220655014 220744214 220153865 219661596 219277362 219458805
5392 219458805 221339900 224889455 228760989 232023855 234398370 235807137 236860068 237709753
$$ packed form
5450B12244343Q19622L399627N019409M843238L392495R22236j988982l520197
5442B25131791l182601k307449j866797o00441J588275L196463L890452L870759
5434B29720452L449352K432459J093883Q6241m52030m09565q38056k308977l257127
5425B29516632k902018k853549l201874l380239l033526k036481l45779K025032
5417B13788198L426425K284941k15881j396888j537305j425358j03118J855840
5409B16676854K713007J571671r9231j001990j275389j598916k282314j877362
5401B12826330N7862K296570L384112K090140Q9200n90349m92269l84234J81443
5392B19458805J881095L549555L871534L262866K374515J408767J052931Q49685
$$ plain form
5384 237709753 237339817 235545717 233518064 231638925 229794530 228550441 227751779 226377099
5376 226377099 224891851 224333530 224013994 223453905 223018207 223266050 224744518 227088434 229545229
5367 229545229 231556329 232466707 232152017 231682656 231648603 230922245 228204030 224151616 220659625
5358 220659625 218715981 218411357 219762387 222482980 225412025 227367289 227969228 227791562
5350 227791562 227619791 227586456 227797364 228037788 227883023 227413355 226807761 226915792 227837686
5341 227837686 228830538 229590988 229668569 229299150 229679383 231988561 236284276 240987296 244277885
5332 244277885 244925229 243626796 242105444 241026192 241085701 242502133 244209580 244974112 244082031
5323 244082031 241800056 239069788 236166417 233615722 232577954 232775298 232562363 231690037
$$ packed form
5384B37709753l69936j794100k027653j879139j844395j244089p98662j374680
5376B26377099j485248n58321l19536n60089m35698K47843J478468K343916K456795
5367B29545229K011100R10378l14690m69361l4053p26358k718215m052414l491991
5358B20659625j943644l04624J351030K720593K929045J955264O01939j77666
5350B27791562j71771l3335K10908K40424j54765m69668o05594J08031R21894
5341B27837686R92852P60450P7581l69419L80233K309178M295715M703020L290589
5332B44277885O47344j298433j521352j079252N9509J416432J707447P64532q92081
5323B44082031k281975k730268k903371k550695j037768J97344k12935q72326
$$ plain form
5315 231690037 231498072 231821324 231621112 230835254 230337417 231235451 233498338 235856158 236822052
5306 236822052 236210734 234366594 232051996 230140593 228431778 226438940 224435736 223167071
5298 223167071 223513791 225546175 228206928 230566770 231676900 231640166 231956174 232975048 234694996
5289 234694996 237378173 240357712 242968755 245291729 246509481 245372429 241981188 238536662
5281 238536662 236693712 236170742 236787649 238029547 238540012 237867028 236731840 236004407 236065007
5272 236065007 236623441 236926408 237293675 238187085 239363737 240407307 241049761 241832768 243822998
5263 243822998 247607161 251758885 254024903 253588006 251143383 247433774 243095616 239324795
5255 239324795 236849691 234753454 232084677 229445286 227559190 226623838 226551047 226911530 227436420
$$ packed form
5315B31690037j91965L23252k00212p85858m97837Q98034K262887K357820R65894
5306B36822052o11318j844140k314598j911403j708815j992838k003204j268665
5298B23167071L46720K032384K660753K359842J110130l6734L16008J018874J719948
5289B34694996K683177K979539K611043K322974J217752j137052l391241l444526
5281B38536662j842950n22970O16907J241898N10465o72984j135188p27433O0600
5272B36065007N58434L02967L67267Q93410J176652J043570O42454P83007J990230
5263B43822998L784163M151724K266018m36897k444623l709609m338158l770821
5255B39324795k475104k096237k668777k639391j886096r35352p2791L60483N24890
$$ plain form
5246 227436420 228250208 229478344 230754003 231534383 232155709 232853260 232823293 232200470 232682567
5237 232682567 235610530 239516581 241753941 241968154 241260828 240752571 240951087 240792577 239311061
5228 239311061 236712752 233832676 231819482 231110422 231376251 231613083 231174040 230563699 230704352
5219 230704352 231825504 233008621 233070661 231887966 229736865 226962678 224749207 224249123
5211 224249123 225058087 226361903 227832435 228980465 229473670 229295490 228813019 228571672 228917741
5202 228917741 229061214 228470620 227265440 226177896 226071588 226899116 227680008 228184597 228918909
5193 228918909 229534468 230212743 231753757 233825265 235327943 235861217 235600874 234669083 232794040
5184 232794040 230119344 228352392 229057358 231572937 233534215 233432185 232137625 231922481
$$ packed form
5246B27436420Q13788J228136J275659P80380O21326O97551k9967o22823M82097
5237B32682567K927963L906051K237360K14213p07326n08257J98516j58510j481516
5228B39311061k598309k880076k013194p09060K65829K36832m39043o10341J40653
5219B30704352J121152J183117O2040j182695k151101k774187k213471n00084
5211B24249123Q08964J303816J470532J148030M93205j78180m82471k41347L46069
5202B28917741J43473n90594j205180j087544j06308Q27528P80892N04589P34312
5193B28918909O15559O78275J541014K071508J502678N33274k60343r31791j875043
5184B32794040k674696j766952P04966K515579J961278j02030j294560k15144
$$ plain form
5176 231922481 233052706 233586662 233891864 235330305 237269555 238401012 238515189 238322882 237139946
5167 237139946 234148869 230793400 228549047 227435343 227400662 229587196 233978285 238004510
5159 238004510 239441506 238706071 237572306 236573028 235565520 234565516 234332669 235791942
5151 235791942 237806526 238776415 238229073 236697326 235303650 234785201 234438238 233711510 233369599
5142 233369599 233558370 234101690 234328213 233849625 233024001 231835200 230940869 231707432 233724347
5133 233724347 235124052 235526916 235861426 236699649 237705055 238377376 238170813 236572466 234482650
5124 234482650 233069545 232490496 233424061 235980260 239396878 242159772 242281881 239499868
5116 239499868 236214266 235317927 236960407 240003877 243854165 248002170 251538833 253897260
$$ packed form
5176B31922481J130225N33956L05202J438441J939250J131457J14177j92307j182936
5167B37139946k991077l355469k244353j113704l4681K186534M391089M026225
5159B38004510J436996p35435j133765r99278j007508j000004k32847J459273
5151B35791942K014584R69889n47342j531747j393676n18449l46963p26728l41911
5142B33369599J88771N43320K26523m78588q25624j188801q94331P66563K016915
5133B33724347J399705M02864L34510Q38223J005406O72321k06563j598347k089816
5124B34482650j413105n79049R33565K556199L416618K762894J22109k782013
5116B39499868l285602q96339J642480L043470L850288M148005L536663K358427
$$ plain form
5108 253897260 254233021 252563833 250202290 247833707 245828150 244244949 242714122 241248391
5100 241248391 240440261 241250796 243023753 244181782 244360110 244332074 244774733 246168471 248390401
5091 248390401 250393416 252457960 255057033 257155428 257612877 256089228 252979449 249368081
5083 249368081 246010763 243525668 242091180 241680714 242109924 242771604 243112412 243082088 243219578
5074 243219578 243255872 242501131 241781701 241731155 241788719 241961530 242776519 244393189 246218593
5065 246218593 247208938 246877409 245589548 244019220 242642484 241894863 241829139 241827869 241385218
5056 241385218 240096928 238671037 238360872 238666001 239219288 241703883 246270462 251655630
5048 251655630 257031649 260752761 261742996 261187898 260903351 261564934 262595017 262792498 261695976
$$ packed form
5108B53897260L35761j669188k361543k368583k005557j583201j530827j465731
5100B41248391q08130Q10535J772957J158029J78328k8036M42659J393738K221930
5091B48390401K003015K064544K599073K098395M57449j523649l109779l611368
5083B49368081l357318k485095j434488m10466M29210O61680L40808l0324J37490
5074B43219578L6294p54741p19430n0546N7564J72811Q14989J616670J825404
5065B46218593R90345l31529j287861j570328j376736p47621o5724j270m42651
5056B41385218j288290j425891l10165L05129N53287K484595M566579N385168
5048B51655630N376019L721112R90235n55098k84547O61583J030083J97481j096522
$$ plain form
5039 261695976 259907763 258122849 256766031 256213371 255908803 254718528 252911031 251755502
5031 251755502 251182116 251279789 252138579 252300072 251462575 251316419 252593275 253817587 253866892
5022 253866892 253688587 253999865 254346630 254716662 255493809 256569455 257351698 257502504 257134831
5013 257134831 256409233 254965859 253182745 252421663 253484292 256404698 260080719 262777763
5005 262777763 264127741 264564855 264317413 264016764 263174258 260602183 257029058 254064975 252813532
4996 252813532 253648901 255495852 256507987 255799267 254353351 253857064 254947498 256654527
4988 256654527 257769138 258711282 259676326 260352035 261387728 262977781 264639285 266108292
4980 266108292 266812809 266650668 266054808 265952644 267502829 270260719 272397088 272726786 272175908
$$ packed form
5039B61695976j788213j784914j356818n52660l04568j190275j807497j155529
5031B51755502n73386R7673Q58790J61493q37497j46156J276856J224312M9305
5022B53866892j78305L11278L46765L70032P77147J075646P82243J50806l67673
5013B57134831p25598j443374j783114p61082J062629K920406L676021K697044
5005B62777763J349978M37114k47442l00649q42506k572075l573125k964083j251443
4996B52813532Q35369J846951J012135p08720j445916m96287J090434J707029
4988B56654527J114611R42144R65044O75709J035693J590053J661504J469007
4980B66108292P04517j62141n95860j02164J550185K757890K136369L29698n50878
$$ plain form
4971 272175908 272482117 274517042 277418857 280253408 282855332 284619047 285400717 285593452
4963 285593452 285520194 284346688 281593093 278693862 277246892 277576605 278362878 278813378 280080451
4954 280080451 283286750 288102845 293374388 297899701 300507116 300518287 298515781 297207113
4946 297207113 298183744 299656512 300692296 302450345 304756927 306984996 309756024 312897527
4938 312897527 316124803 320033379 324405121 327804147 328640065 327270990 325957422 326519614
4930 326519614 329441250 334404424 340307107 345708880 349566193 351166773 350772818 349570711
4922 349570711 349390903 351767623 355808840 358278712 355732313 348344330 339245856 331015790
4914 331015790 323710891 316594892 310335365 305914747 303285372 301051494 296891759 288187005
$$ packed form
4971B72175908L06209K034925K901815K834551K601924J763715P81670J92735
4963B85593452p3258j173506k753595k899231j446970L29713P86273M50500J267073
4954B80080451L206299M816095N271543M525313K607415J1171k002506j308668
4946B97207113R76631J472768J035784J758049K306582K228069K771028L141503
4938C12897527L227276L908576M371742L399026Q35918j369075j313568N62192
4930C26519614K921636M963174N902683N401773L857313J600580l93955j202107
4922C49570711j79808K376720M041217K469872k546399p387983r098474q230066
4914C31015790p304899p115999o259527m420618k629375k233878m159735q704754
$$ plain form
4906 288187005 274148451 255997955 236748523 221562195 213964307 212609143 214144022
4899 214144022 216653213 219432238 222832378 227856737 234115964 239716752 241461171 236782613
4891 236782613 225954040 212712933 201627297 193265907 185099289 176355304 169000080 164529683
4883 164529683 162563019 159756939 151327264 135053901 114001246 94708809 82391975
4876 82391975 78590493 80629546 84901428 89855532 95113979 100123746 104729572 109839980
4868 109839980 116573976 124893986 132775131 137876095 140072370 141058588 142125558 143359863
4860 143359863 145414605 148828581 152621730 156393400 160244457 164111273 168129066 171820039
4852 171820039 174241739 175106077 175313629 175515796 175216635 173291349 170060415 167433638 165880363
$$ packed form
4906B88187005j4038554j8150496j9249432j5186328p597888j355164J534879
4899B14144022K509191K779025L400140N024359O259227N600788J744419m678558
4891B36782613j0828573j3241107j1085636q361390q166618q743985p355224m470397
4883A64529683j966664k806080q429675j6273363k1052655j9292437j2316834
4876H2391975l801482K039053M271882M954104N258447N009767M605826N110408
4868A09839980O733996Q320010P881145N100964K196275R86218J066970J234305
4860A43359863K054742L413976L793149L771670L851057L866816M017793L690973
4852A71820039K421700Q64338K07552K02167k99161j925286l230934k626777j553275
$$ plain form
4843 165880363 165385736 166489882 169171617 172142610 174032405 175076675 176402994 178096560
4835 178096560 179260512 179540616 179799162 180458011 180917296 181502974 183315643 187091014 191690971
4826 191690971 195045249 197249269 199287079 200630740 201016271 201040622 201153975 200937485 199543779
4817 199543779 196845466 193927137 191953677 191677257 192857686 194050663 194285936 193668044
4809 193668044 192995821 193102893 194963305 198990604 203515802 206572755 207905241 207948991 207096428
4800 207096428 205734905 204654571 204649864 205343576 206276513 207085108 207440252 206469157 203595315
4791 203595315 200212259 197895218 196439493 195394289 195521369 197171587 199668903 202166982
4783 202166982 203660726 203832219 203275584 202277037 201022384 200035448 199163894 198445330 198935234
$$ packed form
4843A65880363m94627J104146K681735K970993J889795J044270J326319J693566
4835A78096560J163952K80104K58546O58849M59285N85678J812669L775371M599957
4826A91690971L354278K204020K037810J343661L85531K4351J13353k16490j393706
4817A99543779k698313k918329j973460k76420J180429J192977K35273o17892
4809A93668044o72223J07072J860412M027299M525198L056953J332486M3750q52563
4800B07096428j361523j080334m707O93712R32937Q08595L55144r71095k873842
4791B03595315l383056k317041j455725j045204J27080J650218K497316K498079
4783B02166982J493744J71493n56635r98547j254653r86936q71554p18564M89904
$$ plain form
4774 198935234 200746638 201833867 200761917 199634825 200937631 204041566 206431930 206758182
4766 206758182 206064566 205775685 206062160 206613991 207882293 209795560 211272170 211817556 211405872
4757 211405872 210947311 211584953 213545830 216586918 220193472 222770405 223297131 223209058 223581470
4748 223581470 222511775 218902555 214880719 212077561 210153072 207727752 203985187 200867349
4740 200867349 200306023 201818533 203884947 204938950 204427407 203064188 201836934 201259712
4732 201259712 201872199 203770977 206593116 209686649 212425196 214771704 216487904 216974971
4724 216974971 216035420 214480451 213326100 213188372 213777893 213939354 213653755 213902759 214746256
4715 214746256 215203707 215424531 215908607 216992668 218969380 221186745 222468587 222620647 222212961
$$ packed form
4774A98935234J811404J087229j071950j127092J302806L103935K390364L26252
4766B06758182o93616k88881K86475N51831J268302J913267J476610N45386m11684
4757B11405872m58561O37642J960877L041088L606554K576933N26726q8073L72412
4748B23581470j069695l609220m021836k803158j924489k425320l742565l117838
4740B00867349n61326J512510K066414J054003n11543j363219j227254n77222
4732B01259712O12487J898778K822139L093533K738547K346508J716200M87067
4724B16974971r39551j554969j154351j37728N89521J61461k85599K49004Q43497
4715B14746256M57451K20824M84076J084061J976712K217365J281842J52060m07686
$$ plain form
4706 222212961 221923713 222460559 223941576 225654821 226996281 227861657 227559490 226107039 224757386
4697 224757386 223956094 223707946 223614370 223258943 222941273 223011735 223181367 223023110 223280349 224997880
4687 224997880 227727053 229298499 228289629 225572089 222212899 219206284 217079721 215575965
4679 215575965 214773173 214986158 216849723 219881419 222728899 224352905 224517044 224243620 224657415
4670 224657415 225890316 227713166 230017410 231715453 231500699 230052973 229083039 229361726
$$ packed form
4706B22212961k89248N36846J481017J713245J341460Q65376l02167j452451j349653
4697B24757386q01292k48148r3576l55427l17670P0462J69632j58257K57239J717531
4687B24997880K729173J571446j008870k717540l359190l006615k126563j503756
4679B15575965q02792K12985J863565L031696K847480J624006J64139k73424M13795
4670B24657415J232901J822850K304244J698043k14754j447726r69934K78687
$$ [...]
##END NTUPLES=NMR SPECTRUM
##END=
