##TITLE=C13_SR157_k
 CDCl3, 22300 sc

 23.1.2023
##JCAMPDX= 6.0         $$ Bruker NMR JCAMP-DX V2.0
##DATA TYPE= NMR SPECTRUM
##DATA CLASS= NTUPLES
##ORIGIN= UXNMR, Bruker Analytische Messtechnik GmbH
##OWNER= root
$$ XWIN-NMR		Version 3.5
$$ Tue Jan 24 13:48:41 2023 Russian Standard Time (UT+4h)  she@DPX200
##.OBSERVE FREQUENCY= 50.327896
##.OBSERVE NUCLEUS= ^13C
##.ACQUISITION MODE= SIMULTANEOUS
##.ACQUISITION SCHEME= undefined
##.AVERAGES= 22301
##.DIGITISER RES= 17
##SPECTROMETER/DATA SYSTEM= spect
##.PULSE SEQUENCE= zgpg30
##.SOLVENT NAME= CDCl3
##.SHIFT REFERENCE= (INTERNAL, CDCl3, 0, 222.653)
##AUDIT TRAIL= $$ (NUMBER, WHEN, WHO, WHERE, WHAT)
$$ ##TITLE= Audit trail, XWIN-NMR		Version 3.5
$$ ##JCAMPDX= 5.01
$$ ##ORIGIN= Bruker BioSpin GmbH
$$ ##OWNER= she
$$ F:/spectra/data/she/nmr/c13/1/pdata/1/auditp.txt
$$ ##AUDIT TRAIL=  $$ (NUMBER, WHEN, WHO, WHERE, WHAT)
(   1,<2023-01-24 13:47:08.93 +0400>,<she>,<DPX200>,
      <created by zg, POWCHK disabled, PULCHK disabled
       terminated by command 'halt'
       configuration hash MD5:
       00 E9 B6 7A A2 85 ED C7 34 08 36 98 17 FE 4E 26
       data hash MD5: 32K
       36 31 D8 16 AB 4A 84 47 B1 22 4F C9 EE 79 C8 58>)
(   2,<2023-01-24 13:47:16.15 +0400>,<she>,<DPX200>,
      <Start of raw data processing
       efp BC_mod = 2 LB = 2 FT_mod = 6 PKNL = 1 PHC0 = -312.7209 PHC1 = 29.98446 SI = 32K 
       data hash MD5: 32K
       BF 64 74 0B A1 34 52 B5 87 1A 79 5E 12 A4 BD 9E>)
(   3,<2023-01-24 13:47:19.06 +0400>,<she>,<DPX200>,
      <abs ABSG = 5 
       data hash MD5: 32K
       15 74 B6 F2 99 68 6F 7D 82 A5 34 13 A0 DE 05 F4>)
(   4,<2023-01-24 13:47:53.18 +0400>,<she>,<DPX200>,
      <pk PHC0 = -3.030223 PHC1 = 1.2 
       data hash MD5: 32K
       3A EC 8A 1A 4F BE D8 FD 20 D3 84 C9 5A 6E 4E C8>)
(   5,<2023-01-24 13:47:56.32 +0400>,<she>,<DPX200>,
      <abs ABSG = 5 
       data hash MD5: 32K
       9F D1 2D 14 08 4D DB 84 EF 95 36 19 84 1B 88 87>)
$$ ##END=
$$ 
$$ hash MD5
$$ E8 EE 63 B4 C8 24 75 51 66 05 1D B2 30 EB 99 5F
##$RELAX= 
##$RELAX= 
##$RELAX= 
##$RELAX= 
##$RELAX= 
##$RELAX= 
##$RELAX= 
##$RELAX= 
$$ Bruker specific parameters
$$ --------------------------
##$DU= <F:/spectra>
##$EXPNO= 1
##$NAME= <c13>
##$PROCNO= 1
##$TYPE= <nmr>
##$USER= <she>
##$AMP= (0..31)
100 100 100 100 100 100 100 100 100 100 100 100 100 100 100 100 100 100 
100 100 100 100 100 100 100 100 100 100 100 100 100 100 
##$AQSEQ= 0
##$AQ_mod= 1
##$AUNM= <au_zg>
##$AUTOPOS= <>
##$BF1= 50.322709
##$BF2= 200.13
##$BF3= 50.322709
##$BF4= 500.13
##$BF5= 500.13
##$BF6= 500.13
##$BF7= 500.13
##$BF8= 500.13
##$BYTORDA= 1
##$CFDGTYP= 0
##$CFRGTYP= 5
##$CHEMSTR= <none>
##$CNST= (0..31)
1 1 145 1 1 1 1 1 1 1 1 1 1 1 1 1 1 1 1 1 1 1 1 1 1 1 1 1 1 1 1 1 
##$CPDPRG= <waltz16>
##$CPDPRG1= <>
##$CPDPRG2= <waltz16>
##$CPDPRG3= <>
##$CPDPRG4= <mlev>
##$CPDPRG5= <mlev>
##$CPDPRG6= <mlev>
##$CPDPRG7= <mlev>
##$CPDPRG8= <mlev>
##$CPDPRGB= <>
##$CPDPRGT= <>
##$D= (0..31)
$$ [...]
##$SUBNAM4= <"">
##$SUBNAM5= <"">
##$SUBNAM6= <"">
##$SUBNAM7= <"">
##$SUBNAM8= <"">
##$SUBNAM9= <"">
##$SW= 239.972175391363
##$SWIBOX= (0..15)
0 1 3 0 0 0 0 0 0 0 0 0 0 0 0 0 
##$SW_h= 12077.2946859903
##$TD= 32768
##$TD0= 1
##$TE= 0
##$TE2= 300
##$TE3= 300
##$TEG= 300
##$TL= (0..7)
120 120 120 120 120 120 120 120 
##$TP= (0..7)
150 150 150 150 150 150 150 150 
##$TP07= 0
##$TPNAME0= <>
##$TPNAME1= <>
##$TPNAME2= <>
##$TPNAME3= <>
##$TPNAME4= <>
##$TPNAME5= <>
##$TPNAME6= <>
##$TPNAME7= <>
##$TPOAL= (0..7)
0.5 0.5 0.5 0.5 0.5 0.5 0.5 0.5 
##$TPOFFS= (0..7)
0 0 0 0 0 0 0 0 
##$TUNHIN= 0
##$TUNHOUT= 0
##$TUNXOUT= 0
##$USERA1= <user>
##$USERA2= <user>
##$USERA3= <user>
##$USERA4= <user>
##$USERA5= <user>
##$V9= 5
##$VALIST= <valist>
##$VCLIST= <CCCCCCCCCCCCCCC>
##$VD= 0
##$VDLIST= <DDDDDDDDDDDDDDD>
##$VPLIST= <PPPPPPPPPPPPPPP>
##$VTLIST= <TTTTTTTTTTTTTTT>
##$WBST= 1024
##$WBSW= 4
##$XGAIN= (0..3)
0 0 0 0 
##$XL= 0
##$YL= 0
##$YMAX_a= 142442570
##$YMIN_a= -34920926
##$ZGOPTNS= <>
##$ZL1= 120
##$ZL2= 120
##$ZL3= 120
##$ZL4= 120
##$ABSF1= 222.6533
##$ABSF2= -17.34351
##$ABSG= 5
##$ABSL= 3
##$ALPHA= 0
##$AQORDER= 0
##$ASSFAC= 0
##$ASSFACI= 0
##$ASSFACX= 0
##$ASSWID= 0
##$AUNMP= <proc_1d>
##$AZFE= 0.1
##$AZFW= 0.5
##$BCFW= 0
##$BC_mod= 2
##$BYTORDP= 0
##$COROFFS= 0
##$CY= -3
##$DATMOD= 1
##$DC= 0
##$DFILT= <>
##$DTYPP= 0
##$F1P= 0
##$F2P= 0
##$FCOR= 0.5
##$FTSIZE= 32768
##$FT_mod= 6
##$GAMMA= 0
##$GB= 0
##$INTBC= 1
##$INTSCL= 4.134877e-10
##$ISEN= 128
##$LB= 2
##$LEV0= 0
##$LPBIN= 0
##$MAXI= 10000
##$MC2= 0
##$MEAN= 0
##$ME_mod= 0
##$MI= 0.1934396
##$NCOEF= 0
##$NC_proc= 1
##$NLEV= 6
##$NOISF1= 120.0001
##$NOISF2= 80.00006
##$NSP= 0
##$NTH_PI= 0
##$NZP= 0
##$OFFSET= 222.6533
##$PC= 1.4
##$PHC0= -315.7511
##$PHC1= 31.18446
##$PH_mod= 1
##$PKNL= yes
##$PPARMOD= 0
##$PSCAL= 0
##$PSIGN= 0
##$REVERSE= no
##$SF= 50.322730123286
##$SI= 32768
##$SIGF1= 140
##$SIGF2= 120
##$SINO= 11.81781
##$SIOLD= 32768
##$SREGLST= <13C.CDCl3>
##$SSB= 0
##$STSI= 32768
##$STSR= 0
##$SW_p= 12077.2946859903
##$SYMM= 0
##$S_DEV= 0
##$TDeff= 32768
##$TDoff= 0
##$TI= <>
##$TILT= no
##$TM1= 0
##$TM2= 0
##$TOPLEV= 0
##$USERP1= <user>
##$USERP2= <user>
##$USERP3= <user>
##$USERP4= <user>
##$USERP5= <user>
##$WDW= 1
##$XDIM= 32768
##$YMAX_p= 504931740
##$YMIN_p= -3334769
$$ End of Bruker specific parameters
$$ ---------------------------------
##NTUPLES= NMR SPECTRUM
##VAR_NAME=  FREQUENCY,     SPECTRUM/REAL,   SPECTRUM/IMAG
##SYMBOL=    X,             R,               I
##VAR_TYPE=  INDEPENDENT,   DEPENDENT,       DEPENDENT
##VAR_FORM=  AFFN,          ASDF,            ASDF
##VAR_DIM=   32768,         32768,           32768
##UNITS=     HZ,            ARBITRARY UNITS, ARBITRARY UNITS
##FACTOR=    0.368581032318806, 1,           1
##FIRST=     11204.5221812756, 0,            0
##LAST=      -872.772504714734, 0,           0
##MIN=       -872.772504714734, -3334769,    0
##MAX=       11204.5221812756, 504931740,    0
$$ Real data points
##PAGE= N=1
##DATA TABLE= (X++(R..R)), XYDATA
$$ [...]
17960 250463 510657 644423 712407 699738 554614 302670 34387 -76232 97099 518153
17950 518153 1026582 1332731 1287338 1077441 951022 895987 740407 528739 424143 444076
17940 444076 485992 479743 418165 354978 288668 127692 -79617 -180115 -173622 -84581 98754
17929 98754 258648 329258 347552 298874 179649 86171 22941 -88125 -243187 -271370 -99569
17918 -99569 62239 105871 158849 270785 431117 592898 587589 382829 193974 251817 551430
17907 551430 816928 854607 813744 902325 1104621 1263365 1287482 1235867 1241604 1294825 1278870
17896 1278870 1153772 1014815 956169 946798 893690 872918 924728 915671 786145 605731 501257
17885 501257 503737 493583 439727 422257 388618 318058 328158 385519 438271 486146 461586 282386
17873 282386 98958 109798 188600 178417 172828 256683 396237 503393 551661 533467 441030
17862 441030 250717 -74036 -431367 -756595 -1117323 -1453659 -1646206 -1628359 -1391705 -1047196
17852 -1047196 -773436 -729929 -895290 -1040905 -923593 -566702 -157103 224704 482062 602672
17842 602672 666852 748708 886935 1076375 1280972 1399655 1399281 1267143 1043380 811719
17832 811719 633850 557545 456901 315558 263440 339939 457650 504264 534769 722920
17822 722920 1129214 1617626 2060486 2525363 3000864 3294549 3311329 3159508 3006181 2874990
17812 2874990 2724620 2568664 2446654 2411826 2436454 2396225 2291676 2102128 1850820 1620670
17802 1620670 1360841 978835 560018 352760 494632 951540 1514261 1991712 2297474
17793 2297474 2446820 2517344 2567477 2606488 2521743 2288994 2004162 1757998 1552034 1280330
17783 1280330 998314 837185 804270 883549 1053172 1233694 1385385 1553019 1732752 1899660
17773 1899660 2102893 2273358 2359569 2402633 2389917 2312521 2317889 2491322 2702045 2894796
17763 2894796 3078391 3160422 3044970 2809619 2598146 2572169 2837821 3288325 3606099 3602411
17753 3602411 3333598 3074381 3078648 3297386 3470194 3449220 3344207 3272531 3233263 3202848
17743 3202848 3134134 3013868 2802648 2453770 2067727 1805928 1773184 1883638 1933255 1766761
17733 1766761 1466123 1221529 1103080 1143416 1401054 1839733 2388637 3014355 3563240 3825546
17723 3825546 3815677 3772762 3928367 4281859 4606330 4808382 5016362 5289357 5488938 5540300
17713 5540300 5521959 5443949 5253312 5047187 5044263 5303252 5686003 6005214 6254356 6545338
17703 6545338 6745495 6678026 6324525 5860064 5580725 5648705 6036940 6522817 6794089 6869772
17693 6869772 6931605 7014459 7042776 7004915 6969814 6961136 7032899 7189466 7451035 7828435 8087640
17682 8087640 8089021 8027302 8101088 8326065 8677039 9124052 9577391 9924120 10114693 10210932
17672 10210932 10335610 10533197 10750097 10964052 11343467 11929460 12473894 12789756 12958947
17663 12958947 13221784 13632311 14026214 14280536 14375458 14424813 14517722 14699013 15081127 15741151
17653 15741151 16609197 17506645 18317258 19068369 19805808 20479514 21050170 21740071 22683603
17644 22683603 23748634 24821024 25865520 26903018 27904912 28905246 30024807 31322066
17636 31322066 32830187 34561450 36492581 38704262 41252073 43937367 46602886 49391793
17628 49391793 52549718 56259894 60573462 65436870 70855043 76945287 83665780 90860712
17620 90860712 98399201 106101655 113470510 119610073 123641103 124958938 123132067 118189563
17612 118189563 110716548 101602274 91945468 82710378 74222634 66272870 58790642 52045137
17604 52045137 46339091 41614011 37596031 34131985 31150419 28611277 26576180 25043892
17596 25043892 23759554 22519602 21236856 19867585 18477180 17051872 15548281 14112546
17588 14112546 12894663 11904341 11049702 10259961 9631823 9249407 9038662 8867480 8598347
17579 8598347 8147099 7550179 7019956 6699017 6535636 6406697 6290059 6140980 5853718
17570 5853718 5603152 5604709 5716544 5750673 5630537 5314623 4832836 4353903 4086335 4021176
17560 4021176 3957036 3761007 3459372 3140009 2847019 2612538 2578869 2822382 3175972 3426645
17550 3426645 3522770 3485967 3399869 3372176 3323571 3071626 2686919 2333785 1971989 1567830
17540 1567830 1232145 1112751 1225671 1432614 1612609 1689815 1662122 1568426 1383440 1167439
17530 1167439 1005202 879894 801574 796327 807349 809952 865283 893962 736465 385304 36469
17519 36469 -80584 114158 371879 466533 415426 249957 86425 112861 302558 442207
17509 442207 415965 211264 -93667 -328832 -335888 -80163 296671 663584 1010911 1273262
17499 1273262 1282861 1045017 794547 660762 672147 800652 978130 1215341 1528873 1831888
17489 1831888 2011733 2008557 1852681 1566295 1147437 720331 485397 492974 635385 756281
17479 756281 785484 775936 718152 674239 702875 693560 681144 736091 898441 1285881 1829786
17468 1829786 2247643 2331979 2107159 1660459 1143671 713881 373639 73826 -214351 -418858
17458 -418858 -421968 -362375 -356201 -243451 60633 430993 664271 609911 344640 44327 -176461
17447 -176461 -226926 57974 646369 1186772 1449990 1471378 1367325 1109992 717978 356577
17437 356577 194481 159567 65898 -110447 -290318 -402168 -468842 -508356 -553693 -561838 -435432
17426 -435432 -235326 -143972 -252095 -544632 -905935 -1161987 -1326981 -1519203 -1632812 -1554863
17416 -1554863 -1483179 -1515323 -1544443 -1549236 -1510245 -1408840 -1268188 -1179569 -1095781 -807266 -232049
17405 -232049 421224 849316 868538 504066 -21297 -504065 -902282 -1146810 -1133052 -994703
17395 -994703 -917941 -913153 -814105 -545971 -283391 -148222 -51756 62696 116622 61987 -114
17384 -114 61060 226688 385054 572688 810385 967030 959409 907317 924488 1044943 1262239
17373 1262239 1436098 1406312 1205709 1019083 919100 798931 654495 617375 688092 735573
17363 735573 700475 562983 369075 234623 84982 -143270 -209441 77869 570642 934095
17353 934095 954501 876514 986413 1186087 1264800 1117440 782103 310435 -187461 -540046
17343 -540046 -677393 -607343 -412486 -264130 -156350 110920 584247 1021165 1247907 1419766
17333 1419766 1651706 1760434 1607567 1332450 1052781 743096 419583 181341 60513
17324 60513 -69329 -271902 -500593 -659118 -730441 -793925 -749649 -520242 -269834 -168035
17314 -168035 -217137 -249264 -56725 390597 857560 1056637 958282 779272 665201 444196
17304 444196 13158 -407885 -625423 -572432 -384041 -201166 2757 156496 123324 -86303
17294 -86303 -217174 -115832 76841 215909 309553 351623 395814 514748 642929 730801
17284 730801 737442 677253 663828 739561 836655 997626 1295219 1536855 1536193 1372419 1173201
17273 1173201 1048257 1138885 1457486 1881657 2319201 2616277 2594823 2301329 1869938 1446188
17263 1446188 1189350 1084275 1037356 1058215 1117184 1126986 1034017 794616 420527 -42069
17253 -42069 -432633 -539348 -378018 -181453 -62943 43889 185339 333923 368197 204755
17243 204755 -6717 -93907 -47934 60057 150780 131342 26003 -41739 -58367 -116401 -210957
17232 -210957 -265258 -288044 -313087 -421530 -597568 -648954 -541314 -390068 -272712 -144637
17222 -144637 37207 76106 -197888 -676395 -1155851 -1499806 -1596213 -1551585 -1560801 -1609495 -1544615
17211 -1544615 -1326634 -1101136 -1019807 -1101033 -1206795 -1224699 -1237417 -1322403 -1390737 -1303588 -1040631
17200 -1040631 -624812 -51220 503352 802921 780050 621116 562456 624449 758782 883121
17190 883121 944560 919782 815220 731177 763622 894954 1070022 1196813 1204756 1165733 1192128
17179 1192128 1365880 1591512 1653516 1409693 894387 449087 272070 326970 607549 1006066
17169 1006066 1357747 1621120 1713945 1581373 1328619 1141509 1098104 1112297 1181210 1299197
17159 1299197 1365519 1370758 1463060 1734661 2187188 2678245 2974446 2995217 2861627 2671155
17149 2671155 2409985 2173116 1992507 1736039 1375525 991404 628334 338355 140992
17140 140992 -91367 -429921 -785685 -1080014 -1361320 -1653676 -1753620 -1565976 -1340991 -1253280
17130 -1253280 -1176749 -986176 -701419 -461530 -433243 -591957 -731578 -762941 -735520 -652584
17120 -652584 -496399 -298772 -140235 -162326 -420202 -810199 -1174055 -1369336 -1329562 -1152259
17110 -1152259 -1057850 -1119574 -1195178 -1189836 -1125741 -966777 -662699 -307459 -54876 31361 5731
17099 5731 -31964 61967 291276 483012 537198 471645 385826 399936 537959 612065 524707
17088 524707 417324 460782 658008 916213 1163171 1349613 1446937 1483751 1559609 1801179
17078 1801179 2122666 2301828 2254579 2060411 1723974 1205900 599768 46604 -403359 -858159
17068 -858159 -1370557 -1897235 -2284686 -2347015 -2065761 -1608937 -1243558 -1112189 -1118828 -1125612
17058 -1125612 -990712 -613607 -150818 224081 481518 613609 678125 763211 854516 954650
17048 954650 1084471 1109159 887617 545230 289426 174908 86648 -21568 -9070 99990
17038 99990 75594 -123559 -311161 -308799 -85790 220587 412025 340041 69262 -184129
17028 -184129 -350021 -467606 -467477 -317954 -126384 65556 250611 355857 401260 490757
17018 490757 584376 552440 406681 375449 611647 935833 1134354 1210248 1244253 1302055 1250387
17007 1250387 921644 382497 -61000 -131355 69620 269038 383920 501023 648866 756646
16997 756646 826777 833431 768214 763573 883040 1072590 1199831 1088712 789064 563383 552260
16986 552260 680550 827730 967161 1117367 1218792 1296510 1402525 1438958 1410773 1453300
16976 1453300 1645328 1906939 2072399 2021734 1786060 1440907 1070495 835361 828957 1014311
16966 1014311 1330420 1696713 1915276 1879675 1707855 1558723 1387901 1107964 824009 680361
16956 680361 747672 1000803 1311463 1626041 1868045 1961371 2050885 2231699 2415768 2467080
16946 2467080 2366059 2285943 2392850 2587531 2646589 2530410 2425676 2409612 2355528 2190773
16936 2190773 1895482 1502903 1130561 772181 475909 328530 345475 528783 818191 1121717
16926 1121717 1405841 1688364 1952809 2034470 1844250 1616043 1551802 1574865 1510262 1350657
16916 1350657 1305491 1424067 1561925 1616247 1600043 1660458 1808732 1898777 1948805 2039651 2090146
16905 2090146 1986891 1768890 1582628 1537983 1596609 1621684 1587604 1462417 1294704 1309643
16895 1309643 1622126 2096279 2548858 2974338 3467572 4057157 4744751 5524618 6298855
16886 6298855 6842317 7031179 6959764 6804900 6643957 6492062 6352978 6115081 5715017 5382875
16876 5382875 5394067 5636324 5884953 5982006 5965817 6014136 6276774 6723140 7191851 7572526
16866 7572526 7949728 8474831 9076083 9660159 10250666 10948089 11769375 12668193 13696018
16857 13696018 14874579 16128119 17399285 18702542 20054700 21456014 22999106 24769162
16849 24769162 26749505 28943806 31348718 33843563 36174132 38098612 39423247 39957777
16841 39957777 39600300 38420400 36492700 33865653 30802847 27733609 24973622 22610276
16833 22610276 20525960 18577705 16769437 15163228 13780024 12591176 11502301 10497763
16825 10497763 9599415 8774556 8020460 7228849 6335181 5534252 5031480 4789819 4681956
16816 4681956 4639136 4486941 4160143 3800560 3509030 3278069 3085489 2843497 2484717 2090357
16806 2090357 1807434 1649898 1510732 1312118 1059354 862277 808121 822654 780283 685070
16796 685070 617559 641428 714404 749398 737363 656838 570960 605104 715107 750471 701605
16785 701605 684943 725863 808784 943251 1070498 1016108 718268 281425 -209468 -636932
16775 -636932 -813269 -685821 -419957 -183717 -6595 121128 109774 -94321 -291070 -281364
16765 -281364 -212203 -273593 -464109 -771917 -1153738 -1454314 -1464693 -1047207 -306007 438007
16755 438007 944931 1194520 1228973 1113653 945722 753496 616607 636038 840839 1134535
16745 1134535 1436614 1782245 2080162 2136590 1943433 1608453 1199035 855236 680756 679688
16735 679688 759990 744411 576964 370953 270385 343345 529189 672493 672155 616161 621661
16724 621661 588832 530000 562919 739518 998337 1167541 1200304 1226028 1252049 1267178 1305962
16713 1305962 1309215 1229552 1151754 1114282 1066188 933963 612700 206633 18180 170032
16703 170032 569442 1107558 1617419 1779035 1436717 942017 668693 621187 721948 844025
16693 844025 939122 1039932 1211225 1441252 1523655 1390703 1144670 858200 543397 105934
16683 105934 -462451 -928550 -1105639 -963653 -714744 -554316 -514903 -580346 -702645 -775646
16673 -775646 -709334 -559031 -474702 -400826 -185834 93844 286752 315367 222094 95866
16663 95866 -38930 -197138 -307002 -290470 -166322 38981 273738 355576 291488 298412 406665
16652 406665 563027 653482 488498 109247 -295156 -612816 -831486 -984190 -1040626 -878972
16642 -878972 -540236 -199412 9473 78024 159739 278820 315405 242516 151343 176354 366279
16631 366279 574807 592368 385670 156695 123841 194595 112508 -218869 -628607 -824504
16621 -824504 -763830 -611518 -443095 -267255 -51591 225094 528505 859938 1150979 1295543
16611 1295543 1340969 1334963 1164161 742870 248676 -44862 277 203075 267237 159544
16601 159544 -5475 -198315 -446707 -562634 -393771 -141274 55204 202912 237937 122912
16591 122912 -125456 -441653 -735531 -936695 -983584 -818959 -571260 -424631 -450254 -534538
16581 -534538 -434421 -160779 37781 61047 -11161 6287 239504 557237 822161 1069060
16571 1069060 1310410 1443022 1387666 1209170 978542 675994 331809 -12733 -333459 -468211
16561 -468211 -301030 -63301 -73901 -304873 -433288 -252671 57101 188570 102346 76076
16551 76076 292620 600470 780660 749415 559694 362728 282815 383834 597265 769935
16541 769935 875907 934479 799398 345219 -218648 -613868 -747342 -653545 -495575 -379113
16531 -379113 -333890 -313680 -204107 70761 494133 900117 1087440 1045616 900058 724377
16521 724377 584737 434806 304435 312257 300596 86487 -215310 -446342 -622880 -715337
16511 -715337 -630423 -368761 -3083 339932 527652 487088 220946 -96601 -261867 -325025
16501 -325025 -390363 -341625 -131404 28916 65088 130291 203029 146140 -30834 -196011 -284705
16490 -284705 -294755 -184359 -33735 -53434 -219428 -343206 -425919 -497563 -494100 -484118 -570527
16479 -570527 -659979 -657876 -633100 -704786 -834267 -927785 -996129 -1092110 -1202891 -1189797 -1000980
16468 -1000980 -763840 -701571 -936806 -1312906 -1582177 -1638847 -1506420 -1276657 -1115151 -1060603
16458 -1060603 -1017142 -905901 -653955 -317989 -64701 23984 30454 63985 160420 184580 2436
16447 2436 -365869 -848978 -1303255 -1590964 -1639185 -1416048 -1005723 -536722 -113630 227990
16437 227990 490756 626794 585428 375573 35402 -300822 -423349 -384189 -462782 -664373
16427 -664373 -732480 -542616 -132398 385127 807666 970999 899740 705867 389984 -78868
16417 -78868 -601287 -1078470 -1458151 -1616788 -1465815 -1074069 -667733 -416040 -236964 -50204
16407 -50204 109748 264694 442993 635596 842562 1035840 1150097 1070891 793157 524937
16397 524937 369646 237349 68146 -173303 -414117 -425996 -54038 562638 1126193 1475679
16387 1475679 1690756 1936445 2197512 2276565 2111964 1851964 1595230 1376908 1266199 1181224
16377 1181224 925383 482782 56750 -272336 -505438 -464210 -112124 237368 296518 49364
16367 49364 -230644 -283246 -160975 10424 216885 443793 686437 885705 863506 682671
16357 682671 593608 599377 479868 124916 -356205 -661624 -599509 -325040 -33058 135476
16347 135476 48155 -215936 -569869 -1051951 -1549811 -1777158 -1615083 -1293675 -1065284 -979107
16337 -979107 -1069542 -1267223 -1370653 -1294259 -1157222 -1076485 -955262 -759752 -656323 -658112
16327 -658112 -676580 -793134 -942867 -1018158 -1075828 -1127398 -1104648 -972145 -809649 -806657 -948326
16316 -948326 -1036829 -1023804 -895827 -652086 -388707 -126951 101290 175182 105895 -30006
16306 -30006 -147717 -150041 18258 356955 696105 916273 1011556 954398 754110 529550
16296 529550 382783 261519 104983 -128143 -391651 -558312 -648666 -706414 -738629 -785978
16286 -785978 -875939 -987084 -1114265 -1249102 -1383844 -1510082 -1513884 -1337812 -1024753 -595485
16276 -595485 -114098 258450 460763 556856 504897 262937 -102673 -449677 -625604 -649045
16266 -649045 -598920 -543395 -514872 -502509 -596328 -760952 -862005 -879091 -854787 -780782 -672277
16255 -672277 -568327 -468124 -346674 -89510 167430 129886 -75813 -148095 -101407 -142920
16245 -142920 -334078 -551478 -749304 -942523 -996257 -863197 -736485 -669318 -540450 -385795
16235 -385795 -352425 -473384 -651824 -805452 -906349 -1025847 -1233042 -1518374 -1797748 -1939282
16225 -1939282 -1883442 -1692033 -1398685 -989729 -614512 -437968 -386328 -297604 -110710 95420
16215 95420 121637 -113673 -514844 -934629 -1166240 -1190931 -1168381 -1196655 -1274096 -1307793 -1256095
16204 -1256095 -1228105 -1312935 -1470136 -1633118 -1836920 -2082762 -2175986 -2032559 -1755459 -1413271
16194 -1413271 -1044643 -707895 -373391 4375 454688 976091 1425197 1680573 1695300 1513683
16184 1513683 1329882 1217069 1011670 612765 156416 -257873 -637949 -886733 -907968 -743773
16174 -743773 -485495 -288330 -275442 -410766 -583172 -769373 -953907 -962916 -742980 -416842
16164 -416842 -120610 69846 168669 334211 592354 765738 819192 800321 780032 876530
16154 876530 1080655 1244955 1262336 1129553 951139 855840 970406 1301384 1695040 1924569
16144 1924569 1925631 1827102 1799670 1884679 1921028 1755196 1358130 845964 452506 259422
16134 259422 149854 -13165 -227527 -410520 -484097 -336418 -3746 280874 253402 -69882
16124 -69882 -468074 -877372 -1212029 -1299110 -1020211 -447304 146635 465769 544532 615758
16114 615758 697488 703851 580441 393518 346016 483096 671750 816159 870281 824579 705767
16103 705767 517763 248113 2885 -48571 51685 116266 34490 -156855 -257285 -207731
16093 -207731 -117928 -39576 61899 150214 134033 81361 90185 222461 452387 632616 753102
16082 753102 917197 1127022 1335561 1579105 1874616 2038795 1941696 1627635 1254991 967092
16072 967092 792246 715232 711338 782975 907511 950822 898729 814266 632854 299291 -171360
16061 -171360 -691018 -1100129 -1351826 -1532412 -1574826 -1336100 -926274 -535222 -228530 -27001
16051 -27001 68415 48830 -9565 46720 282856 585407 841841 931371 844546 714592 635360
16040 635360 569639 368418 49556 -153287 -138221 -9922 79841 100193 112971 112343 107060
16029 107060 164785 239828 320599 317412 -18480 -560874 -899235 -916868 -838254 -774498 -699303
16018 -699303 -698085 -820867 -922744 -867452 -684753 -452021 -134235 205518 432505 633610
16008 633610 879387 1057240 1087158 951338 681792 382138 104763 -207626 -593964 -928116
15998 -928116 -1051815 -1045762 -1029597 -991126 -849409 -525204 -162558 -22469 -142274 -347473
15988 -347473 -495949 -511639 -436143 -373024 -337449 -320751 -291263 -304485 -382993 -381713 -364130
15977 -364130 -456159 -556046 -559112 -502916 -428637 -385148 -382102 -366139 -284824 -96199 113600
15966 113600 290505 533861 848899 1019068 793916 229636 -395878 -875699 -1102595 -1058958
15956 -1058958 -844043 -664663 -592797 -570500 -549648 -379547 -14857 332446 459041 386625
15946 386625 257680 212117 148080 -188945 -760059 -1300063 -1654995 -1692290 -1390939 -998898
15936 -998898 -657524 -243160 301172 787775 1055927 1155690 1239147 1347585 1402575 1311216
15926 1311216 1141481 1057911 1049239 976525 749780 410302 117544 12977 69615 169439
15916 169439 267269 290685 201538 69013 -158211 -568029 -1034145 -1382461 -1450172 -1212416
15906 -1212416 -892337 -682135 -684012 -885783 -1085081 -1095894 -910925 -665040 -497258 -453461
15896 -453461 -534491 -755575 -1109075 -1443602 -1564395 -1474889 -1372754 -1458720 -1753963 -2043990
15886 -2043990 -2097475 -1901329 -1602448 -1273498 -902195 -426886 164279 652478 828256 785475
15876 785475 672130 573950 545454 572521 579031 451904 158346 -227606 -559402 -758329
15866 -758329 -848150 -940462 -1177522 -1488333 -1685780 -1659543 -1433720 -1123653 -812070 -549066
15856 -549066 -303298 9279 386616 635957 635918 489094 320141 154330 2146 -150472
15846 -150472 -342801 -620168 -911157 -1024384 -886865 -715778 -741197 -940060 -1173128 -1235640
15836 -1235640 -1060774 -758793 -593264 -770429 -1150858 -1359178 -1191175 -875462 -648413
15827 -648413 -502153 -360165 -237689 -213652 -344921 -693602 -1152321 -1454723 -1463842 -1326711
15817 -1326711 -1248971 -1294177 -1404435 -1454429 -1331892 -1157456 -1093415 -1102454 -1054510 -917505 -764085
15806 -764085 -678835 -667245 -597603 -370171 85678 671066 1135274 1397648 1542160 1568872
15796 1568872 1304173 693201 -5624 -584063 -1052877 -1365491 -1499826 -1429563 -1124792 -856478
15786 -856478 -758129 -682288 -507436 -188163 213738 490929 446010 86145 -323128 -518773
15776 -518773 -515384 -542286 -708038 -972624 -1340673 -1721532 -2000124 -2167055 -2317960 -2462209
15766 -2462209 -2514783 -2495291 -2508904 -2648708 -2797622 -2828492 -2751171 -2583874 -2382051 -2195147
15756 -2195147 -2069430 -2077485 -2141792 -2119837 -2022772 -1876143 -1649739 -1353672 -1094810 -867136
15746 -867136 -571172 -241575 43012 216980 186485 20718 -68523 -91278 -197656 -375666
15736 -375666 -449582 -335177 -146873 40991 162261 118597 18679 -268 51494 165744
15726 165744 430342 857523 1191041 1143819 778808 412152 292266 464690 722513 788383
15716 788383 692909 722966 961382 1297810 1627955 1765970 1621729 1432309 1426674 1384073
15706 1384073 1082275 633378 269512 122254 55282 -61710 -199944 -273222 -330483 -386739
15696 -386739 -403544 -325840 -174001 -201497 -568654 -1073262 -1372264 -1351613 -1102018 -747553
15686 -747553 -403504 -230155 -279205 -389905 -402765 -382944 -407681 -408082 -366270 -333789 -325480
15675 -325480 -311656 -258997 -164302 -27541 131943 270943 379052 416788 344352 207150
15665 207150 157085 202051 176617 -77974 -488404 -793285 -851124 -786864 -845479 -1067848 -1278653
15654 -1278653 -1363464 -1300545 -1215876 -1301059 -1532607 -1629790 -1341629 -839706 -480429 -360855
15644 -360855 -422621 -561082 -574368 -441906 -279229 -139945 -94681 -48556 72244 117276
15634 117276 -18853 -218363 -373753 -466934 -503022 -508073 -446355 -324122 -207932 -86356
15624 -86356 76689 203107 287321 462997 741478 1001776 1154579 1234977 1360330 1472618
15614 1472618 1472743 1392614 1285850 1126315 863966 614325 575508 756175 1042798 1255059
15604 1255059 1232670 1105841 1049689 962986 680563 289917 -17469 -187219 -206557 -66359
15594 -66359 134403 260407 322313 481408 849889 1261142 1451233 1302469 894855 522925
15584 522925 340967 236416 163453 162262 200140 176019 84835 88437 294920 579768 691392
15573 691392 560001 322158 47736 -211962 -346754 -262155 -39865 159462 263129 252301
15563 252301 242687 363667 527222 590581 600555 664033 684686 524918 308564 240794 192344
15552 192344 -100283 -672983 -1342901 -1847635 -2017154 -1776373 -1171329 -441212 171813 525420
15542 525420 615789 577774 489203 312807 58399 -231347 -437958 -503748 -516054 -474863 -339083
15531 -339083 -188450 -122214 -101418 -33942 156804 463089 689159 656759 527873 452248
15521 452248 495882 751262 1037556 1018031 594408 -62751 -749771 -1248923 -1366485 -1148831
15511 -1148831 -848965 -740744 -928809 -1244111 -1431749 -1398960 -1262030 -1100519 -887637 -687576
15501 -687576 -604549 -646573 -724348 -716180 -635171 -707853 -1020698 -1265640 -1194501 -821969 -252205
15490 -252205 315055 669376 805209 782135 550257 45215 -554591 -980611 -1130949 -1034792
15480 -1034792 -881551 -738376 -628615 -707919 -1009009 -1389948 -1636297 -1673995 -1607408 -1603234
15470 -1603234 -1680874 -1708065 -1742177 -1791149 -1782416 -1762999 -1679295 -1444730 -1138168 -844192 -552841
15459 -552841 -237149 49145 318397 553087 565993 250070 -200756 -471545 -395176 -46444
15449 -46444 315774 479845 352201 26992 -243057 -326633 -371843 -460435 -478442 -395249 -351654
15438 -351654 -413094 -499516 -490133 -360142 -222916 -223290 -378802 -602691 -794575 -861212 -857779
15427 -857779 -864005 -833586 -787326 -813965 -874523 -816355 -549565 -221587 -179228 -477648 -863905
15416 -863905 -1148752 -1277176 -1289065 -1184218 -1015076 -819337 -578653 -379990 -220809 4087
15406 4087 304867 699600 1132089 1361384 1309834 1084968 796210 550590 336456 180954
15396 180954 169364 293246 555253 888174 1154864 1218037 1084243 948575 924770 1003784
15386 1003784 1161598 1358986 1541749 1678349 1714776 1649360 1475404 1130640 695944 397537
15376 397537 242295 82420 -35073 -3819 44905 -45314 -209893 -368199 -490869 -551194
15366 -551194 -588395 -702951 -836813 -845771 -742739 -637264 -597903 -586596 -505052 -344360 -204256
15355 -204256 -218247 -427228 -686319 -732710 -460004 -108123 9720 -173300 -407235 -482505
15345 -482505 -403723 -260531 -154255 -137634 -213180 -391134 -555192 -436939 17828 478280
15335 478280 713457 775444 703513 504388 310370 292030 356950 226954 -93990 -400111
15325 -400111 -547797 -504580 -388701 -378582 -597022 -908172 -1035496 -911490 -749782 -668201
15315 -668201 -497372 -91276 475987 963464 1171702 1097060 847032 594150 442411 276000
15305 276000 -96038 -656543 -1135934 -1343690 -1312554 -1197967 -1099260 -1025402 -1066179 -1317855
15295 -1317855 -1688249 -2015408 -2223006 -2334076 -2355826 -2312847 -2315893 -2395929 -2435765 -2260497
15285 -2260497 -1920457 -1585307 -1312770 -1115675 -919716 -685441 -399682 -20122 315768
15276 315768 446786 392076 310613 282707 287303 340905 417711 483349 509457 440502 381835
15265 381835 469541 639959 741803 681900 501718 326913 168234 -67053 -339229 -431686
15255 -431686 -261947 -83798 -137789 -369874 -610756 -845469 -1165226 -1464821 -1555564 -1442848
15245 -1442848 -1271248 -1103951 -879387 -641663 -538661 -656914 -991577 -1401657 -1683717
15236 -1683717 -1741891 -1632796 -1410473 -1170827 -1038180 -1001375 -982763 -1010774 -1149706 -1247317
15226 -1247317 -1155828 -970366 -875684 -828535 -705221 -562002 -462845 -427426 -448323 -472606 -510390
15215 -510390 -525554 -393917 -116843 139160 223840 118963 -31905 2443 209528 344721
15205 344721 351540 285406 163350 2171 -136301 -233937 -334119 -414165 -485796 -581558 -666642
15194 -666642 -783100 -964469 -1066388 -1019328 -961932 -972424 -907735 -650954 -359687 -244211
15184 -244211 -289342 -381549 -493075 -625307 -742029 -868910 -980691 -886766 -592618 -271277
15174 -271277 75192 436714 611632 525563 364048 294290 314315 260135 60784 -207571
15164 -207571 -439257 -557480 -571540 -557649 -481072 -365873 -363560 -526382 -753062 -897085
15154 -897085 -883560 -727336 -523228 -328197 -155419 -32947 27444 62971 64633 49673 67175
15143 67175 82013 78473 89947 73098 -45634 -196038 -327124 -506326 -647566 -687534 -773708
15132 -773708 -835664 -776070 -693596 -639866 -637287 -773449 -1038667 -1309153 -1461784 -1481267 -1465208
15121 -1465208 -1481261 -1515882 -1475134 -1269279 -911305 -591573 -491590 -529699 -632680 -866309
15111 -866309 -1216494 -1534557 -1617376 -1318963 -753864 -244820 -33476 -82221 -147304 -162682
15101 -162682 -211047 -248407 -131348 168835 507023 753418 879202 903188 890140 839513
15091 839513 626092 170301 -369353 -780800 -1004494 -1108115 -1184090 -1204544 -1020974 -606899
15081 -606899 -48158 402509 495845 380832 346703 364795 313039 161722 -58985 -255104
15071 -255104 -389608 -493106 -510391 -296058 160892 627498 853382 874788 756864 556990
15061 556990 434136 453763 558429 578087 387675 98125 -56081 -98009 -109505 -64781
15051 -64781 79921 288234 418743 424631 283534 38695 -157154 -243598 -348369 -528234
15041 -528234 -714344 -897689 -993612 -897371 -741402 -675308 -592646 -458608 -400673 -375888 -343358
15030 -343358 -376754 -533720 -722749 -671746 -349629 -55275 29526 -123020 -305807 -296189
15020 -296189 -237037 -280167 -324763 -377889 -512297 -680900 -680838 -398915 1251 363481 632078
15009 632078 760300 770664 781373 795385 661597 306966 -117020 -458715 -660224 -776580
14999 -776580 -905299 -1059807 -1134548 -1088069 -1095297 -1216280 -1305752 -1253182 -1065406 -763373 -307687
14988 -307687 343923 1049864 1629975 1937682 1969151 1923918 2000448 2165569 2253959 2263093 2197719
14977 2197719 2029596 1785288 1426799 974598 576912 319049 282066 482096 750736 869863
14967 869863 698917 343382 -85567 -530068 -905986 -1189339 -1374300 -1427810 -1339198 -1107008
14957 -1107008 -786689 -518107 -403734 -448166 -515236 -505762 -517733 -571458 -524847 -331781 -46242
14946 -46242 237530 495838 684643 740293 719448 658508 505490 220673 -91997 -433777
14936 -433777 -860609 -1247511 -1452033 -1321726 -893758 -517378 -458700 -644902 -817310 -871975
14926 -871975 -918763 -988629 -1091835 -1193022 -1258176 -1370496 -1569082 -1675473 -1579973 -1451542
14916 -1451542 -1434441 -1520493 -1624088 -1708190 -1839080 -1988759 -2001883 -1875838 -1717356 -1534375
14906 -1534375 -1333513 -1069745 -737305 -505339 -378153 -160197 221644 615914 851002
14897 851002 902941 837108 737879 602647 288514 -190857 -613540 -902866 -1066730 -1149816
14887 -1149816 -1186325 -1116165 -979486 -862211 -748230 -690956 -733892 -757870 -572984 -165930
14877 -165930 239455 401172 300394 27353 -390625 -824516 -1062530 -1096111 -1027680 -898951
14867 -898951 -772793 -708229 -727780 -852447 -1011285 -1054498 -933562 -678584 -331675 44010
14857 44010 375188 616858 691104 594608 420389 222559 84633 -20799 -157395 -284065
14847 -284065 -383590 -466429 -499346 -467864 -417042 -270706 27323 341089 491085 406511 152990
14836 152990 -178537 -476719 -596393 -451529 -200659 -75461 11113 252502 507773 543828
14826 543828 277508 -139960 -438277 -506814 -388449 -156627 20867 -49426 -241099 -334470
14816 -334470 -322128 -302333 -294163 -297210 -331856 -295328 -98556 196067 567274 998644 1405793
14805 1405793 1717008 1916322 2004542 1960026 1754821 1332587 758032 259480 -13553 -59053
14795 -59053 68941 235589 240748 99510 -19269 -88783 -224720 -386230 -356431 -82181
14785 -82181 212410 394057 553879 773338 968225 1056560 1044930 959343 853522 804680
14775 804680 760434 591186 326086 40187 -242468 -477942 -536828 -375412 -51448 282878
14765 282878 510967 738119 960520 1072034 1098379 1043238 929157 782975 572068 369776
14755 369776 216071 24606 -179874 -320433 -423209 -523726 -597409 -613881 -507775 -255312
14745 -255312 -2083 72955 -91315 -407242 -629620 -552507 -245361 68276 289246 460789
14735 460789 622863 773644 915704 958673 795502 570279 435693 350516 261485 210747
14725 210747 292474 484076 623922 605607 511856 361947 131692 -22973 50317 160419
14715 160419 41285 -242183 -496286 -594374 -534347 -409158 -294132 -167662 -21380 54573
14705 54573 -27198 -190363 -357354 -537088 -699690 -685034 -397332 28022 368394 506244
14695 506244 502850 450549 429466 470397 636610 938789 1207962 1284089 1162713 977120 706785
14684 706785 306756 -122553 -375874 -354606 -163691 101391 251663 154669 -39123 -272792
14674 -272792 -595050 -930490 -1246681 -1515857 -1658981 -1732949 -1879651 -2073590 -2210940 -2266243
14664 -2266243 -2287440 -2285109 -2239574 -2060727 -1590973 -753469 210839 1011340 1481853 1470165
14654 1470165 1105576 736519 488220 301567 195120 137320 -13814 -280295 -648936 -1089108
14644 -1089108 -1388732 -1474104 -1451320 -1366883 -1190585 -977285 -834020 -796408 -810026 -786630
14634 -786630 -661914 -343908 68243 372135 553733 698714 706899 535215 391710 412916
14624 412916 553279 659466 511592 100441 -406874 -868108 -1218869 -1480720 -1657454 -1757380
14614 -1757380 -1785836 -1698512 -1429130 -1015168 -612598 -351626 -308802 -436611 -465652 -235559
14604 -235559 110892 337948 363650 211204 17391 -42044 60399 287894 626627 1006112
14594 1006112 1294603 1361138 1142077 762375 431663 326609 544323 925173 1155241 1095355
14584 1095355 849189 462872 29492 -286613 -437079 -432379 -371971 -404425 -518788 -544081
14574 -544081 -450198 -264861 51211 411087 655132 729595 695649 674204 657268 560558 431606
14563 431606 396293 481938 563669 558046 475028 400697 460528 558463 547696 532752 607578 607107
14551 607107 313701 -173027 -535984 -591512 -391696 -87717 190353 420530 551643 479363
14541 479363 276081 165363 265790 461280 565979 564541 463726 259314 40065 18850
14531 18850 227829 455907 538211 398945 172423 80948 89924 41899 -94904 -274070 -488903
14520 -488903 -768044 -994425 -1003898 -866655 -781431 -695916 -569135 -528479 -590956 -652817 -617406
14509 -617406 -427431 -71634 340818 601914 626193 506880 397873 375065 392641 383263
14499 383263 368920 380617 311114 81888 -157354 -255198 -259710 -226772 -219138 -362033 -516723
14488 -516723 -542775 -453612 -373404 -429339 -522340 -610668 -804597 -1119579 -1415551 -1574178 -1575081
14477 -1575081 -1499726 -1391025 -1241954 -982349 -519925 -14070 349232 530034 532405 320491
14467 320491 -122010 -675408 -1220325 -1577573 -1563588 -1304834 -1086719 -993070 -992714 -1030017 -1012933
14456 -1012933 -911656 -807067 -703195 -501215 -241318 -137451 -353074 -766876 -1095629
14447 -1095629 -1204061 -1101410 -875922 -639087 -340493 46852 411050 548123 334134
14438 334134 -91424 -472251 -550710 -297122 113983 468608 587551 462358 289547 268172
14428 268172 333632 284098 126113 50340 135922 337307 604855 900647 1130292 1209858
14418 1209858 1141688 1018160 920804 771714 522682 356988 346478 339738 340086 509681 818109
14407 818109 1040144 1149252 1271027 1428034 1514790 1397045 1125957 878182 694680 552535
14397 552535 494042 426117 112463 -393124 -736594 -801605 -771981 -800565 -837803 -783975 -639253
14386 -639253 -397932 -120652 36503 9353 -114969 -206659 -181331 -79784 60757 260524
14376 260524 422135 390785 206822 -1411 -131323 -142082 -121902 -246223 -524686 -771472
14366 -771472 -932087 -1072429 -1189346 -1245380 -1336328 -1488551 -1632313 -1740991 -1748421 -1643980
14356 -1643980 -1530448 -1498379 -1541265 -1550048 -1485278 -1407750 -1323469 -1231358 -1099216 -918426 -738301
14345 -738301 -532962 -321466 -86130 315114 786981 1134818 1270714 1133028 905900 854224
14335 854224 884785 844868 741907 666133 690852 770925 758803 610712 457401 340984 246724
14324 246724 237414 412801 830310 1323919 1604957 1454844 919388 405102 165936 115856
14314 115856 99504 -22584 -319040 -726163 -1042088 -1219326 -1412472 -1728330 -2087881 -2287556
14304 -2287556 -2229340 -1969296 -1603998 -1188591 -764545 -446285 -372136 -441372 -452710 -392992
14294 -392992 -305430 -192190 -115650 -95712 -89497 -90457 -191968 -434058 -735957 -1026739 -1264888
14283 -1264888 -1340303 -1239376 -1085527 -1001748 -1052701 -1173725 -1306377 -1405696 -1419737 -1331690
14273 -1331690 -1109494 -807949 -520040 -267125 25384 337629 560472 624781 589404 533991
14263 533991 434328 269427 117875 111502 241500 417444 693517 1078550 1386632 1561475
14253 1561475 1666747 1626135 1336056 818623 249328 -168333 -401432 -473480 -460785 -505001
14243 -505001 -620582 -695186 -700286 -637122 -443321 -167432 29814 31341 -84418 -112946 41576
14232 41576 305193 510913 532994 312473 6146 -142673 -85961 32459 30487 -65546 -148821
14221 -148821 -197493 -159961 41854 315691 503350 558718 587466 743515 985436 1161291
14211 1161291 1220874 1137292 892579 492907 33602 -335871 -531276 -661535 -790236 -813874
14201 -813874 -693748 -515258 -332612 -69135 329564 748287 943023 769194 365702 100998
14191 100998 236367 547227 673798 445269 -39214 -421347 -469814 -181188 199638 414061
14181 414061 514424 717456 1038947 1269535 1365863 1418115 1315493 980568 551161 191786
14171 191786 -40437 -39537 218739 615556 1001056 1167771 982278 604564 305658 214027
14161 214027 250321 185249 -35304 -278198 -442503 -551909 -661188 -718412 -747479 -842472
14151 -842472 -1058713 -1231775 -1099134 -790117 -583393 -503330 -358490 -41302 362116 711533
14141 711533 890137 907251 830124 642088 304114 -114362 -481634 -727516 -857014 -933981
14131 -933981 -971531 -913077 -791553 -551106 -193630 101346 151993 -122996 -596687 -1110090
14121 -1110090 -1595441 -2002275 -2253722 -2278927 -2197434 -2172465 -2094631 -1731960 -1159971 -686008
14111 -686008 -540094 -661231 -765464 -674354 -442195 -191065 -1267 70276 32547 5926
14101 5926 121032 340044 556312 720518 755630 680094 602157 593179 711559 865993 873472
14090 873472 764215 612530 477819 388229 250285 28098 -294057 -677050 -1051482 -1257421
14080 -1257421 -1199414 -1017465 -876406 -793546 -739409 -726987 -688111 -600479 -600052 -661257 -602427
14069 -602427 -480499 -476941 -537454 -539307 -499156 -486780 -576258 -718835 -797410 -831512 -896756
14058 -896756 -941561 -866746 -852277 -1112136 -1582019 -2141786 -2636165 -2869821 -2753206 -2410384
14048 -2410384 -2021086 -1662671 -1393274 -1249082 -1149268 -947729 -679120 -405779 -142593 40224
14038 40224 140301 146343 65095 10198 22830 9753 -163206 -537699 -985298 -1313116 -1390713
14027 -1390713 -1292611 -1175084 -1034627 -820513 -576343 -349252 -176411 -129366 -196803 -290931
14017 -290931 -299465 -149464 33399 93060 21494 -115709 -343396 -713926 -1138814 -1442995
14007 -1442995 -1576420 -1723985 -1957231 -2044227 -1727551 -1082338 -406925 74338 247048 179209
13997 179209 95526 112120 118483 -46122 -325488 -575145 -749062 -814119 -779527 -753089 -742695
13986 -742695 -734524 -809061 -881050 -828763 -586163 -220679 45168 125579 130233 177098 230446
13975 230446 172232 -74168 -537802 -1092748 -1481167 -1637692 -1658609 -1565418 -1359149 -1106577
13965 -1106577 -927619 -945926 -1128772 -1246042 -1181579 -1119404 -1103582 -892979 -405362 180723
13955 180723 738034 1160462 1276363 1101109 868243 706372 551708 360541 159653 53477
13945 53477 131923 380078 635653 708995 554776 252442 -51743 -210245 -219483 -195576 -224335
13934 -224335 -332477 -464078 -572023 -679187 -839813 -1068280 -1176733 -942245 -519769 -264417
13924 -264417 -248625 -352868 -429885 -323398 18878 383530 465820 189935 -301974 -821508
13914 -821508 -1177525 -1236524 -1138415 -1102405 -1191839 -1373979 -1621616 -1847705 -1927626 -1921705 -1911361
13903 -1911361 -1882307 -1777385 -1552852 -1300570 -1190367 -1321470 -1567881 -1795299 -1993368 -2111499
13893 -2111499 -2122263 -2123536 -2192313 -2186953 -1989772 -1727591 -1513983 -1343492 -1205667 -1181727 -1242210
13882 -1242210 -1194963 -950757 -648456 -417626 -313188 -348575 -357422 -199906 -2630 109011
13872 109011 211793 388495 608890 811271 899564 805416 651229 636802 723892 769736
13862 769736 716918 460346 -48982 -681636 -1134278 -1227744 -1090905 -884360 -689247 -539909
13852 -539909 -478481 -420007 -223327 29198 202917 310228 399469 434776 331514 103036
13842 103036 -89930 -167239 -268746 -401052 -403586 -273688 6290 458669 918509 1242500
13832 1242500 1374971 1327840 1202170 1041144 958466 1096724 1263361 1180503 867346 463664
13822 463664 85807 -197397 -371389 -493118 -665282 -869036 -984967 -1043982 -1164443 -1351392
13812 -1351392 -1428330 -1288833 -1048998 -879094 -831327 -805693 -639393 -269835 110468 209104
13802 209104 94257 -1693 -127472 -452163 -1027273 -1589290 -1809450 -1710435 -1485504 -1300498
13792 -1300498 -1268501 -1340456 -1412452 -1497574 -1546073 -1476957 -1366328 -1347190 -1599701 -2169364 -2775602
13781 -2775602 -3059269 -2955082 -2593940 -2280009 -2149179 -2016689 -1817786 -1647128 -1507357
13772 -1507357 -1328241 -1045418 -663196 -263490 113599 433146 635460 680754 642796 516555
13762 516555 251414 -156655 -634139 -1041228 -1235485 -1048948 -657029 -482559 -593396 -860642
13752 -860642 -1203837 -1398554 -1278275 -976876 -718361 -587531 -524369 -488766 -476095 -531293
13742 -531293 -678659 -866914 -1069918 -1332127 -1556967 -1647763 -1573429 -1400872 -1246620 -1047285
13732 -1047285 -679785 -227138 163232 515459 781172 867394 827287 821056 934617 1072935
13722 1072935 1205531 1326858 1279195 1028595 712658 475694 465503 691013 1025985 1318416
13712 1318416 1418021 1338227 1279586 1374077 1501293 1520304 1444599 1280319 1155294 1191092 1231795
13701 1231795 1220607 1233053 1205585 1032708 585541 -87387 -750440 -1202069 -1416538 -1511615
13691 -1511615 -1554361 -1538035 -1546694 -1617501 -1594645 -1357168 -965285 -618625 -452465 -518410 -768955
13680 -768955 -946834 -873991 -748441 -781227 -872429 -817908 -553153 -206859 157037 572974
13670 572974 873026 923455 839681 751148 678887 565928 370063 92312 -246522 -664819
13660 -664819 -1186120 -1704833 -1949073 -1755322 -1348896 -975319 -669196 -465113 -386588 -246744
13650 -246744 32481 232509 251563 262437 274061 207490 129998 164750 276562 333832 320981
13639 320981 304522 227265 -9475 -391944 -777688 -995894 -933401 -662013 -359568 -123703
13629 -123703 52668 212992 331703 361810 289094 145657 6027 -88669 -127699 -117324
13619 -117324 -40404 106339 207312 179093 144420 110268 -22125 -149434 -212212 -311963 -478615
13608 -478615 -682878 -875259 -1016035 -1132326 -1283469 -1391786 -1324361 -1129795 -944583 -855113
13598 -855113 -843077 -910158 -1060424 -1144505 -1076630 -927203 -614040 -170841 123059 170747
13588 170747 41159 -187381 -460884 -667808 -673111 -566977 -519707 -530967 -585221 -641529 -624810
13577 -624810 -592662 -543132 -330163 94897 563973 927171 1148341 1153941 879798 371882
13567 371882 -134783 -409823 -513979 -548165 -576547 -655859 -719187 -705618 -682093 -754706 -839260
13556 -839260 -764149 -621538 -621575 -794414 -977069 -990099 -799652 -528202 -370708 -342015 -345949
13545 -345949 -399741 -461666 -396121 -103457 229484 388613 419659 370769 229641 135673 220956
13534 220956 448025 642507 687206 681379 721609 861243 975833 833843 469757 103674
13524 103674 -114394 -71269 265404 735379 1029432 938236 617909 296494 79100 24738
13514 24738 82654 110599 72293 -30820 -170077 -237479 -189302 -94566 -16345 24982 83385
13503 83385 198296 287514 235999 157950 131711 134321 94579 -44301 -178806 -286229 -509071
13492 -509071 -817669 -1086902 -1242990 -1211488 -1091469 -1103872 -1337652 -1724072 -2014576 -1963847
13482 -1963847 -1527111 -823870 -35566 633470 1037178 1117153 960750 817413 821474 841105
13472 841105 751937 690628 761188 904195 1072489 1221053 1288328 1302401 1297514 1190114 862304
13461 862304 345816 -239390 -766023 -1162833 -1276016 -1035782 -588012 -132264 86862 -63251
13451 -63251 -413201 -766349 -1058655 -1284565 -1478444 -1588088 -1498968 -1213684 -778912 -257014
13441 -257014 227116 647594 1034117 1270945 1307540 1280084 1215978 959244 497493 65705
13431 65705 -58435 162508 518802 944930 1374970 1566304 1426954 1068158 563081 16545
13421 16545 -435286 -792066 -1060279 -1154910 -1113746 -1082990 -1034582 -854951 -607574 -424366
13411 -424366 -254200 -61067 101853 170039 255208 547415 916602 1030543 807818 402021
13401 402021 -99420 -613081 -1026154 -1264099 -1329557 -1352482 -1352528 -1295583 -1232632 -1243972 -1302054
13390 -1302054 -1337848 -1323752 -1208007 -956611 -625765 -320167 -107535 12367 140229 280030
13380 280030 385584 570044 871394 1213689 1534227 1751437 1815094 1753660 1640560 1576586
13370 1576586 1592715 1681043 1739770 1648718 1490540 1423606 1431141 1414766 1350345 1189281 988811
13359 988811 852378 832543 910512 982872 982616 924718 849528 707147 459793 147992 -201004
13348 -201004 -415404 -297128 51640 254220 71819 -407957 -886622 -1089873 -940135 -606666
13338 -606666 -345462 -285384 -460932 -684088 -876672 -1052410 -1083003 -1004485 -995734 -951247 -782696
13327 -782696 -664231 -683805 -733045 -747468 -714142 -557764 -311476 -138653 -181582 -452513
13317 -452513 -781443 -979213 -1023400 -1080922 -1176805 -1170991 -1061830 -984740 -990601 -980047 -869169
13306 -869169 -644229 -293787 190108 664194 896313 803064 596333 506439 538664 555321
13296 555321 489598 446006 527073 738681 981602 1102327 1098655 1097591 1265959 1635220 2098565
13285 2098565 2516013 2742177 2703074 2539168 2380474 2271229 2227401 2291828 2468173 2686356
13275 2686356 2828436 2767526 2457784 2035165 1669682 1402489 1251641 1120068 980685 951396
13265 951396 1125870 1630047 2379357 3023980 3314400 3230940 2905110 2564518 2402546 2367184
13255 2367184 2269289 2125200 2071699 2097234 2115987 2095639 2093986 2261240 2634863 3020193 3237795
13244 3237795 3272679 3139041 2828912 2501362 2269504 2154335 2215768 2406163 2599564 2775390
13234 2775390 2997936 3222396 3314022 3272481 3175324 3060763 3021465 3162893 3434193 3747970
13224 3747970 4035245 4159688 4090241 3894886 3569678 3171610 2799347 2429190 2048753 1794913
13214 1794913 1789200 1977836 2254441 2601067 3063510 3567180 3939549 4093534 4048431 3861589
13204 3861589 3644475 3552066 3689865 3957712 4175442 4259275 4234674 4057073 3705972 3328938
13194 3328938 3049251 2886721 2821472 2812492 2820450 2815112 2789977 2749167 2691609 2707411 2898876
13183 2898876 3197223 3365694 3301715 3197378 3224535 3355434 3559117 3839166 4018874 3940465
13173 3940465 3786668 3796352 3967300 4123758 4069307 3871868 3795461 3925231 4195130 4485450
13163 4485450 4611837 4538088 4538361 4854857 5346513 5669578 5712186 5574909 5400995 5335810
13153 5335810 5298707 5215276 5229329 5291157 5149051 4794036 4392790 4103062 4034098 4096863
13143 4096863 4221449 4500869 4945157 5395704 5719698 5852756 5799609 5855899 6272919 6843089
13133 6843089 7213853 7249080 7049119 6752475 6402820 6016351 5600145 5240999 5080536 5200441
13123 5200441 5671539 6452829 7326021 8054980 8470726 8574741 8418675 8102038 7837576
13114 7837576 7761339 7885108 8126594 8370002 8567271 8743317 8887022 9012122 9133759 9303681
13104 9303681 9473897 9483342 9383434 9348522 9480525 9733113 9966514 10196284 10477712 10607903
13094 10607903 10472718 10288006 10232290 10309367 10414623 10472920 10523514 10674381 11037161 11643485
13084 11643485 12286614 12768700 13054824 13177770 13191137 13101224 13047317 13217770 13609382 14030723
13074 14030723 14344857 14550808 14641015 14662844 14768905 14919826 14957311 14916281 14917462 15018989
13064 15018989 15147991 15247526 15298726 15343253 15561722 15903251 16204611 16428252 16632622 16981169
13054 16981169 17541455 18059418 18316945 18370824 18364383 18453711 18630709 18768938 18871592 19078381
13044 19078381 19438337 19851008 20263465 20658055 20990209 21319435 21738773 22232707 22790793
13035 22790793 23433374 24022966 24456967 24861688 25324951 25744386 26089239 26431460 26775376
13026 26775376 27185913 27747058 28399858 29030476 29587349 30089793 30602860 31259772 32082085
13017 32082085 32945942 33726027 34377875 34964084 35547309 36195751 37082067 38121100 39161608
13008 39161608 40308574 41547763 42696504 43728606 44703528 45684644 46757664 47956261
13000 47956261 49262193 50574689 51731439 52747413 53805153 55080748 56688215 58682782
12992 58682782 61069934 63670206 66318466 68979364 71671342 74419280 77243576 80295755
12984 80295755 83667221 87381388 91613175 96517862 102149731 108499151 115614229 123750786
12976 123750786 133254675 144408127 157450936 172640499 190319934 211286249 236653706
12969 236653706 267430053 304316990 347252465 394681191 442183741 481333185 501082263
12962 501082263 493491057 460044345 410868131 357639953 308172858 265684378 230368003
12955 230368003 201262525 177307085 157465753 140837451 126910687 115408394 105943680
12948 105943680 98027669 91197709 85178981 79980402 75563588 71689606 68157387 64897421
12940 64897421 62062773 59806533 57949395 56323023 54984860 53923906 53081720 52513448
12932 52513448 52270388 52199153 52111289 51941960 51683636 51329547 50967111 50795601 50944167 51328084
12922 51328084 51743203 52000786 52162302 52515897 53078534 53678619 54270113 54950167 55893816
12913 55893816 57209568 58897403 60966615 63340867 65753177 68049266 70338410 72733298
12905 72733298 75101148 77229589 79021519 80524359 81973770 83603359 85534748 87850526
12897 87850526 90644316 93984187 97850814 102295437 107375359 113160606 119891791 127812445
12889 127812445 136974397 147546087 160016524 175008906 193230730 215378416 242208518
12882 242208518 274541100 313074256 357751603 406546300 454028027 490618769 504931740
12875 504931740 490413198 450977492 398387428 344227662 295226377 253776905 219824034
12868 219824034 192258814 169804365 151283152 135828524 122870839 111839606 102378676
12861 102378676 94334009 87336525 81090260 75631112 71013197 67088484 63596088 60455656
12853 60455656 57787257 55602045 53728105 51934145 50232886 48801713 47587930 46504914
12845 46504914 45623229 44972886 44512572 44202612 43983336 43865766 43889671 43995271 44149889
12836 44149889 44436756 44825041 45256105 45737045 46261119 46874950 47545238 48173784 48814164
12827 48814164 49610376 50585996 51634804 52689309 53688990 54573762 55366721 56365665 57746194
12818 57746194 59295823 60914514 62660560 64617132 66960892 69698948 72695989 75865054
12810 75865054 79193793 82797059 86867760 91564527 97024952 103328240 110517055 118694332
12802 118694332 128113735 139135277 152238239 167968171 186944284 210016255 238022216
12795 238022216 271646759 311255425 356294099 404179207 448771177 480095593 487692028
12788 487692028 467347452 424911068 372103880 319290845 272073432 232098134 198969836
12781 198969836 171721008 149453923 131220323 115973834 102847705 91470599 81759306
12774 81759306 73445113 66133712 59650909 54015778 49124787 44922133 41354590 38259504
12766 38259504 35544787 33112590 30911240 28967933 27339712 26054123 24914103 23774276
12758 23774276 22702825 21715951 20818073 19938336 18921703 17583137 16001078 14580125
12750 14580125 13563632 12861483 12252536 11706781 11313473 11051646 10771881 10328651 9779287
12741 9779287 9340861 9074692 8853575 8579199 8187146 7718200 7377820 7229233 7192657 7162649
12731 7162649 6929950 6430084 5894143 5489967 5179960 4927574 4728616 4645555 4746599 4928056
12721 4928056 5017038 5013624 5003682 5014852 5026772 5036924 5153672 5371719 5555306 5629105 5569712
12710 5569712 5424139 5149749 4661404 4189532 3895920 3572458 3154472 2871266 2794587 2814142
12700 2814142 2928324 3039230 3023547 2930692 2887302 2955405 3079824 3194296 3314542 3411562
12690 3411562 3362171 3182841 2980120 2744636 2479890 2309537 2195278 2019869 1956353 2139542
12680 2139542 2320282 2279851 2111181 2035447 2166461 2354801 2367867 2171916 1924065 1737980
12670 1737980 1620418 1561109 1458058 1200282 823797 502676 417329 490996 464358 280278
12660 280278 161739 349726 802451 1321499 1788509 2105667 2220787 2269220 2335234 2382151
12650 2382151 2444924 2610429 2752348 2658347 2393201 2142352 1905401 1694283 1703644 1938391
12640 1938391 2151709 2272800 2420470 2710110 3125696 3449877 3541617 3570887 3717047 3867099
12630 3867099 3845593 3632292 3275486 2794254 2249555 1832260 1693504 1754174 1901950 2136417
12620 2136417 2403166 2568348 2597803 2499620 2350142 2285240 2308224 2393971 2453686 2301859
12610 2301859 1947753 1669981 1533282 1457655 1508576 1675888 1909754 2194130 2415481 2400241
12600 2400241 2190393 2069937 2151683 2299671 2388928 2399187 2370314 2360791 2423319 2506215 2437310
12589 2437310 2161975 1844128 1610275 1526031 1583413 1666031 1693031 1636881 1606475 1727189
12579 1727189 1955128 2103787 2006327 1670084 1187859 675999 228763 -107440 -208106 -62586
12569 -62586 174189 419466 624163 798520 1037581 1304579 1531900 1716340 1812569 1851930
12559 1851930 1889490 1818737 1534718 1148587 820493 639493 681611 914646 1182898 1276265
12549 1276265 1118619 839034 582823 352060 114630 -66683 -90596 -12567 21386 -9852
12539 -9852 -44625 -107368 -268630 -473048 -579586 -451019 -142936 238397 520481 507395
12529 507395 302013 112824 29417 -49640 -157004 -215259 -173880 14055 287869 514263
12519 514263 633969 771368 1004184 1280897 1533088 1668804 1595092 1351494 1072335 809212
12509 809212 613078 516566 470170 459818 404639 291460 232639 292730 511172 846106 1138674
12498 1138674 1266667 1200155 1036197 893376 811385 713031 575812 577089 738059 866367
12488 866367 904397 918374 945256 936963 835210 651094 500077 440649 388196 269784 121894
12477 121894 70373 165787 377284 534070 453635 137026 -299552 -677048 -846301 -783222
12467 -783222 -654949 -603262 -627681 -758005 -915164 -949326 -902566 -861903 -846897 -802901 -758647
12456 -758647 -797273 -911319 -1079580 -1340271 -1610126 -1690057 -1587528 -1403127 -1024986 -491089
12446 -491089 -53073 198467 336238 452618 610158 775412 923093 1136441 1413091 1668771
12436 1668771 1861989 1908084 1805846 1630838 1452260 1330826 1225444 1069159 903782 842879
12426 842879 897354 971888 868035 526009 67252 -351667 -571048 -566746 -431826 -244173
12416 -244173 -41321 231608 551565 732386 727374 586338 309202 -37371 -308332 -428149
12406 -428149 -435001 -402530 -257181 129102 551327 751167 721111 467453 82242 -219163
12396 -219163 -332441 -274596 -169541 -150297 -173855 -135196 -7247 189278 378106 462654
12386 462654 433298 344505 214282 108360 67684 -5866 -58307 47663 245421 352064
12376 352064 343339 248238 -22193 -444190 -765474 -837735 -785420 -825252 -1043846 -1297232 -1396962
12365 -1396962 -1263962 -861308 -232413 462688 1095297 1537043 1625966 1346782 849871 340777
12355 340777 -61374 -333136 -430828 -367789 -207701 -38140 -553 -109603 -228500 -232687
12345 -232687 -42274 258625 528096 751024 965214 1118918 1304539 1586225 1813042 1919158
12335 1919158 1964044 1847280 1397345 723958 131905 -195459 -257363 -191292 -155796 -212919
12325 -212919 -339574 -447989 -549464 -711706 -877396 -946171 -927888 -898268 -718168 -291778
12315 -291778 197090 578516 793929 886255 969133 1085965 1103825 822763 292603 -99581
12305 -99581 -44944 332485 752751 997374 904976 507975 33141 -274673 -412868 -465381
12295 -465381 -365012 -186945 -129727 -299630 -625119 -921903 -1075118 -1118755 -1013118 -747800
12285 -747800 -359606 231369 890355 1273294 1287792 1200528 1233395 1396708 1576420 1691476
12275 1691476 1675625 1531298 1394939 1232692 879030 389359 -39015 -293514 -287476 -64603
12265 -64603 141101 173563 60231 -137315 -314569 -351987 -206758 29165 316837 734739
12255 734739 1253591 1670612 1794229 1658031 1467383 1323579 1145718 836094 346779 -236403
12245 -236403 -766734 -1104544 -1128826 -972551 -960964 -1207947 -1546551 -1757120 -1764361 -1573043
12235 -1573043 -1282867 -1041008 -815325 -531282 -272394 -129928 -148154 -282881 -397264 -453611
12225 -453611 -526758 -618627 -635603 -607683 -666460 -790309 -874087 -850585 -614436 -161266 267158
12214 267158 506288 659205 982886 1429293 1723502 1765088 1607516 1311180 935208 591213
12204 591213 334930 139227 5114 18543 269456 753264 1360589 1869030 2086955 2069710
12194 2069710 1945979 1743383 1433461 1112190 954442 950898 949231 917531 881744 862896 861599
12183 861599 847101 797966 669085 509460 388112 277043 222772 192455 88970 -10296
12173 -10296 30599 245069 543741 860020 1223997 1549229 1656482 1492468 1149577 769045
12163 769045 498672 373493 389183 444142 373737 273978 296051 382604 402071 397658 540736
12152 540736 785995 951928 1010907 1014931 1016656 1015657 970107 776709 532965 433899 507764
12141 507764 741494 1025813 1185482 1155441 1125854 1191724 1175596 1081861 1036311 1011827 978844
12130 978844 998809 1084666 1173746 1241812 1327577 1416948 1462625 1454073 1375003 1236518 1110435
12119 1110435 993479 841587 690913 687690 955162 1447227 1920336 2225977 2436495 2676281
12109 2676281 2929432 3122473 3297604 3474039 3601809 3587876 3306051 2802408 2308353 1870316
12099 1870316 1377745 859084 501649 374986 320100 149718 -139683 -322397 -279553 -63704
12089 -63704 176538 368627 559815 776814 1003455 1166500 1190799 1160149 1282055 1549939
12079 1549939 1850253 2181126 2507589 2752306 2833163 2755836 2635337 2492629 2260100 1977425
12069 1977425 1700956 1475269 1384694 1391942 1384945 1268698 1108232 1027021 938421 820572 896589
12058 896589 1164357 1388798 1487832 1460852 1313081 1114111 919548 702719 548652 556744
12048 556744 611561 685053 866200 1046395 1057972 925202 696691 492967 520449 741408
12038 741408 911126 933085 892969 899357 1020387 1210422 1465423 1837224 2196074 2305507
12028 2305507 2097247 1765624 1460145 1179485 893812 656566 584535 696509 820669 811361
12018 811361 713466 647911 636374 559846 333830 -7178 -404869 -817607 -1143673 -1243890
12008 -1243890 -1097062 -783837 -391788 -85174 -22175 -107312 -105650 50361 324238 692942
11998 692942 951404 940966 723317 507419 483100 609982 734726 774726 674386 500104
11988 500104 358842 212645 20964 -101121 29902 354574 573554 562969 450714 439584
11978 439584 592681 713094 618325 315218 -35631 -233992 -151284 77288 223511 288392
11968 288392 431602 710122 1048243 1345318 1442729 1259682 907348 600739 501159 582581
11958 582581 635023 646685 809248 1118080 1443740 1683483 1832136 2001750 2256711 2507209
11948 2507209 2681720 2899596 3297093 3847906 4313821 4440131 4300451 4158085 4065072 3968653
11938 3968653 3904374 3908398 4025366 4216820 4401984 4603467 4808253 4829803 4620642 4383982
11928 4383982 4287063 4370177 4550906 4764053 5068512 5428938 5621970 5589404 5586836 5816117
11918 5816117 6211488 6616551 6984630 7376673 7729957 7889678 7767386 7370144 6908658
11909 6908658 6616007 6630156 6884995 7130543 7217358 7108566 6825297 6518834 6432071 6702090
11899 6702090 7246835 7879734 8366939 8618315 8854112 9182969 9452036 9616324 9715802 9747127
11889 9747127 9731908 9807476 10047558 10377435 10729791 11097010 11501724 11978767 12543503 13237749
11879 13237749 14129566 15214788 16469352 17824879 19341462 21225842 23463400 25974153
11871 25974153 28862219 32232790 36195217 40880314 46249332 52029570 57564692 61823523
11863 61823523 63877668 63692121 62166992 60423185 58937621 57289813 54770466 50916922
11855 50916922 45815050 40205633 34947577 30470142 26758762 23564436 20746534 18381721
11847 18381721 16570425 15203045 14008153 12791315 11605174 10565533 9714181 9157547
11839 9157547 8865716 8649869 8476234 8410504 8416819 8442495 8452076 8488757 8643786 8825778 8954922
11828 8954922 9102138 9269798 9402933 9413935 9283159 9104421 8880043 8638760 8453872 8358079
11818 8358079 8417004 8498259 8386099 8117020 7899746 7909149 8213592 8706332 9180138 9548062
11808 9548062 9818244 10031219 10257760 10429164 10525701 10700194 10992081 11366351 11800454 12207706
11798 12207706 12478797 12582503 12549769 12484143 12442966 12345765 12227426 12298841 12742425 13546328
11788 13546328 14492859 15401462 16280560 17144555 17958184 18753164 19602405 20484677 21390024
11779 21390024 22270261 23075979 23983430 25219658 26843212 28748713 30897593 33372967
11771 33372967 36207743 39483645 43431376 48258371 54227847 61492673 69967948 79596119
11763 79596119 90902570 104353119 119187918 133182329 142732001 144066496 136012458
11756 136012458 121167714 103854997 87559600 73798312 62577877 53370584 45769043
11749 45769043 39540002 34461076 30236677 26629241 23560395 20927634 18679292 16762276
11741 16762276 15097716 13694590 12466954 11221153 9966579 8929162 8268467 7885086
11733 7885086 7556664 7131017 6678550 6291759 5895950 5443034 5091731 4984806 4966092 4902075
11723 4902075 4866149 4901252 4975443 5023594 4925790 4726117 4480328 4111025 3742967 3470011
11713 3470011 3194359 2871269 2505458 2146786 1884579 1816204 1994942 2327483 2658218 2932539
11703 2932539 3083173 3011474 2731513 2355375 1977099 1646723 1424908 1372043 1512792 1748309
11693 1748309 1863955 1683091 1286516 928337 681053 483043 394760 458804 528952 474037
11683 474037 302785 61306 -270586 -594848 -726070 -757032 -827274 -842464 -687770 -526914
11673 -526914 -510168 -478624 -282062 76785 592564 1165893 1585952 1652291 1354624 784672
11663 784672 139731 -213391 -170955 -53721 -73104 -45073 147011 409137 594520 667632
11653 667632 755169 980749 1344102 1734375 2020858 2118032 2108661 2029088 1792566 1487084
11643 1487084 1238151 995572 709183 388528 148779 107935 149019 150112 123813 76542
11633 76542 -1434 -115640 -250121 -314797 -276344 -227194 -237677 -261985 -231203 -116578 157374
11622 157374 562807 939550 1134399 1099264 1020928 1022584 1033173 939777 784024 688747 633703
11611 633703 540896 389816 144442 -124489 -356127 -508680 -417663 -71437 298033 542068
11601 542068 653189 623619 535016 563189 683924 615596 264921 -208477 -761901 -1267237
11591 -1267237 -1535174 -1510735 -1258059 -958345 -733373 -576972 -525549 -660560 -881868 -1025636
11581 -1025636 -1068903 -1016004 -872961 -695855 -477155 -234655 -37924 24589 -76943 -235274
11571 -235274 -395868 -576068 -653208 -506478 -218834 -4903 -46246 -296208 -586158 -800442
11561 -800442 -937408 -1056661 -1087333 -890394 -422281 73212 311789 317591 225964 117327
11551 117327 -28537 -276242 -605579 -909049 -1116927 -1200836 -1157931 -1063634 -995275 -903005
11541 -903005 -710426 -542679 -543487 -659258 -751334 -761371 -677249 -514953 -363576 -316567 -355392
11530 -355392 -415237 -461210 -517241 -641269 -852481 -1062814 -1121801 -1072579 -1022279 -1009688 -1089142
11519 -1089142 -1251261 -1418434 -1470002 -1296287 -957851 -629213 -400310 -270725 -225567 -246863
11509 -246863 -277155 -256095 -241917 -283152 -401214 -617144 -866455 -1122913 -1419488 -1681669
11499 -1681669 -1702059 -1369808 -782774 -229385 59195 154114 182791 112632 31811 64126
11489 64126 179109 314233 419988 455308 480251 542894 559627 486524 387536 308886 230556
11478 230556 71701 -205793 -444870 -430628 -233205 -163475 -266973 -327386 -236154 -88452
11468 -88452 2825 18005 16268 129876 450662 1024115 1681587 2213633 2573098 2732104
11458 2732104 2701599 2533158 2289000 1963363 1503753 956371 450289 15253 -317479 -458417
11448 -458417 -435148 -320978 -176996 26435 294635 478572 558950 688772 945024 1220881
11438 1220881 1405820 1416524 1214629 877491 535059 280620 146889 207024 398342 545865
11428 545865 607362 657284 773765 1000958 1324612 1792707 2400715 3050782 3706902 4391809
11418 4391809 5103032 5656975 5668341 5036058 4165719 3423983 2856097 2430721 2175909 2073780
11408 2073780 2060303 2061778 1962890 1738757 1438558 1025941 630859 495692 536425 551260
11398 551260 538369 442697 230931 -13485 -199921 -299209 -379261 -493400 -658838 -874899
11388 -874899 -1127801 -1422807 -1643174 -1713001 -1576672 -1199603 -723013 -321665 -64075 -13365
11378 -13365 -114300 -130352 -31031 47376 103987 220498 485676 830613 1078289 1067598 769488
11367 769488 336914 -14073 -170253 -191882 -162250 -120565 -89269 -125316 -231834 -284022 -213611
11356 -213611 -97523 -38250 41037 355336 945470 1573590 1976440 1965022 1520512 834945
11346 834945 76786 -630588 -1125522 -1361628 -1327900 -1083795 -954132 -1199434 -1653304 -1989254
11336 -1989254 -2123282 -2095234 -1946749 -1755744 -1509302 -1206574 -1036898 -1088334 -1230983 -1301219
11326 -1301219 -1238954 -1053815 -770518 -408952 35683 556980 1130902 1590962 1751707 1647134
11316 1647134 1437584 1184011 919823 701166 541082 484770 526755 652991 883260 1164154
11306 1164154 1405786 1473850 1356387 1188602 1107176 1135756 1141988 968509 657915 428362
11296 428362 349811 375891 470221 595651 690271 734702 754208 850279 1030626 1100986 970204
11285 970204 718577 476787 337429 296753 311993 307399 183405 -45468 -293940 -542469
11275 -542469 -764903 -834819 -732572 -654200 -691034 -758637 -814317 -797854 -745641 -791761 -885635
11264 -885635 -855143 -644006 -419430 -345565 -363456 -355381 -337929 -367416 -465500 -552645 -565478
11253 -565478 -656247 -910868 -1184917 -1232488 -870177 -212027 398184 728136 729055 482872
11243 482872 289923 193466 62362 -17563 101974 402609 678339 821763 931168 1033849
11233 1033849 1046803 945841 752237 494485 298826 276063 316322 277653 136739 -20958
11223 -20958 28795 383082 937734 1512854 1978043 2259604 2439312 2693692 3007628 3288871
11213 3288871 3622930 4035982 4343641 4337267 3868304 2987769 2051612 1379582 1022692 873853
11203 873853 745147 641061 663360 734404 806536 912051 1032368 1136530 1224396 1272774
11193 1272774 1219466 1085173 936722 774680 645915 612882 605494 557180 530003 614930 724743
11182 724743 693075 564733 537384 682621 891280 981265 902934 770486 640558 467263
11172 467263 233889 -9726 -260469 -585751 -987269 -1338737 -1450234 -1267513 -949080 -703634
11162 -703634 -635709 -718399 -903206 -1216234 -1621742 -1921353 -2050641 -2091236 -2056324 -1861334
11152 -1861334 -1489515 -1048345 -664136 -362165 -247254 -358622 -532831 -668016 -692251 -539781
11142 -539781 -272770 23258 302893 508643 571551 573304 613692 667977 721814 785730 865798
11131 865798 845204 572746 150494 -202889 -387705 -488999 -645099 -840663 -956857 -926936
11121 -926936 -853965 -859540 -978640 -1151439 -1294833 -1436701 -1551533 -1502433 -1300653 -1059706
11111 -1059706 -841183 -629036 -516950 -581971 -744570 -877423 -872897 -741497 -555525 -271620
11101 -271620 122277 424606 404950 47445 -397926 -627145 -591071 -454506 -394124 -391029
11091 -391029 -280168 -16873 261141 469600 675852 912558 1030645 979868 884299 793696
11081 793696 767910 817204 877521 1012957 1295343 1660223 1956497 2104296 2101578 1881712
11071 1881712 1451644 923957 417760 34055 -259307 -504102 -592068 -496868 -395208 -464166
11061 -464166 -745993 -1006350 -973952 -678614 -312587 5114 203269 258222 186873 28762
11051 28762 -203095 -450728 -626250 -604260 -324401 5707 147906 86415 -34181 -68221
11041 -68221 97436 492522 902514 1078829 985106 742123 527941 424321 414656 365464
11031 365464 176854 -6034 -36782 4157 65716 95491 -74407 -368004 -507089 -334993
11021 -334993 160148 841851 1419884 1645531 1487170 1019039 482714 184099 142213 81019
11011 81019 -246460 -726203 -1130771 -1344125 -1259545 -916453 -577772 -411539 -217487 167411
11001 167411 510701 651989 666409 641083 561951 438852 361880 284932 95817 -117146
10991 -117146 -183346 -104841 -22451 -144021 -535226 -939401 -1047342 -850489 -607467 -568495
10981 -568495 -751892 -1056076 -1299853 -1364297 -1398750 -1635432 -2023713 -2258908 -2150349 -1795981
10971 -1795981 -1452850 -1227603 -1106748 -1067990 -991346 -815141 -516328 -121957 195560 276280
10961 276280 186627 164459 281592 403891 538392 894627 1429793 1741946 1606839 1209028
10951 1209028 836016 583168 446466 324897 170979 25855 -141990 -229663 -177059 -136785
10941 -136785 -189337 -296185 -519079 -822799 -1125439 -1437461 -1746580 -1985287 -2106890 -2049984
10931 -2049984 -1907963 -1817576 -1777102 -1777203 -1832225 -1854023 -1647708 -1201820 -821962 -747411 -882187
10920 -882187 -1097752 -1408856 -1759171 -1989409 -1965764 -1708401 -1298804 -844406 -492648 -281638
10910 -281638 -183092 -137686 -160413 -263441 -324613 -222653 -72605 -36175 -44387 9264 17478
10899 17478 -52197 -156905 -273730 -315989 -292635 -252046 -183453 -95614 82330 495415 1039587
10888 1039587 1422091 1475744 1274277 1015263 776860 588407 456843 368883 260297 114355
10878 114355 45088 43085 46028 55762 70970 123024 269575 388405 318811 178489 68912
10867 68912 -39200 -36748 214462 619846 980101 1235487 1441230 1667550 1846230 1842968
10857 1842968 1683880 1447529 1271137 1251844 1266020 1150536 826082 362603 29858 -51778
10847 -51778 -51530 -51462 -41248 -36950 -47656 -33779 -8687 -107880 -295667 -442557 -560817 -748890
10835 -748890 -970444 -1099453 -1106659 -1033773 -918061 -808453 -749212 -684161 -523174 -199291
10825 -199291 189053 469154 552832 504182 397662 151089 -216606 -527044 -684733 -637245
10815 -637245 -397505 -160467 -78314 -143752 -290509 -405890 -394247 -336240 -351287 -459634
10805 -459634 -591934 -712620 -852062 -1047049 -1275752 -1484117 -1659455 -1850228 -2071017 -2142929
10795 -2142929 -1944016 -1522333 -985284 -514071 -248865 -168418 -236645 -425928 -681719 -931929
10785 -931929 -1018592 -883666 -712979 -634454 -516269 -248723 18923 71794 -197388 -746272
10775 -746272 -1269620 -1429808 -1255612 -1036022 -943796 -990477 -1043467 -984715 -860978 -769825
10765 -769825 -684224 -575001 -437464 -292884 -184143 -83306 -6115 -28519 -158804 -288296
10755 -288296 -285118 -4977 433858 668539 492852 49445 -396062 -717586 -864620 -862828
10745 -862828 -694971 -307794 171513 494506 530167 358078 178523 154444 237445 250532
10735 250532 171944 102888 13413 -143974 -333718 -528758 -820887 -1150160 -1143095 -699755
10725 -699755 -158811 148524 156985 29440 -20698 -43611 -205434 -480429 -760699 -959810
10715 -959810 -956699 -747819 -610906 -688711 -823685 -912116 -1021765 -1108221 -993384 -614542
10705 -614542 -187181 -18896 -115799 -238857 -304449 -352055 -352040 -375614 -442779 -451256 -339080
10694 -339080 -161066 36747 352585 795824 1189047 1375954 1344869 1106341 700998 251133
10684 251133 -100908 -341145 -498588 -493780 -345709 -214206 -250073 -529278 -986893 -1453718
10674 -1453718 -1855766 -2113581 -2114784 -1833404 -1375038 -959306 -656217 -382646 -123337 43748
10664 43748 121527 246192 465861 667219 803622 971275 1132361 1176883 1177809 1190399 1079307
10653 1079307 808164 487785 242126 149855 146540 99784 -45223 -174583 -130766 -10691
10643 -10691 30075 -1859 -66867 -261724 -603636 -825117 -822312 -758521 -742644 -770646 -822403
10632 -822403 -838183 -834008 -852632 -891023 -917625 -857980 -661242 -375033 -159926 -119152 -265585
10621 -265585 -546163 -882830 -1231168 -1467497 -1467305 -1324087 -1152344 -878806 -540449 -390440
10611 -390440 -524092 -784819 -1044883 -1247808 -1366424 -1545147 -1806801 -1984319 -2046963 -2079622
10601 -2079622 -2101018 -1991474 -1620008 -1096587 -691721 -574224 -668167 -699342 -540929 -319530
10591 -319530 -130946 33165 102209 22872 -93734 -156438 -222038 -338333 -536834 -813231
10581 -813231 -1040880 -1124857 -1056579 -809332 -462982 -251436 -270868 -408934 -467781 -366450
10571 -366450 -220668 -71253 174638 447764 562711 528522 457811 364865 329466 449821
10561 449821 662876 864126 1032721 1187828 1229486 1087861 882626 673287 407133 101649
10551 101649 -97770 -80600 111577 372297 499193 308235 -164662 -717565 -1106964 -1200819
10541 -1200819 -1071710 -870093 -644162 -408644 -206865 6465 180229 227002 154757 11062
10531 11062 -86381 -124384 -137417 -73784 86538 242118 260849 160707 114802 259442 552890
10520 552890 796506 846316 680253 286395 -160022 -440415 -516333 -542650 -702051 -993054
10510 -993054 -1270726 -1418279 -1456313 -1419605 -1278714 -1109151 -906309 -584336 -239648 -43779
10500 -43779 -61513 -200418 -291174 -262727 -166772 -60776 57349 162185 191724 230326 331021
10489 331021 376904 278763 39642 -258780 -492168 -675441 -892128 -1040897 -1036919 -995809
10479 -995809 -989997 -993811 -925595 -776997 -646336 -497437 -242187 43349 236115 215328 -79037
10468 -79037 -554687 -1072145 -1416008 -1421290 -1268314 -1249536 -1367882 -1438725 -1422719 -1437896 -1458178
10457 -1458178 -1347024 -1093362 -843155 -692203 -635424 -526171 -372929 -407268 -635035 -766476
10447 -766476 -646991 -394233 -104259 127078 147248 -17174 -293066 -613003 -797671 -680684
10437 -680684 -316250 145100 577940 774904 716821 584273 502421 544290 773860 1100916
10427 1100916 1251333 1120275 802868 418041 78707 -166215 -347098 -567550 -852303
10418 -852303 -1069709 -1103050 -977956 -853613 -756682 -552626 -212496 166035 475041 667806
10408 667806 740168 724589 623853 337276 -76317 -428229 -653875 -831141 -1018881 -1195681
10398 -1195681 -1350826 -1475614 -1512937 -1402917 -1155645 -850750 -585499 -375239 -149109 73157
10388 73157 153662 -4664 -377658 -750676 -938094 -941898 -833072 -713812 -722962 -875148 -1027362
10377 -1027362 -1077852 -1125974 -1115773 -955145 -787830 -758646 -825420 -868191 -832584 -687062 -450744
10366 -450744 -293007 -356126 -526873 -539748 -331791 -17262 306718 479576 406178 175057
10356 175057 -83144 -367809 -746851 -1107651 -1331573 -1426933 -1532867 -1681295 -1749967 -1791171
10346 -1791171 -1789917 -1532171 -1011851 -473785 -187939 -162475 -205317 -151811 103838 435890
10336 435890 575622 385832 -75794 -669410 -1275803 -1795989 -2180744 -2342628 -2242693 -1992108
10326 -1992108 -1756182 -1653588 -1612817 -1504065 -1351463 -1216180 -982462 -562430 -74316 244079
10316 244079 264303 91098 -126908 -308643 -460763 -594548 -667881 -715207 -774918 -871147
10306 -871147 -999273 -1087383 -1113591 -1202921 -1445854 -1742585 -1944935 -2061757 -2153356 -2166533
10296 -2166533 -2009389 -1678621 -1259522 -906493 -710793 -693358 -867564 -1089916 -1195503 -1132011
10286 -1132011 -868006 -547405 -442700 -526914 -750359 -1060634 -1130422 -877326 -455968 30147
10276 30147 441533 650585 628184 459448 283591 161300 -24296 -358227 -765622 -1158885
10266 -1158885 -1461930 -1598431 -1597232 -1585858 -1699223 -1830043 -1790674 -1569053 -1348856 -1292407
10256 -1292407 -1351974 -1334877 -1188184 -949197 -663742 -376028 -90206 138034 173677 -19718
10246 -19718 -310662 -588730 -696348 -529141 -158159 270378 539106 552965 481264 505982
10236 505982 684330 930083 1159657 1331589 1375885 1237342 1019796 910317 955056 983855
10226 983855 831195 542212 259122 13279 -130508 -81100 28488 28195 -1740 47100 60990
10215 60990 -72293 -295995 -518666 -682411 -732634 -707117 -722710 -762524 -653936 -295886
10205 -295886 183454 548211 658911 599690 481518 297492 54891 -126517 -223719 -291955
10195 -291955 -275105 -198194 -191974 -316804 -438981 -416971 -286855 -166765 -107618 -91891 -77443
10184 -77443 -46891 -114868 -295935 -350901 -237309 -198933 -341401 -531549 -617999 -586498 -552612
10173 -552612 -533390 -425291 -277480 -232384 -242977 -201616 -129955 -71604 104989 431794 784769
10162 784769 1040195 1163900 1165887 1142723 1253843 1494678 1668248 1633184 1475053 1326437
10152 1326437 1291968 1393230 1557528 1706953 1847003 2034050 2271213 2514456 2698181 2715183
10142 2715183 2633345 2627740 2801489 3154343 3464698 3471268 3209526 2934273 2785408 2748393
10132 2748393 2746196 2655210 2448304 2329355 2423061 2638920 2827874 2882145 2812184 2677947
10122 2677947 2572272 2548084 2652511 2849569 2958073 2921838 2871866 2994800 3342254 3791558
10112 3791558 4270805 4822004 5381685 5784139 6031395 6286104 6669237 7224354 7866248
10103 7866248 8399801 8673124 8604645 8273737 7964641 7838290 7747608 7497649 7007505 6363649
10093 6363649 5758612 5365578 5160113 5009624 4718281 4162409 3534847 3162196 3051590
10084 3051590 2956264 2762060 2530115 2307289 1994470 1580153 1232098 937642 606297 387069
10074 387069 364741 373058 270420 81566 -44021 8711 227669 572129 996820 1403463
10064 1403463 1737412 2020092 2259169 2411112 2412995 2286544 2150582 2052395 1989858 2026711
10054 2026711 2227683 2502827 2717949 2930158 3186524 3358266 3365446 3238957 3079614 2964105
10044 2964105 2863684 2645248 2279223 1942283 1700857 1442308 1201050 1179682 1448570 1893835
10034 1893835 2392500 2763013 2891200 2843817 2682266 2401348 2014637 1558092 1133966 900537
10024 900537 992118 1328304 1702066 1996711 2189334 2257730 2156073 1908609 1629106 1478811
10014 1478811 1533745 1679680 1748301 1722149 1674314 1642236 1586975 1564471 1785840 2276585 2775858
10003 2775858 3173304 3477625 3823567 4373915 5002965 5540330 6011099 6466677 6961372
9994 6961372 7508860 7997426 8356865 8680799 9033453 9431144 9944062 10635800 11547488 12667046
9984 12667046 13810668 14789476 15633364 16443309 17138508 17472135 17337467 16840799 16104558
9975 16104558 15089431 13743011 12204181 10667218 9278025 8185129 7498133 7122087
9967 7122087 6738082 6098610 5217741 4299494 3557349 3034155 2677767 2548987 2670351 2975624
9957 2975624 3390215 3775231 3995174 4017218 3948130 3887113 3757936 3518870 3293217 3257556
9947 3257556 3465027 3747794 3762930 3347700 2803040 2513558 2532110 2712472 2871877 2872594
9937 2872594 2759257 2572811 2232081 1832771 1502835 1175743 952799 973013 1120685 1201676
9927 1201676 1103036 842322 509689 216550 75598 128738 320607 448825 374484 248765
9917 248765 341775 692087 1041898 1216319 1224532 1127103 1061398 1141564 1242271 1217712 1146676
9906 1146676 1169125 1352525 1613045 1821901 1896506 1861350 1916136 2150220 2404798 2420441
9896 2420441 2075648 1527064 1058527 862787 998897 1370268 1788888 2184920 2494112 2657147
9886 2657147 2646187 2606998 2797103 3111377 3292905 3359780 3455675 3577479 3632422 3579687 3488665
9875 3488665 3466019 3502069 3535886 3542686 3605651 3743148 3803215 3727083 3644673 3640996 3648026 3497773
9863 3497773 3272303 3170752 3161828 3211715 3296609 3311069 3303210 3332600 3346402 3222505 2899511
9852 2899511 2519475 2191456 1936904 1881722 2066454 2372300 2769678 3240315 3694022 4111426
9842 4111426 4614602 5220364 5674027 5791383 5682555 5514544 5472521 5668542 6071971 6401444
9832 6401444 6475913 6495539 6735196 7298118 8061581 8988357 10037147 10945814 11579220 12014637
9822 12014637 12277855 12361693 12367083 12203339 11692296 10945938 10203410 9585810 9096342 8593050
9812 8593050 7973059 7398019 7127522 7249581 7584693 7865959 8004663 8047387 7967647 7767992
9802 7767992 7570473 7538230 7679534 7799765 7739454 7623302 7713135 7985363 8227637 8326648
9792 8326648 8244150 8031505 7853324 7849774 8060788 8458779 8944959 9483249 10169487 10973192
9782 10973192 11753504 12452000 13102202 13779066 14388916 14793235 14988089 14880358 14272100
9773 14272100 13214950 11977258 10773935 9816741 9149649 8499216 7778972 7135802 6725877
9764 6725877 6578580 6537732 6445250 6269407 6053211 5801943 5423583 4937538 4527805 4332454
9754 4332454 4333294 4371344 4293329 4172729 4230369 4487356 4826665 5143640 5345537 5492733 5719154
9743 5719154 6001892 6213362 6307242 6292299 6230667 6240672 6369520 6559671 6760741 6995153
9733 6995153 7186235 7265920 7351547 7468831 7408346 7124510 6782326 6550620 6545903 6786897
9723 6786897 7110345 7262112 7257955 7270140 7313340 7339655 7340407 7403948 7635321 7992148 8516474
9712 8516474 9250409 10013228 10713522 11423865 12106246 12773434 13633588 14814362 16231301
9703 16231301 17800867 19487192 21156662 22617031 23762541 24599826 25102529 25263218 25132489
9694 25132489 24773508 24345161 23963771 23709110 23584096 23575300 23661650 23843010 24295871 25052944
9684 25052944 25884867 26536044 26893939 26894663 26383921 25332980 23943549 22321658 20475337
9675 20475337 18482334 16524420 14776010 13238151 11860373 10610413 9469413 8461359
9667 8461359 7636619 7004600 6414990 5773088 5225507 4856942 4583476 4267108 3853427 3357721
9657 3357721 2893011 2628021 2555358 2629835 2824839 3049321 3217342 3249122 3081471 2744449
9647 2744449 2472169 2431564 2500160 2608614 2767052 2921465 3063933 3208260 3323608 3381054
9637 3381054 3375566 3351057 3311412 3184500 2963654 2798050 2753662 2774204 2884551 3150548 3496466
9626 3496466 3672950 3596305 3407274 3146005 2767570 2366084 2079680 1877283 1757714 1725676
9616 1725676 1729165 1696455 1505013 1125275 680224 416638 539353 964271 1405778 1582363
9606 1582363 1483165 1350845 1318968 1334261 1280998 1075112 732096 380287 139852 -65860
9596 -65860 -367543 -736723 -1027996 -1034410 -714871 -309968 -57664 9614 -18604 53161 426711
9585 426711 957912 1343587 1519277 1549439 1445864 1212879 918908 631149 406337 281308
9575 281308 207511 107860 31187 17537 -111054 -356445 -474757 -425258 -341025 -352286 -668629
9564 -668629 -1298751 -1888065 -2058473 -1775817 -1263692 -768444 -384362 -56006 194840 308630
9554 308630 346482 306646 61798 -345101 -617993 -640273 -526657 -400444 -185319 217506
9544 217506 620119 965061 1353034 1671467 1836136 1953642 2070814 2172037 2236428 2278829
9534 2278829 2368969 2521040 2624822 2510034 2177892 1892186 1849459 2025536 2336921 2729567
9524 2729567 3131828 3415209 3570358 3663874 3662205 3622041 3628218 3641364 3629410 3572285 3529028
9513 3529028 3639262 4057460 4777352 5442771 5805223 5937610 5990923 6093142 6277623 6467506
9503 6467506 6651279 6957727 7485500 8167804 8848450 9399365 9808701 10192161 10459671 10444857
9493 10444857 10155089 9666954 9062336 8470423 7873238 7110634 6218131 5373098 4703886
9484 4703886 4315141 4234380 4337764 4454192 4453018 4260254 3921875 3596309 3371347 3281036
9474 3281036 3307223 3349361 3311268 3247647 3247065 3103246 2656091 2044663 1441539 905653 466208
9463 466208 127286 -89174 -87835 135183 500897 833005 999330 1120375 1368575 1640788
9453 1640788 1746892 1688153 1608917 1605439 1730232 1868907 1825925 1611714 1326673 1104885
9443 1104885 1048443 1119058 1363179 1774380 2150059 2372963 2472810 2457389 2364569 2329074 2484152
9432 2484152 2768677 2956491 2989882 2993496 3014560 3003403 2944284 2948535 3063854 3263800 3458343
9421 3458343 3556162 3579005 3579400 3735627 4190397 4771712 5159255 5295266 5334159 5392319 5600270
9410 5600270 6050933 6727310 7629270 8769714 10002364 11193138 12455698 13880216 15397919
9401 15397919 16955590 18510418 19951367 21128440 21836293 21878580 21163358 19747347 17924304
9392 17924304 16116501 14573663 13270660 12136447 11158992 10220079 9237993 8267966 7191787
9383 7191787 5946862 4799446 3930491 3332443 2898903 2579097 2506135 2656318 2775772
9374 2775772 2659029 2322836 1971502 1748832 1589780 1371341 1081481 904344 921815 1060749
9364 1060749 1150737 1115810 1002338 892733 879696 893889 914636 1027107 1219562 1396860
9354 1396860 1585032 1842773 2115736 2259573 2183982 2001647 1923722 1967657 2042303 2100608
9344 2100608 2083581 2002257 1959896 2037997 2182210 2160727 1837833 1413908 1121571 990227
9334 990227 870897 640540 442283 451953 654520 815990 812129 713822 574222 453478 392907
9323 392907 406351 458488 462098 366284 251825 213219 296657 491352 713383 974850 1356526
9312 1356526 1720481 1907710 1931254 1855780 1607600 1134921 605625 188537 -45812 -40376
9302 -40376 129534 211960 61196 -265744 -635966 -854888 -732919 -355624 -42767 70122
9292 70122 108048 190836 245349 257450 356730 511394 602969 565331 415012 255056 107235
9281 107235 -68972 -217463 -225803 -143778 -111389 -15543 265059 602002 842065 912037 800605
9270 800605 613562 442136 282739 80268 -129980 -326250 -567237 -751805 -764849 -681095
9260 -681095 -560623 -375594 -172024 -117809 -220263 -287052 -191557 -43941 -65112 -272121
9250 -272121 -505486 -551641 -315589 20436 244028 301857 211804 -55935 -487306 -866995
9240 -866995 -1068622 -1169898 -1099230 -798829 -461620 -285965 -283888 -375658 -478567 -587484
9230 -587484 -803721 -1204616 -1708198 -2129547 -2327537 -2281807 -2048410 -1663298 -1277446 -1111122
9220 -1111122 -1165422 -1244273 -1176319 -983645 -801760 -790625 -961872 -1114378 -1182610 -1232222 -1236597
9209 -1236597 -1082862 -743768 -314166 35831 207905 214173 46951 -134774 -185473 -157325
9199 -157325 -194731 -346272 -487805 -496629 -460060 -501811 -468371 -236653 23233 113480 15338
9188 15338 -93427 -18174 206688 388883 442853 419247 309071 156533 72567 -37173 -336734
9177 -336734 -671533 -776260 -689855 -630753 -679400 -764000 -836396 -951883 -1046435 -1019584 -896832
9166 -896832 -730828 -511108 -271624 -132323 -152317 -299750 -486067 -591214 -672758 -834540
9156 -834540 -1021243 -1146143 -1187502 -1206494 -1233284 -1281786 -1281711 -1176266 -1024838 -871930 -741446
9145 -741446 -612449 -486085 -389500 -250520 -20548 121904 19615 -143617 -131929 22838
9135 22838 187764 292483 460616 764760 946683 782511 361904 -12788 -151597 -145597
9125 -145597 -161576 -220164 -241011 -227748 -207489 -153330 -102919 -121201 -216994 -317268 -311883 -174801
9113 -174801 96460 485704 840473 1080610 1284375 1552236 1867949 2139922 2316252 2337688
9103 2337688 2147872 1856317 1613706 1360316 1005102 671748 444151 236845 9950 -227740
9093 -227740 -454325 -608838 -706442 -871773 -1064516 -1079956 -904538 -719326 -577706 -372298
9083 -372298 -156405 5219 198420 339329 278426 74621 -120650 -268982 -428493 -671214
9073 -671214 -929911 -1101509 -1114228 -849078 -494205 -450136 -765065 -1111810 -1183559 -1001807
9063 -1001807 -740977 -454737 -55829 478116 913747 1045405 1041720 1094975 1017189 640707
9053 640707 173019 -190169 -334556 -184047 129988 370700 403153 303312 173895 48195
9043 48195 -35743 -94303 -168096 -235882 -320700 -464438 -626655 -701091 -691269 -607627 -468281
9032 -468281 -311141 -80807 139554 216517 173440 21095 -240534 -584349 -966203 -1210184
9022 -1210184 -1177274 -967474 -711056 -405116 -50590 242101 526910 887207 1195613 1320881
9012 1320881 1212304 892357 529821 395738 464282 491643 413615 264750 80235 -169726
9002 -169726 -614666 -1055291 -1151913 -947217 -798954 -817906 -802883 -676011 -519550 -375367
8992 -375367 -182692 -4735 104864 236134 339147 329486 253322 248567 446545 815343 1224492
8981 1224492 1375270 1068095 602902 325420 178434 61998 -32109 -87299 -110228 -99653
8971 -99653 91129 522006 964568 1186187 1212645 1211034 1216204 1134395 969844 793774 678353
8960 678353 633606 654243 774491 959665 1019426 828339 512127 251753 77949 6425
8950 6425 70872 256464 465437 582604 540993 304330 -41260 -355546 -530308 -542725 -483185
8939 -483185 -443580 -518117 -605137 -516624 -334873 -248273 -332919 -537276 -761705 -925679 -1035651
8928 -1035651 -1174117 -1387779 -1476682 -1291812 -988269 -768705 -626373 -533502 -523531 -521964 -397698
8917 -397698 -118127 189586 296772 122909 -128030 -365288 -678654 -925523 -995467 -950966
8907 -950966 -895349 -902866 -938368 -900476 -707370 -380953 -10240 226003 313568 342066 231681
8896 231681 -111687 -594426 -959080 -1048462 -918676 -716762 -542568 -318419 66972 518750
8886 518750 797119 752884 529871 437409 581882 839871 1066460 1240900 1403279 1557863
8876 1557863 1602574 1462872 1179171 790003 428582 285353 390622 566191 532122 243368
8866 243368 22611 59211 234216 425744 429237 123884 -262425 -464485 -457996 -449613 -535455
8855 -535455 -734071 -1080988 -1581951 -2148146 -2527313 -2629947 -2555994 -2352227 -2075070 -1801621
8845 -1801621 -1578395 -1527626 -1779044 -2182389 -2399518 -2374946 -2184911 -1825725 -1378179 -997841
8835 -997841 -787025 -690837 -566966 -453544 -416053 -491073 -737026 -1148676 -1566082 -1714798
8825 -1714798 -1602813 -1510419 -1492852 -1538679 -1712240 -1835716 -1638654 -1221842 -835387 -642098
8815 -642098 -645567 -736509 -818071 -805307 -626116 -287333 97382 423553 629608 700040 684176
8804 684176 643508 646748 886039 1330982 1577581 1416825 1070197 862747 937984 1161808
8794 1161808 1346847 1546715 1686656 1508084 963430 231543 -458789 -969473 -1306882 -1510584
8784 -1510584 -1506444 -1243406 -923839 -810636 -842354 -822947 -766568 -848120 -1117854 -1457513 -1761155
8773 -1761155 -1978024 -2092414 -2194578 -2283396 -2263181 -2172878 -2105929 -2089956 -2072813 -1964661 -1809540
8762 -1809540 -1586775 -1221176 -888878 -805501 -978248 -1272189 -1544096 -1690784 -1741534 -1756646
8752 -1756646 -1710844 -1607230 -1462976 -1407874 -1541033 -1746597 -1864826 -1883294 -1838436 -1726264
8742 -1726264 -1523529 -1221775 -933508 -835859 -946767 -1119593 -1267159 -1376879 -1458250 -1508801
8732 -1508801 -1525096 -1514985 -1459733 -1368082 -1241552 -1052257 -827234 -616489 -430928 -280412
8722 -280412 -181617 -104412 42192 310677 574830 679552 623893 490694 405089 374029 182276
8711 182276 -237076 -649553 -856599 -881101 -791532 -619410 -389073 -191167 -97177 -82823
8701 -82823 -118681 -209491 -250139 -233962 -377519 -763665 -1271577 -1731318 -1995209 -1971292 -1598935
8690 -1598935 -932904 -227696 280868 504987 452457 169718 -138132 -292679 -406988 -592077
8680 -592077 -799159 -964527 -1135794 -1358660 -1446509 -1304298 -1043645 -746429 -416308 -107989
8670 -107989 42227 -12344 -194649 -449512 -712010 -867177 -926453 -932707 -828826 -614842
8660 -614842 -421577 -369447 -350893 -173666 136273 522849 993536 1370553 1489137 1383987
8650 1383987 1156769 882516 616109 263728 -184640 -407229 -269069 -69103 -58744 -176979
8640 -176979 -313182 -446634 -529327 -487512 -330650 -163791 -97271 -165158 -334329 -551700
8630 -551700 -680871 -658154 -631712 -720184 -754191 -531739 -157545 104882 141848 -31879 -325222
8619 -325222 -530181 -485729 -309309 -159711 -68141 -58860 -129958 -265649 -478797 -765787 -1003824
8608 -1003824 -1094950 -1072510 -1046843 -1023145 -936142 -849378 -800951 -786515 -767377 -663369 -515312
8597 -515312 -445944 -479274 -515826 -467331 -344818 -213873 -103462 -18944 -37618 -186691 -371585
8586 -371585 -546795 -681094 -760353 -880974 -1109131 -1399424 -1642421 -1729176 -1640312 -1433987
8576 -1433987 -1188321 -915084 -747503 -842570 -1170037 -1475791 -1483006 -1229578 -931817 -716881
8566 -716881 -542143 -322022 -109737 38062 115062 187236 291283 446122 650680 798592
8556 798592 823225 758715 629544 457184 306640 242759 309579 437974 474349 408261 296283
8545 296283 59596 -467551 -1228962 -1965148 -2522296 -2787508 -2691153 -2412337 -2299432 -2420957
8535 -2420957 -2529666 -2446194 -2242497 -2031454 -1910376 -1995613 -2164189 -2109667 -1673778 -1028931
8525 -1028931 -497311 -241032 -312967 -694556 -1131549 -1275556 -986019 -432032 23099 168106
8515 168106 79350 -46197 -71127 14369 205180 467114 688579 711019 495652 231437
8505 231437 111056 158602 253529 294865 225547 152421 238590 417761 543957 589704 640504
8494 640504 675729 667710 618884 449923 205784 24879 -84939 -182916 -256017 -344422 -435830
8483 -435830 -506414 -563048 -687736 -1005461 -1402472 -1675797 -1764725 -1752557 -1729062 -1636437 -1355078
8472 -1355078 -880802 -248720 407622 825877 878800 686608 439150 214564 -29737 -281453
8462 -281453 -445995 -570851 -661813 -545734 -199327 78077 40019 -162048 -413125 -765314
8452 -765314 -1092650 -1303646 -1532515 -1822879 -2034781 -2068929 -1900188 -1571855 -1202529 -910443
8442 -910443 -737123 -571565 -315186 -62481 51854 16044 -44788 -57331 -154847 -328135
8432 -328135 -398167 -426429 -484250 -500676 -473956 -477095 -618239 -996367 -1517036 -1887868 -1954354
8421 -1954354 -1813537 -1581249 -1303413 -1111063 -1136997 -1347731 -1603587 -1811196 -1932421 -1900750
8411 -1900750 -1693849 -1456493 -1278345 -1152693 -1022895 -765222 -346828 1637 10386 -258748
8401 -258748 -552572 -716854 -716223 -602726 -462132 -236276 86686 324299 297362 71543
8391 71543 -101051 -100077 13736 180378 370374 522596 503227 193542 -389521 -943955 -1094464
8380 -1094464 -798684 -315338 80882 337366 564620 685076 545318 280902 141088 135143
8370 135143 213250 333157 337029 246771 212029 263824 325508 382184 406851 309358 143806
8359 143806 102374 211454 311524 319669 242756 48986 -284782 -611528 -797601 -834186 -747041
8348 -747041 -614686 -612487 -815100 -1099475 -1300333 -1381262 -1404198 -1381461 -1199200 -803561 -381378
8337 -381378 -143059 -23813 44192 -46510 -224107 -314210 -296353 -211393 -102745 63796 347350
8326 347350 641304 768885 615367 254103 -123374 -413717 -633803 -771493 -816245 -790425
8316 -790425 -685325 -578785 -643750 -916383 -1250670 -1475068 -1506932 -1358025 -1142797 -1049169
8306 -1049169 -1054627 -928818 -648793 -444689 -466777 -606518 -748218 -806802 -644199 -343452
8296 -343452 -101465 30099 167292 495668 980491 1365660 1574588 1652011 1539255 1279983
8286 1279983 992856 754067 630739 685156 855681 1005034 1089481 1190104 1406159 1706521
8276 1706521 1878460 1801244 1655138 1667755 1787152 1814294 1617700 1220693 743484 236850
8266 236850 -259631 -627131 -736240 -585890 -383227 -369235 -563525 -762744 -785955 -643008
8256 -643008 -510630 -536069 -740430 -1032134 -1267978 -1358396 -1342634 -1349522 -1495146 -1743218 -1861798
8245 -1861798 -1709361 -1369560 -992740 -658694 -263112 249030 596606 554844 213617 -256471
8235 -256471 -698135 -1078125 -1435126 -1689495 -1781106 -1709186 -1655562 -1752964 -1918222 -2028674
8225 -2028674 -1925504 -1610932 -1271792 -1009707 -865709 -802899 -795279 -848782 -918147 -963095 -982142
8214 -982142 -1036159 -1171280 -1309971 -1406050 -1495633 -1448583 -1178068 -780032 -510967 -530609 -646071
8203 -646071 -661154 -593809 -533992 -522601 -567126 -695363 -862026 -951469 -953774 -875505 -709559
8192 -709559 -473857 -308765 -370728 -545784 -658933 -673922 -721715 -817917 -902825 -911295 -765628
8181 -765628 -532497 -438528 -573221 -772648 -965969 -1109222 -1245192 -1513797 -1759701 -1746592
8171 -1746592 -1519265 -1338340 -1438564 -1781388 -2123469 -2238023 -2194495 -2173603 -2151037 -2071957
8161 -2071957 -1982445 -1973137 -2050895 -2091025 -2088249 -2091440 -2045075 -1926598 -1741468 -1432453 -1053521
8150 -1053521 -735930 -489802 -325287 -265736 -296034 -412953 -550060 -672274 -800408 -977796
8140 -977796 -1246714 -1518140 -1680895 -1724633 -1669543 -1563856 -1482366 -1461629 -1440412 -1306082 -1023088
8129 -1023088 -760810 -775219 -1015968 -1248510 -1424722 -1632462 -1755156 -1622714 -1294189 -968749
8119 -968749 -868650 -969136 -1067787 -1029174 -868846 -707000 -588620 -456010 -223970 135672
8109 135672 526405 747012 656822 345541 5931 -344618 -776514 -1294719 -1764151 -1959778
8099 -1959778 -1957151 -1968699 -1967135 -1846815 -1653945 -1547234 -1611441 -1695353 -1620856 -1394229 -1184148
8088 -1184148 -1179077 -1386882 -1657475 -1867977 -1966591 -1883714 -1614492 -1308172 -1141965 -1183665
8078 -1183665 -1282809 -1207947 -936186 -651280 -499311 -418647 -230966 122699 530015 785322
8068 785322 763345 480009 -7967 -563848 -984385 -1204639 -1306826 -1325967 -1247632 -1124859
8058 -1124859 -1040375 -1059357 -1192794 -1386592 -1567817 -1597516 -1396428 -1151497 -1099147 -1212706
8048 -1212706 -1351701 -1468760 -1628587 -1755125 -1662272 -1414106 -1230635 -1116030 -1028293 -1033494
8038 -1033494 -1068112 -1007746 -833221 -544867 -247855 -50928 129932 404904 691700 835397
8028 835397 807451 721583 614350 518323 448128 240190 -75083 -276218 -331461 -348884 -330470
8017 -330470 -316861 -448923 -707514 -905408 -941112 -807079 -583342 -455966 -516290 -678361
8007 -678361 -794122 -845109 -878119 -897287 -914229 -935022 -963400 -1000725 -1079902 -1220643 -1423753
7996 -1423753 -1627912 -1761254 -1951353 -2257832 -2492594 -2517408 -2355325 -2176628 -2088729 -2050060
7986 -2050060 -2016890 -1950000 -1769739 -1555555 -1492142 -1591974 -1781054 -1949167 -2015245 -2045610 -2088594
7975 -2088594 -2083285 -1980650 -1742475 -1425015 -1167437 -1052983 -1106053 -1284860 -1486619 -1665029
7965 -1665029 -1786900 -1773529 -1549980 -1132470 -702332 -412106 -301832 -268834 -118307 180702
7955 180702 440832 509089 454690 453961 522617 520885 342100 46572 -201030 -290882 -262760
7944 -262760 -256781 -438829 -787629 -1059518 -1100102 -959444 -772688 -747274 -1024714 -1456882
7934 -1456882 -1796055 -1934567 -1989636 -2105291 -2250173 -2267982 -2163306 -2016830 -1843476 -1646646
7924 -1646646 -1457797 -1230140 -840252 -337814 158607 580711 839215 924055 935571 953696
7914 953696 942366 870719 757598 674121 608374 479602 282585 52659 -194577 -448679
7904 -448679 -718207 -1113321 -1650916 -2101320 -2255754 -2150655 -1986613 -1899171 -1824535 -1656447
7894 -1656447 -1503296 -1544842 -1702183 -1855763 -1972092 -1946651 -1711716 -1345371 -955019 -587033
7884 -587033 -337609 -253389 -251117 -238850 -267868 -392520 -587381 -805248 -1002786 -1074226 -1032368
7873 -1032368 -1001292 -938679 -772876 -617409 -569517 -572226 -574006 -463572 -126738 222513 262400
7862 262400 -62839 -511162 -738809 -687106 -547384 -494778 -541268 -611086 -575308 -348222 88031
7851 88031 561333 899378 1010456 839113 430678 -54371 -403574 -482887 -371810 -320939
7841 -320939 -430304 -479300 -279771 -12956 83900 -13571 -176674 -358624 -647627 -1031822
7831 -1031822 -1321563 -1387283 -1338510 -1290874 -1310571 -1493022 -1836701 -2143587 -2200139 -1996008
7821 -1996008 -1628906 -1274199 -1145601 -1301333 -1648985 -2059249 -2400058 -2487048 -2261162 -1894890
7811 -1894890 -1476867 -1028795 -671373 -507968 -517278 -617777 -708127 -768733 -868501 -995332
7801 -995332 -1079549 -1133605 -1151492 -1034671 -806524 -575980 -411961 -310056 -162995 117065
7791 117065 459164 619108 469506 219533 84882 51748 52762 25246 -32158 -47407 -55549
7780 -55549 -40318 31061 9571 -297999 -814731 -1328675 -1709060 -1869850 -1798010 -1644656 -1595641
$$ [...]
##END NTUPLES=NMR SPECTRUM
##END=
