##TITLE=C13_SR157TFAA2eq
 CDCl3, 1500 sc

 5.7.2023
##JCAMPDX= 6.0         $$ Bruker NMR JCAMP-DX V2.0
##DATA TYPE= NMR SPECTRUM
##DATA CLASS= NTUPLES
##ORIGIN= UXNMR, Bruker Analytische Messtechnik GmbH
##OWNER= root
$$ XWIN-NMR		Version 3.5
$$ Thu Jul  6 13:36:54 2023 Russian Standard Time (UT+4h)  she@DPX200
##.OBSERVE FREQUENCY= 50.327896
##.OBSERVE NUCLEUS= ^13C
##.ACQUISITION MODE= SIMULTANEOUS
##.ACQUISITION SCHEME= undefined
##.AVERAGES= 17000
##.DIGITISER RES= 17
##SPECTROMETER/DATA SYSTEM= spect
##.PULSE SEQUENCE= zgpg30
##.SOLVENT NAME= DMSO
##.SHIFT REFERENCE= (INTERNAL, DMSO, 0, 222.624)
##AUDIT TRAIL= $$ (NUMBER, WHEN, WHO, WHERE, WHAT)
$$ ##TITLE= Audit trail, XWIN-NMR		Version 3.5
$$ ##JCAMPDX= 5.01
$$ ##ORIGIN= Bruker BioSpin GmbH
$$ ##OWNER= she
$$ F:/spectra/data/she/nmr/c13/1/pdata/1/auditp.txt
$$ ##AUDIT TRAIL=  $$ (NUMBER, WHEN, WHO, WHERE, WHAT)
(   1,<2023-07-06 08:39:39.92 +0400>,<she>,<DPX200>,
      <created by zg, POWCHK disabled, PULCHK disabled
       terminated by command 'halt'
       configuration hash MD5:
       00 E9 B6 7A A2 85 ED C7 34 08 36 98 17 FE 4E 26
       data hash MD5: 32K
       57 FE D8 37 7E 84 8B 59 1C 59 41 18 44 CB 22 E0>)
(   2,<2023-07-06 13:34:38.79 +0400>,<she>,<DPX200>,
      <Start of raw data processing
       efp BC_mod = 2 LB = 2 FT_mod = 6 PKNL = 1 PHC0 = -389.5054 PHC1 = 32.53318 SI = 32K 
       data hash MD5: 32K
       F2 4D F0 E6 38 10 31 BC 2F 0F 36 D5 09 13 AA 8C>)
(   3,<2023-07-06 13:34:57.39 +0400>,<she>,<DPX200>,
      <pk PHC0 = 0.6100562 PHC1 = 0 
       data hash MD5: 32K
       80 DD 88 FD E7 62 1A 8F 30 13 D1 33 47 5B BC 65>)
(   4,<2023-07-06 13:35:00.46 +0400>,<she>,<DPX200>,
      <abs ABSG = 5 
       data hash MD5: 32K
       1C E2 73 2F 77 18 91 29 AE DA 54 5D C6 04 C4 CD>)
(   5,<2023-07-06 13:35:34.79 +0400>,<she>,<DPX200>,
      <pk PHC0 = 16.93443 PHC1 = -26.4 
       data hash MD5: 32K
       80 5A A0 80 2F 26 74 96 F6 81 DF FB 6B 6B 9F 95>)
(   6,<2023-07-06 13:35:38.00 +0400>,<she>,<DPX200>,
      <abs ABSG = 5 
       data hash MD5: 32K
       DE AB D6 2E E8 27 F1 06 72 AB EA 3F 96 D8 4F 56>)
(   7,<2023-07-06 13:35:56.48 +0400>,<she>,<DPX200>,
      <pk PHC0 = -11.61732 PHC1 = 18.6 
       data hash MD5: 32K
       98 69 C1 62 F7 8D C7 B0 86 6C 43 D7 4D 7D DD 2E>)
(   8,<2023-07-06 13:35:59.92 +0400>,<she>,<DPX200>,
      <abs ABSG = 5 
       data hash MD5: 32K
       88 75 7D 79 15 3C 00 9B 59 CC 5D DD 1F F1 DA E3>)
$$ ##END=
$$ 
$$ hash MD5
$$ AF 5E 87 B8 8B 37 CA 16 6C 15 DB E9 2E 99 E5 15
##$RELAX= 
##$RELAX= 
##$RELAX= 
##$RELAX= 
##$RELAX= 
##$RELAX= 
##$RELAX= 
##$RELAX= 
$$ Bruker specific parameters
$$ --------------------------
##$DU= <F:/spectra>
##$EXPNO= 1
##$NAME= <c13>
##$PROCNO= 1
##$TYPE= <nmr>
##$USER= <she>
##$AMP= (0..31)
100 100 100 100 100 100 100 100 100 100 100 100 100 100 100 100 100 100 
100 100 100 100 100 100 100 100 100 100 100 100 100 100 
##$AQSEQ= 0
##$AQ_mod= 1
##$AUNM= <au_zg>
##$AUTOPOS= <>
##$BF1= 50.322709
$$ [...]
##$SUBNAM4= <"">
##$SUBNAM5= <"">
##$SUBNAM6= <"">
##$SUBNAM7= <"">
##$SUBNAM8= <"">
##$SUBNAM9= <"">
##$SW= 239.972175391363
##$SWIBOX= (0..15)
0 1 3 0 0 0 0 0 0 0 0 0 0 0 0 0 
##$SW_h= 12077.2946859903
##$TD= 32768
##$TD0= 1
##$TE= 0
##$TE2= 300
##$TE3= 300
##$TEG= 300
##$TL= (0..7)
120 120 120 120 120 120 120 120 
##$TP= (0..7)
150 150 150 150 150 150 150 150 
##$TP07= 0
##$TPNAME0= <>
##$TPNAME1= <>
##$TPNAME2= <>
##$TPNAME3= <>
##$TPNAME4= <>
##$TPNAME5= <>
##$TPNAME6= <>
##$TPNAME7= <>
##$TPOAL= (0..7)
0.5 0.5 0.5 0.5 0.5 0.5 0.5 0.5 
##$TPOFFS= (0..7)
0 0 0 0 0 0 0 0 
##$TUNHIN= 0
##$TUNHOUT= 0
##$TUNXOUT= 0
##$USERA1= <user>
##$USERA2= <user>
##$USERA3= <user>
##$USERA4= <user>
##$USERA5= <user>
##$V9= 5
##$VALIST= <valist>
##$VCLIST= <CCCCCCCCCCCCCCC>
##$VD= 0
##$VDLIST= <DDDDDDDDDDDDDDD>
##$VPLIST= <PPPPPPPPPPPPPPP>
##$VTLIST= <TTTTTTTTTTTTTTT>
##$WBST= 1024
##$WBSW= 4
##$XGAIN= (0..3)
0 0 0 0 
##$XL= 0
##$YL= 0
##$YMAX_a= 113347626
##$YMIN_a= -71358748
##$ZGOPTNS= <>
##$ZL1= 120
##$ZL2= 120
##$ZL3= 120
##$ZL4= 120
##$ABSF1= 222.624
##$ABSF2= -17.3728
##$ABSG= 5
##$ABSL= 3
##$ALPHA= 0
##$AQORDER= 0
##$ASSFAC= 0
##$ASSFACI= 0
##$ASSFACX= 0
##$ASSWID= 0
##$AUNMP= <proc_1d>
##$AZFE= 0.1
##$AZFW= 0.5
##$BCFW= 0
##$BC_mod= 2
##$BYTORDP= 0
##$COROFFS= 0
##$CY= -3
##$DATMOD= 1
##$DC= 0
##$DFILT= <>
##$DTYPP= 0
##$F1P= 0
##$F2P= 0
##$FCOR= 0.5
##$FTSIZE= 32768
##$FT_mod= 6
##$GAMMA= 0
##$GB= 0
##$INTBC= 1
##$INTSCL= 4.134877e-10
##$ISEN= 128
##$LB= 2
##$LEV0= 0
##$LPBIN= 0
##$MAXI= 10000
##$MC2= 0
##$MEAN= 0
##$ME_mod= 0
##$MI= 0.1934396
##$NCOEF= 0
##$NC_proc= 2
##$NLEV= 6
##$NOISF1= 120.0001
##$NOISF2= 80.00006
##$NSP= 0
##$NTH_PI= 0
##$NZP= 0
##$OFFSET= 222.624
##$PC= 1.4
##$PHC0= -383.5783
##$PHC1= 24.73318
##$PH_mod= 1
##$PKNL= yes
##$PPARMOD= 0
##$PSCAL= 0
##$PSIGN= 0
##$REVERSE= no
##$SF= 50.3227315983092
##$SI= 32768
##$SIGF1= 140
##$SIGF2= 120
##$SINO= 11.81781
##$SIOLD= 32768
##$SREGLST= <13C.CDCl3>
##$SSB= 0
##$STSI= 32768
##$STSR= 0
##$SW_p= 12077.2946859903
##$SYMM= 0
##$S_DEV= 0
##$TDeff= 32768
##$TDoff= 0
##$TI= <>
##$TILT= no
##$TM1= 0
##$TM2= 0
##$TOPLEV= 0
##$USERP1= <user>
##$USERP2= <user>
##$USERP3= <user>
##$USERP4= <user>
##$USERP5= <user>
##$WDW= 1
##$XDIM= 32768
##$YMAX_p= 305164053
##$YMIN_p= -1513210
$$ End of Bruker specific parameters
$$ ---------------------------------
##NTUPLES= NMR SPECTRUM
##VAR_NAME=  FREQUENCY,     SPECTRUM/REAL,   SPECTRUM/IMAG
##SYMBOL=    X,             R,               I
##VAR_TYPE=  INDEPENDENT,   DEPENDENT,       DEPENDENT
##VAR_FORM=  AFFN,          ASDF,            ASDF
##VAR_DIM=   32768,         32768,           32768
##UNITS=     HZ,            ARBITRARY UNITS, ARBITRARY UNITS
##FACTOR=    0.368581032318806, 1,           1
##FIRST=     11203.0474430531, 0,            0
##LAST=      -874.247242937185, 0,           0
##MIN=       -874.247242937185, -1513210,    0
##MAX=       11203.0474430531, 305164053,    0
$$ Real data points
##PAGE= N=1
##DATA TABLE= (X++(R..R)), XYDATA
$$ [...]
15991B30891R2207j6801j08548j80102j71388j16193m0769N2097J16672J16247
15981b5687O5790n13m3435p0007j07141j22379q4212j8076M8973J06880J31854
15970a17953R9915M7592K1109k8492r6017p7906k4699k2865p3547j47390j78271
15959e98524q5421M4702Q9288P7552J13460J55451R5925J9150K0461M1584L2720
15948F348O712l2222l8335L9597J01542O4862j5832k6091M8202R6997O2658j5588
15936B98850p4731l6013N6729J04291Q0431L3702K3381l9511j49341j49972n7266
15925I0550K3598L7123n4742j80308k33147j82484n9577M1280N2439J4942K7034
15914d23292P5251R2349P9665P6408M4444l1719o8771l0136M6179R4308P8604
$$ y = [230891, 323098, 306297, 197749, 17647, -153741, -269934, -310703, -258606, -141934, -25687, 40103, 39590, -3845, -73852, -180993, -303372, -387584, -405660, -356687, -249807, -117953, -18038, 29554, 50663, 22171, -73846, -151752, -176451, -199316, -272863, -420253, -598524, -683945, -639243, -549955, -472403, -358943, -203492, -107567, -88417, -67956, -26372, 6348, 13060, -19162, -57497, -17900, 83642, 148504, 132672, 106581, 154783, 251780, 314438, 298850, 224119, 188106, 244835, 349126, 429557, 463259, 486640, 447129, 297788, 147816, 90550, 114148, 151271, 96529, -83779, -316926, -499410, -558987, -517707, -465268, -450326, -423292, -348041, -255692, -176027, -99619, -55175, -86894, -155665, -185801, -139622, -45314, 33290]
15903C3290n274r8119j23290p5138M351O1692R8472J42533J36381P8122J3130
15892B66150n7685r5744n6763K419O7138J18704P1980n3368j65004k36629k46495
15881c85297j59356o8407k5877L5573Q2955O9382J4040n5780j37847k01390j59202
15870i91206j3823O8153M3878l737N382M4402O8557O1165N5965P3972O4410N2793
15858d70089K7303j6114j1442M7553R0831R6542Q5310M1061n3431j53764j51224
15847d67464n2042K2164P0222J06490J58940J70253J12039M9416k8302j12850
15837B8866j44119j03308q358J11633J59392R1642l6450j26309j44833j48246
15827c20090j29289n7616N0068J33772J59022J51315J30979J12584J18929R8727
$$ y = [33290, 28016, -70103, -193393, -268531, -264180, -202488, -104016, 38517, 174898, 253020, 266150, 208465, 112721, 55958, 58377, 125515, 244219, 316199, 262831, 97827, -138802, -385297, -544653, -613060, -638937, -603364, -520409, -451027, -436987, -492767, -630614, -832004, -991206, -1005029, -936876, -892998, -896735, -891353, -846951, -778394, -717229, -661264, -587292, -522882, -470089, -442786, -458900, -470342, -422789, -331958, -235416, -150106, -109045, -162476, -316240, -467464, -519506, -497342, -427120, -320630, -161690, 8563, 120602, 170018, 141716, 28866, -115253, -218561, -226919, -115286, 44106, 135748, 99298, -27011, -171844, -320090, -449379, -506995, -456927, -323155, -164133, -12818, 118161, 230745, 349674, 448401]
15817D48401K3406n8040j01391j17202j18610j13235j00351r5995r2675o2907
15807c88599l3469k5822l8925p0894j09785r0410l1137l71J8950N6019R6163R4808
15795e23472Q9400J48806J81571Q7083o0097j28267q4105M5735J77064K42640
15785A76358K45869J82686Q8392m096j06508k08282k53520j79125m6035K2635
15775h1626j873n1710m7261j662K8372J428l2444m7367o2765m7162k2680n5766
15763d22516j13180r2777M2554J80907K25466J91550J65251J52871R7345M0700
15753D68171J8436j2275m6694m4681RO2863O4766j9811j08820j15715k1111J06522
15741C51660J82061J72156J13579J5930j04983j82890k32511k60050k43849j78217
$$ y = [448401, 471807, 413767, 312376, 195174, 76564, -36671, -137022, -233017, -325692, -388599, -422068, -447890, -486815, -557709, -667494, -757904, -789041, -789412, -770462, -714443, -618280, -523472, -434072, -285266, -103695, -16612, -76709, -204976, -289081, -243346, -66282, 176358, 422227, 604913, 693305, 689209, 582701, 374419, 120899, -58226, -104261, -81626, -83499, -135209, -182470, -184132, -155760, -154332, -186776, -234143, -296908, -344070, -366750, -422516, -535696, -628473, -585919, -405012, -179546, 12004, 177255, 330126, 427471, 468171, 486607, 474332, 427638, 382957, 382966, 445829, 510595, 490784, 381964, 266249, 245138, 351660, 533721, 705877, 819456, 835386, 730403, 547513, 315002, 54952, -188897, -367114]
15731c67114r3591l0973j1162j2672j0245l190K0524M8448Q9101J48023J90675
15720c2176J62056O8824R580L9144O1492L0812K9497N8569l211j06696j18243
15709A99648m4452r110m1588n0200k5380l7388p4707m3880L1600P9227J01472
15698H5242O5361j0147l9642l3351l7861p2422r2829j6788J15582J92477K04549
15687C60171J68715Q6129j3214p4829j07648j42321j48761j10375p2459p6766
15677a31358p5184m8789l9783k3892K4229M6846O2116R0172J17111J51050J66621
15666C39139J11002l4733j53211j83656j65193j06282j5512L1263k1699p6513
15656b75395n702R9353R0410o468p7297o7164Q12N3136L5243o8456j45087j05516
$$ y = [-367114, -460705, -491678, -502840, -515512, -525757, -528947, -508423, -459975, -370874, -222851, -32176, 129880, 198704, 208284, 247428, 308920, 339732, 369229, 427798, 424587, 317891, 199648, 155196, 146086, 104498, 54298, 28918, -8470, -83177, -127057, -95457, -16230, 85242, 150603, 140456, 100814, 67463, 29602, -42820, -135649, -152437, -36855, 155622, 360171, 528886, 615015, 601801, 526972, 419324, 277003, 128242, 17867, -54592, -131358, -206542, -255331, -295114, -319006, -294777, -247931, -185815, -95643, 21468, 172518, 339139, 450141, 415408, 262197, 78541, -86652, -192934, -208446, -177183, -198882, -275395, -281097, -181744, -91334, -97802, -175099, -242263, -241451, -188315, -153072, -221528, -366615, -472131]
15644d72131j4183K5253j6111p5705m1764P7210J54625J37316P5681K4431j2287
15633a37665n9033j06639p7092L2272J18861J02825L1195j8300n6082j28383j85927
15622d83968j37851J5470J34115J57569J82870J95219J22293P170p7111q4350
15612C1426l5684K1550O2265P4508P8837L4087o8497k01865k73130j95404k5514
15601d97421Q5232J14658J34793J36213J37919J11968L7928L138M2157P6290M6201
15590D29076R11m696p947n923L8191P5631J02877P3201R459m3982r3003q5601
15578D88194q3583j27537j48754j54608j40675j35796j50372j46991j12271m7043
15568g59436L8411J45588K04391J45717N8501N8139J18843J55583J13497j0788
$$ y = [-472131, -486314, -461061, -477172, -552877, -594641, -517431, -362806, -225490, -149809, -125378, -137665, -196698, -303337, -380429, -348157, -229296, -126471, -95276, -113576, -169658, -298041, -483968, -621819, -606349, -472234, -314665, -131795, 63424, 185717, 192887, 115776, 31426, -4258, 17292, 79557, 154065, 232902, 266989, 198492, -3373, -276503, -471907, -497421, -412189, -297531, -162738, -26525, 111394, 223362, 261290, 264428, 306585, 382875, 429076, 429987, 425291, 417344, 411421, 449612, 525243, 628120, 701321, 710780, 666798, 573795, 488194, 404611, 277074, 128320, -26288, -166963, -302759, -453131, -600122, -712393, -759436, -721025, -575437, -371046, -225329, -166828, -108689, 10154, 165737, 279234, 268446]
15558B68446j21739j05397j3823N3857K9716m1263o0932l8845l5444k2087L5287
15547e2224R0685J14936O5664m1317q4552k8620M7760P8819J1747o4605m7093
15536I1200L0302R4504R8623L9887j8543n7942p4797o8108l7373J5973N0471N5669
15524B19866O3763J09329J29128R6634N3039J2393l3022q3569q5313n7480m0866
15513C83902m9243q5402j43004j89109j83474j10131O475Q2681Q2736O9877O1257
15502g3435J6586p2419j33025j20375n7636N5969J56775J76607J65315J46230
15492B60592M1555o9261q0634n1196l8314l087P9910J26853R8500R7911J10175
15481E73004L1366q2316j42471j28835p0501n782J5196K721O576K215l8598j19994
$$ y = [268446, 146707, 41310, 27487, 81344, 111060, 69797, 8865, -29980, -65424, -87511, -52224, 38461, 153397, 219061, 177744, 93192, 64572, 112332, 191151, 202898, 138293, 91200, 121502, 216006, 314629, 354516, 335973, 278031, 203234, 135126, 97753, 113726, 164197, 219866, 283629, 392958, 522086, 618720, 671759, 684152, 651130, 567561, 482248, 424768, 383902, 334659, 249257, 106253, -82856, -266330, -376461, -369986, -287305, -204569, -134692, -73435, -56849, -129268, -262293, -382668, -440304, -384335, -227560, -50953, 114362, 260592, 302147, 232886, 152252, 101056, 62742, 59655, 139565, 266418, 364918, 462829, 573004, 604370, 522054, 379583, 250748, 180247, 174465, 189661, 192382, 198958, 201173, 162575, 42581]
15469D2581j92048j85123j41580o5319L9523J12320J41221J17356Q4485M9661
15459C077L042l7043m3194J1680J06507J58752J11281P313r0023j45161j25635
15448c9404m0592J7239j2912n7622j22720j58939j20718o0650j9004M5709J82686
15437c86927K43064J36164J6063n951L4395Q3703J04333P4710P674o0802j00161
15426A46265j14672j38274j35592o1057K6994P7298O4269J2196j4047K8118P8142
15415c0360Q4673Q5555J01395Q2636J9383j2458k530L8062P9878P4737N7640L6751
15403F15362K5742q217p6994j23890j42859j29748j19584j06707o5115r0850j68426
15392c91286j62824n7166L9624O0542P7834J16860J25210J08253Q0495P7092J07613
$$ y = [42581, -149467, -334590, -476170, -541489, -501966, -389646, -248425, -131069, -46584, 3077, 6119, -30924, -74118, -62438, 44069, 202821, 314102, 321415, 231392, 86231, -39404, -79996, -62757, -75669, -133291, -256011, -414950, -535668, -596318, -615322, -569613, -386927, -143863, -7699, 8364, 2413, 36808, 120511, 224844, 299554, 307228, 246426, 146265, 31593, -106681, -242273, -303330, -276336, -199038, -134769, -122573, -136620, -108502, -30360, 54313, 139868, 241263, 323899, 343282, 330824, 328294, 366356, 446234, 520971, 578611, 615362, 641104, 632887, 555893, 432003, 289144, 159396, 39812, -66895, -132010, -222860, -391286, -554110, -611276, -571652, -511110, -433276, -316416, -191206, -82953, -2458, 74634, 182247]
15381A82247J09916O4748J6314p262k7786n0273p4838j27183j35116n0818K6049
15370g4002N7646Q5779J00848M9338m5038p5585o2408j04581j30178q7898m5025
15359c31104R752N9643P2087O6503R8172J55304J67831J40407O6835j3611l0804
15348D61015l7462r8159j31756o1275O9468J65579J50237N9105r997o0842j45900
15337C60013j99108k01402j73439r6623k3825L4334O2107K8433m0175r7475j22216
15326d69376j47968j87194k00181j61142k9588J58091K77938K70666J77650R7441
15316b13663N1312N525k0565L585N7813J01378J24631J39376R2339j5228o1174
15305B65329q0222j21645j04785m9230J194M6826O4753P4071Q7160P0732J7961
$$ y = [182247, 292163, 356911, 373225, 365963, 338177, 287904, 213066, 85883, -49233, -100051, -74002, -16356, 69423, 170271, 219609, 174571, 98986, 36578, -68003, -198181, -286079, -331104, -321352, -261709, -189622, -123119, -24947, 130357, 298188, 438595, 505430, 491819, 461015, 423553, 325394, 193638, 132363, 201831, 367410, 517647, 576752, 566755, 505913, 360013, 160905, -40497, -213936, -310559, -334384, -300050, -237943, -209510, -249685, -347160, -469376, -617344, -804538, -1004719, -1165861, -1195449, -1037358, -759420, -488754, -311104, -213663, -162351, -156826, -177391, -173806, -115993, -14615, 110016, 249392, 341731, 326503, 265329, 185107, 63462, -41323, -90553, -89359, -42533, 22220, 96291, 183451, 254183, 272144]
15294B72144o7033j34988j50003j52302r9187J6035R0660R0605M7685J4044K1516
15283e0824N4494Q0182R1498J09356O7785n3257j17076n3592M0565N8289L4786
15272B62206K3527P752Q929j383n9641j30848j86681k16837k16336j55161l5807
15261g00280N6525O8975N152p6776r6544j5934R7954J62841J31697K4123l3520
15250c75787j8283J923L570l6701q5504p7374k6430Q272N796k9918p0506n2895
15238g53837J0677M0051N5729R5060J64286K31449J90978M9739j7764L8715R0374
15227A95457R6528R1381N1135k0279r3106j45424j38394r1164L694J63670K53370
15216C66868J86632P9996K7892n791j7969n141k1263k8527K4313P2214N3226k0411
$$ y = [272144, 205111, 70123, -79880, -232182, -331369, -315334, -224674, -134069, -86384, -72340, -50824, 3670, 83852, 175350, 284706, 352491, 299234, 182158, 128566, 169131, 227420, 262206, 285733, 293485, 302414, 301031, 241390, 110542, -76139, -292976, -509312, -664473, -700280, -643755, -574780, -569628, -646404, -742948, -758882, -660928, -498087, -366390, -342267, -375787, -394070, -392147, -388577, -425278, -510782, -588156, -614586, -606314, -600518, -630436, -700942, -753837, -743160, -703109, -647380, -552320, -388034, -156585, 34393, 84132, 66368, 105083, 195457, 291985, 383366, 434501, 414222, 321116, 175692, 37298, -53866, -50172, 113498, 366868, 553500, 633496, 661388, 655597, 637628, 632487, 611224, 582697, 607010, 679224, 732450, 712039]
15204G12039j06310j79104k01239j38602j0241R1967J29648J55095J63486J32300
15194G49039J02962N3731j8543q8116j54291j70281j15773j9170K3003j9101p0472
15183B72988r6993j14936j00191n2091j1962l929m3149j13521j30276r1097m6908
15172e32065L0164J21464J54541J09277K3074m0449q7139r3505n5603K944P2682
15161b94615J03823N1818m7204j08409j19347j00274p1903k7209K1493O3541J22746
15150d05540J80341K15021K10081J24145j1616j15003j36662j33289j43135j51805
15140c67462j61746j07731j9623O9243J44814J66685J54515J08214R977p4452
15130g7566q0949n3444m5512o3240o6567K669P3205R4867J14489J02738L6604
$$ y = [712039, 605729, 426625, 225386, 86784, 76543, 168510, 298158, 453253, 616739, 749039, 852001, 905732, 887189, 799073, 644782, 474501, 358728, 339558, 362561, 343460, 272988, 175995, 61059, -39132, -91223, -103185, -107114, -150263, -263784, -394060, -485157, -532065, -501901, -380437, -225896, -116619, -93545, -133994, -221133, -314638, -370241, -367297, -294615, -190792, -138974, -186178, -294587, -413934, -514208, -586111, -613320, -591827, -528286, -405540, -225199, -10178, 199903, 324048, 312432, 197429, 60767, -72522, -215657, -367462, -529208, -636939, -656562, -587319, -442505, -275820, -121305, -13091, -3114, -77566, -158515, -211959, -257471, -320711, -387278, -384609, -311404, -216537, -102048, 690, 37294]
15119C7294l603N3849J16693Q4746J199j10133k12141k12443p2746J35682K32641
15108E1038J76550J12284Q1997N0554K1955M170k656k8982q4196j10556o2238
15097B09920k3221l3214o5505j01201j47925j68140r7906M4843J97942K91647
15087A07240L08915K60284J41978Q126r3446j15920r0876p8540o8506k7127K5904
15076C78032K3223j8380o2666j06874r3692n8629o5148n6833k8234l7888o1614
15065a88703p3298q1145o6673n458R7005J50436J35324P7487j9633r6224r9090
15054a69972o9497n6217j1671M6935P0869N7214K9092J3663j1673l5416K8180
15043a08493J70542K38064J69997N4142m9614j04023p9006k2690j136m3451p4347
$$ y = [37294, 33691, 87540, 204233, 288979, 290178, 180045, -32096, -244539, -317285, -181603, 51038, 227588, 339872, 421869, 472423, 494378, 498548, 495892, 466910, 382714, 272158, 209920, 186699, 153485, 87980, -13221, -161146, -329286, -427192, -382349, -184407, 107240, 416155, 676439, 818417, 826543, 733097, 617177, 526301, 447761, 379255, 352128, 378032, 401255, 382875, 320209, 213335, 119643, 61014, -4134, -60967, -89201, -127089, -188703, -262001, -343146, -409819, -415277, -318272, -167836, -32512, 44975, 25342, -70882, -169972, -239469, -295686, -307357, -260422, -189553, -132339, -103247, -89584, -101257, -136673, -108493, 62049, 300113, 470110, 524252, 474638, 370615, 291609, 268919, 267783, 224332, 149985]
15032A49985k5299N9768J11667R0637L4180J9456K2959L6769O9818O9411J3977
15021F53328k1697L334J053r4313j83520j76681j20082m0320M5422O6161O509
15010A39194o7260p8249p813R2754J61635J60372J35800J22461R0431L6793j2267
14999G73851p4320j14387j12976j07939r7559p8504n2783m6796o9032q1796m1040
14988a03281J3391K2820l1247j04990j21277r8605o4656q22N4614O6333N1216
14977c16504O1602Q4475O8748K1542k9916p1757j07571q9055l9741k1964N8580
14966c81561K06083K70962K05495R2250J3922p829k7027o6911j01428q9339m6393
14955F8224j5099k094J2024N1768R5260O3381m0666j24037j60190k07638k25279
$$ y = [149985, 124686, 184454, 296121, 386758, 420938, 440394, 463353, 500122, 569940, 639351, 653328, 631631, 634965, 636018, 541705, 358185, 181504, 61422, 21102, 66524, 132685, 139194, 71934, -6315, -14128, 78626, 240261, 400633, 536433, 658894, 749325, 786118, 773851, 699531, 585144, 472168, 364229, 266670, 188166, 135383, 88587, 19555, -62241, -103281, -89890, -67070, -98317, -203307, -324584, -423189, -487845, -488667, -434053, -367720, -316504, -254902, -170427, -101679, -80137, -110053, -181810, -289381, -378436, -418177, -440141, -381561, -175478, 95484, 300979, 393229, 407151, 399322, 372295, 305384, 203956, 114617, 68224, 53125, 51031, 63055, 114823, 210083, 273464, 232798, 108761, -51429, -259067, -484346]
14944d84346j35179L6264J44665J09982K2400l5110m4331j7053M8819J30651J28671
14933i4567J1686r7401j38953j27548r2654o7253j8728J2777j2416l4054k7598
14922f86709L0046M8970K0297K1591M5507P9760J01087N3000m4024o8121J6805
14911c81791J01825J28955Q4498M1903L6335k644k5885k954j744n9365j19234
14900b00101o0188Q0437J32140K3256j31158j80528j07027j5703K0911M2542P1142
14889c24277Q2565O4871j380j11590j83098j68545j05260n0193O760M7132N0728
14878f92287L0137j00J9119J09531J81483J77938J73356K24766K81780K52339
14868G58062Q3588q1917r6092n1445q4273j50387k08307k19193j44145j4286R2774
$$ y = [-484346, -619525, -583261, -438596, -328614, -306214, -341324, -385655, -402708, -353889, -223238, -94567, -82881, -180282, -319235, -446783, -539437, -606690, -625418, -612641, -625057, -659111, -686709, -656663, -607693, -587396, -565805, -520298, -440538, -339451, -286451, -330475, -398596, -381791, -279966, -151011, -66513, -24610, 11725, 9081, -16804, -19758, -21502, -80867, -200101, -260289, -179852, -47712, -24456, -155614, -336142, -443169, -458872, -437961, -395419, -324277, -241712, -176841, -178221, -289811, -472909, -641454, -746714, -796907, -790147, -743015, -692287, -662150, -662250, -643131, -533600, -352117, -174179, -823, 223943, 505723, 758062, 841650, 759733, 663641, 612196, 527923, 377536, 169229, -49964, -194109, -208395, -115621]
14857a15621J05960N2122J131k2177J185N9378J03959J02910K7913r8799j74655
14846D3306j42515r1069p3225n1980j6992M980l0838j02596j13595n3910J4172
14835f14262N3328P5780N6314J2979j686j3727n0928o4809L86Q4759Q3792K1466
14823c56608K2786R2987J44083J37024Q7459K6958J4619L1089K0324K773J882
14812B25376l6765q6106q8569j04626j19288j08803j01935p0960k8174m495j7328
14801e41673l5682J4398R5148J32374R9773J9077n8034p9363n6993m1119k1646
14790d73740M0579J50680K33027K05140J14976Q4884R5525O2820L2731J6411n7659
14779E05374j35469j40298o8420m350M238m239j7914k6338k797M648k2315K5707
$$ y = [-115621, -9661, 42461, 43592, 21415, 22600, 81978, 185937, 288847, 316760, 217961, 43306, -99209, -190278, -263503, -315483, -332475, -327495, -358333, -460929, -574524, -628434, -614262, -560934, -485154, -428840, -415861, -417547, -431274, -482202, -547011, -546625, -461866, -378074, -356608, -333822, -240835, -96752, 40272, 127731, 154689, 169308, 200397, 220721, 223494, 225376, 188611, 102505, 13936, -90690, -209978, -318781, -420716, -491676, -519850, -524345, -541673, -577355, -562957, -467809, -335435, -235662, -216585, -274619, -353982, -410975, -452094, -473740, -433161, -282481, -49454, 155686, 270662, 355546, 451071, 513891, 546622, 563033, 505374, 369905, 229607, 161187, 156837, 161075, 156836, 138922, 112584, 109787, 114435, 92120, 117827]
14767A17827Q6807O2952o404o5020q5508o7158n979Q0370J31807J74548J97011
14756F21253J05774n5497j31589j05824q8434p6599k9995j2550p5937j65341j79785
14745a94524j11929m9069l497P6435J09512M0680j5862k394N6167P2722M6082
14734B4323N7466J01983R3173J7184k9201O496M9563J1465o1343j04174j18598
14723D8337j30858r8849n7664p3948r5668k8934R7129J84958K07822K11470J94043
14712D57838J28816R8094J10104Q3121K3798p675O817k0601j05843j72902j47299
14701D54268n7729O72K521j8380j6056J0929P461j2478k1498o1669j17838j26634
14689D3569q5024j0979M9649O2028N7022K5455Q788N0956J08839J07952O4523
$$ y = [117827, 204634, 267586, 261182, 196162, 110654, 43496, 37517, 117887, 249694, 424242, 621253, 727027, 671530, 539941, 434117, 345683, 269084, 239089, 226539, 150602, -14739, -194524, -306453, -355522, -359019, -282584, -173072, -132392, -148254, -150648, -94481, -21759, 24323, 81789, 183772, 276945, 294129, 264928, 271424, 320987, 332452, 271109, 166935, 48337, -82521, -181370, -239034, -312982, -408650, -437584, -340455, -155497, 52325, 263795, 457838, 586654, 684748, 794852, 877973, 901771, 894096, 900913, 880312, 774469, 601567, 454268, 396539, 397211, 399732, 381352, 365296, 376225, 383686, 371208, 349710, 288041, 170203, 43569, -41455, -52434, -2785, 59243, 116265, 141720, 150508, 201464, 310303, 418255, 482778]
14678D82778K6429J5108M8615M7407k8565j08930j28904p0850j7371j866j7385
14667B46466k4248K2422L5651j1157o6089j27339j58843j55176j62623j62327
14657e63263q1284P4271J65041J28205P0537N3325O3818Q0027J23354J71565J62848
14646D48444P2151m4590q2746n5018n1311p7836o2534q459K4518K0949j0004o7656
14634A05908j18326j19139k8578J28290K19172J09374p8954j55254j28894q8641
14624a55042p9625o8212q0914j16221j08797o4600k2742J4592Q2393J28640J22853
14613c47675O6726j4164j6479L7061M7833L3776L1083M3023P3029J00282J00259
14602A54754K6757p1706q6797m6695n4084r4178j10600q2669J4708R1519O3630
$$ y = [482778, 509207, 524315, 572930, 620337, 591772, 482842, 353938, 283088, 265717, 263851, 246466, 222218, 244640, 280291, 269134, 203045, 75706, -83137, -238313, -400936, -563263, -644547, -570276, -405235, -277030, -206493, -153168, -89350, -9323, 114031, 285596, 448444, 520595, 476005, 393259, 338241, 286930, 209094, 146560, 138101, 162619, 183568, 173564, 105908, -12418, -131557, -160135, -31845, 187327, 296701, 217747, 62493, -66401, -155042, -234667, -302879, -383793, -500014, -608811, -673411, -696153, -681561, -599168, -470528, -347675, -280949, -295113, -311592, -274531, -226698, -192922, -161839, -118816, -45787, 54495, 154754, 181511, 109805, 23008, -23687, -77771, -171949, -282549, -365218, -350510, -258991, -195361]
14591a95361P568K6204N4168p584o5952p4427q7806r2734j7400J27106J91239
14580a34979J49364P7162n2478j61018j54577j25281j33776j42436o0042R8291
14570f39770K18757L02383L45003K40294O9076n398j2112n8945j45150j98111
14560A16027j80660j11396m9123k4350P654M3858J6479m8677q8655j04489r9992
14549e23324n9774L0082J29814J62161J37877J30095Q4861j6354r8021j57366
14539a79949j69648j57385j48455q1882L8332J19890J17445P8097O9942P4309
14529b39304N3095l8964j39540j42584o5223N5469J60281J53790N4457j0039R183
14518a49379M2336M5176N2290O9829P3288O0875L9776L931k0256l5519l3398J3330
$$ y = [-195361, -187793, -161589, -107421, -115005, -180957, -255384, -343190, -435924, -453324, -326218, -134979, 14385, 91547, 39069, -121949, -276526, -401807, -535583, -678019, -738061, -639770, -421013, -118630, 226373, 466667, 535743, 530345, 518233, 459288, 314138, 116027, -64633, -176029, -225152, -249502, -241848, -197990, -181511, -230188, -318843, -423332, -523324, -583098, -553016, -423202, -261041, -123164, 6931, 91792, 75438, -22583, -179949, -349597, -506982, -655437, -737319, -698987, -579097, -461652, -383555, -313613, -239304, -186209, -225173, -364713, -507297, -572520, -517051, -356770, -202980, -148523, -158562, -149379, -107043, -61867, -9577, 60252, 133540, 194415, 234191, 238122, 217866, 182347, 148949, 162279]
14506A62279O1393O5691L4123r790m0133l3948j4495R373K5036M3227L4361K4287
14494C61404Q4582J45327J20120J3605j10698j66191j58761j29258j20164j31430
14484i1464j59328j88640j33394l7808r076L010P7097J74925J91804J14319M5250
14473a3305L6700J2777o8673j59649j53743q2379n2288o2225r2745r7331l9850
14462g72711N5643J15752J03309N6800N4885P5174P3623K8678k0104j787L2359
14451a98379P8301J48869J95953J93678J22986J0251m3828n1899r0198j17673
14441B48061r3566n1906j7118K1491J1616o1129j16650j29587q1199n786J4159
14430b61614k3117k0856K8007J1647m4256o7657m6370m062L8495N2320R411o7461
$$ y = [162279, 223672, 289363, 323486, 313696, 273563, 239615, 225120, 234493, 259529, 302756, 337117, 361404, 445986, 591313, 711433, 725038, 614340, 448149, 289388, 160130, 39966, -91464, -250792, -439432, -572826, -610634, -619710, -616700, -539603, -364678, -172874, -58555, -13305, 23395, 36172, -32501, -192150, -345893, -428272, -480560, -542785, -635530, -732861, -772711, -717068, -601316, -498007, -441207, -386322, -311148, -237525, -208847, -228951, -230738, -198379, -120078, 28791, 224744, 418422, 541408, 551659, 507831, 455932, 365734, 248061, 154495, 102589, 85471, 106962, 118578, 57449, -59201, -188788, -269987, -275773, -261614, -284731, -305587, -277580, -265933, -310189, -377846, -424216, -428278, -389783, -337463, -328052, -395513]
14418c95513o6492K9413J27100J43618J33422J50613J20785K1556q414L6721N4607
14407C47416J2875l0741k9064L7308J13893J63536J67659Q3570k8149j10984j36444
14396E90875j04265m1470J9056M9361K5226m9831j03231j03688j34808j74749
14386b7524j62046j05219l586N8746K830j08200j53037j07799m5000O679N5472
14375e88684J15580J43456J21038N4947j6287o7121p3696l7119L51N4909J23295
14364a69331J22140J40394K41402K69655J57617J0720m3694k0417p4360j78416
14354D55710j83495q4356p53O569j3938j0474J6892L5116J56n8408n6737K578
14342A08860N3118M2672m5826j38599j09500Q043P8894Q5279P9751Q0705P9550
$$ y = [-395513, -462005, -432592, -305492, -161874, -28452, 122161, 242946, 264502, 256088, 292809, 347416, 360291, 329550, 300486, 337794, 451687, 615223, 782882, 866452, 838303, 727319, 590875, 486610, 445140, 464196, 513557, 538783, 488952, 385721, 282033, 147225, -27524, -189570, -294789, -298375, -239629, -236799, -344999, -498036, -605835, -650835, -644156, -588684, -473104, -329648, -208610, -153663, -169950, -237071, -310767, -347886, -347535, -292626, -169331, -47191, 93203, 334605, 604260, 761877, 772597, 728903, 708486, 634126, 455710, 272215, 187859, 187106, 193675, 179737, 169263, 186155, 221271, 221427, 163019, 106282, 108860, 161978, 204650, 158824, 20225, -89275, -81232, -2338, 82941, 162692, 243397, 322947]
14331C22947L9460n0790j41152j50049r0319m5476n0912r3021j39106j38690q5258
14320f22366j4547J3456k2036n7195k2545O3241J17534P5800r428m4557k7951
14309e50594P435K4505Q834j1154j6643L8976J06858P3432M6965J01610J35502
14298c4274J21121P6511K1729K152Q200Q960L6889J03918J48712J45451R6807
14287G36176K0668m8527j14120j78912j95166j44318n3728j604j2654K3775J17041
14276A48631J38683Q0734K5400l4529j34605k25948k28130j35621k7394M255l4136
14265d22660o2081o0884k2881K5007L295o1054n6141J9430Q1385J21771J44414
14254b90399J42756J14283P1416M4963J7150o756j0052k6478q779K5504J0826
$$ y = [322947, 362407, 311617, 170465, 20416, -69903, -115379, -166291, -259312, -398418, -537108, -622366, -636913, -623457, -645493, -702688, -725233, -661992, -544458, -468658, -478086, -522643, -550594, -543159, -518654, -509820, -520974, -537617, -498641, -391783, -318351, -271386, -169776, -34274, 86847, 163358, 185087, 187239, 195439, 204399, 241288, 345206, 493918, 639369, 736176, 756844, 708317, 594197, 415285, 220119, 75801, 22073, 20469, 7815, 31590, 148631, 287314, 368048, 393448, 358919, 224314, -1634, -229764, -365385, -392779, -388524, -422660, -484741, -545625, -568506, -543499, -540204, -601258, -657399, -637969, -556584, -434813, -290399, -147643, -33360, 38056, 83019, 100169, 93413, 83361, 56883, 48104, 73608, 84434]
14243H4434J912l590r565k2298l2042l1257q4705j53426j20329J0271J29870J51036
14231g9689Q0113o551o7550p9361n5307o4150j07800j02119n7003m7419l288J28493
14219d61631K22473J54670J2950p5234p6615j8622K8828J7134j2931j3767K1208
14208b01537M7321K2492j2155k1977j6491k1987j6111M3863R7460M8509m9926
14197h0539n4457L4284J13021J30668M9415m7497q0150j02078j36678j46388j52878
14186d73277j36696p8706K093Q4138J37378J26778O2571m265k6111J2849K3537
14175b69711m3187n4939N0377J22472Q2629K8770Q23l3339n1303n9648p3255K416
14163b97895J50081J97053J16796k3517j23386j12306o9064m0439P207O6270Q7810
$$ y = [84434, 86346, 82756, 73191, 50893, 18851, -12406, -97111, -250537, -370866, -360595, -230725, -79689, 424, -6127, -73677, -153038, -208345, -272495, -380295, -482414, -539417, -586836, -590124, -461631, -239158, -84488, -71538, -146772, -223387, -242009, -213181, -196047, -208978, -222745, -201537, -154216, -131724, -143879, -165856, -182347, -204334, -220445, -176582, -79122, -30613, -80539, -134996, -100712, 12309, 142977, 192392, 144895, 64745, -37333, -174011, -320399, -473277, -609973, -688679, -686586, -602448, -465070, -338292, -275721, -279986, -306097, -293248, -269711, -312898, -367837, -317460, -194988, -112359, -83589, -82766, -116105, -167408, -227056, -300311, -297895, -147814, 49239, 166035, 142518, 19132, -93174, -162238, -202677, -195470, -129200, -41390]
14152d1390O3556k4855j25250j68195j59780r7581k5614k139J5455N1009J9478
14141d95306l8775l4611k7227m6586m9926J518N7257M6535J813l7563q2742j18325
14129h23938j19673j10544q6196k7055K8351P1911Q8215N2397K8309L1050M8844
14118h18329Q9165J33549J88045K40319K34858J31978J8612q648J443J545J700
14107B14237Q558M0352O4531K7348k8327l7138m4785j01700j16047l5826O7468
14096E8671J35392J44158P9117N484l5037o0753l4897K6696O0036M2639p249n3516
14084C60741o5220l5844J7958O2531M8987o886q4531j59595j83152j58574j24491
14073c28076j42481j85041j32710J2554J56124K70805L13232K63808J53147Q847
$$ y = [-41390, 22166, -2689, -127939, -296134, -455914, -553495, -579109, -581248, -565793, -514784, -495306, -534081, -568692, -595919, -642505, -692431, -690913, -633656, -587121, -585308, -622871, -705613, -823938, -943611, -1054155, -1140351, -1167406, -1139055, -1067144, -978929, -926532, -898223, -867173, -818329, -729164, -595615, -407570, -167251, 67607, 199585, 218197, 209549, 210992, 212537, 214237, 222795, 263147, 327678, 355026, 326699, 289561, 244776, 143076, 27029, -8797, 58671, 194063, 338221, 417338, 422822, 387785, 327032, 292135, 318831, 378867, 421506, 414257, 360741, 295521, 259677, 277635, 340166, 389153, 382267, 297736, 138141, -45011, -203585, -328076, -470557, -655598, -788308, -775754, -619630, -348825, -35593, 228215, 381362, 390209]
14063C90209q5356r6650o7364m7262q2144j34696j11156k7921M9286R5980J01634
14052a5440N9469n7546j90099j92674l6917J20195J65146J34416Q0982M2935J2887
14041A23354k5916n6718j04074j28726n5306O0618J03475N0841p070l6659l7569
14030a13750n7253j05340j00163l4268P3617J87847J92036Q4676n0227j23999
14020d6824q2915j3066J6667K038l7072l6405K1666R7317J43778J48236J58631
14009C72051J88955K03527J54043K456j50168k06423k32529k18110j25626o3125
13999g4949o1299m1090m3770q9494j46928j77748p9520Q3466J17121L1029k0405
13988e03587J0486O6776P9120K7582l7124l9287r704M991N8439J40583J75993
$$ y = [390209, 304853, 208203, 140839, 93577, 11433, -123263, -234419, -262340, -213054, -117074, -15440, 44029, -13517, -203616, -396290, -433207, -313012, -147866, -13450, 67532, 110467, 123354, 97438, 40720, -63354, -192080, -247386, -186768, -83293, -32452, -39522, -76181, -113750, -171003, -276343, -376506, -410774, -337157, -149310, 42726, 127402, 77175, -46824, -129739, -142805, -126138, -124100, -161172, -197577, -175911, -78594, 65184, 213420, 372051, 561006, 764533, 918576, 921032, 770864, 564441, 331912, 113802, -11824, -74949, -136248, -177338, -221108, -310602, -457530, -635278, -714798, -631332, -514211, -483182, -503587, -493101, -426325, -347205, -319623, -356747, -396034, -405738, -400747, -342308, -201725, -25732]
13977b5732J46876J22928P8713K687j8884J3236L7732j1235j07903j23072k8556
13966H6790N1931M8379L8099L1032L275j5761m6467j00701j45370j78334j97611
13955d24738j48954l0879L3356j0452n6294o7689l6146N0824R0350O1534O6470
13944d72618J29991J56210J08565M6512J503l0244o9591j36190j73050j52903
13934e91815p2066K0191K0104l2718l9691j7394j77N0585J26081J57473R9095
13923b80332j1104p8497l1860L8327M2510j658k5720J2956R4132J38528Q4565
13912a8153l932k7017M2040J19693Q7931p018r2692j42960j59683j37188j45730
13901d84709j40177j1075J39616J99987J71693J19487M5513n7536j19494j24171
$$ y = [-25732, 121144, 244072, 322785, 325472, 306588, 319824, 357556, 346321, 238418, 115346, 86790, 138721, 187100, 225199, 256231, 259506, 243745, 197278, 96577, -48793, -227127, -424738, -573692, -604571, -571215, -581667, -637961, -705650, -741796, -690972, -600622, -539088, -472618, -342627, -186417, -77852, -31340, -29837, -60081, -129672, -265862, -438912, -591815, -663881, -643690, -623586, -656304, -695995, -713389, -713566, -662981, -536900, -379427, -280332, -291436, -369933, -401793, -363466, -320956, -322614, -348334, -335378, -241246, -102718, -18153, -22085, -49102, -7062, 112631, 200562, 193544, 100852, -42108, -201791, -338979, -484709, -624886, -635961, -496345, -296358, -124665, -5178, 40335, -17201, -136695, -260866]
13891b60866r9867p1469l7170L2232P1184Q866r6110j12933m1836N0831R8442
13880d58696P7836o226r8797r9414m0831K9048P4861K4450l7526k1488L5540P3763
13868d47480O9951N1306P1083R1392N4283L7679O8088P9248N9903K7470l1937
13857A30986j02868j35651j29405j05394m1429K7957N8758O7365Q3515P9272N6611
13846a0283P9322Q6422q831j07533j10612m1177O9102J61471J83741J53440R9379
13835E54441J7138n0032m5594k364l2486j23724j54730n2756P4236J06446P1514
13824C62089P5327J31251J12206L4594j7017l8292p5404j13839j11349r3684o5368
13813B00514j0953M3686J09092J83531J76984R3549J7543o4609j28536r8670k9532
$$ y = [-260866, -360733, -432202, -469372, -437140, -365956, -357090, -453200, -566133, -607969, -557138, -458696, -380860, -387086, -485883, -585297, -626128, -597080, -522219, -497769, -535295, -556783, -521243, -447480, -377529, -326223, -255140, -163748, -109465, -71786, -3698, 75550, 135453, 162923, 130986, 28118, -107533, -236938, -342332, -383761, -355804, -297046, -229681, -146166, -66894, -10283, 69039, 155461, 146630, 39097, -71515, -112692, -43590, 117881, 301622, 455062, 554441, 571579, 521547, 475953, 473589, 441103, 317379, 162649, 109893, 184129, 290575, 362089, 437416, 568667, 680873, 715467, 698450, 660158, 584754, 470915, 359566, 265882, 200514, 189561, 233247, 342339, 525870, 702854, 796403, 813946, 749337, 620801, 522131, 492599]
13802D92599K461J2112l261J1587J09687J97101J74378R0711K5919J1623J5180
13791A140097k3227r6528j07216n1282l3600o3008j08003j48681j49035j20062
13781B39455p2246J1684J01821J53419J50532Q8472k637r3555j44621j85822k26949
13770A9553j77260l6987J09343K08238K22865J53037Q7729P8247M0184q3528k31968
13759C89453l09453k37670j04242k7754L7376R5018Q0481M7612L4393J1747K4339
13748D1300O9993J14232J09657O0212J9768j2233l8476o2475q8444j14301j48382
13737d9149q4111P2830J64736J11630l7750j05899o7508l8001m8659n9059o7996
13726b08936n8505L833J13067J69669J14639K1420l629J3176M5698Q5709Q5103
$$ y = [492599, 495060, 507172, 503911, 515498, 625185, 822286, 996664, 1087375, 1113294, 1124917, 1140097, 1116870, 1020342, 913126, 861844, 828244, 765236, 657233, 508552, 359517, 239455, 167209, 178893, 280714, 434133, 584665, 673137, 670500, 576945, 432324, 246502, 19553, -157707, -194694, -85351, 122887, 345752, 498789, 586518, 664765, 704949, 621421, 389453, 80000, -157670, -261912, -289666, -252290, -157272, -76791, -29179, 5214, 16961, 41300, 111293, 225525, 335182, 395394, 415162, 402929, 364453, 301978, 213534, 99233, -49149, -133260, -60430, 104306, 215936, 178186, 72287, 4779, -33222, -81881, -140940, -208936, -267441, -263608, -150541, 19128, 133767, 155187, 151558, 164734, 210432, 296141, 381244]
13715C81244K9567o8973j62063k04430j83389j28945j08617r1986n9684J134R6328
13704d99814J37899J00325M7563J2931M054J6952j3597m5701l1834m3759j01059
13693d16040r5921K189M7609J9742L556p895j9407K6470J39046J87542J13584
13682D75k016o8876m8720j0169k8038o6348m0008J8337M4575J8713p223R519P7164
13669a02615J51197J49931J08009J14106J48472J50652J22676M0257o2453r7787
13659G22445o3415j7588l0691o3623o1271p8604j33662k06809k44094j78529o7382
13648d23223K1888P7914Q0850M3109Q255R907L8816K7080J2165q516p7139j35610
13636c24504j11893q3159q3447j9285O6024R6443J06405J47782J78388J52419
$$ y = [381244, 410811, 341838, 179775, -24655, -208044, -336989, -445606, -537592, -597276, -596142, -499814, -361915, -261590, -214027, -201096, -197042, -180090, -193687, -239388, -271222, -314981, -416040, -511961, -509772, -462163, -442421, -438865, -446760, -466167, -439697, -300651, -113109, 475, -1541, -70417, -119137, -129306, -157344, -223692, -263700, -245363, -200788, -182075, -189298, -179779, -102615, 48582, 198513, 306522, 420628, 569100, 719752, 842428, 882685, 820232, 722445, 659030, 641442, 610751, 547128, 485857, 407253, 273591, 66782, -177312, -355841, -423223, -401335, -323421, -242571, -199462, -191207, -181300, -142484, -115404, -103239, -111755, -188894, -324504, -436397, -519556, -603003, -622288, -556264, -459821, -353416, -205634, -27246, 125173]
13626A25173J13961Q8992N3220L0748L6948P5986J26509R8672k2776j11147j48080
13615D68206j90076j81488o2817Q8849J79193J63570K8436j04735j04155l6568
13605B48415L2272R6444P5527k6630j35270j85343j89039k02039k03500j70440
13595f59603j12187j7691P4787J05567P6825K0723R635O2207P6788N9520O2945
13584b40484N1173J5482k3493q1128j06147p7035n0329l4732K4316J25668J98093
13573a98616J87297J20516L5159j0941M9385J67507K22654J52184K4768o4876
13563F85037j20173j57197j69486j50381j08102m2412K8487M3784M7081N6459
13553A13097N9307N7595k601j16531j74539j47767r2940k4980K2171J9797P106
$$ y = [125173, 239134, 328126, 381346, 412094, 449042, 525028, 651537, 750209, 727433, 616286, 468206, 278130, 96642, 33825, 122674, 301867, 465437, 493873, 389138, 284983, 248415, 280687, 377131, 452658, 426028, 290758, 105415, -83624, -285663, -489163, -659603, -771790, -789481, -714694, -609127, -532302, -511579, -501944, -439737, -362949, -303429, -240484, -189311, -173829, -197322, -278450, -384597, -461632, -511961, -546693, -522377, -396709, -198616, -11319, 109197, 144356, 133415, 182800, 350307, 572961, 725145, 749913, 685037, 564864, 407667, 238181, 87800, -20302, -62714, -34227, 9557, 56638, 113097, 172404, 229999, 227398, 110867, -63672, -211439, -304379, -329359, -307188, -287391, -280285]
13542b80285K1492M8497P8174Q9078J4142p9873m6409Q1819J62257J29114L3760
13531B51766m8049j00403j21120r8272n2528m1801m8602o4860q8867j07253j02630
13520f22619j06683j37740j45666j02251L00J27667K28822K65558K14125J44886
13510a33601J17210J18625Q0252Q042J1215N2057K4080o9616j71771j98680j28724
13499b90911l0452J4461L3254K6880p564j6527j6996j7148K1770N4523K0456k7337
13487b35591m5050j646O2357M5317l3384j15392j58825j22192m4542K803N5513
13476e90632J11157J20643R6470L4990k3969l8337l2964j6289J9992O5363Q4232
13465a69344Q4161R8623J41185J61530J16469K7483o4626r5973m5773L5061R4077
$$ y = [-280285, -258793, -210296, -132122, -43044, -28902, -108775, -155184, -73365, 88892, 218006, 251766, 203717, 103314, -17806, -116078, -168606, -210407, -259009, -323869, -412736, -519989, -622619, -729302, -867042, -1012708, -1114959, -1114659, -986992, -758170, -492612, -278487, -133601, -16391, 102234, 182486, 190528, 201743, 253800, 277880, 208264, 36493, -162187, -290911, -321363, -306902, -273648, -246768, -254332, -270859, -287855, -305003, -283233, -228710, -208254, -235591, -280641, -282287, -219930, -174613, -207997, -323389, -482214, -604406, -648948, -646145, -590632, -479475, -358832, -262362, -227372, -251341, -289678, -322642, -338931, -318939, -253576, -169344, -85183, 13440, 154625, 316155, 432624, 460107, 395481, 299508, 253735, 288796, 382873]
13454C82873Q6345J9042m4968j12837j57421j04171N808J15703K23434K57835
13444F71643J59651J5495p4625j10971j00738o8029m8546l7119p6904j59980j87247
13433a7370j34451m6639J1770M6313Q7914J13244Q2879K5528p124k9160k7319
13422A05585K7917O2432L98q5000q2138k3728L2010N0379M9195Q1467J24739J03303
13410D46559Q254q5545j21118j03345p1920o7905r0439q9351m0277M1798Q5275
13399h8014N2676q52j8199l4899p1653n6859L2485J65755K29919J24852o0346
13388B74865j55168j16336k5095L0316M4459N2804P4759Q4432O6435N1482M9812
13377D32765K9013l9758j09049j26732j01348r1135l3156Q2039J59139J96080
$$ y = [382873, 469218, 488260, 443292, 330455, 173034, 68863, 74671, 190374, 413808, 671643, 831294, 846789, 772164, 661193, 560455, 492426, 443880, 406761, 329857, 169877, -17370, -151821, -198460, -186690, -140377, -52463, 60781, 143660, 169188, 162064, 132904, 105585, 133502, 195934, 196332, 111332, 29194, 5466, 37476, 87855, 137050, 218517, 343256, 446559, 454813, 369268, 248150, 144805, 72885, 4980, -85459, -174810, -215087, -173289, -88014, -35338, -36190, -54389, -89288, -160941, -217800, -185315, -19560, 210359, 335211, 274865, 119697, 3361, -21734, 8582, 53041, 105845, 180604, 265036, 331471, 382953, 432765, 461778, 422020, 312971, 186239, 84891, -6244, -39400, 42639, 201778, 397858]
13367C97858J93190J38928L8145p9286j46493j66997j62596j18145m7738L79K6684
13356G3929J6722n7401j07258o7212l4584o0312o0799k7518n3807p9171J0417
13345d46994J06923R8443K7543L0222J23021J50589N7062o8347j19998p4800j1617
13334a27953K2786J8997J3961K2597K6488K9105L4402M1440K8351L3842Q1897
13323B25913J09667Q7175P9987J30522J87171J35329k1746j60110k00389j42638
13313D30881l9956L3231P3634Q5665L8248r900P36L9774O5942L3130n4482j09328
13301E87575j14673p0468K4923O1221k3712j06983n4087O2769J08796J04805O9853
13290F50019j072o3146p0703m6704k5487k3928l0962k5448L940M8880N6089N1241
$$ y = [397858, 591048, 729976, 768121, 688835, 542342, 375345, 212749, 94604, 46866, 47245, 73929, 90651, 33250, -74008, -141220, -175804, -236116, -296915, -324433, -378240, -457411, -446994, -340071, -241628, -214085, -183863, -60842, 89747, 146809, 78462, -41536, -116336, -127953, -105167, -86170, -72209, -49612, -23124, 5981, 40383, 81823, 110174, 144016, 225913, 335580, 422755, 502742, 633264, 820435, 955764, 934018, 773908, 573519, 430881, 390925, 424156, 497790, 583455, 621703, 611803, 612539, 652313, 718255, 751385, 696903, 587575, 472902, 402434, 427357, 488578, 464866, 357883, 303796, 366565, 475361, 580166, 650019, 648947, 585801, 515098, 468394, 442907, 418979, 388017, 362569, 366509, 415389, 471478, 522719]
13278E22719O9651R5681J03502J21010J47051J18544L4926m5713r2246q6387l5031
13267I53707J5920M3400K0992p8854j69927j55185q2576k0009J2384K0905q925
13256E51832q7350j26012o9123P970K8551J1549k437k772k73j3023l7557n8786
13244B02569n7101k0506K2630J8619Q366Q1245J80445J99989J57622J02598K0002
13233I16478j01682k13078k45585j83345r5234l1621K1938N4715P3049P2771K9636
13222B98042j6529j7417k4858o3182l8609L6558O4676N8212N2782O2910R7316
13211E09901J29592J47430J41371P9536l3378p4854l2279l1723r2821j26051q0121
13200E36603N325N5257N8806M7705L2005J3225R159M7366J02990J17854Q4087
$$ y = [522719, 592370, 688051, 791553, 912563, 1059614, 1178158, 1213084, 1167371, 1075125, 988738, 953707, 969627, 1013027, 1034019, 955165, 785238, 630053, 547477, 527468, 539852, 560757, 551832, 464482, 338470, 269347, 277317, 305868, 317417, 314980, 312208, 311935, 298912, 261355, 202569, 145468, 124962, 147592, 166211, 174577, 255822, 436267, 636256, 793878, 896476, 916478, 814796, 601718, 356133, 172788, 77554, 45933, 67871, 122586, 195635, 268406, 298042, 281513, 264096, 239238, 176056, 137447, 174005, 238681, 296893, 349675, 412585, 509901, 639493, 786923, 928294, 1007830, 974452, 899598, 867319, 835596, 742775, 616724, 536603, 541928, 597185, 655991, 703696, 735701, 748926, 758085, 805451, 908441, 1026295, 1110382]
13189A110382K7927L765p285m3830n2621j6062p321l5697m5925j3439N2808R3774
13177A066476P1887J8133j6534j3629J2951Q4938J66272J96644J91714J94128
13167A972980K09204J74437M0227j61788l07402k90683j61932n2196k5013l7369
13157A360465n8358o7714l7331K6313O7943O2991m340r3679j31982q4622L984
13146A043670Q5337J45764J54584J21309R3938J24524J65939J65934J34085O2937
13136B298021r401m8356n8446o7167r3983j70658k44563j88054n4965N8882J19843
13125A541153J36137J28766N6313o5393j47760j80998j93715j70896j23594r0316
13115H89697p1310o2266o3409m7136M815J08429K10121K06391R7330k3476n2466
$$ y = [1110382, 1138309, 1142074, 1134789, 1090959, 1038338, 1022276, 1014955, 979258, 933333, 919894, 972702, 1066476, 1138363, 1156496, 1139962, 1126333, 1139284, 1224222, 1390494, 1587138, 1778852, 1972980, 2182184, 2356621, 2396848, 2235060, 1927658, 1636975, 1475043, 1422847, 1397834, 1360465, 1302107, 1234393, 1197062, 1223375, 1291318, 1354309, 1349969, 1256290, 1124308, 1039686, 1043670, 1129007, 1274771, 1429355, 1550664, 1644602, 1769126, 1935065, 2100999, 2235084, 2298021, 2288620, 2240264, 2181818, 2114651, 2020668, 1850010, 1605447, 1417393, 1362428, 1421310, 1541153, 1677290, 1806056, 1862369, 1796976, 1649216, 1468218, 1274503, 1103607, 980013, 889697, 818387, 756121, 692712, 645576, 650391, 758820, 968941, 1175332, 1272662, 1249186, 1196720]
13104A196720J8670J04840J19798P7516M3840K6818J3089K9258L7329j0533p0032
13093A587313j01346q6962n0339j3326m409M4206J70413K34224J60866M4947j6110
13082A969477l9466k7910M4355J18503R8916p862r0764q7237j14101j94082j86808
13071A483021r4058K769N2832O5112P0991R3462J44806J91133J92062J41214O1939
13060B405283J1723K774J0179O6450J52552J58881N8279k0391R754R2205J59484
13049C107173J53895R3056L8552m468k3896p675j1859k2593N858K8879K9256M8151
13037C434329J05233J53560J51983J16145Q1317M8961L6771O4621J11176J19860
13027D423956J02722J23590J54360J57219J55354J28369R6039J02936J26553J03155
$$ y = [1196720, 1215390, 1320230, 1440028, 1517544, 1561384, 1588202, 1601291, 1630549, 1667878, 1657345, 1587313, 1485967, 1399005, 1348666, 1335340, 1330931, 1375137, 1545550, 1779774, 1940640, 1985587, 1969477, 1930011, 1902101, 1946456, 2064959, 2163875, 2156013, 2065249, 1978012, 1863911, 1669829, 1483021, 1388963, 1391732, 1444564, 1509676, 1580667, 1674129, 1818935, 2010068, 2202130, 2343344, 2405283, 2417006, 2419780, 2429959, 2496409, 2648961, 2807842, 2866121, 2845730, 2855484, 2947689, 3107173, 3261068, 3354124, 3392676, 3388208, 3364312, 3356637, 3344778, 3322185, 3328043, 3356922, 3386178, 3434329, 3539562, 3693122, 3845105, 3961250, 4042567, 4091528, 4128299, 4192920, 4304096, 4423956, 4526678, 4650268, 4804628, 4961847, 5117201, 5245570, 5341609, 5444545, 5571098, 5674253]
13017E674253N8239O1263J05228J73737L01144M32939N04362N09464M27249L25313
13007H573191L01803L20193M02628N52773O34090O39992N99451O03737P13177
12998A3341035P96976Q62133J052897J380434J752100K058568K275360K465334
12990B5984837K753248L239721L905075M699000N585233O595601P791161R246738
12982F9800614J1058894J3347592J6210667J9748019K3984165K8703033L3037984
12975B15890968L4851473L0578387J7244004l046507k2270449l3346365l5615480
12968B04286031l2594785k7702310k2793272j8475359j4861475j2009053r781931
12961F6067846q008976o628551n557638m710406m009315l403172k854844k391089
$$ y = [5674253, 5732492, 5793755, 5898983, 6072720, 6373864, 6806803, 7311165, 7820629, 8247878, 8573191, 8874994, 9195187, 9597815, 10150588, 10784678, 11424670, 12024121, 12627858, 13341035, 14138011, 15000144, 16053041, 17433475, 19185575, 21244143, 23519503, 25984837, 28738085, 31977806, 35882881, 40581881, 46167114, 52762715, 60553876, 69800614, 80859508, 94207100, 110417767, 130165786, 154149951, 182852984, 215890968, 250742441, 281320828, 298564832, 295518325, 273247876, 239901511, 204286031, 171691246, 143988936, 121195664, 102720305, 87858830, 75849777, 66067846, 58058870, 51430319, 45872681, 41162275, 37152960, 33749788, 30894944, 28503855]
12953B8503855k061084j831343j615772j399911j266291j197560j088231r35101
12945A7108562p65914o08135n29286m99801m29165l67559m15049m98538m71299
12936A2523816l59924k78984k42129j98427j23500m1265J4463O1162J15096J27076
12926A1597384J20528J55136J96288K26611L04078M29260N75030O90855P75995
12917A5071165Q75416R56394R62437Q47069O11720L80130L40500N10618O90577
12908B1246026Q23843J024129J374721J832519K301496K806387L371448L995808
12900C8776377M708417N554630O637690Q023075R715727J1752726J4236171J7292721
12892A16697534K1096377K5643364L0555927L4650039L5324937K8702335J2493540
$$ y = [28503855, 26442771, 24611428, 22995656, 21595745, 20329454, 19131894, 18043663, 17108562, 16342648, 15734513, 15205227, 14705426, 14276261, 13908702, 13493653, 12995115, 12523816, 12163892, 11884908, 11642779, 11444352, 11320852, 11279587, 11294050, 11355212, 11470308, 11597384, 11717912, 11873048, 12069336, 12295947, 12600025, 13029285, 13604315, 14295170, 15071165, 15946581, 16902975, 17865412, 18712481, 19324201, 19704331, 20044831, 20555449, 21246026, 22069869, 23093998, 24468719, 26301238, 28602734, 31409121, 34780569, 38776377, 43484794, 49039424, 55677114, 63700189, 73415916, 85168642, 99404813, 116697534, 137793911, 163437275, 193993202, 228643241, 263968178, 292670513, 305164053]
12885C05164053r198807k7259742l5863489l6089627l1939741k6565394k1598228
12878A16649025j7511268j4207442j1484381r293963p652408o423850n439448
12871D4636265m589808l854908l251882k795153k458342k192790j933905j713257
12863B1846220j532977j297776j082441j003403r63853q61016p55165o81099o05803
12854A3062687n23309m39939l44419k97331k84847k29504j27123j022N1901j5441
12844A0851653r7357j26268j39959j36679l8328J41196K62964K52705K03531K05241
12834A1378699K43952K73092K76727K53411K79512M05798O15262P96395Q41144
12825A5363992Q50410R28944J048054J207671J429398J672727J942278K235239
$$ y = [305164053, 295965246, 268705504, 232842015, 196752388, 164812647, 138247253, 116649025, 99137757, 84930315, 73445934, 64151971, 56499563, 50075713, 44636265, 40046457, 36191549, 32939667, 30144514, 27686172, 25493382, 23559477, 21846220, 20313243, 19015467, 17933026, 16929623, 15965770, 15104754, 14349589, 13668490, 13062687, 12539378, 12099439, 11755020, 11457689, 11172842, 10943338, 10816215, 10815193, 10867094, 10851653, 10754296, 10628028, 10488069, 10351390, 10313062, 10454258, 10717222, 10969927, 11173458, 11378699, 11622651, 11895743, 12172470, 12425881, 12705393, 13111191, 13726453, 14522848, 15363992, 16214402, 17143346, 18191400, 19399071, 20828469, 22501196, 24443474, 26678713]
12817B6678713K557502K955457L445845M036205M786088N786731P005816Q390708
12809F5643065J0039028J2156275J4880180J8268303K2310116K6874228L1440711
12802B01611906L4581120L3427068K4327559O519339j4352202k9789538l5963780
12795B20361472l4918537l0457567k5268981k0499902j6458722j3244558j0795838
12788F8717367q894142p359760o151342n247419m518354l872254l305049k831087
12780B6537960k455435k110650j775172j495976j306139j242352j197308j076569
12772A3878359q71024o70210n70053n55484n94773o24107o07038n34702m18774
12763H432194l15485l18236l93103m37200m43493m22185m14454m65136m90858
$$ y = [26678713, 29236215, 32191672, 35637517, 39673722, 44459810, 50246541, 57252357, 65643065, 75682093, 87838368, 102718548, 120986851, 143296967, 170171195, 201611906, 236193026, 269620094, 293947653, 300466992, 286114790, 256325252, 220361472, 185442935, 154985368, 129716387, 109216485, 92757763, 79513205, 68717367, 59823225, 52463465, 46312123, 41064704, 36546350, 32674096, 29369047, 26537960, 24082525, 21971875, 20196703, 18700727, 17394588, 16152236, 14954928, 13878359, 13007335, 12337125, 11767072, 11211588, 10616815, 9992708, 9385670, 8850968, 8432194, 8116709, 7798473, 7405370, 6968170, 6524677, 6102492, 5688038, 5222902, 4732044]
12754D732044m03725k25574n0330L3080L2186j718n7945j10897j47415j70493
12744C629213j45581q9965j6943M4907j2036j43396k16550j82908j38431j22469
12734B605841j03004p6545p5530p9431k9562K5537P128k8054m1931p9322j17124
12723B008003j53070j79207j46019q5217k3660J4164o019n3652q0597p5548n9465
12712A159713l4850m933P710J9089J0939k1462m1341j3969N5577J05731J07035
12701A349239J07557J15389O6966q030n2210l5426o236L29K2569M4488N976q7351
12689A523260j42939r9038k9217r650k9379l4564l6919j9735Q579K709m9765q3230
12677A000112n2113L1815R3612O7674l5560j57079j91045j10480r6O1352O7431
$$ y = [4732044, 4328319, 4102745, 4052415, 4085495, 4117681, 4115963, 4058018, 3947121, 3799706, 3629213, 3483632, 3393667, 3376724, 3421631, 3409595, 3266199, 3049649, 2866741, 2728310, 2605841, 2502837, 2426292, 2350762, 2271331, 2241769, 2267306, 2274434, 2246380, 2204449, 2125127, 2008003, 1854933, 1675726, 1529707, 1444490, 1420830, 1434994, 1428975, 1375323, 1294726, 1219178, 1159713, 1124863, 1119930, 1127640, 1146729, 1157668, 1136206, 1094865, 1080896, 1136473, 1242204, 1349239, 1456796, 1572185, 1639151, 1631121, 1578911, 1543485, 1537249, 1537578, 1560147, 1604635, 1610611, 1523260, 1380321, 1281283, 1252066, 1242416, 1213037, 1178473, 1141554, 1121819, 1130398, 1133107, 1083342, 1000112, 947999, 979814, 1073426, 1141100, 1105540, 948461, 757416, 646936, 646840, 708192, 775623]
12666G75623L1526k0063r4076j80197k08922j54230j04592j00919r7098m1281
12656a94229K6269N3536M9792M5585O1971O0627M4914K8416K5436M4765P8693
12645C25775M5848o3452j47898j60653q2999L3485J06780R7765N2378k389m4102
12634A60538m5171n3720q9799p0241K4321J10280J30393J22060J35115J48327
12624E72103J46788J04307l4008j98413k55309j66161J9661J93877K46566J52767
12614G82178L1012j0985k5181p1065j17723r9137m8493l0788n0731r7352j25784
12603A35951j49393j65713j22937l4120P0485J83614K54785K38273J50688M3684
12593F05317m1442o0168k4681M772K7721L4921K7567O2711J18244J03356L1923
$$ y = [775623, 807149, 787086, 693010, 512813, 303891, 149661, 45069, -55850, -152948, -194229, -167960, -114424, -64632, -19047, 42924, 103551, 148465, 176881, 202317, 247082, 325775, 371623, 308171, 160273, -380, -83379, -49894, 56886, 154651, 207029, 204640, 160538, 115367, 61647, -28152, -98393, -74072, 36208, 166601, 288661, 423776, 572103, 718891, 823198, 789190, 590777, 335468, 169307, 188968, 382845, 629411, 782178, 813190, 802205, 777024, 705959, 588236, 489099, 440606, 409818, 359087, 261735, 135951, -13442, -179155, -302092, -336212, -265727, -82113, 172672, 410945, 561633, 605317, 563875, 503707, 479026, 483798, 511519, 546440, 574007, 636718, 754962, 858318, 890241]
12582H90241k6267q2775j57085j98083j66000j12262m4212N8061J39960J62280
12572D63858J30362M8945M268l938n7983j28014j81075j72042m8044R7059J44563
12561B97959Q5260m5377k05375k85281k23780q1160L7248P3922R1816J26798O7456
12550f0514o4157j18076r2755m1583J7159N5493R0064J55051J70332R4435R323
12539B14772j9550J5890Q1521J11568P9893Q931q2620j43293j23653l7975L7389
12528A42873o88r7455j51310j59970o3456J37371K63050K03047L6875j30401j92809
12517a2873r9654P4208K18461K36521J11425m2363j29600j34020q8178k9122P846
12506A12651J4819J6144K4682M1987N2180M4086N0010K7097l0317j8814P3310
$$ y = [890241, 863974, 781199, 624114, 426031, 260031, 147769, 103557, 161618, 301578, 463858, 594220, 643165, 647433, 643495, 585512, 457498, 276423, 104381, 56337, 153396, 297959, 383219, 337842, 132467, -152814, -376594, -457754, -420506, -346584, -254768, -127970, -60514, -124671, -242747, -335502, -377085, -359926, -304433, -214369, -59318, 111014, 205449, 214772, 195222, 211112, 292633, 404201, 484094, 493025, 410405, 267112, 143459, 105484, 142873, 142185, 44730, -106580, -266550, -330006, -192635, 70415, 273462, 310337, 179936, -12873, -112527, -38319, 180142, 416663, 528088, 485725, 356125, 222105, 133927, 104805, 112651, 127470, 143614, 168296, 210283, 262463, 306549, 356559, 383656, 353339, 334525, 407835]
12495D07835J22431P1743L2383M9129N8627J8054p3819j50261j69450j80704j67874
12484A8094j08512l2862L6346N0894J3770J5570O7752J04825R0345O1657L1483
12473C49362K8189L0673K0606N0541Q2289Q1071L5953n5351j40029k11359k55291
12462A6654k22888j05922N015L2114K4717J4267J52L0210M1731J5975J5279M0583
12450i2113N6085N7588N5166P6756J34207J67774J20966K6530l3874l9287m3700
12439D86098k0278P9036J66460J47644P8641N4632K8549o2245j39697j71342j83688
12428D63810j76292j52312j20615o6126K1769O3701M8479K417q3511j50157j64700
12417c13537j44222p4217J8123J06983J84181K05570J57582R1943O9198N6397
$$ y = [407835, 530266, 602009, 634392, 683521, 742148, 760202, 686383, 536122, 366672, 185968, 18094, -90418, -123280, -86934, -36040, -22270, -6700, 61052, 165877, 256222, 317879, 349362, 377551, 408224, 428830, 479371, 561660, 642731, 678684, 623333, 483304, 271945, 16654, -206234, -312156, -307141, -275027, -250310, -236043, -235891, -205681, -163950, -147975, -132696, -92113, -36028, 21560, 76726, 153482, 287689, 455463, 576429, 602959, 569085, 529798, 486098, 465820, 544856, 711316, 858960, 937601, 992233, 1020782, 958537, 818840, 647498, 463810, 287518, 135206, 14591, -51535, -29766, 33935, 82414, 84831, 1320, -148837, -313537, -457759, -531976, -513853, -406870, -222689, -17119, 140463, 232406, 301604, 358001]
12407C58001M0136J0842l8994m1321J5012R5802J65357J73160J29332J00540O8773
12396A076640j6219j17817j58086j43498q6814j5078k8045p9772q6625p5039j8569
12385B51078L7344O5365Q6090Q7090J00643J25431R7592N0580O9824J27089J39192
12374A237318M4701j09364k37409l18343l03746k12672j11310j3223O2958J04128
12364A43038J12172N4561l5008m3840j0259k7335p6209p7397j7981M4993P1291
12353A38026P7347R0238Q8070j7267k15872l22751k28312o2982o294l1646m9483
12342e40926J635J61083L18900L46038K29264Q4107J337l1852l1741j6950j0938
12331E09957j5206J6383N9222P6546P1735K6838k6269m7025l3645l70j4357q3560
$$ y = [358001, 398137, 408979, 369985, 328664, 343676, 439478, 604835, 777995, 907327, 1007867, 1076640, 1060421, 942604, 784518, 641020, 554206, 539128, 511083, 431311, 344686, 269647, 251078, 288422, 353787, 439877, 526967, 627610, 753041, 850633, 901213, 971037, 1098126, 1237318, 1282019, 1172655, 935246, 616903, 313157, 100485, -10825, -24048, 38910, 143038, 255210, 309771, 274763, 230923, 220664, 193329, 117120, 39723, 21742, 66735, 138026, 215373, 305611, 393681, 376414, 160542, -162209, -390521, -453503, -459797, -491443, -540926, -539291, -378208, -59308, 286730, 515994, 600101, 601438, 569586, 537845, 520895, 509957, 494751, 511134, 570356, 646902, 718637, 745475, 719206, 672181, 638536, 638166, 623809, 540249]
12319E40249j29223j40158j45790j37563j26458q8931q540M4239N1213P3790J08949
12308D1777J09775N6148O45K5271P6615N7629K602m1036q4317j02221k7641O5834
12296A81081O5368J4041m152K3287M5750L6738K8665Q4054J65532J60429M1419
12285H42212r4782j28493l6574O4998J02553Q8784N5430N064m1968q1420j14257
12274F61547j26246o0793K1758M3534K2408j7879n2434n1997l9963o2827r4536
12263B42572o4393M5054J58141K16965K18545J64554Q1299K8979M2024N3702L7416
12252A224858L2023R283j0976l0581q5540j18500r5483r3575j35411k04184k42584
12241B49330j87284p2368J8817N5836M0407r559k4253N4315J40427J40087R5653
$$ y = [540249, 411026, 270868, 125078, -12485, -138943, -227874, -236414, -192175, -140962, -67172, 41777, 151552, 207700, 208345, 233616, 310231, 367860, 370462, 329426, 245109, 142888, 115247, 181081, 246449, 260490, 256338, 279625, 325375, 362113, 390778, 474832, 640364, 800793, 842212, 747430, 618937, 582363, 647361, 749914, 838698, 894128, 899192, 857224, 775804, 661547, 535301, 474508, 496266, 539800, 562208, 544329, 491895, 439898, 399935, 337108, 242572, 178179, 223233, 381374, 598339, 816884, 981438, 1062737, 1091716, 1133740, 1187442, 1224858, 1256881, 1266164, 1255188, 1224607, 1139067, 1020567, 925084, 831509, 696098, 491914, 249330, 62046, -10322, 8495, 64331, 104738, 95179, 70926, 125241, 265668, 405755, 501408]
12230E01408K6711n0761n4657j3666m683n580L7164O2553M1455L8419m795j21633
12218D51935k18251j79804k5824Q5203J02897J14150R7033J9148k0183K3129L2321
12207D81754o7722j76885k10868j70584q6081k8829r864L5206J01585J30184J13791
12196A11687P2686J0627n240J0470l158l1857m8221j5912O0728R0741N1524J2562
12184C16637K1312N4091O5166J7474n9821r4480p1342m1938M248O4566P9292O9945
12172D25150R5289J04481M4322n4363j44713j64380q6654Q787L0730J7272K8153
12161C04074L7535J6305j6320n5399p8166l8459P44o1684j48211j55809q0254
12150b75644N4881J62885J85625P7677o5427j25651j29972j34962j21826o9859
$$ y = [501408, 528119, 477358, 422701, 409035, 404352, 398772, 435936, 498489, 539944, 578363, 573568, 451935, 233684, 53880, 28056, 113259, 216156, 330306, 427339, 446487, 426304, 449433, 481754, 414032, 237147, 26279, -144305, -230386, -259215, -269079, -233873, -132288, -2104, 111687, 184373, 195000, 189760, 200230, 197072, 165215, 116994, 101082, 161810, 252551, 304075, 316637, 337949, 392040, 457206, 474680, 414859, 320379, 249037, 207099, 211347, 275913, 355205, 425150, 520439, 624920, 669242, 614879, 470166, 305786, 219132, 227919, 258649, 275921, 304074, 341609, 357914, 341594, 286195, 208029, 169570, 170314, 108630, -39581, -195390, -275644, -220763, -57878, 127747, 205424, 139997, 14346, -115626, -250588, -372414, -442273]
12140d42273j2631M5624J08033J47588J59263J58982J20097M4863l4886q0819
12130B13841j03207j01805q4998q6935p2637R673R2564J13805R9730J25821J71387
12119C77239J07560j6401o8685K577R0073J31306J63525J38246K9183p3242p7618
12108H03763n422M6976M3000m1980j70237j84933p2884N9114J39651J33746N6190
12097H06984l3149j18210k07258k32080k12848j73375r8701o0789n5206k9885
12087d14517k9258p5298j11128m8373J11398K11956K00994J71250J44123R5234
12077B56381N5887L5953N565j8593k4516n5591r3651j03518q2400o7450k3596
12066a15529O7205J19651J13796O7200r143p6537j34059j66426q5377L1523L8733
$$ y = [-442273, -454904, -409280, -301247, -153659, 5604, 164586, 284683, 329546, 294660, 213841, 110634, 8829, -76169, -163104, -235741, -226068, -133504, -19699, 80031, 205852, 377239, 484799, 468398, 399713, 402290, 492363, 623669, 787194, 925440, 954623, 881381, 803763, 798341, 845317, 888317, 846337, 676100, 491167, 418283, 477397, 617048, 750794, 806984, 773835, 655625, 448367, 216287, 3439, -169936, -268637, -329426, -384632, -414517, -443775, -519073, -630201, -678574, -567176, -355220, -154226, 17024, 161147, 256381, 312268, 348221, 353786, 335193, 310677, 255086, 161435, 57917, -24483, -91933, -115529, -48324, 71327, 185123, 252323, 243180, 166643, 32584, -133842, -219219, -187696, -148963]
12055a48963l6596j42199k14106j94741q4816M5943J24981J22509K8808p2546
12045e71726q3627m2477j1957J8611M8329R3608J49832J55666J06764M8035K5839
12034f3103L018p5772j25715r2252l6136j5638j7933j2486m9333j02425p8597
12023f66372K2351R5803Q7050O2365R565n3324p0970n5691l5289M2516J24122
12012d37874J04007M2507K9852Q6582J69152K54259K83942K07052J22815R5170
12002I57464O7509J3554n6332j28858j93656k05729j23229k3227k0684o7988p6100
11991A42724o7623n5768m676M7134J8868j1021J2332M0360Q4225J38643J61784
11980E06982J22794M3632n6206j71309k57933k18184o3909O3092Q3925R291q7373
$$ y = [-148963, -185559, -327758, -541864, -736605, -821421, -775478, -650497, -527988, -499180, -571726, -655353, -697830, -709787, -691176, -642847, -549239, -399407, -243741, -136977, -88942, -63103, -60085, -135857, -261572, -353824, -389960, -405598, -423531, -436017, -485350, -587775, -666372, -644021, -548218, -461168, -398803, -389238, -442562, -513532, -569223, -604512, -561996, -437874, -333867, -291360, -261508, -174926, -5774, 248485, 532427, 739479, 862294, 957464, 1024973, 1038527, 982195, 853337, 659681, 453952, 330723, 307496, 286812, 218824, 142724, 75101, 19333, 14657, 61791, 80659, 69638, 81970, 122330, 206555, 345198, 506982, 629776, 673408, 617202, 445893, 187960, -30224, -94133, -31041, 52884, 62175, -25198]
11969b5198j33714j59775j66047j69960j49138p5007j833J704n614M1680J28551
11958g14351J67538J46847J43656J83829J75667O7398k5048j5968J851r850P772
11947A29341P0676J25313J28251J07543Q7091N0000j8355n6371o9748p4917p3357
11936D05467q1673r1546q9754m8157N7660J43819J49426Q3224O800k4316j2383
11925D98567K8404M8240N2048K5327l803R286K894j7548l4032m0309l0358m8394
11913D90322p3344k8311R2314J65920J07772m074r2773j35650j17242k2661R8606
11902D80879J80879J99474J33091M8339J582m8115r3899r4294m6241j135M1572
11891H02132J06841J97258K70457K55390J66373N4663k9600o2297n6144n4924
$$ y = [-25198, -158912, -318687, -484734, -654694, -803832, -878839, -880672, -878968, -884582, -842902, -714351, -546813, -399966, -256310, -72481, 103186, 170584, 145536, 129568, 131419, 121569, 129341, 200017, 325330, 453581, 561124, 648215, 698215, 679860, 623489, 553741, 478824, 405467, 323794, 232248, 142494, 94337, 151997, 295816, 445242, 528466, 535266, 510950, 498567, 526971, 575211, 627259, 652586, 648783, 658069, 660963, 643415, 609383, 569074, 538716, 490322, 416978, 388667, 480981, 646901, 754673, 750599, 657826, 522176, 404934, 382273, 480879, 661758, 861232, 994323, 1042662, 1044244, 996129, 902230, 807936, 761695, 760560, 802132, 908973, 1106231, 1376688, 1632078, 1798451, 1853114, 1823514, 1761217, 1705073, 1650149]
11881A650149o7497m8392j8745k1791m6882l9176l6077o5822o6237k3469K5841
11870A241902N1816N2356M5270J5360l6415n2756j4642Q957K7050P2666J09093
11859A520657J15780Q1580J0532o6185j24151j09090m0239j210J247j1859j2185
11848A364877K8300Q6123J07387O4500n269l451O0426J07710J37455J75854K04047
11837B327959J71175N6119r2151k35474l09561k65231j70817q0281j3687J6657
11827A404708K6949K8312n470n6852p8474r3707q8394o9662l6875K9815P5572
11816A135922Q2744O4026K6644j7656j4190J1890J9371P0818J53460J67710J00913
11805A801652Q3077J73932K65982K74780K60958K75388L04503L04755K40038J27471
$$ y = [1650149, 1582652, 1534260, 1515515, 1493724, 1446842, 1407666, 1371589, 1305767, 1239530, 1216061, 1241902, 1293718, 1346074, 1391344, 1406704, 1370289, 1317533, 1302891, 1311848, 1338898, 1411564, 1520657, 1636437, 1718017, 1728549, 1662364, 1538213, 1429123, 1388884, 1387674, 1388921, 1377062, 1364877, 1393177, 1479300, 1586687, 1651187, 1645918, 1642467, 1702893, 1810603, 1948058, 2123912, 2327959, 2499134, 2555253, 2463102, 2227628, 1918067, 1652836, 1482019, 1401738, 1388051, 1404708, 1431657, 1459969, 1454499, 1397647, 1319173, 1225466, 1137072, 1067410, 1030535, 1060350, 1135922, 1218666, 1282692, 1309336, 1291680, 1277490, 1289380, 1308751, 1379569, 1533029, 1700739, 1801652, 1884729, 2058661, 2324643, 2599423, 2860381, 3135769, 3440272, 3745027, 3985065, 4112536]
11795D112536K0525o8854j26249j01137l0428l7972j51508k92433l95648m06220
11785B522612l21997k10380j37238r1846p2562o6253j9296J3628o709j9367q676
11774A581916O764O533o2066k44784l75125k99655o1172J67259K05863R9201P653
11763A032387m985K506O407R067j2829l9088l0292r739j2557j8934k0887m2897
11751H58159o0716m0480L0857J33854J86454J75816J50430J21641R9849O9106
11741A724970J6424l8816n4751j4853J8998m638q7111j57644j09487M9046K21409
11730A563547L04684K93872K57530J95907J41464J49902J84491K13081K49001
11721C553479L26229M42803N60120O67042P53010Q79148J076732J324922J577918
$$ y = [4112536, 4133061, 4064207, 3937958, 3836821, 3806393, 3768421, 3616913, 3324480, 2928832, 2522612, 2200615, 1990235, 1852997, 1761151, 1688589, 1622336, 1603040, 1616668, 1609959, 1590592, 1581916, 1588680, 1595213, 1533147, 1288363, 913238, 613583, 552411, 719670, 925533, 1024734, 1032387, 1027402, 1029908, 1036315, 1045382, 1032553, 993465, 963173, 953434, 940877, 921943, 901056, 858159, 797443, 756963, 787820, 921674, 1108128, 1283944, 1434374, 1556015, 1655864, 1724970, 1741394, 1702578, 1647827, 1632974, 1651972, 1647334, 1560223, 1402579, 1293092, 1342138, 1563547, 1868231, 2162103, 2419633, 2615540, 2757004, 2906906, 3091397, 3304478, 3553479, 3879708, 4322511, 4882631, 5549673, 6302683, 7181831, 8258563, 9583485, 11161403]
11712A1161403J814914K047469K142135J925097J374711N92418j98522p45728
11704B0113897r77124r96922r11140q01096o86815o66069p89695r47514j039959
11695A2297563j072373j044464r46383q54978p95795o85493n18581l32751j37972
11686E908773J8362J03042J46608K42341L93264N56567P21675R10974J136199
11677A0137805J400832J595357J567567J221748M88670m72325j298808j704542
11669A2936304j728114j555702j315441j111341r80483q87250p72576o60834n72707
11660C351856m27016k54146j72310j84777k10369j76562q4815O128K6547j5158
11650A859378q6042j36932j02745l5258p28Q114K344j454j8541k9488o635k9253
$$ y = [11161403, 12976317, 15023786, 17165921, 19091018, 20465729, 21058147, 20859625, 20113897, 19136773, 18139851, 17228711, 16427615, 15740800, 15074731, 14285036, 13337522, 12297563, 11225190, 10180726, 9234343, 8379365, 7583570, 6898077, 6379496, 6046745, 5908773, 5927135, 6030177, 6176785, 6419126, 6812390, 7368957, 8090632, 9001606, 10137805, 11538637, 13133994, 14701561, 15923309, 16411979, 15939654, 14640846, 12936304, 11208190, 9652488, 8337047, 7225706, 6245223, 5357973, 4585397, 3924563, 3351856, 2924840, 2670694, 2498384, 2313607, 2103238, 1926676, 1841861, 1847989, 1874536, 1859378, 1773336, 1636404, 1533659, 1498401, 1497673, 1505787, 1508131, 1506677, 1488136, 1458648, 1452013, 1422760]
11638A422760j20440j71345j47172k4707J21356J24027K2685o1777j26369j24300
11628I14718k2003P1141N4737n2383j90116k60693k01477p4846M3000J10376J31171
11617E23625J03449N622p2025n0276m641N345j6423k3778L9554J11441J60423
11606G82316K21105K22298J06681n1945j96992l02861l28211k74516k06323j71335
11596a99783j63288j44674r3896q0090p1572q302N5034J15266J76741K38022K69371
11585I2829K41375J39921k6386j20345r6806o9106o9072o1438p1558r2060q2258
11574b14904l6393M090j5528j12539j93731j87760j34597o6468K8911J12901J35631
11563f80387J20861Q1738M3092K5397R521j8677n2903q1206j09015r7367l1843
$$ y = [1422760, 1302320, 1130975, 983803, 959096, 1080452, 1204479, 1227164, 1165387, 1039018, 914718, 892715, 963856, 1018593, 966210, 776094, 515401, 313924, 239078, 282078, 392454, 523625, 627074, 632696, 560671, 510395, 505754, 511099, 494676, 470898, 510452, 621893, 782316, 1003421, 1225719, 1332400, 1280455, 1083463, 780602, 452391, 177875, -28448, -199783, -363071, -507745, -601641, -681731, -753303, -761605, -706571, -591305, -414564, -176542, 92829, 334204, 474125, 447739, 327394, 230588, 161482, 92410, 30972, -40586, -132646, -214904, -251297, -247207, -262735, -375274, -569005, -756765, -891362, -957830, -928919, -816018, -680387, -559526, -477788, -434696, -409299, -399778, -418455, -471358, -552564, -661579, -758946, -790789]
11552g90789N5027J33963J85058J80452J23892M0917l9572o5886l0515J3230J9962
11541a74261L9742J04451J29144R4249J9014o4762q0618m3878j8278L318O951
11530A5072j4576k7754J2854R8577J47002J02761j6872j00599j06832o4599o598
11519C8436J3487r778k1180j894L874l9861p0979l1763M4985O0794k475n4557
11507g0911q0742j20915j21273p9638j1379Q2934J30713P0215m2658j18999j60715
11496e23368j04900L6041J37240K08724K43494K07574O5804p4957j03085j04128
11486a1561j36651j64378j11132j2832K8905J7186j1694l3161l0713P37M8745
11475d16549M3736k0747j02645j03558K551R1232R2545L5885r567j6059k9797
$$ y = [-790789, -735762, -601799, -416741, -236289, -112397, -71480, -111052, -176938, -207453, -194223, -174261, -134519, -30068, 99076, 193325, 212339, 147577, 66959, 23081, 4803, 8121, 15072, 496, -27258, -14404, 84173, 231175, 333936, 317064, 216465, 109633, 45034, 38436, 51923, 42145, 20965, 19071, 22945, -16916, -87895, -119658, -74673, -13879, -16354, -70911, -151653, -272568, -393841, -473479, -484858, -401924, -271211, -200996, -243654, -362653, -523368, -628268, -592227, -454987, -246263, -2769, 204805, 270609, 195652, 92567, -11561, -148212, -312590, -423722, -436554, -407649, -390463, -402157, -435318, -466031, -465294, -416549, -372813, -393560, -496205, -599763, -597212, -505980, -413435, -377550, -387117, -403176, -432973]
11464d32973m8145n2480l2781m307N73k5073o4119j00601r1239M030Q0122Q1431
11452f85562Q6116J43892K41186K61662J48191J9924J423L2576K4189J382k481
11441B72498J7861L5417Q567n8645j34896j73977j79585j61668r9141j2271K8110
11430d57730L5208L5278j933o4370r0480q0923m4103K6935N8563L8539K9387J03777
11418d11852K45859K86816J37426k3475n1576m288L7585N6606L2635R348M2464
11407C57548J00866J03833M7331J8737J7706k412o1130p4017o619J6819l6946
11396D81716r0945j22445j66595j98782k05243j72422m6477J07702J84300J67004
11386f2187J08966L1857l3603l1050k767k0822p9272j03243p4567n4491q1662
$$ y = [-432973, -481118, -533598, -566379, -570686, -570113, -595186, -659305, -759906, -851145, -847115, -766993, -685562, -599446, -455554, -214368, 47294, 195485, 215409, 216832, 249408, 273597, 274979, 272498, 290359, 325776, 334343, 275698, 140802, -33175, -212760, -374428, -473569, -485840, -457730, -422522, -387244, -389177, -453547, -544027, -624950, -669053, -642118, -583555, -545016, -515629, -411852, -165993, 120823, 258249, 234774, 183198, 178910, 216495, 273101, 305736, 315084, 357548, 458414, 562247, 609578, 628315, 646021, 643609, 582479, 508462, 501843, 518662, 481716, 390771, 268326, 101731, -97051, -302294, -474716, -521193, -413491, -229191, -62187, 46779, 78636, 45033, 13983, 11216, -9606, -88878, -192121, -266688, -321179, -402841]
11375d02841j21101j35580j20511r9951q3878k0980N5170J15974J66153J92906
11365d54639J99431J56587Q0393J7147l8225j25791j83703j55055j03633n2874
11355f60362o629J2534M262m612J3520N2892N6826J2804m2966q0881l522J53591
11343d92543K64843K81797K17596J12573j4221j26740j29776j363J27014J34446
11333C73626L3690n8716q9584q9109p2953m5269l5152p2793j29764j71088j33150
11322d90262m4193K9271N2531M0011J8872j010K373J362l0639m7531m5904o9204
11310e84323p4766m9496n4564p8307l6669M4410P4424N3242M3723J15083K08509
11299c38734J96465P9653k5287l3932J5620L4224m9830j67150j90192j31597o4583
$$ y = [-402841, -523942, -659522, -780033, -879984, -963862, -984842, -929672, -813698, -647545, -454639, -255208, -98621, -18228, -1081, -39306, -165097, -348800, -503855, -607488, -660362, -666991, -654457, -650195, -654807, -641287, -588395, -531569, -518765, -561731, -642612, -646134, -492543, -227700, 54097, 271693, 384266, 370045, 243305, 113529, 112166, 239180, 373626, 407316, 348600, 259016, 169907, 96954, 51685, 16533, -56260, -186024, -357112, -490262, -534455, -505184, -452653, -412642, -393770, -394780, -392407, -391045, -421684, -469215, -515119, -584323, -659089, -708585, -763149, -841456, -878125, -833715, -759291, -706049, -662326, -547243, -338734, -142269, -62616, -87903, -121835, -106215, -71991, -121821, -288971, -479163, -610760, -675343]
11288f75343J482P9108J16117J09970Q8091O2063M3905K1336j9843p0374j00751
11277c44239j30981j15171k5296M8890M8858l072m8063m0288M9260J37239J31675
11266b91188O3468L457l5365n1113m1788m1905n0037k6065L0481J5860n1995o3858
11254e40048j7615O2677J87178K71112K40886J79402J36958Q0423J9487o1459
11244E59001j55423k27392k41927j81768q9137l7938o270N5373Q6153N9199J4151
11233a65978m4652q1840m2305J7618J0018o68M2450N2750K7733o465n7573j01311
11221c50223j14824j08355p5541j1647O3678Q3028K8622Q06J4977N7965J11399
11210c00115J31935Q5628k4405j38674j68361j02579k2126J6211P937L269N0775
$$ y = [-675343, -673861, -594753, -478636, -368666, -280575, -218512, -174607, -153271, -173114, -243488, -344239, -475220, -590391, -615687, -566797, -517939, -521011, -569074, -609362, -560102, -422863, -291188, -227720, -224263, -259628, -310741, -352529, -394434, -444471, -470536, -440055, -424195, -476190, -540048, -557663, -494986, -307808, -36696, 204190, 383592, 520550, 600973, 620460, 559001, 403578, 176186, -65741, -247509, -336646, -374584, -380854, -325481, -239328, -180129, -165978, -210630, -292470, -334775, -317157, -307139, -307807, -265357, -212607, -184874, -191339, -248912, -350223, -465047, -573402, -648943, -660590, -596912, -513884, -485262, -484456, -469479, -411514, -300115, -168180, -82552, -106957, -245631, -413992, -516571, -538697, -522486, -514549, -511280, -460505]
11199d60505J06491J01862P0809O4733P0024R6351J37286J25733N4824k9970r3078
11188B44560r0786n6698m9815k5335N5506J37600J11948k3130j34148j32634q1550
11177d4482j1238R5044J72667J59538J01754N6248p905p5767j30325j94206k26451
11166a05123j59803k7648O3325P9500R6012J46275J80493J51542Q6551J9490k2345
11155E08269j0797N4170J10892Q7170L4485q996r6293j69420j64205j22040m4487
11144A78748P0973J55227J38801N4276k1536j10418j85271j47270n9291j6415
11134E7824j1857m559m0772q8453n8306J5915R5797J63463J88165J23802l115
11123D37904q6103o3970P726k0978j24760j67827j28817o3842k6646l842N9515
$$ y = [-460505, -354014, -252152, -181343, -116610, -46586, 49765, 187051, 312784, 367608, 337638, 244560, 153774, 97076, 47261, 21926, 77432, 215032, 326980, 303850, 169702, 37068, -44482, -55720, 39324, 211991, 371529, 473283, 529531, 521626, 445859, 315534, 121328, -105123, -264926, -292574, -229249, -149749, -53737, 92538, 273031, 424573, 511124, 530614, 508269, 497472, 551642, 662534, 749704, 784189, 775193, 678900, 509480, 345275, 223235, 178748, 249721, 404948, 543749, 598025, 576489, 466071, 280800, 133530, 74239, 57824, 45967, 41408, 636, -87817, -146123, -130208, -34411, 129052, 317217, 441019, 437904, 351801, 287831, 295557, 274579, 149819, -18008, -146825, -210667, -237313, -241155, -181640]
11112a81640J71455K32665J71947M5351q0011j53657j88791j89380j47890m4557
11102c64508N1319M2716m9328j27317j27664p8351R399J10528J30820N8643J6162
11091c27581M5057P8600P1942K4936j2724J787J1531Q58K1640N9994R2167R1555
11079A59762P594j07807j67645j58650j21124n7392L3996R7856Q7073P1362J49738
11068e237K66422K89116K35857J96890J29565o601j29685j70480j12614m7561
11058F45672q0558j71195k31006k04451r3653K6072O4822K3297l0551k9320J4166
11047f6705M6844K7038n0374r9975o1107N5263J52338J67822J37893O9763m0027
11036C38773j28629j51163j04780m256N7065L9r0544q2721K2516R0591Q5128M5496
$$ y = [-181640, -10185, 222480, 394427, 439778, 359767, 206110, 17319, -172061, -319951, -364508, -313189, -270473, -319801, -447118, -574782, -653133, -643734, -533206, -402386, -343743, -327581, -282524, -203924, -131982, -107046, -119770, -117983, -106452, -105594, -83954, -23960, 68207, 159762, 167356, 59549, -108096, -266746, -387870, -445262, -411266, -313410, -226337, -154975, -5237, 261185, 550301, 786158, 983048, 1112613, 1106012, 976327, 805847, 693233, 645672, 565114, 393919, 162913, -41538, -135191, -109119, -44297, -21000, -51551, -80871, -66705, -19861, 7177, -43197, -143172, -204279, -149016, 3322, 171144, 309037, 378800, 338773, 210144, 58981, -45799, -50055, 7010, 7049, -83495, -166216, -143700, -53109, 32019, 77515]
11024G7515K1366M3132L9866j1139n1999k4588J7083q918j10026k04844k12565
11013d25117j17581L1589J54650J68643R2044K5123L4601Q8435J14780J35500
11003C02667J60303J37405N7161k7208j04179j80787k18979j83297j00185j5709
10993a72808N1123J30928J92620J61503P9626j6029p9414o5739l7012j3358Q0573
10982C12013J53981Q1691k3546l6140o9299j50596j69726j54033j25595o8905
10972b50155L1556J39789J84691J59646J03437L2778m5814j27172j89857k07115
10962a68216j77925j11286j0485M9502M030j9417L6061N9081N3905N2242L3694
10951a98814J9721K3508M0046P0965J29726J60770J25219N2178j7580k7158J4408
$$ y = [77515, 98881, 142013, 181879, 170740, 118741, 94153, 111236, 102318, -7708, -212552, -425117, -542698, -511109, -356459, -187816, -95772, -70649, -36048, 52387, 167167, 302667, 462970, 600375, 657536, 630328, 526149, 345362, 126383, -56914, -157099, -172808, -121685, 9243, 201863, 363366, 442992, 426963, 347549, 281810, 244798, 231440, 312013, 465994, 547685, 524139, 487999, 418700, 268104, 98378, -55655, -181250, -250155, -218599, -78810, 105881, 265527, 368964, 401742, 355928, 228756, 38899, -168216, -346141, -457427, -467912, -418410, -414380, -433797, -397736, -338655, -284750, -232508, -198814, -179093, -155585, -115539, -44574, 85152, 245922, 371141, 423319, 405739, 378581, 392989]
10940C92989O2785Q6800N3639r743l4768j3809J670j1494q087L2960Q8697R5469
10928G37108K3537q1913j77135j98171j00231L5841J02104R2105O2956K1467m521
10917E13147k9950r3190j56969k18660k74441l04395k31308o4875Q2549J84417
10907e93675K28017K13541K22930K43077J75294M3724o6197r1466l7278J1898
10897C49865K0319N039q946j6630o7223j29572j67396j75211j28453k8019K6382
10886c19845J0252K7279J01907J73005K08987J62270L2372l9443l485K6741J0252
10875C90292K5992N7975K1118m8228o2057n9866r8369j79330k19513j74384j18187
10864d64557o0506Q462R3381K03537K50992J82740O6180l4512j25136j78764j12151
$$ y = [392989, 455774, 542574, 596213, 586470, 551702, 537893, 539563, 528069, 519982, 552942, 641639, 737108, 760645, 678732, 501597, 303426, 203195, 239036, 341140, 433245, 496201, 517668, 513147, 483197, 390007, 233038, 14378, -260063, -564458, -795766, -860641, -778092, -593675, -365658, -152117, 70813, 313890, 489184, 532908, 466711, 375245, 337967, 349865, 370184, 375223, 366277, 349647, 282424, 152852, -14544, -189755, -318208, -346227, -319845, -309593, -282314, -180407, -7402, 201585, 363855, 396227, 356784, 353299, 380040, 390292, 416284, 474259, 495377, 447149, 385092, 325226, 226857, 47527, -171986, -346370, -464557, -525063, -516601, -423220, -219683, 31309, 214049, 280229, 245717, 120581, -58183, -170334]
10853a70334M5333J73161K34329K70069K10860M2461q7592r0039q3726j62424
10843C82098j87693r4341J0527N7180K1872o9747j17103m9609P9342J53536J52384
10832C38446J10547Q2667P6593Q351j01971j15599K521J52096K00259J35063M0931
10821I29904j8806p0502j33052j70183j38399p6512m3895J8352J15781J84420
10811E97108K01590J72082J15512M1617j5502j4071J6843M3683L3260m6893j38629
10800A006600j94503k18710j97928j41871r8412o7009m0551j3285K2583K5405
10790H2319o1745j54981j42680r6286n5215q338L2935O8533R0170M6392l6272
10779b35168n1845k4973j6430n0197r4837q9002j8947N2747N9220L1970K3478
$$ y = [-170334, -125001, 48160, 282489, 552558, 763418, 805879, 718287, 628248, 544522, 382098, 194405, 100064, 110591, 167771, 189643, 119896, 2793, -46816, 32526, 186062, 338446, 448993, 531660, 608253, 616604, 514633, 399034, 401555, 553651, 753910, 888973, 929904, 911098, 840596, 707544, 537361, 398962, 322450, 278555, 296907, 412688, 597108, 798698, 970780, 1086292, 1127909, 1112407, 1098336, 1115179, 1158862, 1192122, 1145229, 1006600, 812097, 593387, 395459, 253588, 155176, 88167, 47616, 34331, 56914, 82319, 20574, -134407, -277087, -373373, -428588, -436926, -403991, -335458, -245288, -198896, -235168, -287013, -311986, -328416, -378613, -473450, -562452, -581399, -528652, -469432, -437462, -413984]
10768d13984K8059M7644J23341J85835J25224P849n1303o1617n8358k5006M843
10757h7473l3077p8621n3807l8348m0225J7295O3869O2318P5431J12414J70272
10746A70048J94577R7866m6247r6547r6477j24497j37180j16368j06759j17182
10736c78766q9393J3864J32870K28167K67551J98235K6474j21017j29300l7336
10726A11349R6985J79528J06035k6899p8818p1621m1661L771K2531K5541L7571
10715C64312J1717j06771k16923k08429j48941q8738k8595J1946N5425P6352O4604
10704b14041P6597Q8168Q8923Q4996O9922M0792Q204k4595j02933j71596j12194
10693a67757M2895J39865R2198J4932J3697L0360K1309j3051l2692k847R321k7420
$$ y = [-413984, -385925, -338281, -214940, -29105, 96119, 103968, 52665, -8952, -67310, -92316, -87473, -120550, -199171, -252978, -291326, -331551, -314256, -250387, -188069, -112638, -224, 170048, 364625, 462491, 416244, 319697, 223220, 98723, -38457, -154825, -261584, -378766, -468159, -454295, -321425, -93258, 174293, 372528, 399002, 277985, 148685, 111349, 208334, 387862, 493897, 466998, 388180, 316559, 274898, 278669, 301200, 326741, 364312, 376029, 269258, 52335, -156094, -305035, -393773, -422368, -410422, -354997, -278645, -214041, -137444, -49276, 39647, 124643, 194565, 235357, 243561, 218966, 116033, -55563, -167757, -124862, 15003, 107201, 122133, 135830, 166190, 187499, 174448, 141756, 138909, 148230, 120810]
10681A20810n9393p8604p3377o0150m1262j2420M997L7369J04073J46878J20648
10670B09569P9694K9962j5539l8552n7605j16610j72957j10957P3513K15795J67603
10659B63916j2649j43425j77069j54089o5652L5816M0944l3286q0457p1982k9786
10648d27719J8883N5280Q9285J42769J70605J26914O1330K9884Q0628J37570Q7595
10637E73024l8292j65160k30431k17311j61965j06022n6408j1882K6857O2298
10627c25292Q6394O7267J7941m4825p7532m1552J1153N2294O2090O2459P0154
10616e9449N6350k385o9333j19145j34129j52419j82803j63973r6347l4639J4810
10605i43462J02361J73410J63576Q5933P210l834J0331m780l1288o373N0833O2255
$$ y = [120810, 61417, -17187, -90564, -150714, -191976, -204396, -199399, -162030, -57957, 88921, 209569, 289263, 319225, 303686, 265134, 207529, 90919, -82038, -192995, -119482, 96313, 263916, 251267, 107842, -69227, -223316, -288968, -253152, -212208, -245494, -325951, -397933, -427719, -408836, -353556, -264271, -121502, 49103, 176017, 237347, 267231, 347859, 485429, 573024, 534732, 369572, 139141, -78170, -240135, -346157, -402565, -414447, -387590, -325292, -238898, -171631, -153690, -198515, -276047, -317599, -306446, -254152, -192062, -129603, -59449, -3099, -5484, -74817, -193962, -328091, -480510, -663313, -827286, -923633, -958272, -943462, -841101, -667691, -504115, -418182, -410972, -414806, -404475, -409255, -440543, -446916, -396083, -333828]
10593c33828L9864j868o5951j08135m5423Q6968J52936J30759P7201K5778q579
10582e0278n454M4884L4828n9020j01451n5634l883k2767q8137j46548j68288
10571f21748j39792n7129M9440J07869R0264O1247P3538Q6266Q7398R4177R6553
10560g1917R2277Q3230K2928q6222j43244j02093j4824N8155R6786P6856K0794
10549C2726J5231M3977M2326K2294O662j9936r081L8477O562j38967k82803k69865
10537e12397r4853J32236K67860K13471Q5758N8020J09363J25383Q1406L0594
10527D96841M2669Q0418J01807R9396M4161o285k0499j1008L5741O6851K9263
10516I59355m8686j06248j46066j31924r2299j22641j68733j17613K9285J42215
$$ y = [-333828, -293964, -295832, -361783, -469918, -515341, -428373, -275437, -144678, -67477, -41699, -50278, -55732, -10848, 23980, -35040, -136491, -192125, -196008, -218775, -306912, -453460, -621748, -761540, -818669, -769229, -661360, -571096, -509849, -436311, -350045, -262647, -168470, -71917, 20360, 103590, 126518, 40296, -102948, -205041, -219865, -161710, -64924, 11932, 32726, 47957, 91934, 134260, 156554, 163216, 143280, 134199, 172676, 179238, 40271, -242532, -512397, -607250, -475014, -207154, 6317, 92075, 150095, 259458, 384841, 466247, 496841, 539510, 619928, 721735, 821131, 865292, 859007, 838508, 827500, 863241, 930092, 959355, 910669, 804421, 658355, 526431, 434132, 311491, 142758, 25145, 54430, 196645]
10506A96645J52464Q1710K4466K4347k0776r3135r2965n2173j5745J788m0027
10495A66599p0227o5526n1885l5059k3599m4090o5013j0643M4054N7345M3460
10484e4584K1152K5188N8923Q4992O0773l456p1244j12673j40381j94135k20913
10473e46358j89239j00290L4990J34815J72889J81952J72131J59323J48793J51069
10463C20075J22875K6681l7779l3686l2434m3599q4127j97408l07224l27480k75404
10452h69510j62805o645J26750J84885J62072J14451J12943J30207J18888R8392
10442I628R9768P7988K7098k607L85J4235J3116K014K4608O8078P6927L7936K9148
10429D78322P0843M6927l6227p1957k6759K3378L5326n386r7270j52282j20670
$$ y = [196645, 349109, 430819, 455285, 479632, 458856, 365721, 272756, 220583, 204838, 206626, 166599, 96372, 30846, -21039, -56098, -79697, -123787, -188800, -199443, -155389, -98044, -54584, -33432, -8244, 50679, 135671, 196444, 192988, 121744, 9071, -131310, -325445, -546358, -735597, -835887, -800897, -666082, -493193, -311241, -139110, 20213, 169006, 320075, 442950, 469631, 431852, 398166, 365732, 322133, 238006, 40598, -266626, -594106, -869510, -1032315, -1038960, -912210, -727325, -565253, -450802, -337859, -207652, -88764, 9628, 109396, 187384, 214482, 211875, 212260, 226495, 239611, 241625, 266233, 334311, 411238, 449174, 478322, 549165, 596092, 559865, 487908, 461149, 484527, 519853, 514467, 417197, 264915, 144245]
10418A44245k6042M5082K9861k8517p0378o5178l5950p176L0297R1474J33248
10407B40966Q6712j9282q9030p9073l3985j3715p6350j31022j01631q0391q9976
10396c86777r0333n8753K5700J10605J19163O7582M5952Q3481J16652J27445J04875
10385B65592M0595k3644m7991K6622J08596P1880j1645p3177j07706r0984n3602
10374A04536n4170n8811n8428n5344l8546R706N5463J5068p6765r3904j0562N8162
10362b03595J04298J33425N7430k4758l3505l9615n5530n2410j6953J5458O495
10351a09260j0368J6671L1835J8213R648l6310j01401r3818l4418k3638m6059
10340c78905q0424p0133K4432Q5759Q1047N4264j650n6713p3125m0308K1675P1059
$$ y = [144245, 118203, 163285, 193146, 164629, 94251, 29073, -6877, -14053, 16244, 107718, 240966, 327678, 308396, 219366, 140293, 106308, 92593, 16243, -114779, -216410, -296801, -386777, -477110, -535863, -510163, -399558, -280395, -212813, -166861, -83380, 33272, 160717, 265592, 306187, 282543, 234552, 261174, 369770, 441650, 430005, 356828, 249122, 158138, 104536, 50366, -8445, -66873, -122217, -160763, -151057, -95594, -80526, -157291, -251195, -261757, -203595, -99297, 34128, 91558, 66800, 33295, -6320, -61850, -114260, -131213, -115755, -109260, -119628, -102957, -71122, -52909, -43261, -79571, -180972, -274790, -309208, -332846, -378905, -459329, -529462, -505030, -419271, -338224, -283960, -285610, -342323, -415448, -455756, -434081, -363022]
10328c63022J21814J50911J10329L8330l3964q6844o1132q591j5158m6486l3816
10317b27629Q50O0813Q4745N540o4181n5701j3200J6131L0996N9058M2146q965
10305f9397r792L7350N0687J9043k8164o2487n7198p1553o6148j9532K033j702
10293b76860K7614J14707J63729Q5115n83o11j0894m2470o9692p6412p6779n7423
10281b20559k3991k2730m6510o4317m2651p500K8890O7574Q2554P9551P4357M3434
10269e1898J45k6941o5829j00415q8038p7062j22735j39356r5502o0706l1832
10258h60169l4841n5156p1576k2175R5516J96056K12553J58887J34598J52781
10248i3526R9994l0547q9874k7869L8006L5267j613n0089p7961p0957l5006K3548
$$ y = [-363022, -241208, -90297, 20032, 58362, 24398, -62446, -123578, -132169, -147327, -193813, -227629, -226779, -165966, -81221, -75681, -139862, -195563, -208763, -192632, -161636, -102578, -60432, -69397, -79189, -41839, 8848, 27891, -273, -62760, -119958, -191511, -257659, -277191, -275158, -276860, -249246, -134539, 29190, 114305, 113722, 113111, 102217, 59747, -9945, -86357, -163136, -220559, -244550, -267280, -313790, -378107, -420758, -428258, -399368, -331794, -249240, -169689, -95332, -51898, -51753, -78694, -144523, -244938, -332976, -410038, -532773, -672129, -767631, -828337, -860169, -895010, -950166, -1021742, -1043917, -948401, -752345, -539792, -380905, -246307, -93526, 6468, -24079, -113953, -141822, -103816, -68549, -70162, -120251, -198212, -269169, -304175, -280627]
10236b80627O7735Q3628N7741L6169M6088L124q0479r4438m3965L0018J02909
10225g2097J13916K9073r1902j65173j48604n8123J633k7250m3888j7662j0900
10214d90977j4578L4601J40724K29187K70023K67520K40489K37806K11783J79318
10204A305896K17621K67927K87780L27319L22431J88810K7148m7836j08040k38042
10194B551014l59436l80191k72439p7691J04505J54583M8107p8402j36044j32440
10184A421566q3413l3764j6871j5990J730R744k6080k2978J9091K5017K3073M812
10172A305937p1968j85466k42808k03299r5765R167L7662L185m3482m7000p384
10161D58779N2758O7932j5386j17230j57656j53211j39461j50629j75199j62466
$$ y = [-280627, -212892, -129264, -71523, -35354, 10734, 13858, -66621, -161059, -205024, -175006, -72097, 41819, 70892, -21010, -186183, -334787, -392910, -391277, -418527, -462415, -480077, -490977, -505555, -470954, -330230, -101043, 168980, 436500, 676989, 914795, 1126578, 1305896, 1523517, 1791444, 2079224, 2406543, 2728974, 2917784, 2944932, 2897096, 2789056, 2551014, 2191578, 1811387, 1538948, 1461257, 1565762, 1720345, 1768452, 1690050, 1554006, 1421566, 1338153, 1304389, 1287518, 1271528, 1273258, 1283002, 1256922, 1233944, 1253035, 1278052, 1301125, 1305937, 1233969, 1048503, 805695, 602396, 506631, 515798, 553460, 556645, 513163, 466163, 458779, 511537, 579469, 564083, 446853, 289197, 135986, -3475, -154104, -329303, -491769]
10151d91769j18700l145J15324J58054J69665J46223P7101K1675Q651N999j301
10140H7777l130K6702R3614J52532J54547J07235O7391L6727K4682P8166J56193
10129I82436K05017J95861J94005K16268K16957J96232J64614J61076K10113K24267
10119B966846J55576P4099j0613j64301l30796l75315k99260k17308j68158j08686
10109A522084o8963p4336j06939j34955j77568k06755j43020m7575m8633q2610
10099D30730n8095j7681J0625K2713n83n987M0988P6624P3955N5245K0167k1310
10087F27391l5689k4856m3360o3324n4905j7129L973l6978p4904k0806P4142Q1386
10075D14941J3528k4078N633M5018K3437k4273m5187k4552J6029M0194O333j3287
$$ y = [-491769, -610469, -613614, -498290, -340236, -170571, -24348, 52753, 74428, 83079, 89078, 87777, 84647, 111349, 204963, 357495, 512042, 619277, 686668, 723395, 748077, 826243, 982436, 1187453, 1383314, 1577319, 1793587, 2010544, 2206776, 2371390, 2532466, 2742579, 2966846, 3122422, 3196521, 3185908, 3021607, 2690811, 2315496, 2016236, 1798928, 1630770, 1522084, 1453121, 1378785, 1271846, 1136891, 959323, 752568, 609548, 561973, 513340, 430730, 372635, 354954, 365579, 388292, 387709, 381722, 422710, 499334, 573289, 628534, 648701, 627391, 591702, 566846, 523486, 460162, 405257, 388128, 392101, 355123, 280219, 259413, 333555, 414941, 428469, 404391, 410024, 455042, 478479, 454206, 409019, 384467, 400496, 440690, 447023, 433736]
10063D33736J3359j8985r5016j31519j16197q6588m6460j066O904j7185J0298
10052d8719P1611R6833M8144m927J2782L4950K8900L8524Q2806J18000O8610k9939
10040E17575r6453r9852m9675k0572m8468o6984m5017j2391Q854K7840N3738M2629
10028B11224P246M4891J28414J91864J80552P1549k8899r9306j64772j81322j02654
10017B58787O8180K26694K87517K94461L56190M28021L79666K67032J23978r3942
10007B596584k69739k98737k45868j60090n9361k1754r6763k20492l12223l08737
9997F02820j64040K252O7469M5336O44k748M4526O7714K7286j3723k9916o7052
9985E80568j36509k21685k61778j93858l9776O8110N0295j9632m6164k1925M1474
$$ y = [433736, 447095, 428110, 333094, 201575, 85378, -1210, -47670, -48736, -41832, -59017, -48719, 22892, 119725, 167869, 162942, 175724, 210674, 239574, 278098, 360904, 478904, 547514, 517575, 421122, 321270, 271595, 251023, 202555, 135571, 90554, 78163, 87017, 114857, 168595, 211224, 218470, 263361, 391775, 583639, 764191, 835740, 806841, 707535, 542763, 361441, 258787, 326967, 553661, 841178, 1135639, 1491829, 1919850, 2299516, 2566548, 2690526, 2596584, 2326845, 2028108, 1782240, 1622150, 1562789, 1541035, 1444272, 1223780, 911557, 602820, 438780, 441032, 508501, 553837, 554481, 551733, 596259, 663973, 691259, 677536, 647620, 580568, 444059, 222374, -39404, -233262, -273038, -204928, -154633, -174265, -220429, -242354, -200880]
9974b00880J17868J36764R8042O5030R5930J14324L9955n0455l0741O9268J41791
9963E96896J04781j9625j04769j27362j10568m6735M4369J14223J32409J32555
9953G16174J25535R5919M7478k098j1309K9770J06459J96726K21600J53129Q9093
9942A768476Q0391J03572J43431J69732J46523M5291o9943j30051j60900j58158
9932A938364j45194j88737k60010k90341k21153r7179j352M3462Q9842J50164
9922A017866J75587J32607J13522J48805J58421J65017K26813K95453L48240L59257
9912C141588K80365J25724p6773k64513l36138k77866j81051j44661j46191j43137
9902A977347j96395k74965k74729j92529j11150o0273k7909M838N3250J08067
$$ y = [-200880, -83012, 53752, 151794, 216824, 312754, 427078, 467033, 416578, 385837, 455105, 596896, 701677, 682052, 577283, 449921, 339353, 292618, 336987, 451210, 583619, 716174, 841709, 937628, 985106, 983008, 971699, 1001469, 1107928, 1304654, 1526254, 1679383, 1768476, 1848867, 1952439, 2095870, 2265602, 2412125, 2457416, 2387473, 2257422, 2096522, 1938364, 1793170, 1604433, 1344423, 1054082, 832929, 735750, 734398, 777860, 867702, 1017866, 1193453, 1326060, 1439582, 1588387, 1746808, 1911825, 2138638, 2434091, 2782331, 3141588, 3421953, 3547677, 3470904, 3206391, 2870253, 2592387, 2411336, 2266675, 2120484, 1977347, 1780952, 1505987, 1231258, 1038729, 927579, 867306, 839397, 844235, 897485, 1005552]
9892A005552J40560J45605J28810J14946J23202J43308J54669J62313J20949o111
9882B233803j72462k67222k00387q4320q1741j07040q0974l1039J8929L3182k6664
9871A234065j20165j32024n1520L3066Q3222J19112J39102J41059J42027J50504
9861A738448J22938L3790o7382q1178M4545K17986K85177J97118P0060P0141K00771
9850B832414L47225M21219L51260J57910n4801k35909l66709m05543l61203l30425
9840B355438l06868k41788k00561j96899j79186j14001m5451m553L1333J7663
9830A115127n9859j13347n4494O8221J64571K09987K53540L32601L82795L63227
9820B662369L25400L25645L09874K06870K6600j76176l26459l50805k94151k06180
$$ y = [1005552, 1146112, 1291717, 1420527, 1535473, 1658675, 1801983, 1956652, 2118965, 2239914, 2233803, 2061341, 1794119, 1593732, 1509412, 1427671, 1320631, 1239657, 1208618, 1227547, 1260729, 1234065, 1113900, 981876, 930356, 963422, 1046644, 1165756, 1304858, 1445917, 1587944, 1738448, 1861386, 1895176, 1827794, 1746616, 1791161, 2009147, 2294324, 2491442, 2561502, 2631643, 2832414, 3179639, 3600858, 3952118, 4110028, 4055227, 3819318, 3452609, 3047066, 2685863, 2355438, 2048570, 1806782, 1606221, 1409322, 1230136, 1116135, 1070684, 1066131, 1097464, 1115127, 1055268, 941921, 887427, 955648, 1120219, 1330206, 1583746, 1916347, 2299142, 2662369, 2987769, 3313414, 3623288, 3830158, 3856758, 3680582, 3354123, 3003318, 2709167, 2502987]
9810B502987j26480j34497k22616k66253k21053j33925m7577m5990j28670j91877
9800I84049j69159j01275n5950m0746n7398q7567j07532r7289p5303o1582m5268
$$ y = [2502987, 2376507, 2242010, 2019394, 1753141, 1532088, 1398163, 1350586, 1304596, 1175926, 984049, 814890, 713615, 657665, 616919, 559521, 471954, 364422, 267133, 191830, 130248, 84980]
$$ [...]
##END NTUPLES=NMR SPECTRUM
##END=
