##TITLE=C13_SR157-K3-TFAA6
 CDCl3, 22400 sc

 6.6.2023
##JCAMPDX= 6.0         $$ Bruker NMR JCAMP-DX V2.0
##DATA TYPE= NMR SPECTRUM
##DATA CLASS= NTUPLES
##ORIGIN= UXNMR, Bruker Analytische Messtechnik GmbH
##OWNER= root
$$ XWIN-NMR		Version 3.5
$$ Wed Jun  7 13:42:02 2023 Russian Standard Time (UT+4h)  she@DPX200
##.OBSERVE FREQUENCY= 50.327896
##.OBSERVE NUCLEUS= ^13C
##.ACQUISITION MODE= SIMULTANEOUS
##.ACQUISITION SCHEME= undefined
##.AVERAGES= 22401
##.DIGITISER RES= 17
##SPECTROMETER/DATA SYSTEM= spect
##.PULSE SEQUENCE= zgpg30
##.SOLVENT NAME= DMSO
##.SHIFT REFERENCE= (INTERNAL, DMSO, 0, 222.624)
##AUDIT TRAIL= $$ (NUMBER, WHEN, WHO, WHERE, WHAT)
$$ ##TITLE= Audit trail, XWIN-NMR		Version 3.5
$$ ##JCAMPDX= 5.01
$$ ##ORIGIN= Bruker BioSpin GmbH
$$ ##OWNER= she
$$ F:/spectra/data/she/nmr/c13/1/pdata/1/auditp.txt
$$ ##AUDIT TRAIL=  $$ (NUMBER, WHEN, WHO, WHERE, WHAT)
(   1,<2023-06-07 13:40:14.89 +0400>,<she>,<DPX200>,
      <created by zg, POWCHK disabled, PULCHK disabled
       terminated by command 'halt'
       configuration hash MD5:
       00 E9 B6 7A A2 85 ED C7 34 08 36 98 17 FE 4E 26
       data hash MD5: 32K
       44 61 5D 56 44 55 44 68 E8 D7 5B 52 AC 79 9E DA>)
(   2,<2023-06-07 13:40:25.35 +0400>,<she>,<DPX200>,
      <Start of raw data processing
       efp BC_mod = 2 LB = 2 FT_mod = 6 PKNL = 1 PHC0 = -388.0178 PHC1 = 30.96414 SI = 32K 
       data hash MD5: 32K
       4C 4A 07 45 B2 C9 C7 2D F5 AF 36 0C 6C 1C 3D 64>)
(   3,<2023-06-07 13:40:34.01 +0400>,<she>,<DPX200>,
      <abs ABSG = 5 
       data hash MD5: 32K
       4B E7 69 DA BD 58 8D 11 99 26 29 F6 8A 1F 36 4C>)
(   4,<2023-06-07 13:41:04.92 +0400>,<she>,<DPX200>,
      <pk PHC0 = 2.59267 PHC1 = 0.3999976 
       data hash MD5: 32K
       5C 7A 22 0A 1A 28 CA 31 73 AD F1 45 9D E6 FD 3B>)
(   5,<2023-06-07 13:41:08.31 +0400>,<she>,<DPX200>,
      <abs ABSG = 5 
       data hash MD5: 32K
       DB 28 06 13 3C 34 EE 00 6B CF 0B C9 F9 0E DE B8>)
$$ ##END=
$$ 
$$ hash MD5
$$ 1C E1 62 70 5E 52 31 A7 32 F9 DB E8 18 34 33 9F
##$RELAX= 
##$RELAX= 
##$RELAX= 
##$RELAX= 
##$RELAX= 
##$RELAX= 
##$RELAX= 
##$RELAX= 
$$ Bruker specific parameters
$$ --------------------------
##$DU= <F:/spectra>
##$EXPNO= 1
##$NAME= <c13>
##$PROCNO= 1
##$TYPE= <nmr>
##$USER= <she>
##$AMP= (0..31)
100 100 100 100 100 100 100 100 100 100 100 100 100 100 100 100 100 100 
100 100 100 100 100 100 100 100 100 100 100 100 100 100 
##$AQSEQ= 0
##$AQ_mod= 1
##$AUNM= <au_zg>
##$AUTOPOS= <>
##$BF1= 50.322709
##$BF2= 200.13
##$BF3= 50.322709
##$BF4= 500.13
##$BF5= 500.13
##$BF6= 500.13
##$BF7= 500.13
##$BF8= 500.13
##$BYTORDA= 1
##$CFDGTYP= 0
##$CFRGTYP= 5
##$CHEMSTR= <none>
##$CNST= (0..31)
1 1 145 1 1 1 1 1 1 1 1 1 1 1 1 1 1 1 1 1 1 1 1 1 1 1 1 1 1 1 1 1 
##$CPDPRG= <waltz16>
##$CPDPRG1= <>
##$CPDPRG2= <waltz16>
##$CPDPRG3= <>
##$CPDPRG4= <mlev>
##$CPDPRG5= <mlev>
##$CPDPRG6= <mlev>
##$CPDPRG7= <mlev>
##$CPDPRG8= <mlev>
##$CPDPRGB= <>
##$CPDPRGT= <>
##$D= (0..31)
$$ [...]
##$SUBNAM4= <"">
##$SUBNAM5= <"">
##$SUBNAM6= <"">
##$SUBNAM7= <"">
##$SUBNAM8= <"">
##$SUBNAM9= <"">
##$SW= 239.972175391363
##$SWIBOX= (0..15)
0 1 3 0 0 0 0 0 0 0 0 0 0 0 0 0 
##$SW_h= 12077.2946859903
##$TD= 32768
##$TD0= 1
##$TE= 0
##$TE2= 300
##$TE3= 300
##$TEG= 300
##$TL= (0..7)
120 120 120 120 120 120 120 120 
##$TP= (0..7)
150 150 150 150 150 150 150 150 
##$TP07= 0
##$TPNAME0= <>
##$TPNAME1= <>
##$TPNAME2= <>
##$TPNAME3= <>
##$TPNAME4= <>
##$TPNAME5= <>
##$TPNAME6= <>
##$TPNAME7= <>
##$TPOAL= (0..7)
0.5 0.5 0.5 0.5 0.5 0.5 0.5 0.5 
##$TPOFFS= (0..7)
0 0 0 0 0 0 0 0 
##$TUNHIN= 0
##$TUNHOUT= 0
##$TUNXOUT= 0
##$USERA1= <user>
##$USERA2= <user>
##$USERA3= <user>
##$USERA4= <user>
##$USERA5= <user>
##$V9= 5
##$VALIST= <valist>
##$VCLIST= <CCCCCCCCCCCCCCC>
##$VD= 0
##$VDLIST= <DDDDDDDDDDDDDDD>
##$VPLIST= <PPPPPPPPPPPPPPP>
##$VTLIST= <TTTTTTTTTTTTTTT>
##$WBST= 1024
##$WBSW= 4
##$XGAIN= (0..3)
0 0 0 0 
##$XL= 0
##$YL= 0
##$YMAX_a= 156805283
##$YMIN_a= -39740299
##$ZGOPTNS= <>
##$ZL1= 120
##$ZL2= 120
##$ZL3= 120
##$ZL4= 120
##$ABSF1= 222.624
##$ABSF2= -17.3728
##$ABSG= 5
##$ABSL= 3
##$ALPHA= 0
##$AQORDER= 0
##$ASSFAC= 0
##$ASSFACI= 0
##$ASSFACX= 0
##$ASSWID= 0
##$AUNMP= <proc_1d>
##$AZFE= 0.1
##$AZFW= 0.5
##$BCFW= 0
##$BC_mod= 2
##$BYTORDP= 0
##$COROFFS= 0
##$CY= -3
##$DATMOD= 1
##$DC= 0
##$DFILT= <>
##$DTYPP= 0
##$F1P= 0
##$F2P= 0
##$FCOR= 0.5
##$FTSIZE= 32768
##$FT_mod= 6
##$GAMMA= 0
##$GB= 0
##$INTBC= 1
##$INTSCL= 4.134877e-10
##$ISEN= 128
##$LB= 2
##$LEV0= 0
##$LPBIN= 0
##$MAXI= 10000
##$MC2= 0
##$MEAN= 0
##$ME_mod= 0
##$MI= 0.1934396
##$NCOEF= 0
##$NC_proc= 2
##$NLEV= 6
##$NOISF1= 120.0001
##$NOISF2= 80.00006
##$NSP= 0
##$NTH_PI= 0
##$NZP= 0
##$OFFSET= 222.624
##$PC= 1.4
##$PHC0= -385.4251
##$PHC1= 31.36414
##$PH_mod= 1
##$PKNL= yes
##$PPARMOD= 0
##$PSCAL= 0
##$PSIGN= 0
##$REVERSE= no
##$SF= 50.3227315983092
##$SI= 32768
##$SIGF1= 140
##$SIGF2= 120
##$SINO= 11.81781
##$SIOLD= 32768
##$SREGLST= <13C.CDCl3>
##$SSB= 0
##$STSI= 32768
##$STSR= 0
##$SW_p= 12077.2946859903
##$SYMM= 0
##$S_DEV= 0
##$TDeff= 32768
##$TDoff= 0
##$TI= <>
##$TILT= no
##$TM1= 0
##$TM2= 0
##$TOPLEV= 0
##$USERP1= <user>
##$USERP2= <user>
##$USERP3= <user>
##$USERP4= <user>
##$USERP5= <user>
##$WDW= 1
##$XDIM= 32768
##$YMAX_p= 346568031
##$YMIN_p= -1842709
$$ End of Bruker specific parameters
$$ ---------------------------------
##NTUPLES= NMR SPECTRUM
##VAR_NAME=  FREQUENCY,     SPECTRUM/REAL,   SPECTRUM/IMAG
##SYMBOL=    X,             R,               I
##VAR_TYPE=  INDEPENDENT,   DEPENDENT,       DEPENDENT
##VAR_FORM=  AFFN,          ASDF,            ASDF
##VAR_DIM=   32768,         32768,           32768
##UNITS=     HZ,            ARBITRARY UNITS, ARBITRARY UNITS
##FACTOR=    0.368581032318806, 1,           1
##FIRST=     11203.0474430531, 0,            0
##LAST=      -874.247242937185, 0,           0
##MIN=       -874.247242937185, -1842709,    0
##MAX=       11203.0474430531, 346568031,    0
$$ Real data points
##PAGE= N=1
##DATA TABLE= (X++(R..R)), XYDATA
$$ [...]
15952C42647j19680o4600M7197R2525M2678l6019r5767j13796r4249n2264J2478
15941c8850Q3950R0414N2616N6701R0598R0851P8849R4702Q4491k2041j75763
15930D86518k24628j88604j01318K2726N5707K1244k543k8579n4561r542Q3669
15919F0089J20509J18043J12998N6112j2923k4490J3331K6397k5883p3692j06454
15908B64037j47969j65384j34121q3707r051L5458L0336L3524K9748J302l1295
15897a77122l2492j3786N313N5183J38431J34531Q143p2449m0265J4672K2626
15886D2785m3873j19131j39365j32129r0533L6551J90360K46065J72688L4336
15876A97754j08014j63305j38863r3990o0432n082R7199J38377P2231k3830q5385
$$ y = [342647, 222967, 158367, 205564, 298089, 340767, 304748, 208981, 95185, 936, -51328, -38850, 45100, 135514, 188130, 244831, 335429, 426280, 505129, 599831, 684322, 662281, 486518, 261890, 73286, -28032, -5306, 50401, 71645, 69102, 40523, -14038, -23580, 60089, 180598, 298641, 411639, 467751, 454828, 430338, 443669, 470066, 444183, 370491, 264037, 116068, -49316, -183437, -267144, -276195, -240737, -210401, -176877, -147129, -145827, -177122, -209614, -223400, -218087, -162904, -24473, 110058, 118201, 45752, 5487, 20159, 42785, -1088, -120219, -259584, -391713, -482246, -445695, -255335, -9270, 163418, 197754, 89740, -73565, -212428, -306418, -366850, -371932, -274733, -136356, -64125, -87955, -173340]
15865a73340p5782m8315n1874n0424K2953J02934O5317P263q806n9425j26246
15854c95745j51371j39354o5332L404l0p765M7815J29867J75851J16078K4829
15843b61753J7740N0989M6223L3316P4722J50642J85288J29896k0058j62256j66485
15832G8264o4591K4956K6255k6218l7122M2452J38242J72266J72978J54253J34738
15821H16473J18363L9449q0523j55648j76357j34307m0409K8569K0361n5432j34846
15810B45693j52715p0165N8235J20712Q0545M4167K7249m9307j55219k27871k21637
15799c00313o3847J24265J58585P0885k9268q3692m1432L1802P0295P8349J9080
15788C4709n4881n6891j3198K965k4157l3777M6001J14589J01889O1696K7102
$$ y = [-173340, -249122, -297437, -349311, -399735, -376782, -273848, -208531, -201268, -210074, -269499, -395745, -547116, -686470, -751802, -748398, -748428, -756193, -708378, -578511, -402660, -286582, -261753, -244013, -193024, -146801, -113485, -38763, 111879, 297167, 427063, 407005, 244749, 78264, 13673, 38629, 64884, 38666, 1544, 43996, 182238, 354504, 527482, 681735, 816473, 934836, 974285, 893762, 738114, 561757, 427450, 387041, 415610, 435971, 380539, 245693, 92978, 22813, 81048, 201760, 282305, 326472, 353721, 304414, 149195, -78676, -300313, -364160, -239895, -81310, -10425, -39693, -123385, -164817, -133015, -62720, 15629, 34709, -20172, -77063, -90261, -87296, -111453, -145230, -99229, 15360, 117249, 178945, 206047]
15777B06047K4673O0792Q4523M2564j0557k6447Q996P6980J05537O6215j0738
15766F28585j19765k40283k53670j78639j23658o1777P9128K15151K13183J15298
15756B73553J4178k9988n3804j11924j97699k55361k19638q4426Q49k6775k6069
15745g17104N5515J55606K31583K08293R2245J2638k6019q0118q5571k7862m539
15734a85333q11K7005M1319J4486j0715J4476Q7436J59730J84608J37734K4335
15723D94270r9966j79631j85056j02080j4398k6402p3760k1137Q2818J07097M4697
15712B6452Qn606p157l5470r7896j24082r1950l7637M410K0446L0850L1791P314
15699b78527k0770l936M5383J6624j08581k16446j97979q8150J3666P5615R4523
$$ y = [206047, 230720, 291512, 376035, 418599, 408042, 381595, 390591, 467571, 573108, 639323, 628585, 508820, 268537, 14867, -163772, -287430, -349207, -270079, -54928, 158255, 273553, 287731, 257743, 203939, 92015, -105684, -361045, -580683, -665109, -664260, -691035, -717104, -661589, -505983, -274400, -66107, 26138, 38776, 12757, -67361, -152932, -180794, -185333, -186144, -159139, -117820, -103334, -114049, -99573, -12137, 147593, 332201, 469935, 494270, 394304, 214673, 29617, -72463, -86861, -113263, -187023, -208160, -125342, -18245, 26452, 26460, 20854, 13697, -21773, -119669, -243751, -335701, -373338, -368928, -348482, -317632, -285841, -278527, -299297, -303233, -257850, -241226, -349807, -566253, -764232, -852382, -838716, -763101, -668578]
15688f68578P1102P0149J07890J73940K32353K34406J66146L4024r2917j58380
15678A70135j66703j73152j73032j18166j5169K4273K0756O2657J19558J35944
15668a12899Q2805j5084r6300j62398k23428k87594l28099k59204p6800J21260
15658a357741K91351L94322L35394J83933R9750P7591N8982M0337J6471O016r238
15647A37168m0211n7481p3069p4701j1448O1228O9902R0041J47144J71202J27489
15636E47264N2659J0881j9646n3059o7513l9175j118L4618Q7998J44124J78448
15625H75481J77333J23321J4381j19097k81059m56117n01807l55011j47842k945
15615f73362P2387J17365J34870R0556l9534p4918O1507J59156Q3574j00234k04929
$$ y = [-668578, -597476, -527327, -419437, -245497, -13144, 221262, 387408, 421432, 328515, 170135, 3432, -169720, -342752, -460918, -476087, -451814, -431058, -368401, -248843, -112899, -30094, -45178, -141478, -303876, -527304, -814898, -1142997, -1402201, -1479001, -1357741, -1066390, -672068, -336674, -152741, -52991, 24600, 83582, 123919, 140390, 146406, 137168, 96957, 39476, -33593, -108294, -119742, -58514, 11388, 101429, 248573, 419775, 547264, 599923, 610804, 591158, 538099, 470586, 431411, 430293, 464911, 552909, 697033, 875481, 1052814, 1176135, 1190516, 1071419, 790360, 334243, -167564, -522575, -670417, -673362, -600975, -483610, -348740, -258184, -297718, -372636, -311129, -151973, -68399, -168633, -373562]
15604c73562j15302P2034J70489J65652J19243O0085K2919j1052o1693p5975J2152
15593a5010J14216Q1500l1281q9689p2282k9109r3167k28103k58545j29967L7019
15582g14418J25615J54269J45370J18500J04120Q7833P6083L4761j4464k6042
15572I1627m910L8777R5047J39028J37388J39916J31220J03428Q5304K8926q7561
15561H98190j80541j94602j28782l2357N9295P8524Q447o8781j04020j01755o7368
15550A66250n1319q7591j29978j27429j15935j35684j48920j29140j6195J51436
15540f24505J83736O8281j800lk3655k4962K0951J9181j5712L8430J71576K04330
15528A5848R9302K4976N8529J06062J14029J41817K19258K71312K10035K6481
$$ y = [-373562, -488864, -416830, -246341, -80689, 38554, 98639, 121558, 110506, 48813, -27162, -15010, 99206, 180706, 149425, 59736, -12546, -41655, -134822, -362925, -621470, -751437, -714418, -588803, -434534, -289164, -170664, -66544, 21289, 97372, 132133, 117669, 91627, 86717, 125494, 220541, 359569, 496957, 636873, 768093, 871521, 956825, 985751, 898190, 717649, 523047, 394265, 361908, 421203, 499727, 508174, 439393, 335373, 233618, 166250, 114931, 27340, -102638, -230067, -346002, -481686, -630606, -759746, -775941, -624505, -440769, -372488, -374288, -374291, -397946, -422908, -401957, -382776, -398488, -360058, -188482, 15848, 115150, 140126, 198655, 304717, 418746, 560563, 779821, 1051133, 1261168, 1287649]
15518A287649j86086l00673k65922k04702k12618k15418j92128j40685m6687K9712
15508d47558J7775n0569l9535N6098J16188J25705J06419N7762L3015K0066k640
15497g274l0974l5591K4037Q5294O6053L2922N9865N3442m9210j50513k00471
15486a52420k12477j97186j58065n6757L4285N6054P4794N9232N811k2399l3199
15475f02327m8876m2373q1P5126J18596M7377n4898r5402q0275l4038M9055J80638
15463d87478L01214K82168R7822r7713j86496k09198k09948j46044l6094N9827
15453f31940J37647K12213K51369K24243J64026Q7715Q489p0047j01259q6343
15443A96113j10309j76673j78736j37748j07862m7104M1235J16611J21570M3706
$$ y = [1287649, 1101563, 800890, 534968, 330266, 117648, -97770, -289898, -430583, -477270, -447558, -429783, -480352, -519887, -463789, -347601, -221896, -115477, -57715, -24700, -4634, -7274, -38248, -73839, -49802, 35492, 101545, 134467, 194332, 247774, 198564, 48051, -152420, -364897, -562083, -720148, -776905, -742620, -686566, -611772, -552540, -546729, -569128, -602327, -651203, -693576, -693657, -618531, -499935, -452558, -507456, -602858, -683133, -717171, -668116, -487478, -186264, 95904, 193726, 96013, -90483, -299681, -509629, -655673, -691767, -631940, -494293, -282080, -30711, 193532, 357558, 445273, 453762, 383715, 282456, 196113, 85804, -90869, -269605, -407353, -515215, -562319, -521084, -404473, -282903, -239197]
15433b39197l9235l4851O4802J38508J49162J30976Q0331K8660J2287J03324K24106
15422F18873K04535M7102j21360k27427k33850j44847l1160K0200k973k7469k7565
15411G4059j5817L7490J06933N5828j02875j98666j46822p2779n3827j1421Q1534
15400b46363J22382P2807j9162q2728j07101j21597o7445M5000J32464J73369
15390i8374J44904N5118k774L27j3773q7761j65161j51954o5941N470O6927J26806
15378a86186J88002J81664N0769n8265k2955J10309J91669J46640K0711j61891
15368D60467k99617k92021j88991j31290j60554j53865m8925R0297J95669K05333
15358c23497J11530N4209M9935K3778k4857r4457j15061k5254J00855J43593J18622
$$ y = [-239197, -278432, -313283, -248481, -109973, 39189, 170165, 250496, 279156, 291443, 394767, 618873, 823408, 870510, 749150, 521723, 287873, 143026, 111866, 132066, 129093, 101624, 74059, 58242, 95732, 202665, 258493, 155618, -43048, -189870, -262649, -316476, -327897, -246363, -123981, -51174, -70336, -153064, -260165, -381762, -449207, -404207, -271743, -98374, 46530, 101648, 98874, 99201, 85428, -2333, -167494, -319448, -385389, -379919, -312992, -186186, 1816, 183480, 234249, 175984, 153029, 263338, 455007, 601647, 622358, 460467, 160850, -131171, -320162, -451452, -612006, -765871, -814796, -724499, -528830, -323497, -211967, -157758, -107823, -84045, -108902, -203359, -318420, -343674, -242819, -99226, 19396]
15347A9396J00365Q4818Q9442P4446r39p8111p5655r292L3104P8995J34730J36857
15335E88156N9785k3929p9528j41570j48514j13547j03018j24623j45253j30836
15325c62877r2308n3990p3750j04606q6727j0398Q0435J00624M9508P159m9922
15314e96852j06595q9893p5241q2512m5143L666J0614N1927J39951K04465J97614
15303c87999R3484O376k5352n1248n3186q4002j70769j44026J1822R8191N3803
15292f52906k0871l6734J7445J16589J62364J06717K1142m4154n9403k0649L9616
15281c70844O8457N9085O0646N4543m7642j51151o2078J80340K90221J50412n9433
15270A72556j63484j75013r7057M1963J44618J82979J41515K8711p1730q5271
$$ y = [19396, 119761, 204579, 294021, 368467, 367528, 289417, 213762, 204470, 237574, 316569, 451299, 588156, 647941, 624012, 544484, 402914, 254400, 140853, 37835, -86788, -232041, -362877, -455185, -509175, -582925, -687531, -774258, -784656, -704221, -603597, -554089, -546930, -596852, -703447, -793340, -868581, -951093, -996236, -992570, -981956, -930029, -790078, -585613, -387999, -294515, -288139, -313491, -364739, -417925, -501927, -672696, -816722, -804900, -706709, -652906, -673777, -710511, -693066, -576477, -414113, -307396, -286254, -330408, -389811, -410460, -370844, -302387, -243302, -182656, -128113, -175755, -326906, -388984, -208644, 81577, 231989, 172556, 9072, -165941, -262998, -221035, -76417, 106562, 248077, 276788, 205058, 119787]
15260A19787k0683N2864O1386Q536o7730j48101j46016n7539M409k9472n0731
15249b73290J3141O3680O8735Q0341Q1190O0392Q6946J16725N0520p4413j22246
15238A51721p0954N095L6795L426q6238j44770j41549q1948q349K6967K8298J4611
15226b66895k4424r9615j23832q1484r3752j29775q8293O808J14755K33180K72284
15215b81043K28561J88860J82961J39209P164j55338l00699l12281j77682k9386
15205e09674P2934P2378m6206j58774j80015j90312j83539n7788J48281L20901
15195g11814L94700L35586J47300l5850j17297o5947O8751J25112L3467r4809
15185G9199q0495K1806Q7520J38235J73589J22967k9314k15249k80926k08833
$$ y = [119787, 99104, 151968, 213354, 221890, 154160, 6059, -139957, -197496, -193087, -222559, -273290, -260149, -196469, -127734, -47393, 33797, 94189, 181135, 297860, 348380, 273967, 151721, 80767, 85862, 122657, 126083, 39845, -104925, -246474, -328422, -336771, -309804, -281506, -266895, -291319, -390934, -514766, -596250, -690002, -819777, -908070, -901262, -786507, -553327, -281043, -52482, 136378, 319339, 458548, 465712, 310374, 9675, -302606, -480288, -509674, -436740, -364362, -410568, -569342, -749357, -939669, -1123208, -1180996, -1032715, -711814, -317114, 18472, 165772, 129922, 12625, -53322, 15429, 140541, 174008, 79199, -1296, 20510, 108030, 246265, 419854, 542821, 513507, 298258, 17332, -191501]
15175a91501r4484L7130J28634J18718N3381K0148O0696J28866J03553k3599j16898
15164B24644j23699j19937j47232j33319q4114q8617j10808p3525j810J02764
15154e55653K32079K59591J36954N4942R6263J54964J72549J14185L6342Q653
15144G10869j4130r0533j33563j48300j84418j99631j46366n3850J5479L1315
15134b13128k891n8603p9440k8756P3980J82024K22601J52499L9352l9829q1339
15123A66470j12019j08366m0577L8772Q1934O6959N3963R6381Q5916n5582j60619
15112A13232r4073J267m5204j11585r0174o6623n4807r883P4560J58656J72020
15101D7386R3405l477k6001P922M1585M3342J3255n3507j23619r6951L1334R6796
$$ y = [-191501, -285985, -248855, -120221, -1503, 51878, 72026, 132722, 261588, 365141, 341542, 224644, 100945, -18992, -166224, -299543, -383657, -472274, -583082, -656607, -658417, -555653, -323574, -63983, 72971, 127913, 224176, 379140, 551689, 665874, 702216, 710869, 696739, 606206, 472643, 324343, 139925, -59706, -206072, -259922, -244443, -213128, -216019, -274622, -354062, -382818, -308838, -126814, 95787, 248286, 287638, 247809, 166470, 54451, -53915, -94492, -55720, 26214, 93173, 147136, 243517, 329433, 273851, 113232, 19159, 20426, -24778, -136363, -226537, -293160, -347967, -357850, -283290, -124634, 47386, 140791, 137314, 111313, 119235, 160820, 204162, 217417, 163910, 40291, -56660, -25326, 71470]
15089G1470J8226q2202r6215m6569J6911N8201K7914m4088l3514O1197J14656
15078F5987R1516K9665Q823N4282N6511k5817j38444j88184j44349j08559q9544
15067c88113m1484O237J6278K2502K8372K1905M0554P6074P9664Q5821J23021
15056G0831J30627O0464k1150k0340Q0632J97262J78882K7208j17178k10334k24805
15045A52099j44907l2091M7123R2034O6429L448k4530m7076p9156m6021N6603
15034D3955J19258J18568P9900q133r0362q7704k9076J2004L7570Q4724R9638
15023C80342N1429j2888m9158k9282M2571J29626J58280O2967j25500k69112k68998
15012G0277j77853q8518k4802K3823N2851R0579J28643J57096J95672J45020m5232
$$ y = [71470, 89696, 7494, -88721, -135290, -118379, -60178, -32264, -76352, -109866, -48669, 65987, 157503, 187168, 195991, 250273, 306784, 280967, 142523, -45661, -190010, -298569, -388113, -429597, -423360, -407082, -384580, -356208, -334303, -293749, -217675, -138011, -52190, 70831, 201458, 261922, 240772, 220432, 301064, 498326, 677208, 704416, 587238, 376904, 152099, 7192, -24899, 22224, 114258, 180687, 184135, 159605, 112529, 33373, -12648, 43955, 163213, 281781, 361681, 353548, 263186, 175482, 146406, 158410, 195980, 280704, 380342, 431771, 418883, 369725, 340443, 383014, 512640, 670920, 733887, 608387, 339275, 70277, -107576, -196094, -220896, -197073, -144222, -53643, 75000, 232096, 427768, 572788, 527556]
15001E27556k17743k54781k41359j94286m6430J38328K17099J60259Q2257L3230
14991B04130j1831l8169k2297l4560p6074k3094P5849P1092O91l1133K648N7899
14979A75151J09884J09006L5280n7221j08123j32132j60485j69892j43700j26166
14969d68398j08676n8854j0389K6274j3014p4696k4220N3263N4238L3446R2502
14958d98524J67825J52634P8977K6922L8655R6071J28573J31398R7814k3389j13192
14947B83764p4615L0885N6910l0372j18688j33956p3406M6464J11248J11298J62990
14936C72522K17848J60934K4924j25409k16175j86378j36643j96069k49113j66325
14926d99884n8183m709K5293M6030J7729n1229p2135m2898n655Q968l5432j46943
$$ y = [527556, 309813, 55032, -186327, -380613, -427043, -288715, -71616, 88643, 170900, 204130, 192299, 154130, 131833, 97273, 21199, -1895, 73954, 145046, 145737, 114604, 117252, 175151, 285035, 394041, 429321, 372100, 263977, 131845, -28640, -198532, -342232, -468398, -577074, -635928, -646317, -620043, -633057, -707753, -731973, -678710, -624472, -591026, -498524, -330699, -178065, -99088, -72166, -33511, 62560, 191133, 322531, 420345, 396956, 283764, 209149, 240034, 296944, 266572, 147884, 13928, -59478, -13014, 98234, 209532, 372522, 590370, 751304, 776228, 650819, 434644, 248266, 111623, -84446, -333559, -499884, -558067, -562776, -537483, -491453, -473724, -524953, -597088, -639986, -645641, -636673, -672105, -819048]
14914h19048k40565k16384j15305j8142K7604N8101J28407K08335K53025K20116
14904e13856J41569J22716J59348J71210J26673J6182j29401j93543j54675q8776
14894c42553P7J17418J74086J49011J36024R4265P746m9718n2705M447R3222J27542
14882D58862O7726N844j1664p7665j50594j34666j13078j13098p7891j700R6481
14871e1443K06686K77661K54372J06627r9250k15454k21635j84108j39018p3368
14861a38930p5480j43875j48832j29554j15464o9825m5521l3381L1535J24674
14851g44653J89218J55262Q3427L2103m97J8228K4480l694k7665j3408L6619P0778
14839a79802L4899p898n316j5117o6103r1560l3411P3061Q7337k0310q1271l3625
$$ y = [-819048, -1059613, -1275997, -1391302, -1409444, -1381840, -1323739, -1195332, -986997, -733972, -513856, -372287, -249571, -90223, 80987, 207660, 223842, 94441, -99102, -253777, -342553, -342476, -225058, -50972, 98039, 234063, 328328, 336074, 286356, 233651, 238098, 331320, 458862, 526588, 532432, 520768, 443103, 292509, 157843, 44765, -68333, -146224, -147924, -51443, 155243, 432904, 687276, 793903, 694653, 479199, 257564, 73456, -65562, -138930, -214410, -358285, -507117, -636671, -752135, -821960, -867481, -900862, -869327, -744653, -555435, -400173, -316746, -284643, -285140, -266912, -242432, -246126, -273791, -287199, -250580, -179802, -144903, -152801, -158117, -173234, -239337, -330897, -364308, -291247, -203910, -224220, -305491, -339116]
14827c39116N1778J13130J23663P0326K9439O9998J04722N7562j0713n8901r2390
14816A19498j14015j49438j82085j56809m7379O2626J27567J27037M9828l9535
14806b02705o6862l7760J1268R2658J55928J58888J05201m037j10490j45621j32479
14795a76011q8051l0933J6076O6731Q1217N3689M9636M1704j0338n9199m8056
14784a03535M167J5009P264k528o7982j40333j73278j63093o7273P6547J78077
14773d36958J92377J18059L503p3976o3116l5600n3843o3383J2761J27823J44633
14762a27720N0116L8187J55964K22211J69929Q4751J2464K2638P7503J00955R7387
14751I04385R4700N1044o9423j27303j06161j36354j95953j87237j10251n7531
$$ y = [-339116, -287338, -174208, -50545, 19781, 49220, 119218, 223940, 281502, 270789, 211888, 119498, 5483, -143955, -326040, -482849, -530228, -467602, -340035, -212998, -163170, -202705, -269567, -307327, -296059, -203401, -47473, 111415, 216616, 212579, 102089, -43532, -176011, -264062, -294995, -278919, -212188, -130971, -77282, -27646, 14058, 3720, -55479, -103535, -99368, -84359, -77095, -79623, -147605, -287938, -461216, -624309, -691582, -615035, -436958, -244581, -126522, -123019, -196995, -260111, -295711, -349554, -412937, -400176, -272353, -127720, -77604, -39417, 116547, 338758, 508687, 593438, 605902, 628540, 706043, 806998, 904385, 999085, 1050129, 980706, 853403, 747242, 610888, 414935, 227698, 117447, 59916]
14741E9916k0838L6973M6124p078j4418K2318M5950j0843j38313k08297j84004
14730c72510j34334j16822r9063M408Q2946L7914j5372Q22N4116O2873J4607j3665
14718d94080M2856J05934Q2729r626n8928k1830J8010J4515l704j4455l2509m3223
14706d14311l7091q4446k30034l63650l27178j71557l0879L6517M1351O0840J59053
14695a361385K92396L36408K89770K04783Q7838k4930n0247n586K2095O7616J60856
14684A9614J98860J47712N3586m0801j27359j88064j87245j44839q9642j5641
14674c73819N2025Q0485P0309M5028M0514J4212Q99L0806k0562j48554j92304
14663d00961j35667n362J35345K16166K01218J32753O6232k2165j25635j85788
$$ y = [59916, 39078, 76051, 122175, 115097, 100679, 122997, 168947, 158104, 19791, -188506, -372510, -506844, -623666, -722729, -718321, -635375, -597461, -612833, -612011, -557895, -495022, -480415, -494080, -451224, -345290, -262561, -272187, -331115, -352945, -334935, -320420, -324124, -338579, -371088, -414311, -451402, -535848, -765882, -1129532, -1456710, -1628267, -1659146, -1622629, -1581278, -1520438, -1361385, -1068989, -732581, -442811, -238028, -150190, -175120, -225367, -230953, -208858, -141242, 19614, 218474, 366186, 419772, 378971, 251612, 63548, -123697, -268536, -358178, -373819, -321794, -241309, -171000, -125972, -85458, -71246, -70347, -39541, -60103, -208657, -400961, -536628, -541990, -406645, -190479, 10739, 143492, 209724, 187559, 61924, -123864]
14653a23864j49660o5317j1985o432j4615N713J6880j5296k2301L5435J28640
14642b22802J42757L0034m7709j5871K7076J01232J86523J83573R3692l0245j31971
14631C16289j86517k17694k29495j69854l6182R5850J58893J65993J83407J93213
14621B73903J88289J40874n531r8469r9390r3596o6242m2283r5680j61302j80094
14610b39521j56695n4464Q5683J32230J8285j32526j61755q2146K9761J32148
14600d29000J44324Q5708Q0409J21233J19671L4150p5234r1336j8317M2627Q4564
14589I8799R9299O9630R378m3957o2782p3924j00009j20702j43314j22299k6971
14578d16852O9952R6118M3767p7393j71479j47074o7793j864l522j02455j81026
$$ y = [-123864, -273524, -338841, -350826, -357258, -371873, -366160, -349280, -364576, -386877, -351442, -222802, -80045, -50011, -97720, -113591, -86515, 14717, 201240, 384813, 478505, 448260, 316289, 129772, -87922, -317417, -487271, -523453, -427603, -268710, -102717, 80690, 273903, 462192, 603066, 597535, 499066, 399676, 306080, 239838, 197555, 101875, -59427, -239521, -396216, -450680, -364997, -232767, -214482, -347008, -508763, -590909, -561148, -429000, -284676, -198968, -118559, 2674, 122345, 156495, 81261, -10075, -28392, 14235, 98799, 198098, 267728, 277106, 233149, 170367, 96443, -3566, -124268, -267582, -389881, -416852, -346900, -250782, -207015, -284408, -455887, -602961, -670754, -672618, -676140, -778595, -959621]
14567i59621j13130n30M6783O2597O5118Q2885J21783J21602R8643R9778J10192
14556b63900J08950P8691j5210j29857j17735j6201p4k4437q878j3515p4957j38004
14544f15127r1789P3049K54104L19223K37727Q0743k3941k8675o4943j35374r8103
14533i3106P227O8942Q4535N0006j1306n3635r4860j14988q9159m2962L9877J21039
14521a28390J46491J29002P7000J2430p4814j55930j04135J3278M4399r08n6944
14510i8521j26598j84074j61160q3643q9113j43434j17150n5684p191P2489J53199
14499h40880K03552J94997J04076J017j9387M4538J03720O7038J8175M6178J07212
14488C0236Q6210j8750p8410o3446k4005N3707J92035K17024N8321r0067j16789
$$ y = [-959621, -1072751, -1073281, -1026498, -963901, -898783, -815898, -694115, -572513, -473870, -374092, -263900, -154950, -76259, -91469, -221326, -339061, -355262, -355336, -379773, -388651, -402166, -477123, -615127, -706916, -633867, -379763, -60540, 177187, 257930, 233989, 205314, 140371, 4997, -93106, -85879, -16937, 67598, 117604, 106298, 52663, -42197, -157185, -246344, -289306, -249429, -128390, 18101, 147103, 224103, 236533, 161719, 5789, -98346, -85068, -40669, -41577, -98521, -225119, -409193, -570353, -653996, -743109, -886543, -1003693, -1059377, -1066568, -994079, -840880, -637328, -442331, -338255, -337238, -356625, -312087, -208367, -141329, -123154, -76976, 30236, 116446, 97696, 19286, -44160, -68165, -14458, 177577, 394601, 452922, 362855, 246066]
14477B46066r0922q7908r5307p2036l6676j7186J1176M9329M3478k695k4827P292
14465g0216P0606J48087J95456J24975l1296j07239l5034L2739l6440j87327k25679
14454a21368j45271j06737j44151j79894j60299j25819o6181r134J252M0609P4299
14443i42694N4229O2058J54775K48665K38367J98006K36835K41741R4053j17790
14433D68245k77292l06490j75213P701J05686J11805R5972P5305J2082o2821r2501
14422c7521l2976M3572L0998j6232L5290J24242J15127M4577j4061p0282j00285
14411A22449j33523j91176k41844k23764j16068k315O1087R3822R9863P4687M9657
14400d07125J7670n8686j36679j24606m1040j2211m572M0122N3053L92k1560J0974
$$ y = [246066, 155144, 67236, -28071, -100107, -136783, -153969, -142793, -93464, -49986, -52681, -77508, -70216, 390, 148477, 343933, 468908, 437612, 330373, 295339, 328078, 291638, 104311, -121368, -266639, -373376, -517527, -697421, -857720, -983539, -1049720, -1058854, -1057602, -1016993, -942694, -888465, -826407, -671632, -422967, -184600, 13406, 250241, 491982, 586035, 468245, 190953, -115537, -290750, -283049, -177363, -65558, 30414, 105719, 117801, 54980, -37521, -70497, -26925, 4073, -12159, 23131, 147373, 262500, 307077, 293016, 222734, 122449, -11074, -202250, -444094, -667858, -783926, -786241, -725154, -631332, -531469, -456782, -407125, -389455, -448141, -584820, -709426, -750466, -762677, -767249, -727127, -674074, -673682, -695242, -684268]
14388f84268N1675Q3537Q8399O5133L8289L6893M2676P2233J04440J28458J80053
14377B07518J81014R4892M8918Q7568J13740Q2920O4047N2661k2875j28468j87882
14366E94053j74580q6546p807N7202J20037J28677Q4162j7800r6938r7398p8784
14355D24278q1978n5924N0761J36556J08989J3163n1265m4790K413K3871n9644
14344D66430j48002j23007j6063Q5149O7126k8622p5465o6103j0295M0372N9657
14333B51177Q7167Q8212M1461l9595j14300j25928j01395p3821l1071j4773q1136
14322a14002j61213j17329J0836R3608Q6535M8475M5670P5407P7788L6345l2093
14311E0027o3839m2175R366K9609k8146n2792m602L1874Q7775J83965J67005o3343
$$ y = [-684268, -632593, -549056, -460657, -395524, -357235, -320342, -277666, -205433, -100993, 27465, 207518, 388532, 483424, 532342, 619910, 733650, 816570, 880617, 933278, 910403, 781935, 594053, 419473, 332927, 325120, 382322, 502359, 631036, 715198, 697398, 600460, 503062, 424278, 342300, 286376, 337137, 473693, 582682, 595845, 544580, 499790, 502203, 526074, 466430, 318428, 195421, 179358, 264507, 331633, 303011, 227546, 161443, 151148, 191520, 251177, 338344, 426556, 468017, 428422, 314122, 188194, 86799, 12978, -18093, -32866, -114002, -275215, -392544, -381708, -288100, -201565, -153090, -107420, -32013, 45775, 82120, 50027, -13812, -55987, -46621, -17012, -45158, -97950, -102552, -70678, 17097, 201062, 368067, 304724]
14299C04724l70077n23028m23846j73189P0168K18994K41895J61981N9626k4504
14289d57256q1278o3692M823M2654P4176R6632O7938J2473N598J7828n9837j60619
14277e00560j73658r7268M4446J90538J92836J05624P5768R9618J16488J57205
14267B11037J51529L6362o9271j40503k00540k26408k16323j81719j24130j3969
14257g73935R8447J37027J21605Q9049J9867n8647m3468P6452J87246J56462N0959
14246F1064K3143J1494m506J2206m7887j61978k37465k46361k03878j34029m0566
14235i68763J8449L7459O1388R3741P6786N0925O8004O7500M0247J9735J9341
14224d15188K260o375J8961K8974J1991j0947l0760l6980k5776k3189l2867p4267
$$ y = [304724, -65353, -588381, -1012227, -1185416, -1115248, -896254, -654359, -492378, -432752, -457256, -538534, -602226, -597403, -554749, -480573, -383941, -316003, -303530, -297932, -280104, -339941, -500560, -674218, -771486, -727040, -536502, -343666, -238042, -162274, -62656, 53832, 211037, 362566, 398928, 329657, 189154, -11386, -237794, -454117, -635836, -759966, -773935, -675488, -538461, -416856, -327807, -307940, -366587, -410055, -333603, -146357, 10105, 61064, 84207, 95701, 91195, 103401, 55514, -106464, -343929, -590290, -794168, -928197, -968763, -950314, -912855, -851467, -757726, -680940, -630015, -562011, -494511, -454264, -434529, -415188, -412928, -419303, -400342, -371368, -359377, -370324, -401084, -438064, -463840, -487029, -519896, -594163]
14212e94163j12770o2556J9911O6660J24921K45869K81024R6468j29255j96397
14202b60288j47813q6549l0984l617K2422R9503J30582L3143p9787n2956K8716
14191c47628M4847K3678J47l2139o5037r0178j20014j23464r5712l7389P713n0937
14179h86113j30112o1695O5318J46514K17556K71086K49143J37839r919q1069
14169h1452m7856m0037o5532o5363o3125o0527k7166J7565M5943K8499m8815r0649
14157d98515m7350J6456N2448J5540k2503m394K0962O9385J21551P9971r633o4995
14145b71077n0091L1815J61153K38245J74360L1365o8294l6038O1005M2377j09207
14134B05613k63490l14251k30865n4769J24114J90204J38911M7953j6851q363
$$ y = [-594163, -706933, -769489, -749578, -682918, -557997, -312128, -31104, 65364, -63891, -260288, -408101, -494650, -525634, -529251, -506829, -407326, -276744, -243601, -323388, -376344, -347628, -302781, -279103, -278956, -311095, -376132, -466310, -586324, -709788, -805500, -842889, -835176, -886113, -1016225, -1077920, -1012602, -866088, -648532, -377446, -128303, 9536, -383, -81452, -129308, -169345, -234877, -300240, -363365, -423892, -451058, -433493, -387550, -359051, -407866, -498515, -545865, -529409, -476961, -461421, -483924, -488318, -467356, -397971, -276420, -196449, -206082, -271077, -321168, -289353, -128200, 110045, 284405, 315770, 247476, 211438, 272443, 314820, 205613, -57877, -372128, -602993, -657762, -533648, -343444, -204533, -156580, -173431, -181794]
14124a81794P6637J08932O3178P6962J17201L9764p5133o5615K1734M5603k0464
14113B07005o8529q6850j23011j57017j37116l9583R2019K03589K27848J54365
14103B72720M4031j6023R517N8832P3881M6205m5263j42589j52395r9406o6231
14092a6721p7210j34472j45820j19946j37675j62615j03245M07L7652m1198j71277
14081a072120j79216j4711J35717J46220J00566L7997L665K9277Q5991J18555
14071f08059R5241N5200J6350q485k090J9224Q6484J15325M0938n2662r1129p1627
14059d05290k3286O4892J52502J39623L2247p8750j30643j03536k0860K5346L6047
14048c11708Q5280J51075J31479O250q1342q3853n1313j1271K1980N1108O8920
$$ y = [-181794, -105157, 3775, 66953, 143915, 261116, 300880, 225747, 160132, 181866, 227469, 207005, 138476, 51626, -71385, -228402, -365518, -405101, -313082, -109493, 118355, 272720, 316751, 300728, 310245, 369077, 442958, 489163, 443900, 301311, 148916, 49510, -16721, -93931, -228403, -374223, -494169, -631844, -794459, -897704, -897297, -859645, -900843, -1072120, -1251336, -1266047, -1130330, -984110, -883544, -845547, -841882, -812605, -726614, -608059, -512818, -457618, -441268, -449753, -451843, -432619, -346135, -230810, -189872, -242534, -333663, -405290, -428576, -363684, -211182, -71559, -39312, -118062, -248705, -352241, -373101, -347755, -311708, -226428, -75353, 56126, 62376, -18966, -102819, -154132, -165403, -143423, -92315, -23395]
14037b3395O5367L5802L711m702Q094m70l2242r1058j80947j37573Q974M1473
14025c06966l5939j23282j58628r2665k3065n4148j11125j15460r1696n3605m3713
14014a210292p1913l5105O6444J16254J43694J97442K17884K14111K16551J44095
14004h35k0856j45301j47416j01163p7083j4656O3934R7510J25576J14996M8907
13993e6387r639q0571j89417k42697j78493k6777R4602J24486J47098J64316J18829
13982a34650j270j10759q8715N5019J72682J57048J15686J32100Q3113m8029j25760
13971B06465j25034j47506j71462j33360l6915P9919J81510K32428J81090P8896
13961C46031k2626j27921j69177j09065J8178O7021K3175K1300P0526P5502k4463
$$ y = [-23395, 41972, 77774, 81485, 76783, 84877, 84407, 52165, -38893, -219840, -357413, -348439, -306966, -342905, -466187, -624815, -717480, -740545, -794693, -905818, -1021278, -1112974, -1166579, -1210292, -1282205, -1317310, -1250866, -1134612, -990918, -793476, -575592, -361481, -144930, -835, -21691, -166992, -314408, -415571, -492654, -507310, -443376, -345866, -220290, -105294, -56387, -66026, -146597, -336014, -578711, -757204, -783981, -689379, -564893, -417795, -253479, -134650, -135920, -246679, -335394, -280375, -107693, 49355, 165041, 297141, 380254, 332225, 206465, 81431, -66075, -237537, -370897, -407812, -327893, -146383, 86045, 267135, 346031, 323405, 195484, 26307, -82758, -64580, 2441, 25616, 46916, 117442, 192944, 168481]
13950A68481j60953k22323j44345o304J33338K13290J52907N4550k5179j46475
13940A6987k30168k05665r8632K4324J14846J30667J8555j20968j60890j05134
13930f16078j3332L2668M6185M9706J1134m1105p5934j20545j52762j03347L053
13919i80357R5952J55809K02268K24222K23288K01739J42605R1143J6452r1470
13909B81651j06045j6295k289j09259j92741k18948j80690m1171Q1642J01407
13899d02738J14627J39270J09802Q8948O4523J6254j7551j0059J971o962m0072
13888E8013n2542j2286K6077K861n2976o7562l3774J6992O3865J18246J54140
13877B21054J04973K6010Q454j8501q1105j00590n1546l4679o4186o2920m3407
$$ y = [168481, 7528, -214795, -359140, -365444, -232106, -18816, 134091, 188641, 163462, 16987, -213181, -418846, -517478, -493154, -378308, -247641, -229086, -350054, -510944, -616078, -629410, -596742, -550557, -500851, -489717, -530822, -606756, -727301, -880063, -983410, -980357, -884405, -728596, -526328, -302106, -78818, 122921, 265526, 356669, 373121, 281651, 175606, 159311, 157022, 47763, -144978, -363926, -544616, -585787, -504145, -402738, -288111, -148841, -39039, 49909, 114432, 130686, 113135, 103076, 105047, 98085, 58013, 5471, -6815, 19262, 22123, -30853, -98415, -132189, -115197, -51332, 66914, 221054, 326027, 352037, 360491, 341990, 260885, 160295, 108749, 74070, 9884, -53036, -96443]
13866i6443n0356q5412j27077j02595K446Q3471M1486q9692j99182k06370j10232
13855i39956k3813k9124q1725j32228j57033j21914q9792j12991o4222Q8955K19485
13844a444358K46770J85141J34947J26453J23021P6301R893J0370L9050L8255
13834d54157L2786N7816P1346J7415r8825j78439j24965p74Q3602Q8099L9485
13823d66611L5043J08960J59761J56063J73430K23721K08800R5797m1462j58361
13813D95141k56951l09782k52460r6008O2010J16871P4088J4343J8103K1503p327
13802a20469m2963o5185r3859j20893j14437j32193j93911k01438q4076L3654
13792a135770M4915O315K4452R9006J10973N2853J7712J4372l0117r4006p0427
$$ y = [-96443, -146799, -232211, -359288, -461883, -459437, -375966, -334480, -424172, -623354, -829724, -939956, -963769, -992893, -1074618, -1206846, -1363879, -1485793, -1575585, -1688576, -1752798, -1663843, -1444358, -1197588, -1012447, -877500, -751047, -628026, -551725, -541832, -531462, -492412, -454157, -421371, -363555, -292209, -274794, -373619, -552058, -677023, -677797, -594195, -506096, -466611, -431568, -322608, -162847, -6784, 166646, 390367, 599167, 694964, 653502, 495141, 238190, -71592, -324052, -420060, -358050, -241179, -167091, -152748, -134645, -113142, -120469, -163432, -228617, -322476, -443369, -557806, -689999, -883910, -1085348, -1169424, -1135770, -1090855, -1084540, -1060088, -961082, -850109, -797256, -779544, -765172, -795289, -889295, -959722]
13781i59722P387O9106J36594J45121P8861Q046n6846q0258k0126R7648J59574
13770d14615J24260Q8139N9182L029k7311l9613o0706l3079M3142P8594Q5121
13759i3857Q3230J357o2875j8311L7605M6853M6629K8516o9899j56286j18578
13748b75616o4452q3423q8724k6116Q764k4222j7535M9903J07178J16565O5397
13737b32281o023p837O5685J28695J09449M2442L0412N2971J9833n1242j15819
13726C6285j81257k45957k61487j91166p3783j44k104o7647j65772k03955j53787
13715a510774j0881J28406J72025J78619J81415J75712J76607J53722J35181J17338
13705a02630N0881j1462m2300q6640j20959r1085l5978L428J996j9434k0602m6457
$$ y = [-959722, -952335, -883229, -746635, -601514, -522653, -514607, -571453, -651711, -671837, -574189, -414615, -290355, -202216, -143034, -140005, -167316, -206929, -267635, -300714, -257572, -178978, -93857, -10627, -9270, -72145, -90456, -52851, -5998, 40631, 69147, -752, -157038, -275616, -340068, -423491, -512215, -538331, -529567, -553789, -571324, -521421, -414243, -297678, -232281, -238304, -246141, -180456, -51761, 57688, 100130, 130542, 183513, 203346, 152104, 36285, -144972, -390929, -652416, -843582, -917365, -917509, -919613, -987260, -1153032, -1356987, -1510774, -1521655, -1393249, -1221224, -1042605, -861190, -685478, -508871, -355149, -219968, -102630, -51749, -63211, -105511, -192151, -313110, -404195, -440173, -436745, -434749, -454183, -474785, -521242]
13693e21242j08457j41053q5448O7979K29200K78171K28429J14184o1339k39256
13683b38832l08099k26248o7610R9940J69497R1826q2919k06895k07346j68342
13673a145028j16087k8487K2140J7716R763J853K8894J31455K34348K06742Q0568
13662e56123l0564j22147j71205j45906q5178m2042k6563j546O1148J00580M4113
13651i75433q7840j49275n8081Q1043J48954J41103J51012K02397K19255K01263
13641a25602J86481J17005L2090K1372N0613O1949L4181k0012j00499j95236j82255
13630a19913m3872K4739r482p0237j33354j46962r2186p1516j23389j94199j48064
13619a128435r434Q5031J15935R1800L7255L3160J12549J99234K04260J14565
$$ y = [-521242, -629699, -770752, -856200, -788221, -559021, -280850, -52421, 61763, 424, -238832, -546931, -773179, -840789, -740849, -571352, -479526, -562445, -769340, -976686, -1145028, -1261115, -1289602, -1267462, -1249746, -1239983, -1238130, -1209236, -1077781, -843433, -636691, -556123, -586687, -708834, -880039, -1025945, -1111123, -1153165, -1179728, -1181274, -1120126, -1019546, -975433, -1063273, -1212548, -1270629, -1189586, -1040632, -899529, -748517, -546120, -326865, -125602, 60879, 177884, 209974, 231346, 281959, 343908, 378089, 358077, 257578, 62342, -119913, -163785, -139046, -148528, -218765, -352119, -499081, -591267, -662783, -786172, -980371, -1128435, -1137869, -1052838, -936903, -845103, -807848, -774688, -662139, -462905, -258645, -144080]
13609a44080m8740j87901j92065j37573j01887k4363Q9717J31148J03557J01460
13599d10727R7370N0824L2315M6594J1374k8634J680K5819j8581o4287p6884j18932
13587d52069j70079j67181j20752q8571k5229N1966M4034L479L9659J12275J57466
13576f15002J46790N8997j3716k192P9040J24577J34254J75426J52443Q1062J0961
13565C32640r6319j79830j82075j30721k4589R3351J22565J06971R8199P0816
13555B11008P5498J08753O9877l0468m3980L9151O1715j145r5430j88465k40673
13544c4159k00857j01537l7655j5514l4006o9129l1449M5417O7749J3825p2431
13533d69746q0470K162R7065J48542J05308m6017k18007l04350k92826k52893
$$ y = [-144080, -192820, -380721, -572786, -710359, -812246, -836609, -746892, -615744, -512187, -410727, -313357, -262533, -230218, -183624, -172250, -200884, -199204, -173385, -191966, -256253, -333137, -452069, -622148, -789329, -910081, -998652, -1023881, -971915, -927881, -924402, -884743, -772468, -615002, -468212, -409215, -422931, -425123, -346083, -221506, -87252, 88174, 240617, 321679, 332640, 236321, 56491, -125584, -256305, -280894, -187543, -64978, 41993, 140192, 211008, 286506, 395259, 465136, 434668, 390688, 429839, 491554, 490409, 394979, 206514, -34159, -235016, -336553, -374208, -389722, -423728, -492857, -524306, -478889, -411140, -397315, -469746, -550216, -548054, -450989, -302447, -197139, -243156, -461163, -765513, -1058339, -1311232]
13523a311232j80364j2972J59386J89013J02154L0851O919n630J9924K9415M1185
13512i31351R6351J30094J16666P8846J3720n5789q2329n3455J6501L4776k7793
13501f63763n1685k0543L466O4711K02311K97455K65451J58575L8806l8548p6205
13490A80031q8032m5753q790r309l960j7990n6999p7120o3666m8475p6181j64477
13478d80721k37261j98563j23924l8707J11711K26834K78767K69924J56962N1966
13468A6988J2102k2063n9461j29500k18817k47974k01628r0137R2616K02761J55962
13457d89151P0655r832q2642n9864N6813J16131N7116n3716j01776l9130N1786
13446d83610R4907Q8339N8336J9366l1127j06480j28218j8617J23436J70041J28472
$$ y = [-1311232, -1491596, -1504568, -1345182, -1156169, -1054015, -1023164, -1016245, -1021875, -1001951, -972536, -931351, -835000, -704906, -588240, -509394, -495674, -551463, -633792, -687247, -670746, -635970, -663763, -715448, -735991, -732525, -667814, -465503, -168048, 97403, 255978, 294784, 256236, 180031, 91999, 46246, 37456, 28147, 24187, 6197, -50802, -127922, -191588, -240063, -316244, -480721, -717982, -916545, -1040469, -1079176, -967465, -740631, -461864, -191940, -34978, 16988, 29090, 7027, -52434, -181934, -400751, -648725, -850353, -940490, -847874, -645113, -489151, -418496, -428328, -510970, -570834, -514021, -397890, -340774, -394490, -496266, -535396, -483610, -388703, -300364, -242028, -222662, -253789, -360269, -488487, -507104, -383668, -213627, -85155]
13435h5155R9603J03517Q5699M0397o112m4248l8801l6519o1839n2850k2181p531
13423b6020j974L2726M4686O072p6526j69353j83556p6455N5248J03267J20971
13412a70914J16709O9673M228o1810o3518Q088K5746k4747l7540J4868O8879Q2771
13400C2433P2018M7807N2641P3371O6140N3974Q0919J03455R3384N2810J4484
13389G43436m7226j14291j56592j44927r1455p9578p1592m0780m4608n9022p2378
13378a79013m3596N2833J44467J26380L8844J1654J9519J7807J942p9404j83943
13367g2510j59636m4955L8007N5015R8521J84350J92424J21069M1115m1161o5171
13356C47068q1576j36183j57171j10197l0376L4141K1740l8247o6627k5765K6798
$$ y = [-85155, 14448, 117965, 203664, 244061, 237949, 193701, 154900, 118381, 56542, 3692, -18489, -26020, -27994, 4732, 49418, 55490, -21036, -190389, -373945, -450400, -395152, -291885, -170914, -54205, 15468, 19696, -42114, -105632, -97544, -71798, -96545, -134085, -119217, -50338, 32433, 104451, 152258, 204899, 278270, 344410, 398384, 479303, 582758, 676142, 728952, 743436, 696210, 581919, 425327, 280400, 188945, 109367, 37775, -3005, -47613, -106635, -179013, -222609, -169776, -25309, 101071, 139915, 151569, 171088, 188895, 190837, 111433, -72510, -232146, -277101, -239094, -184079, -85558, 98792, 291216, 412285, 453400, 412239, 347068, 265492, 129309, -27862, -138059, -168435, -134294, -112554, -150801, -217428, -243193, -216395]
13345b16395L5415O3532J26072J86169K01706J48490Q4023J22463J49669L5081
13335I36225p8032p9982j5400N1191O6089J8287o1889j58864k53603k61412j78516
13324a5906n8161J4053k8832p1181k2408N5641N0964l2121r6892q4225j1510M1468
13312b59110K1587J0959M0312O0701M8159J5011K5826J01186J73178J90882J37562
13301E66253L2549q0623j17486o9914n1772n8005m3425l6024k3450J5246N7704
13290A91053P2862Q6142Q4402M1429M7882J18895J61786Q2093q1431j72654j65239
13279D67220p9180K1201O9905P8303K7201n8463o3740J6387N3053K9481O2070
13268F23438J51195J47956M3820l9912r4548j58416j99824j79874r2649k0746
$$ y = [-216395, -180980, -117448, 8624, 194793, 396499, 544989, 629012, 751475, 901144, 936225, 858193, 778211, 762811, 814002, 880091, 898378, 836489, 677625, 424022, 162610, -15906, -74067, -60014, -88846, -160027, -182435, -126794, -75830, -107951, -204843, -289068, -300578, -259110, -237523, -226564, -186252, -125551, -77392, -62381, -36555, 64631, 237809, 428691, 566253, 598802, 518179, 400693, 330779, 279007, 221002, 177577, 141553, 118103, 133349, 191053, 263915, 350057, 434459, 475888, 523770, 642665, 804451, 886544, 805113, 632459, 467220, 388040, 409241, 479146, 557449, 584650, 526187, 462447, 478834, 531887, 561368, 623438, 774633, 922589, 966409, 926497, 831949, 673533, 473709, 293835, 201186, 180440]
13258A80440k3064J9952J22033J65296Q4842j20505l21734l59957k21533J6048
13248d58182K12853K31989J28621N6685N5022J8740r0639j46895o0909P1244J30297
13237A48826J18079R8110R5132R0056N1444Q292n535L308m5240j59117j97101
13226B06254j10658j9137k0640q1507j17104n7947P0893J30562P3996j4141j287
13215E9284J10400J25923K3376p8074j05415p8355q0217p5909n0461l4435k6401
13204b10284k4157Q116P1339J27882J34532L6777p2505j45163j13789L3875J58765
13193E388J94857K02666K31506K08512R0485J2499k4208p0451q6555r3695p2046
13182E98958j9801l552l5058p1186n0256J1680K2995j2033k9594l1065k8725K9528
$$ y = [180440, 157376, 177328, 299361, 464657, 549499, 428994, 107260, -252697, -474230, -458182, -245329, -13340, 115281, 171966, 226988, 245728, 155089, 8194, -52715, 18529, 148826, 266905, 365015, 460147, 550203, 601647, 609939, 604404, 607712, 562472, 403355, 206254, 95596, 76459, 55819, -25688, -142792, -200739, -129846, 716, 74712, 60571, 59284, 169684, 295607, 318983, 240909, 135494, 57139, -23078, -98987, -149448, -183883, -210284, -234441, -226325, -154986, -27104, 107428, 144205, 71700, -73463, -187252, -153377, 5388, 200245, 402911, 634417, 842929, 933414, 945913, 921705, 851254, 764699, 671004, 598958, 579157, 575605, 540547, 469361, 419105, 430785, 453780, 441747, 412153, 381088, 352363, 381891]
13170C81891M9093l8923j63731j77679k1527J47220J90673J10554j1426o1564
13160D04581p621N2734N9704K7926n3869j26107j10574m0199N0649J52705J49542
13149E59471M0346l9854l3657K5798P2723O5601O6202P6061P3020M4930L4260
13138I84901J47015K61100K18410J15852O4408N0688L1635k9755j13212j58647
13128A572395j62479j28842l5720K3641m4663j10633j22469j31105j00188m537
13118G55400O7033Q8071J02805R7661N6513J4831J0335M8903O3413K6499J3556
13107A345020J5302O190J5848L2980p202q0209r8666p5519p6866o3440p026Q489
13095A014901j5045j1881J4921N0431O7792P826r4229j00574k7536L6171P5691
$$ y = [381891, 430984, 392061, 228330, 50651, 29124, 176344, 367017, 477571, 466145, 404581, 396960, 449694, 509398, 537324, 483455, 357348, 246774, 206575, 257224, 409929, 559471, 599817, 559963, 526306, 552104, 624827, 690428, 756630, 832691, 905711, 950641, 984901, 1131916, 1393016, 1611426, 1727278, 1791686, 1842374, 1874009, 1844254, 1731042, 1572395, 1409916, 1281074, 1245354, 1268995, 1224332, 1113699, 991230, 860125, 759937, 755400, 822433, 910504, 1013309, 1110970, 1167483, 1182314, 1192649, 1241552, 1304965, 1331464, 1345020, 1360322, 1366512, 1382360, 1415340, 1408138, 1327929, 1229263, 1153744, 1076878, 1013438, 1006412, 1014901, 999856, 987975, 1002896, 1053327, 1121119, 1128945, 1034716, 934142, 906606, 942777, 1018468]
13084A018468N6087J5654L3350L7469J3749j5144m5400q3901r0564j6471Q3628
13073A006925J56987J99687J78537J05824M4805J8479J3249L8030L3196M989p783
13062A792925m2116j01720j40169j37112j14848p9583m0420l0177j1963R4256
13052A189073K57617L64440L53854K42703P5514n1772p7835n9547n1444j3593
13042B229010L6062M0944J3134o329m705k5588m0648K3925J44410K08798J95675
13031B814688J56497J21183J05127J30369J43244P6935J8385L4722Q1044J26656
13021C808850J55004J48744J14970R5064J02640R6386O5287j9589j44044k22700
13011D200612j98148n3195J76004L97450M83512L94366K56532J90712J66392K05694
$$ y = [1018468, 1074555, 1090209, 1123559, 1161028, 1174777, 1159633, 1114233, 1030332, 939768, 923297, 1006925, 1163912, 1363599, 1542136, 1647960, 1692765, 1711244, 1724493, 1762523, 1795719, 1800708, 1792925, 1750809, 1649089, 1508920, 1371808, 1256960, 1177377, 1136957, 1106780, 1094817, 1189073, 1446690, 1811130, 2164984, 2407687, 2483201, 2431429, 2353594, 2294047, 2242603, 2229010, 2265072, 2306016, 2319150, 2312821, 2308116, 2282528, 2241880, 2265805, 2410215, 2619013, 2814688, 2971185, 3092368, 3197495, 3327864, 3471108, 3548043, 3566428, 3601150, 3682194, 3808850, 3963854, 4112598, 4227568, 4322632, 4425272, 4521658, 4586945, 4567356, 4423312, 4200612, 4002464, 3949269, 4125273, 4522723, 5006235, 5400601, 5657133, 5847845, 6014237, 6219931]
13001F219931K92920L15317L11390L33202L76246M45222N08949N31804N47010
12992I881991N69514N85448N51928N05467N55994P04337Q32493Q84781R06294
12983A5978247J012534J230271J483956J744808J963280K227049K650603L118088
12975C1408836L551700M053197M761277N690764O800805Q057508R534684J1376735
12967H5235506J3702423J6632317K0189197K4343734K9053888L3921153L7668624
12960B60746842L7646180L0143341J3379891q539105k7371102l7516195l9156275
12953B29333577l5689028l0351262k5016395k0387786j6581142j3528324j1053292
12946G6726348r029438p435981o196451n233274m527849m003914l571827l121154
$$ y = [6219931, 6512851, 6828168, 7139558, 7472760, 7849006, 8294228, 8803177, 9334981, 9881991, 10451505, 11036953, 11588881, 12094348, 12650342, 13354679, 14187172, 15071953, 15978247, 16990781, 18221052, 19705008, 21449816, 23413096, 25640145, 28290748, 31408836, 34960536, 39013733, 43775010, 49465774, 56266579, 64324087, 73858771, 85235506, 98937929, 115570246, 135759443, 160103177, 189157065, 223078218, 260746842, 298393022, 328536363, 341916254, 333377149, 306006047, 268489852, 229333577, 193644549, 163293287, 138276892, 117889106, 101307964, 87779640, 76726348, 67696910, 60260929, 54064478, 48831204, 44303355, 40299441, 36727614, 33606460]
12938C3606460k624217k169625j793044j513129j380141j369549j376780j311003
12930B0068972j133250r18605p43906o15921n76002n94655n80684m71078l00365
12921A4134506j50472n0569k0154k9235r8973j68136j39986l6857J00133J88208
12911A3728465K05345K23981K66163L02551L93802N53864P11645Q64048J057349
12902A8307213J210421J254844J157245R35215O98796N19007M81559O01024Q35685
12893B6001009J142422J514275J934184K357754K818408L392156M121670M949284
12885D8231162N830837O876398Q192793R818007J1807159J4283523J7350980K1046581
12877A43437440K5464208L0556191L5666650L9026553L7419799K7163830P833360
$$ y = [33606460, 30982243, 28812618, 27019574, 25506445, 24126304, 22756755, 21379975, 20068972, 18935722, 18017117, 17273211, 16657290, 16081288, 15486633, 14905949, 14434871, 14134506, 13984034, 13933465, 13913311, 13884076, 13785103, 13616967, 13476981, 13440124, 13540257, 13728465, 13933810, 14157791, 14423954, 14726505, 15120307, 15674171, 16385816, 17249864, 18307213, 19517634, 20772478, 21929723, 22864938, 23563734, 24082741, 24564300, 25165324, 26001009, 27143431, 28657706, 30591890, 32949644, 35768052, 39160208, 43281878, 48231162, 54061999, 60938397, 69131190, 78949197, 90756356, 105039879, 122390859, 143437440, 168901648, 199457839, 235124489, 274151042, 311570841, 338734671, 346568031]
12870C46568031j4672949l1846373l9522482l9293757l4863546k9202929k3882971
12863A33283024j9437779j5870180j3045442j0766660q827895p210842n953403
12856E2170823n014051m367303l896043l407112k898409k428593k020636j690768
12848B6447908j486559j378281j241188j113696j063587j014896q90451p62308
12840A7496942o94228o58870o18627n15321l37661j89821j51073k13698l12215
12831A3805428l05297j86254r5694o8860m5898n0155j18936k03993j80525l8121
12821A2511695J44688L33662N09074O63207P02232N86891M55870M57478O10906
12812A6975703Q17211R70765J142529J373973J555388J629963J686502J850888
$$ y = [346568031, 331895082, 300048709, 260526227, 221232470, 186368924, 157165995, 133283024, 113845245, 97975065, 84929623, 74162963, 65335068, 58124226, 52170823, 47156772, 42789469, 38893426, 35486314, 32587905, 30159312, 28138676, 26447908, 24961349, 23583068, 22341880, 21228184, 20164597, 19149701, 18259250, 17496942, 16802714, 16143844, 15525217, 15009896, 14672235, 14482414, 14331341, 14117643, 13805428, 13500131, 13313877, 13218183, 13149323, 13103425, 13053270, 12934334, 12730341, 12549816, 12511695, 12656383, 12990045, 13499119, 14162326, 14864558, 15451449, 15907319, 16364797, 16975703, 17792914, 18763679, 19906208, 21280181, 22835569, 24465532, 26152034, 28002922]
12804B8002922K120428K484666K963005L484258M073277M904318O032655P368655
12796F1434184Q871108J0628719J2708072J5193726J8231560K1978914K6480741
12789A75527024L1449390L6033737L8251100L4682183K2159778J783592j9504496
12782C20382308l4034555l9318484l7791357l3077202k7659517k2636738j8397759
12775A07466696j5017607j2380741j0263353q462887o990009n839317m890460
12768D3622322m135468l550936l075773k744509k554302k410505k179410j851862
12760B1119557j563378j374676j204988j025081q91243q19366p48160o35292n11270
12751A2346103m43019m68454n55722o51149p03945o49804m96888l25345j87365
$$ y = [28002922, 30123350, 32608016, 35571021, 39055279, 43128556, 48032874, 54065529, 61434184, 70305292, 80934011, 93642083, 108835809, 127067369, 149046283, 175527024, 206976414, 243010151, 281261251, 315943434, 338103212, 339886804, 320382308, 286347753, 247029269, 209237912, 176160710, 148501193, 125864455, 107466696, 92449089, 80068348, 69804995, 61342108, 54352099, 48512782, 43622322, 39486854, 35935918, 32860145, 30115636, 27561334, 25150829, 22971419, 21119557, 19556179, 18181503, 16976515, 15951434, 15060191, 14240825, 13492665, 12857373, 12346103, 11903084, 11434630, 10878908, 10227759, 9523814, 8874010, 8377122, 8051777, 7864412]
12742G864412r7800j16624j92056k02060j91441j74393r1480N53j4161j43687
12732F641263k98996l97443l87077k84855k08505k05404k27841k19489j71696
12723D239957r6146n6819o5204o8416n1592j8053O881J4345K394o4059j69482
12712C673806k41383k00775k3893J62549K10257J26914J729j69688l17325l39481
12702B882710k34157p4496l0477r2552p7967o467j1982m1158m4253q6725j44236
12691B038240j85367k18481j69896m2648M6025P9169J00566J22462J58991K11300
12681B140361K28355J69318P3080J5973J5626O615j7737j2203m713n7626j83431
12670B373618k48934j51837j4236L7949L7089k2815j30492j82171j54307r6631
$$ y = [7864412, 7766612, 7649988, 7457932, 7255872, 7064431, 6890038, 6798558, 6799111, 6784950, 6641263, 6342267, 5944824, 5557747, 5272892, 5064387, 4858983, 4631142, 4411653, 4239957, 4143811, 4086992, 4021788, 3953372, 3901780, 3883727, 3890608, 3904953, 3907347, 3843288, 3673806, 3432423, 3231648, 3207755, 3370304, 3580561, 3707475, 3709204, 3539516, 3222191, 2882710, 2648553, 2574057, 2543580, 2451028, 2373061, 2366594, 2354612, 2313454, 2269201, 2182476, 2038240, 1852873, 1634392, 1464496, 1421848, 1467873, 1547042, 1647608, 1770070, 1929061, 2140361, 2368716, 2538034, 2611114, 2627087, 2642713, 2649328, 2631591, 2619388, 2614675, 2557049, 2373618, 2124684, 1972847, 1958611, 1996560, 2033649, 2010834, 1880342, 1698171, 1543864, 1447233]
12660A447233j9870P5172J65054K16778J96291Q4413m0791j19297j51956j69320
12650A683707j85128j46892p7059o6068o0372m6304p1411n4987l552M4645O5598
12639A082177K2555j4795q341m89J3031L5706J8270j3197L6671O5318k5582j61427
12627A049897k58012k51688j01888J32257L15398L51690K30596N1593p2989j15648
12617A331206j15405j32577j65504j29646k7401L673p5147j59115j78950j31969
12607B19165p4051n4757n7817o4890n8791j4843L6417L9009J9639K5384M8415
12596F2880N0997K0040j402J087J4370q375o1556m8635J9432O3445R6507R7521
12584C06311N7356J7639l478j61P732Q976K4850K4441j0741l8185n2024l4530
$$ y = [1447233, 1427363, 1502535, 1667589, 1884367, 2080658, 2165071, 2124280, 2004983, 1853027, 1683707, 1498579, 1351687, 1274628, 1208560, 1148188, 1101884, 1030473, 975486, 971934, 1016579, 1082177, 1104732, 1089937, 1081596, 1081107, 1094138, 1129844, 1148114, 1134917, 1171588, 1236906, 1211324, 1049897, 791885, 540197, 438309, 570566, 885964, 1237654, 1468250, 1519843, 1446854, 1331206, 1215801, 1083224, 917720, 788074, 760673, 764346, 689199, 530084, 351134, 219165, 145114, 90357, 32540, -32350, -91141, -105984, -69567, -30558, -10919, 14465, 62880, 113877, 133917, 132515, 133602, 147972, 139597, 78041, 29406, 48838, 112283, 208790, 306311, 363667, 381306, 377828, 377667, 385399, 394375, 419225, 443666, 432925, 394740, 342716, 308186]
12572C08186M7051J30685J05364k161j14399j51263r7285m2714l4476k3424J2618
12561A38182M6318N1043N0831R7711J36940J21951Q5959M8246K5481L952m4545
12550G62069j21919k15593k55255k02111j24252q8649r3819m6987P7626J66582
12540a42308J34625J1571k8600O2341J35550J26279Q9743L3193l7623q4265j08497
12529A92009q6433l39Q5340J12734J15200P0996k5390n1037J149J9060M445m474
12517D33260j7288r338q366n0278q7170l4307P6628R2629K0211L74L4388P0246
12505E20989R5551N7632l6833j05307r4699p1390n9807k4700N7849J55798J98199
12494F93282J73755J04772K8428n5630j31406j80943j48804o2308N113M3010N4903
$$ y = [308186, 355237, 485922, 591286, 589125, 474726, 323463, 226178, 183464, 148988, 125564, 138182, 184500, 235543, 286374, 384085, 521025, 642976, 728935, 777181, 802662, 806614, 762069, 640150, 424557, 169302, -32809, -157061, -245710, -339529, -386516, -308890, -142308, -7683, 3888, -24712, 37629, 173179, 299458, 389201, 422394, 384771, 300506, 192009, 105576, 105237, 190577, 303311, 418511, 489507, 464117, 413080, 414229, 433289, 437734, 433260, 415972, 406634, 398268, 347990, 260820, 226513, 303141, 395770, 415981, 416355, 450743, 520989, 616540, 674172, 637339, 532032, 437333, 365943, 306136, 281436, 339285, 495083, 693282, 867037, 971809, 1000237, 944607, 813201, 632258, 483454, 421146, 426259, 469269, 524172]
12483E24172P2536J00324J28277J43029Q4904N882n2239j52053k15155j68255
12473D71422j03105j16385j46934j02866k1983K0522M7739P0237R5166J31911
12463C45724J34890N6030m8503j20081j10768l1023O1905J28258J16065Q8509
12453F21006J36181J57736J00231K8590j3576j5530K1607J11745J29265M3918
12443A321173k557J3071P058o8346j83057k78513k93323j96932k1567J33436J50321
12432E80764J0220j23622j43370r1118p145L3509K6544K187n7122j23753j41200
12421c4106j14203j31418j73186j92695j89028j57844r4542J8444J58208K71515
12411f38855L35147K91285J32238n2526j47819j16298n0459n7051r2932q9368
$$ y = [524172, 596708, 697032, 825309, 968338, 1053242, 1059124, 1006885, 854832, 639677, 471422, 368317, 251932, 104998, 2132, -19851, 671, 48410, 118647, 213813, 345724, 480614, 536644, 488141, 368060, 257292, 226269, 288174, 416432, 532497, 621006, 757187, 914923, 1015154, 1043744, 1030168, 1014638, 1036245, 1147990, 1277255, 1321173, 1318616, 1331687, 1338745, 1270399, 1087342, 808829, 515506, 318574, 297007, 430443, 580764, 590984, 467362, 323992, 232874, 225729, 259238, 285782, 287969, 230847, 107094, -34106, -148309, -279727, -452913, -645608, -834636, -992480, -1087022, -1068578, -910370, -638855, -303708, -12423, 119815, 67289, -80530, -196828, -247287, -304338, -397270, -486638]
12401d86638o7334l7533M54M5701M2823J504P317O9857J54641J64288Q3941N1448
12389C0469O5695O0581O5243P4097L4130l9021o0859k4490m280L1280R3142R4384
12377D20371K6130n2942j44197k19816k08286j35688n2439L8090R3694R3138N3624
12366h8321J8980L0441M4315M1231R1684J61291J84898J77341J54288J17633M6429
12355I80210o2990j63473j97691j41131o0755m4861n1638Q539J21274K19125K39888
12344H46497J59315K8190r1851j26561k4320J23488J71122N8072q3137j53359
12334I07456j45422j05396j07047j37571j89204k19175k21728k18316j28029K2481
12324e41951J38668J52541M5753o1791j03853j40989j80777j81117r4923J7217
$$ y = [-486638, -553972, -591505, -591051, -545350, -502527, -501023, -493706, -423849, -269208, -104920, -20979, 30469, 96164, 156745, 221988, 296085, 330215, 291194, 230335, 205845, 201565, 232845, 325987, 420371, 446501, 393559, 249362, 29546, -178740, -314428, -366867, -328777, -235083, -141945, -88321, -69341, -38900, 5415, 46646, 138330, 299621, 484519, 661860, 816148, 933781, 980210, 917220, 753747, 556056, 414925, 354170, 309309, 257671, 266210, 387484, 606609, 846497, 1005812, 1034002, 942151, 815590, 791270, 914758, 1085880, 1143952, 1060815, 907456, 762034, 656638, 549591, 412020, 222816, 3641, -218087, -436403, -564432, -541951, -403283, -250742, -204989, -266780, -370633, -511622, -692399, -873516, -968439, -951222]
12314i51222O0589K3437q830K4417M3122J4945n786K9124R6531J36802J41173
12303c95698J40590J26870J08849J11539J07176M2296m1029r1274j14311r2577
12293i7569m0674j6361J5781M7122L323m6195J0745Q7417Q8797M4371K2136N8207
12281A77100P9430L5567L371j1620o8742j03708r2792q5345r1531o5141L3009
12270a90402J49792J62469M3023p8941p0433M1064Q5456R177j39596k56410k23846
12259d68647q0368M495j5939l9563k4565M5278J03938J60018K15487K26063K23907
12248C50104K04778J24024K0114m3807o1339o5550o5572p0102q5286o7435o2215
12237A77714j35431j96585j85045j51651r5026K0493J55335K15219K00092J35800
$$ y = [-951222, -890633, -867196, -876026, -851609, -808487, -793542, -799328, -770204, -673673, -536871, -395698, -255108, -128238, -19389, 92150, 199326, 241622, 200593, 109319, -4992, -97569, -138243, -154604, -138823, -91701, -88378, -134573, -123828, -36411, 52386, 96757, 118893, 177100, 256530, 292097, 295468, 283848, 215106, 111398, 18606, -66739, -158270, -223411, -190402, -40610, 121859, 164882, 85941, 15508, 56572, 142028, 151205, 11609, -244801, -468647, -549015, -544520, -560459, -600022, -624587, -579309, -475371, -315353, -99866, 126197, 350104, 554882, 678906, 699020, 655213, 593874, 528324, 462752, 392650, 307364, 239929, 177714, 42283, -154302, -339347, -490998, -586024, -565531, -410196, -194977, 5115, 140915]
12227A40915K3745p1256o4923J4417O7081O8163M8947j01n2618l0285N3374R4985
12215B92444N0799l2867r1465j16159o0549O2401J41373J19995N9765L549l2700
12204C96586N37Q2696J17840O0674M325J8591L3053o357r7949j05022k8137O380
12192D83217P897j2565m0877l0800j1836l5433p7193j45342k00427j56583n0952
12181b70894L3613L4678m0722r6432p5306n0590l6613M3222J00512N3320m100
12170c09312K668O1757P5795L0286L7381O3760O3061R6519J07019N0909j0550
12159B69293n4708n2610l5183r9152j74375j32140j7426J03390J53450P4667k5577
12148I629l4066P415J1596k1476n1443q3145j04232p5938Q704P5472P8176O7467
$$ y = [140915, 164660, 93404, 28481, 42898, 109979, 178142, 227089, 226988, 174370, 144085, 197459, 292444, 343243, 310376, 218911, 102752, 42203, 104604, 245977, 365972, 425737, 429286, 396586, 397123, 479819, 597659, 658333, 662658, 681249, 714302, 707945, 609996, 504974, 476837, 483217, 491114, 478549, 437672, 406872, 395036, 359603, 282410, 137068, -63359, -219942, -270894, -237281, -202603, -243325, -339757, -415063, -465653, -502266, -459044, -358532, -305212, -309312, -306644, -244887, -169092, -138806, -101425, -37665, 25396, 121915, 228934, 279843, 269293, 214585, 161975, 126792, 27640, -146735, -278875, -296301, -192911, -39461, 35206, 9629, -24437, -17022, -5426, -26902, -78345, -161490, -265722, -341660, -332956, -257484, -179308, -111841]
12136a11841M3251J1652J5713L5209M9977K5430p819k815L3180R0950J36184J53652
12124D72723J45008J41709J61567J54957J33089M6418r7495j78636j25638J9979
12114H73681J45937J32210l385j38817k12722k08336j04591R0376K20198J73811
12104I68362j336k22718l22576k19658j6682J22560J44139R4225O1085N7862N8639
12093G23902N6514J0153r9620k08891k56562k79145k64795k09975j74699j47511
12083h50629p2212M4846J64000K22290J85153J16831J03591J44497J57685J12584
12073C28636N4597n411j03774j89170j93156j71395j57732r5473n061K4708Q923
12062e04308O270K4464P3999R3090P8424Q9194O6768K0480l409m4022p9128L14
$$ y = [-111841, -68590, -56938, -41225, -6016, 43961, 69391, 61572, 58757, 91937, 182887, 319071, 472723, 617731, 759440, 921007, 1075964, 1209053, 1255471, 1157976, 979340, 853702, 873681, 1019618, 1151828, 1148443, 1009626, 796904, 588568, 483977, 574353, 794551, 968362, 967026, 744308, 421732, 202074, 185392, 307952, 452091, 546316, 607401, 665263, 723902, 780416, 790569, 690949, 482058, 225496, -53649, -318444, -528419, -703118, -850629, -922841, -877995, -713995, -491705, -306552, -189721, -86130, 58367, 216052, 328636, 383233, 377822, 274048, 84878, -108278, -279673, -437405, -532878, -537939, -513231, -504308, -498038, -473574, -399575, -306485, -228061, -138867, -72099, -51619, -55028, -99050, -178178, -177864]
12050a77864J25853J39965M5390k5319K0490J11922J27989O2838K4299M1716J1342
12039E08621n7955o5223Q817M6760j0676m0311j332N383K7955R0854J06485R5787
12027G15165J17041J06188O572j32235j99834j12366J7112K0605n7469r2263q0959
12016C07557n7840N152J05845J70520J25951l053j45266k40398j93456l9726N1956
12005H7242L4036O338M0103R7346J44566J57913J37526O2055l2991p8475q1161
11994E74498o6390p4625j00536r3513l5026M5160R9908L4062r7479j73517j66613
11983e4071p1507M4767J01237R6460N7352j4442j02064j31171o6378L1461J07737
11972f19J53437J48151O5702p174J7627R2046J54887J84539J53863K8249j80035
$$ y = [-177864, -52011, 87954, 133344, 108025, 128515, 240437, 368426, 431264, 455563, 497279, 508621, 450666, 385443, 394260, 441020, 430344, 390033, 388701, 394084, 422039, 512893, 619378, 715165, 832206, 938394, 944966, 812731, 612897, 500531, 517643, 538248, 480779, 388516, 307557, 249717, 254869, 360714, 531234, 657185, 654132, 508866, 268468, 75012, 35286, 87242, 121278, 127616, 167719, 265065, 409631, 567544, 705070, 767125, 734134, 655659, 574498, 508108, 433483, 332947, 239434, 204408, 249568, 349476, 383538, 286059, 112542, -54071, -125578, -80811, 20426, 116886, 174238, 159796, 57732, -73439, -139817, -108356, -619, 152818, 300969, 366671, 359497, 377124, 469170, 624057, 808596, 962459, 990708, 810673]
11961H10673l58067l66679k19819r7181p2861q8360q6285m1177J4673M7142N4309
11950d03632P1612R0606Q1443O5717M5763L5236N9924J13744J73014J81865R5672
11939F10964L1891O7258J31563J45627P2227l119l608R327m6123j09026q6776
11928H20205m4520j8805P984j8522o3380l6234L6883P9639M3873p8856j85368
11917E42899j79644q6301K689P9406J88470K75360K99235K76968K04797J34212
11907A738091J09842J07133J51486K41758L05110L08509K44396K01171K96888
11898C704384N29168P77675R65176J140814J335494J566300J874214K228624K566029
11889A6687878K878374L069973K917598K217603J066162k1401o58316j027296
$$ y = [810673, 452606, 85927, -133892, -231073, -303934, -392294, -478579, -519756, -505083, -457941, -403632, -332020, -241414, -159971, -94254, -48491, -13255, 46669, 160413, 333427, 515292, 610964, 642855, 710113, 841676, 987303, 1059530, 1056411, 1052803, 1062130, 1016007, 906981, 820205, 775685, 756880, 764864, 746342, 682962, 646728, 683611, 763250, 807123, 728267, 542899, 363255, 276954, 279643, 359049, 547519, 822879, 1122114, 1399082, 1603879, 1738091, 1847933, 1955066, 2106552, 2348310, 2653420, 2961929, 3206325, 3407496, 3704384, 4233552, 5011227, 5976403, 7117217, 8452711, 10019011, 11893225, 14121849, 16687878, 19566252, 22636225, 25553823, 27771426, 28837588, 28816187, 28157871, 27130575]
11881B7130575j478619k078953k602836k769760k568626k260928j994359j708529
11873I667965j314848q56294n27655m18011n17315o60411o51099n17450l67600
11864C837282k58696k05872k16282k20085j88314j63263j59694j37283p3458p496
11854B206839m317r6374j61651j25381p0609n1620o7221q1201p6711o2287N228
11843A414695P6872R6792J19432J92936K81283K90172K95897M19357N81773O42036
11833D411245N80100M84359L55741J47238n7498j84388l20747m80722n48119n21478
11823C865731m43251l43927l04217k65869r1263J53542K40207J81483J71078K59942
11813C423456L11356L15789L91039N13578O25211O97753P50206P50736P83964
$$ y = [27130575, 25651956, 23573003, 20970167, 18200407, 15631781, 13370853, 11376494, 9667965, 8353117, 7496823, 6969168, 6551157, 6033842, 5373431, 4722332, 4204882, 3837282, 3578586, 3372714, 3156432, 2936347, 2748033, 2584770, 2425076, 2287793, 2214335, 2206839, 2202522, 2106148, 1944497, 1819116, 1748507, 1696887, 1629666, 1548465, 1471754, 1409467, 1414695, 1491567, 1588359, 1707791, 1900727, 2182010, 2472182, 2768079, 3187436, 3769209, 4411245, 4991345, 5475704, 5831445, 5978683, 5921185, 5736797, 5416050, 4935328, 4387209, 3865731, 3422480, 3078553, 2774336, 2508467, 2417204, 2570746, 2810953, 2992436, 3163514, 3423456, 3734812, 4050601, 4441640, 4955218, 5580429, 6278182, 7028388, 7779124, 8563088]
11804H563088R92644J292665J589219J911802K286041K797620L490361M240301
11796B7163741M963551N566409N683882M922765L077588L18707k645008m896239
11788D4155396n923126n820167n052917m088203l206839k520081k013385j635537
11780A3895141j370326j181500r86787q11382p03087o08531n56175n41392m95197
11771F640764m54162m64409m43082l66804k63165j63195j39234k28723l62994
11762C754996l34794j49162L3549J66892J77776O9664k5575p1625l7935O4661
11752C648447J17219L3435l9389O8123K22301L22750M28103N31859O53828Q62419
11742F849095J031788Q76438L10119m38443j000842j150969r99928p91768o33344
$$ y = [8563088, 9555732, 10848397, 12437616, 14349418, 16635459, 19433079, 22923440, 27163741, 32127292, 37693701, 43377583, 48300348, 51377936, 51696643, 49051635, 44155396, 38232270, 32412103, 27359186, 23270983, 20064144, 17544063, 15530678, 13895141, 12524815, 11343315, 10356528, 9545146, 8842059, 8233528, 7677353, 7135961, 6640764, 6186602, 5722193, 5279111, 4912307, 4649142, 4485947, 4346713, 4117990, 3754996, 3420202, 3271040, 3304589, 3471481, 3649257, 3718921, 3693346, 3621721, 3583786, 3648447, 3765666, 3799101, 3759712, 3827835, 4050136, 4372886, 4800989, 5332848, 5986676, 6849095, 7880883, 8757321, 9067440, 8628997, 7628155, 6477186, 5477258, 4685490, 4052146]
11733D052146n04712l83698l00515k52409k31690k05062j83871j96751k27151
11724A566287k60636k92837k91124j74505l4938k0496m6172J8831Q6118J5324
11714E65852j38708k06234j48350l1610R8780J64527J52147O7260k8919p6873
11704D17872q1047m1914J7911P0317R4313P9091J667j06892j22368n1638l8209
11693B39103o9191n6309j6137L0642J09956J77254J86713J52675O7377n193m7716
11682G69174r0997j09642p6558l0097m8350j23217j21810n9398m6366m7797J153
11671A6095Q1854R8436p065j03038m6145P7910J33372J02427O4603n817j28717
11660B83915j79467q0190Q9612K11992K29500J58616P1656O604k9829r2945j79165
$$ y = [4052146, 3547434, 3163736, 2863221, 2610812, 2379122, 2174060, 1990189, 1793438, 1566287, 1305651, 1012814, 721690, 547185, 512247, 491751, 445579, 464410, 550528, 565852, 427144, 220910, 72560, 40950, 139730, 304257, 456404, 523664, 494745, 417872, 336825, 294911, 312822, 383139, 477452, 556543, 558210, 451318, 328950, 277312, 239103, 169912, 113603, 97466, 128108, 238064, 415318, 602031, 754706, 822083, 816890, 769174, 678177, 568535, 491977, 461880, 413530, 290313, 168503, 109105, 62739, 14942, 16095, 97949, 196385, 189320, 86282, 40137, 118047, 251419, 353846, 418449, 412632, 283915, 104448, 24258, 113870, 325862, 555362, 713978, 785634, 792238, 762409, 669464, 490299]
11649D90299k12902k17445k05768j65357r3029L2779J85889K66547K47334J90201
11639E18548J33924O9920N171j3591K6571L0303o0642j66903j99365q6935N4408
11628C11409N3189k0211R896J41056J85750O5766p6424j25973j44794j31632o1261
11617B06771m5670r7692j03430n1381n6998r7477q2904j140J20356J95193K22096
11606B07724K51905K35312J51861P5299L0515P802k5441j41432k91067l44590
11596A57888k91437j03044J82545L89742L93616K37833O3243l8309j04605j79613
11586G07859k55441k62137j99716j29524k9269J17275K20218K04763J30381O7423
11576E71832j5302o5639j5964Q830n4812r9556m5348K2595j662p3881j21460j51270
$$ y = [490299, 277397, 59952, -145816, -311173, -404202, -371423, -185534, 81013, 328347, 518548, 652472, 722392, 727563, 713972, 740543, 770846, 710204, 543301, 343936, 257001, 311409, 364598, 344387, 354283, 495339, 681089, 746855, 670431, 544458, 399664, 268032, 206771, 161101, 63409, -40021, -91402, -148400, -245877, -328781, -329921, -209565, -14372, 207724, 459629, 694941, 846802, 922101, 952616, 960418, 934977, 793545, 502478, 157888, -133549, -236593, -54048, 335694, 729310, 967143, 1030386, 992077, 887472, 707859, 452418, 190281, -9435, -138959, -168228, -50953, 169265, 374028, 504409, 571832, 556530, 490891, 474927, 483757, 428945, 329389, 284041, 306636, 304974, 231093, 109633, -41637]
11564d1637j45908j15045m6129N7878J19435J39252J62568J27478N0837L5446
11554C44175R5757J39819O7252m2058k9162Q5813J36277M2814j23709k29398k32094
11543B55486k74399l42168k78555j33705k8736M1209P9152O2251M5783N3523j4679
11532e34838q9985j08592q5277L6116J77736K02416J50233Q3181K3406q664J0565
11521a43703N373p6348j24936o4256K9710P7990R3110Q5336L3532m6518q4614
11510b15324o3474k9776k0797q736l506M551N4285J48468J73828J16216O1153
11499B16888N6369J01808J14480L4105j20690j98007j24630R842R2864N4709n7532
11488A80206j09964o0831j5891k4176l7408K509Q0565J33617J07769L3728M1508
$$ y = [-41637, -187545, -302590, -348719, -290841, -171406, -32154, 130414, 257892, 308729, 344175, 439932, 579751, 647003, 604945, 575783, 661596, 797873, 840687, 716978, 487580, 255486, -18913, -361081, -639636, -773341, -802077, -760868, -681716, -619465, -573682, -520159, -534838, -624823, -733415, -818692, -782576, -604840, -402424, -252191, -169010, -145604, -154268, -143703, -138330, -214678, -339614, -403870, -374160, -296170, -203060, -117724, -84192, -130710, -215324, -278798, -308574, -329371, -338107, -341613, -337062, -282777, -134309, 39519, 155735, 216888, 273257, 375065, 489545, 523650, 402960, 204953, 80323, 90165, 183029, 237738, 180206, 70242, 9411, -6480, -30656, -68064, -65555, 15010, 148627, 256396, 290124, 331632]
11477C31632J05208J16032J00137N0682o114R39M1870P1118Q6796Q6896N6521
11466A041717J2111m0078j34270k46261k96931k58712j51155m7726M2947P6543
11456a815P7922J23629J56494J13448n960j65402k62937k36641j43589L787J65485
11445a75579K79880K89811J77157L2443r0114j67145j64039j34108r5832j4330
11435f1856Q1962Q3496J328p2155p4968j0883N0292O0037M7517M4606P3937Q7376
11423C10689M0941l6034r2516j10719q6322k0070K2118J5447k564m6906j17065
11412a23001j29729k1671P3125L9989p5618j39879p2912K1791L2911K3434P8983
11401b92577J49387J04192L4267J4787M75N5689J63697K10662J55591O2229m567
$$ y = [331632, 436840, 552872, 653009, 703691, 697577, 698516, 740386, 811504, 898300, 985196, 1041717, 1053828, 1013750, 879480, 633219, 336288, 77576, -73579, -121305, -78358, -1815, 76107, 199736, 356230, 469678, 463718, 298316, 35379, -201262, -344851, -341064, -175579, 104301, 394112, 571269, 603712, 513598, 346453, 182414, 48306, -47526, -61856, 20106, 103602, 104930, 32775, -42193, -53076, -2784, 57253, 104770, 149376, 223313, 310689, 351630, 315596, 223080, 112361, 26039, 5969, 28087, 43534, 40970, -5936, -123001, -252730, -274401, -201276, -161287, -236905, -376784, -449696, -427905, -394994, -371560, -292577, -143190, -38998, -4731, 10056, 10531, 66220, 229917, 440579, 596170, 658399, 653832]
11390F53832O134O1365Q1235P848r9534j17918o8739l5807k0064n0617j34141
11379B83594j99877k18863j70249l4204J32798K53488K67099J98448J68707J89014
11369H69955J93834J43006K0101q8936j07542m8789L3650J4351n3251m2862o873
11358I26644l3794o9709j44310k80318l53581l33306k51031j07056q468m4337
11348f99266q5707o3033k4583K0218N1636L5369m359l6818m3842M52Q9511J84246
11336e76176K44032K56103K08031J43278O4166l5389o9033k4662M0127N9757M8369
11325C58603N7966P3910N8774K6337n258r7224k49028l27491k58215j07015j3626
11314d82267K6730L7990L814p1070j34315j18449p1142k5421J8623K5130M5975
$$ y = [653832, 659966, 721331, 802566, 810414, 710880, 592962, 524223, 488416, 468352, 417735, 283594, 83717, -135146, -305395, -339599, -206801, 46687, 313786, 512234, 680941, 869955, 1063789, 1206795, 1226896, 1137960, 1030418, 981629, 1015279, 1029630, 976379, 933517, 926644, 892850, 823141, 678831, 398513, 44932, -288374, -539405, -646461, -654929, -699266, -784973, -848006, -872589, -852371, -800735, -765366, -769725, -806543, -850385, -849933, -760422, -576176, -332144, -76041, 131990, 275268, 339434, 304045, 235012, 210350, 250477, 310234, 358603, 416569, 490479, 549253, 575590, 570332, 473108, 224080, -103411, -361626, -468641, -482267, -455537, -417547, -413733, -484803, -619118, -737567, -808709, -834130, -815507, -790377, -744402]
11303g44402Q7447Q7799P2215J20152J55154Q9104k627k6306J048K6515J1829
11292a22072m9959j64674k68039k68310j84188o4660K7124O2097M7251K8329K3311
11281i33790J9070R0403K22198K62270J75775M0196k1641q661m9690j35187j45393
11270d84450p3829K8788J01880Q0750K0487K5867P4778Q2787M2659o624j3954
11259a20861P255K884Q470M2249M6116o094l0102M3838M2652j01600k03128k05706
11247d74027j97385j57758p1921r508K2163P2962J45129K03715J65834N5177j4664
11236b60283k1302O2118K29462L64426L60120K48569J51920J02123L8902m1999
11226A234056o1182q1303j50149k02748j87811j14646o6593j05819k14698k81189
$$ y = [-744402, -656955, -569156, -496941, -376789, -221635, -132531, -135158, -161464, -160416, -133901, -122072, -172031, -336705, -604744, -873054, -1057242, -1121902, -1094778, -1032681, -985430, -957101, -933790, -914720, -824317, -602119, -339849, -164074, -123878, -145519, -154180, -203870, -339057, -484450, -558279, -529491, -427611, -346861, -326374, -300507, -225729, -142942, -100283, -106907, -120861, -113606, -110722, -102252, -60003, -13887, -19981, -50083, -6245, 36407, -65193, -268321, -474027, -671412, -829170, -901091, -910599, -888436, -815474, -670345, -466630, -300796, -245619, -260283, -281585, -219467, 9995, 374421, 734541, 983110, 1135030, 1237153, 1276055, 1234056, 1172874, 1091571, 941422, 738674, 550863, 436217, 369624, 263805, 49107, -232082]
11216b32082k03092l9402J06863J95913K44876K03890M2587q3693n2143K8739
11206B12456J5871k9799m2381m8138q0688j00796j09592r2163k029J03481J35722
11195c8056P8060q934o2689j08786j58108j83982k17803k26787j55587j6755J17211
11184i82216J47459R2299R1728J45457J26948M6749L7988O2076K2652k2085m0286
11173b71231m8630m9431o9047k1644P6317J17760J18742O4160k366k7709m2041
11162a55120j10038j73882j66742j40485p1548N9260J49812J47664J27189J44770
11152a89120J72550J62427P6259n6677j64601k33303k70554k17579j04113j3083
11142h37794j3185o0551k7140L0967K5212r529k5530j1296J8139Q3062J32027
$$ y = [-232082, -435174, -474576, -367713, -171800, 73076, 276966, 319553, 235860, 183717, 212456, 228327, 198528, 156147, 108009, 27321, -73475, -183067, -275230, -277259, -173778, -38056, 40004, 31070, -31619, -140405, -298513, -482495, -700298, -927085, -1082672, -1099427, -982216, -834757, -742458, -650730, -505273, -378325, -331576, -293588, -231512, -208860, -230945, -271231, -319861, -369292, -438339, -459983, -383666, -265906, -147164, -83004, -85370, -113079, -155120, -265158, -439040, -605782, -746267, -817815, -758555, -608743, -461079, -333890, -189120, -16570, 145857, 222116, 165439, 838, -232465, -503019, -720598, -824711, -837794, -850979, -911530, -938670, -907703, -882491, -892020, -917550, -928846, -910707, -827645, -695618]
11131f95618R8170M6740P0469J85971K42822J43318K6050J6248L0173k8340l7199
11120I8804M1097N7439n2965j82628j76351p5776j3537j521N521J9094O9366Q4389
11108a27068N1743P1158J45108J82304J13293m3540k08448k54879j35952N495
11098b00786P9427J25645J36315J17764J05513J19201J32940P4676m4254j11160
11088E35281j24737r0074l0139j3809l2839n4899n9727l0083L4002N1528N2017
11077B36521J22047K47029L66689M19798L24749J39991K7321j993m5366j47201
11067A689585k35926k10367j14821n3733m8452l7420J8858R9494J39464J01595
11057A348277P6847J28717J97748J81683L9982j38075k51764k41362j73513j39595
$$ y = [-695618, -597448, -550708, -480239, -294268, -51446, 91872, 117922, 134170, 164343, 136003, 98804, 139901, 197340, 144375, -38253, -214604, -290380, -303917, -305438, -299917, -280823, -211457, -127068, -75325, -4167, 140941, 323245, 436538, 392998, 184550, -70329, -206281, -200786, -121359, 4286, 140601, 258365, 363878, 483079, 616019, 690695, 646441, 535281, 410544, 320470, 290331, 276522, 243683, 188784, 129057, 98974, 132976, 184504, 236521, 358568, 605597, 972286, 1392084, 1716833, 1856824, 1884145, 1882152, 1836786, 1689585, 1453659, 1243292, 1128471, 1074738, 1026286, 988866, 1007724, 1107218, 1246682, 1348277, 1425124, 1553841, 1751589, 1933272, 1973254, 1835179, 1583415, 1342053, 1168540, 1028945]
11047A028945j38444j60658j43618p3957k3334N8646J93680K34743J18825k7519
11037A067309o4928m8188p4798r0470p7609j20963j82817j52800p0563J2730R0590
11026B87493Q0610l864o6892p9290l3399K7866K297p4179o3508M028K5315K129
11014A08606k0344O851L7938L1251m712l4231O783J16312J85373J30327L7277
11003F01431P7144J58599J63871J14089K4471m9715o0155p9719j34554j88231
10993F27231k55571l10477k77229k16350j37149L539R1587O1143K4042O4754R5755
10982b28725P1155M9524K0729J1576Q6267J87129K45552K14957Q5454k7190j2386
10971G04042K1233n9937j86324k40730k05594j38646r4454o1798n0001o5990m0806
$$ y = [1028945, 890501, 729843, 586225, 512268, 488934, 547580, 741260, 976003, 1094828, 1067309, 1002381, 954193, 879395, 788925, 711316, 590353, 407536, 254736, 184173, 196903, 287493, 368103, 364239, 297347, 218057, 184658, 212524, 214821, 140642, 77134, 81162, 106477, 108606, 88262, 95113, 133051, 164302, 159590, 125359, 132142, 248454, 433827, 564154, 601431, 678575, 837174, 1001045, 1115134, 1139605, 1089890, 1029735, 950016, 815462, 627231, 371660, 61183, -216046, -432396, -569545, -566006, -474419, -413276, -389234, -324480, -228725, -157570, -108046, -87317, -75741, 10526, 197655, 443207, 658164, 743618, 716428, 704042, 725275, 665338, 479014, 238284, 32690, -105956, -200410, -262208, -312209, -378199, -419005]
10960d19005r431k8196R205J14519J51582J04646N8240O8622P7499J1022r6323
10949D2380k10534l04027l65794l54364k72840j57713m8791J4874O6014J00915
10939a489880J14869J61384K34611K77875L10410L21687K51331J29504M795n4154
10929B62432j6585O7915R9951P3243Q5881J36578J72428J19987R724q8103j63124
10918G60327k14319k34488k19112j73613j00306j9944O693p990j3136J1002P7022
10907a27864J34748R6536j0745r3972q2161l2424p2674j76967k22386j60977o5516
10896h14402j3257K0129N3831J17880J94222J80722R5845K5236j0735j1700K3496
10885a38733K2214p3432j64924j70007j19439r792J43349K48811K71383K32822
$$ y = [-419005, -428436, -456632, -447427, -332908, -181326, -76680, -18440, 50182, 127681, 138703, 42380, -168154, -472181, -837975, -1192339, -1465179, -1622892, -1671683, -1656809, -1590795, -1489880, -1375011, -1213627, -979016, -701141, -390731, -69044, 182287, 311791, 316586, 262432, 245847, 313762, 413713, 486956, 572837, 709415, 881843, 1001830, 1011554, 923451, 760327, 546008, 311520, 92408, -81205, -181511, -201455, -194762, -202752, -215888, -204886, -127864, 6884, 103420, 92675, -1297, -83458, -115882, -188556, -365523, -587909, -748886, -814402, -827659, -807530, -753699, -635819, -441597, -260875, -165030, -139794, -150529, -162229, -138733, -116519, -189951, -354875, -524882, -644321, -654113, -510764, -261953, 9430, 242252]
10875B42252J19728r822p6847o3880k685j5225j30207k36368k66499k01645q1924
10864g23122K6561J30229J81670J64579J13087L9958O209J7708M0747Q3706J18480
10853A99812P9205p626n3774q8069j56172j79281j42818o6272M5550J30057J72208
10842f7180J97885J93239J28161J6373n1356o4524j5841Q2889J11978L7049r4489
10831D74184k31788l25660l41357k24465J0668K06901K25467J29854M7886P1459
10821D3149J50968J35642J2153j20030j62070j44181j03070k4240M7461L1749
10811a32469p7562j59223j25424o7479l7292k9324l1631k4179k0531j1394M5001
10800f71507R9230K2555n3122m192P1054R6903M0825m7738j18471j58143j60319
$$ y = [242252, 361980, 352158, 275311, 211431, 208746, 193521, 63314, -173054, -439553, -641198, -723122, -696561, -566332, -384662, -220083, -106996, -67038, -60829, -43121, -2374, 81332, 199812, 279017, 271391, 217617, 129548, -26624, -205905, -348723, -414995, -369445, -239388, -67180, 130705, 323944, 452105, 468478, 417122, 352598, 336757, 419646, 531624, 568673, 474184, 242396, -83264, -424621, -649086, -638418, -431517, -206050, -76196, -28310, 43149, 194117, 329759, 341912, 221882, 59812, -84369, -187439, -211679, -164218, -132469, -210031, -369254, -494678, -562157, -599449, -628773, -660404, -684583, -705114, -716508, -671507, -572277, -549722, -602844, -607036, -535982, -439079, -398254, -445992, -564463, -722606, -882925]
10789h82925j46027j42822j24270k1139R2133R5713M8703K9826N7350J76666L02177
10778e14615L31256K52839J48889Q4625J6008j25757k31755j98648j63119j84702
10768e84979j36169M5786K51337L35757K25718r912j88740k27382j06389M3436
10758c51537O7567K7103k932l8300l9968j8337l482k0044q3026j16987p0372r0
10746f50405N0728N7514L189K945N3560K2340j02547j88077j22493L6746J58558
10735f77942J53648P7810K8594J2906j9709n3107m6761m1316m7882k3192j9248
10724f56199o7109j10403j08111o6558j7799L6931Q9051J10156R8833J18248J59004
10713d13956J37989Q4717N3718k171q5343j57073j82451j32672n8320j1146L4902
$$ y = [-882925, -1028952, -1171774, -1296044, -1317183, -1225050, -1129337, -1080634, -1050808, -993458, -816792, -514615, -183359, 69480, 218369, 302994, 319002, 193245, -38510, -237158, -400277, -584979, -721148, -675362, -424025, -88268, 137450, 127538, -61202, -288584, -394973, -351537, -283970, -256867, -259799, -298099, -338067, -356404, -359886, -379930, -462956, -579943, -650315, -650405, -599677, -542163, -538974, -536029, -482469, -460129, -562676, -750753, -873246, -836500, -677942, -524294, -446484, -417890, -404984, -424693, -477800, -524561, -565877, -613759, -636951, -656199, -723308, -833711, -941822, -1008380, -1026179, -989248, -900197, -790041, -691208, -572960, -413956, -275967, -191250, -137532, -139703, -225046, -382119, -564570, -697242, -755562, -766708, -731806]
10702g31806R0440J12135J03402J05942J25914R9953N1412K3178k9945p7372q4961
10691b11708m3882J7029L8814M0265K1848J8945M8302K3532m2978p0209n1335
10680b11377k7757m5525o6873n617Q3541Q5633M6143O5683J37725J88977J72538
10669D23091J12603J2325q6940j26105j35551j49677j45586j24690j14081o0936
10659c95547K0542K9173K4058P4299N4035l9966p0914n5931n1227k8437N2144
10648c87771J52707J84919J22852L0703o2172j95538k69526j77478j5466J17745
10638d99025J75162J49726R0476N024q0882j23350j05043o2384p4721p4623R252
10627e90388R1794J14411J26384J40260J02625K8064m0328p9699q6167q3518q7456
$$ y = [-731806, -641366, -529231, -425829, -319887, -193973, -94020, -42608, -19430, -49375, -126747, -211708, -255590, -238561, -199747, -159482, -137634, -118689, -70387, -46855, -89833, -160042, -211377, -239134, -284659, -351532, -357149, -273608, -187975, -141832, -76149, 61576, 250553, 423091, 535694, 548019, 461079, 334974, 199423, 49746, -95840, -220530, -334611, -395547, -375005, -345832, -321774, -247475, -193440, -233406, -304320, -360251, -411478, -439915, -387771, -235064, -50145, 72707, 103410, 41238, -154300, -423826, -601304, -616770, -499025, -323863, -174137, -83661, -78637, -159519, -282869, -387912, -450296, -525017, -599640, -590388, -498594, -384183, -257799, -117539, -14914, 13150, -27178, -106877, -193044, -276562, -364018]
10616c64018j03172j12796j30216j14498n9697J04K3638L3154O5255J15309J61026
10605d85911J87520J62175R1073j4904j40341k02570j84964j01649K5493O4835
10595e99243p408o3889m7053J3108O9228P9671P4084N2450J4144J4968L5230N0999
10583c13711N9538O1057M9133N435j8551O568O9368J13658M7135q1044j31687
10572a33101o5987k9675r9965j28716p0245k4103K7022J07035J29392M1069l6529
10561b83803m307O4276L9640o4676q0611J8599J16960J31781J01465P1344M2897
10550A53565M9441M6321j0477n2082k0061L0873K6727k8502p2540j09551j64359
10539a50645k22051j84489p9397J154O9402J40125J62359O4770j04753j95247
$$ y = [-364018, -467190, -579986, -710202, -824700, -884397, -884293, -860655, -827501, -762246, -646937, -485911, -298391, -136216, -45143, -60047, -200388, -402958, -587922, -689571, -664078, -599243, -606651, -670540, -717593, -704485, -635257, -555586, -481502, -429052, -414908, -399940, -364710, -313711, -254173, -193116, -143983, -138548, -157099, -150531, -81163, 32495, 79630, -1414, -133101, -199088, -228763, -328728, -457444, -527689, -551792, -524770, -417735, -288343, -247274, -283803, -288110, -223834, -184194, -248870, -329481, -310882, -193922, -62141, 39324, 110668, 153565, 203006, 249327, 238850, 186768, 166707, 197580, 224307, 195805, 123265, 13714, -150645, -372696, -557185, -636582, -635428, -566026, -425901, -263542, -198772, -303525, -498772]
10529d98772j34792K1589J60185K42996K68100K19722J20200m06k9330O5161J32304
10518E66957N7296q3970j74732k02987k05153j73994j39943j21165n8337Q8595
10508d47433K26545K49351J49935J5480o3652q3941p1407l3646j9533n5450k7070
10497a60821P4229R2959J7779m8300l3121K6653L1706m3447j33612j52173j18822
10486d46970q9784r3794q4765p695Q0691N1862l2495k0778N9698J24744J17693
10475c41593J05984J29323J16250L4245n985J7245j7326j05135j32622j14062
10465c13676n0633K6435J5121n8014j13286j20076r2454l6476K1561N3174P5099
10454e93225R1325P8710M484o0441k4810R4865K13359J82180o995j71439j67621
$$ y = [-498772, -633564, -611975, -451790, -208794, 59306, 279028, 399228, 398822, 369492, 434653, 566957, 624253, 540283, 365551, 162564, -42589, -216583, -356526, -477691, -536028, -447433, -220888, 28463, 178398, 193878, 130226, 46285, -25122, -58768, -78301, -133751, -160821, -86592, 6367, 24146, -24154, -57275, -30622, 1084, -42363, -175975, -328148, -446970, -536754, -630548, -715313, -723008, -642317, -590455, -622950, -643728, -584030, -459286, -341593, -235609, -106286, 9964, 44209, 38224, 55469, 38143, -66992, -199614, -313676, -364309, -337874, -322753, -380767, -494053, -614129, -706583, -743059, -721498, -668324, -593225, -501900, -423190, -418706, -479147, -503957, -409092, -195733, -13553, -20548, -191987, -359608]
10443c59608r8594p2360o5502m8536l1226L7445J45863K01260J73444J01374M0465
10432B4025O4155J54754K21773K31403K37046J87344N2550n7254n8902K9067P2490
10421A158451K6181m9889j04940j11695j24436j38068j57589j63838j14842n2776
10411A66559l7842p2373j13371j26349j43293j56288j10891k9549P52k6278k80
10400f49203O3881Q4308J21044J83946J76498J12051O9728N1234K3061j470R77
10389B36055O834j0237k9482n0448n5655L7905J56788J85500J15660J6538l3279
10378E76179r7759j65259j95595k42081k87477k45262j06411P987L5247N3789
10368f66642O1948P098n9128m8988N983N6113P8888J16624J94383K44857K18708
$$ y = [-359608, -458202, -530562, -596064, -644600, -675826, -638381, -492518, -291258, -117814, -16440, 24025, 88180, 242934, 464707, 696110, 933156, 1120500, 1173050, 1115796, 1056894, 1085961, 1158451, 1184632, 1134743, 1029803, 918108, 793672, 655604, 498015, 334177, 219335, 166559, 128717, 56344, -57027, -183376, -326669, -482957, -593848, -623397, -622645, -648923, -649203, -585322, -501014, -379970, -196024, -19526, 92525, 162253, 213487, 236548, 235078, 236055, 242889, 232652, 203170, 152722, 97067, 134972, 291760, 477260, 592920, 609458, 576179, 478420, 313161, 117566, -124515, -411992, -657254, -763665, -755678, -720431, -666642, -604694, -597596, -656724, -705712, -699729, -643616, -564728, -448104, -253721, -8864, 209844]
10357B09844J21887q750l1128m346q7222j68053j38253p8441m6780l2649k5209
10346b89100j6766J4872P4556O0899m0746j37860j90806j63065n4859M1333P5964
10335f25578P0747N8060J06874J66571J72453J34959R3937P1150O5192P1594L2122
10324D18081j07590k19102k31002k13199j30510p602J13172J95160K06229J91414
10314B15051J28247o8498k73557k73100q8875J38061K87722K56936P7210q2086
10304C17111j61178j88811j79097j39012k9217L0610o0647j71968k00849j47203
10294i30261j7197R3488J63593K31390K29140J52377J01730Q7897M3545m4190
10284A11512j47265j62983j10949o7704m303P0682R4544K5290j9787K7935M9779
$$ y = [209844, 331731, 322981, 291853, 287507, 200285, 32232, -106021, -184462, -231242, -263891, -289100, -305866, -290994, -216438, -155539, -196285, -334145, -524951, -688016, -742875, -701542, -625578, -554831, -496771, -389897, -223326, -50873, 84086, 178023, 249173, 314365, 385959, 418081, 310491, 91389, -139613, -352812, -483322, -490924, -377752, -182592, 23637, 215051, 343298, 274800, 1243, -271857, -360732, -222671, 65051, 321987, 399197, 317111, 155933, -32878, -211975, -350987, -380204, -349594, -410241, -582209, -783058, -930261, -947458, -853970, -690377, -458987, -229847, -77470, 24260, 112157, 155702, 111512, -35753, -198736, -309685, -377389, -381692, -311010, -216466, -191176, -210963, -183028, -133249]
10273a33249m756o8850j5555J17159J73474J19763k2118j65407k17858j75708
10263c93105p4771j2401K7468R0798J28100R0165J5899K1306O1242Q0593J02931
10252A38225N4524p3795r9202r709M9666N4279K3509l4786j01223j40372j17445
10241b56329j6271O9644M3964m2509n4579J5260O2969O4127N6664J9719l3138
10230g0479n9512p2507r9942r6764q0035j13593j16011l7429O0974J46093J84278
10219c54927K21212K65693J69809k1438j04281m8574j4250o9109r8038n6660j2749
10208a23312J3920n659n6466p7377m2835L6400J34385J63881N8217p6037q9873
10197f4756p4117q8514n4084k4118m1449o1583r8586j56503k06533k25635j61843
$$ y = [-133249, -138005, -206855, -222410, -105251, 68223, 187986, 165868, 461, -217397, -393105, -467876, -480277, -452809, -362011, -233911, -143746, -127847, -106541, -45299, 35294, 138225, 192749, 118954, 19752, 10043, 59709, 113988, 137497, 102711, 1488, -138884, -256329, -272600, -202956, -158992, -201501, -256080, -240820, -177851, -113724, -57060, -37341, -70479, -129991, -202498, -302440, -399204, -479239, -592832, -708843, -746272, -685298, -539205, -354927, -133715, 131978, 301787, 280349, 176068, 127494, 113244, 44135, -53903, -110563, -123312, -109392, -115051, -171517, -248894, -291729, -255329, -120944, 42937, 101154, 25117, -64756, -138873, -227387, -281471, -305589, -347038, -408621, -507207, -663710, -870243, -1095878, -1257721]
10186a257721j4612Q9688N6599n8196j26858r0597N4777K19235K39487J24062
10176g64136P2143J20364J40119N9481n9693r9357q5147m5770K3038P3491N3075
10165e12392R868N0581J41887J72289J00882k323n7872q1362j18096j25258n9473
10154d81269L5154J63668K79359K67596K00079J66868J42082R6852L0468k7101
10144H73756j18713k05007j79762r9749m3004L0200J48659J95386Q0516p0421
10134F11861m7625J09401K30603K75712K63195J66095K3215m4640N226J24880
10124A717923K46392L02042K13328P7609J19463K45442K23767J10811L3273K527
10114C292577p0128j59754j90745k01009k08350k07365k12590k16082k00494k06014
$$ y = [-1257721, -1272333, -1182645, -1126046, -1184242, -1311100, -1401697, -1346920, -1127685, -888198, -764136, -691993, -571629, -431510, -372029, -431722, -531079, -616226, -661996, -638958, -565467, -512392, -502524, -451943, -310056, -137767, -36885, -39208, -97080, -178442, -296538, -421796, -481269, -446115, -282447, -3088, 264508, 464587, 631455, 773537, 870389, 900857, 873756, 755043, 550036, 370274, 270525, 227521, 257721, 406380, 601766, 682282, 611861, 564236, 673637, 904240, 1179952, 1443147, 1609242, 1632457, 1587817, 1593043, 1717923, 1964315, 2266357, 2479685, 2557294, 2676757, 2922199, 3145966, 3256777, 3290050, 3292577, 3222449, 3062695, 2871950, 2670941, 2462591, 2255226, 2042636, 1826554, 1626060, 1420046]
10104A420046k06807j28057m84Q5859J25341J07549J5478p6091r9936p9574p2780
10093A090544j26928j93080j94776j46138q3941o1273j19284j75368j64071o9046
10083b43361Q8653J94582J65929N1292m2335o1125j5363J4191j1979j9583K5641
10072A46542P4480O3699Q422K3514M0574l1057j10745j51154j77029j49995m8561
10061c11310P3590J98486K64058K10800J00876K4373L4183J03677J35949R4504
10051I29186L0534k4544o0617o943J25992K15864J97264R0392j6303j21475k52986
10040A106364l25022l10990k46943j79470j19804l7053L2948M2459L3169K4907
10030B0565L529k1448l5652j2446O152M6009J31366J58016O3996n5252j01025
$$ y = [1420046, 1213239, 1085182, 1084698, 1170557, 1295898, 1403447, 1418925, 1342834, 1242898, 1163324, 1090544, 963616, 770536, 575760, 429622, 345681, 284408, 165124, -10244, -174315, -243361, -154708, 39874, 205803, 257095, 214760, 153635, 138272, 152463, 140484, 120901, 146542, 221022, 284721, 293143, 316657, 357231, 326174, 215429, 64275, -112754, -262749, -311310, -237720, -39234, 224824, 435624, 536500, 560873, 595056, 698733, 834682, 929186, 959720, 935176, 874559, 867616, 993608, 1209472, 1406736, 1497128, 1480825, 1359350, 1106364, 781342, 470352, 223409, 43939, -75865, -112918, -79970, -37511, -4342, 20565, 24094, 2646, -33006, -45452, -39300, 6709, 138075, 296091, 360087, 304835, 203810]
10019B03810o5581l9481m5995m1911k2159n350l9523m3526N1593J39263J62431
10008B53571J51443J48347J39840J09984J10084J47983J66321J70170K16938K75370
9998A890051L25735L76506M22966N19454O17391O36194N86618N40143M66569L25223
9988F706850J62283m7521k78483m33045n20645n59285n03771l97679l22381k50593
9978C555730j64131j31190j53144j80303k07095k43641k64963k76264k56809j82868
9968A495322j13299q2768o1452o7931j11893j06363n0903j6858j8699n7606q0755
9957G26795m0904k3748l8839j0168m526n3239j17800j70187j97721j95893j60339
9946b86569p1761L2726J19727J81449K19937K92388L18654K35612Q0214q4603
$$ y = [203810, 138229, 98748, 52753, 10842, -11317, -16667, -56190, -99716, -48123, 91140, 253571, 405014, 553361, 693201, 803185, 913269, 1061252, 1227573, 1397743, 1614681, 1890051, 2215786, 2592292, 3015258, 3534712, 4152103, 4788297, 5374915, 5915058, 6381627, 6706850, 6869133, 6821612, 6543129, 6110084, 5589439, 5030154, 4526383, 4128704, 3806323, 3555730, 3391599, 3260409, 3107265, 2926962, 2719867, 2476226, 2211263, 1934999, 1678190, 1495322, 1382023, 1299255, 1237803, 1169872, 1057979, 951616, 900713, 883855, 865156, 807550, 726795, 685891, 662143, 623304, 613136, 608610, 555371, 437571, 267384, 69663, -126230, -286569, -358330, -325604, -205877, -24428, 195509, 487897, 806551, 1042163, 1122377, 1037774]
9936A037774k26098k78841j73031j2646Q4753J36891J23766L1816k8735n4757
9926F40892m9403M9782J32517R0112j624m8644o8283m3699K5597M6453N423k108
9914G77015P6922J02389J5667n8637j07239j48406j22554j5458J10207J73904
9904H03810J71396Q1032j05474k24659k47527k81177l19772k68648j34244l2919
9894e58182O908L1115Q2930R7493K0855k4684J4210O7806J39916J94500K32666
9883C05533K89750K80175J59070K0582o8576j27336j45514r8414m9528k2163m8282
9872D95297j20682j41693n8965Q4924J61718J52289R4822R2304J41834J07997
9862A009845k4908q9454k9997M7517O6596K3279k6721l2676R720K493o2428q1725
$$ y = [1037774, 811676, 532835, 359804, 347158, 431911, 568802, 692568, 724384, 695649, 640892, 591489, 641271, 773788, 863900, 862276, 813632, 745349, 701650, 727247, 773700, 779123, 777015, 853937, 956326, 971993, 913356, 806117, 657711, 535157, 519699, 629906, 803810, 975206, 1056238, 950764, 726105, 478578, 197401, -122371, -391019, -525263, -558182, -551274, -520159, -437229, -339736, -318881, -343565, -329355, -261549, -121633, 72867, 305533, 595283, 875458, 1034528, 1055110, 986534, 859198, 713684, 615270, 565742, 543579, 495297, 374615, 232922, 173957, 258881, 420599, 572888, 667710, 760014, 901848, 1009845, 984937, 895483, 865486, 913003, 979599, 1002878, 976157, 943481, 953201, 955694, 893266, 811541]
9850H11541o083P8227J08085K01165L51298M30519M38292L54913K11833J37917
9840C117707J92452K83391K63175J18115m1635j52302k04024k02279j90903j71584
$$ y = [811541, 805458, 883685, 991770, 1192935, 1544233, 1974752, 2413044, 2767957, 2979790, 3117707, 3310159, 3593550, 3856725, 3974840, 3933205, 3780903, 3576879, 3374600, 3183697, 3012113]
$$ [...]
##END NTUPLES=NMR SPECTRUM
##END=
