##TITLE=C13_SR157-K3-TFAA1
 CDCl3, 23000 sc

 5.6.2023
##JCAMPDX= 6.0         $$ Bruker NMR JCAMP-DX V2.0
##DATA TYPE= NMR SPECTRUM
##DATA CLASS= NTUPLES
##ORIGIN= UXNMR, Bruker Analytische Messtechnik GmbH
##OWNER= root
$$ XWIN-NMR		Version 3.5
$$ Tue Jun  6 13:41:56 2023 Russian Standard Time (UT+4h)  she@DPX200
##.OBSERVE FREQUENCY= 50.327896
##.OBSERVE NUCLEUS= ^13C
##.ACQUISITION MODE= SIMULTANEOUS
##.ACQUISITION SCHEME= undefined
##.AVERAGES= 23001
##.DIGITISER RES= 17
##SPECTROMETER/DATA SYSTEM= spect
##.PULSE SEQUENCE= zgpg30
##.SOLVENT NAME= DMSO
##.SHIFT REFERENCE= (INTERNAL, DMSO, 0, 222.624)
##AUDIT TRAIL= $$ (NUMBER, WHEN, WHO, WHERE, WHAT)
$$ ##TITLE= Audit trail, XWIN-NMR		Version 3.5
$$ ##JCAMPDX= 5.01
$$ ##ORIGIN= Bruker BioSpin GmbH
$$ ##OWNER= she
$$ F:/spectra/data/she/nmr/c13/1/pdata/1/auditp.txt
$$ ##AUDIT TRAIL=  $$ (NUMBER, WHEN, WHO, WHERE, WHAT)
(   1,<2023-06-06 13:40:09.43 +0400>,<she>,<DPX200>,
      <created by zg, POWCHK disabled, PULCHK disabled
       terminated by command 'halt'
       configuration hash MD5:
       00 E9 B6 7A A2 85 ED C7 34 08 36 98 17 FE 4E 26
       data hash MD5: 32K
       52 5B 4B B9 1F 88 6D 44 47 D3 58 78 F7 D2 B4 9C>)
(   2,<2023-06-06 13:40:25.37 +0400>,<she>,<DPX200>,
      <Start of raw data processing
       efp BC_mod = 2 LB = 2 FT_mod = 6 PKNL = 1 PHC0 = -379.0112 PHC1 = 37.36414 SI = 32K 
       data hash MD5: 32K
       3E 44 62 82 20 6F 48 37 E6 58 EC 6F 7B F7 6E 1E>)
(   3,<2023-06-06 13:40:44.42 +0400>,<she>,<DPX200>,
      <pk PHC0 = -16.17345 PHC1 = 4.8 
       data hash MD5: 32K
       00 97 41 CC EB 46 77 9B 97 A9 ED 06 25 8C 26 EC>)
(   4,<2023-06-06 13:41:03.21 +0400>,<she>,<DPX200>,
      <pk PHC0 = 7.166884 PHC1 = -11.2 
       data hash MD5: 32K
       55 71 BC 1E AB BF 4B 56 52 B5 BE 89 3F 65 F3 01>)
(   5,<2023-06-06 13:41:06.56 +0400>,<she>,<DPX200>,
      <abs ABSG = 5 
       data hash MD5: 32K
       CE 5F D9 69 6A F7 1B AD C8 07 91 08 E1 83 FC BE>)
$$ ##END=
$$ 
$$ hash MD5
$$ 9A 5C B4 42 8C 8D DA 53 99 C2 3C D5 69 97 FD 30
##$RELAX= 
##$RELAX= 
##$RELAX= 
##$RELAX= 
##$RELAX= 
##$RELAX= 
##$RELAX= 
##$RELAX= 
$$ Bruker specific parameters
$$ --------------------------
##$DU= <F:/spectra>
##$EXPNO= 1
##$NAME= <c13>
##$PROCNO= 1
##$TYPE= <nmr>
##$USER= <she>
##$AMP= (0..31)
100 100 100 100 100 100 100 100 100 100 100 100 100 100 100 100 100 100 
100 100 100 100 100 100 100 100 100 100 100 100 100 100 
##$AQSEQ= 0
##$AQ_mod= 1
##$AUNM= <au_zg>
##$AUTOPOS= <>
##$BF1= 50.322709
##$BF2= 200.13
##$BF3= 50.322709
##$BF4= 500.13
##$BF5= 500.13
##$BF6= 500.13
##$BF7= 500.13
##$BF8= 500.13
##$BYTORDA= 1
##$CFDGTYP= 0
##$CFRGTYP= 5
##$CHEMSTR= <none>
##$CNST= (0..31)
1 1 145 1 1 1 1 1 1 1 1 1 1 1 1 1 1 1 1 1 1 1 1 1 1 1 1 1 1 1 1 1 
##$CPDPRG= <waltz16>
##$CPDPRG1= <>
##$CPDPRG2= <waltz16>
##$CPDPRG3= <>
##$CPDPRG4= <mlev>
##$CPDPRG5= <mlev>
##$CPDPRG6= <mlev>
##$CPDPRG7= <mlev>
##$CPDPRG8= <mlev>
##$CPDPRGB= <>
##$CPDPRGT= <>
##$D= (0..31)
$$ [...]
##$SUBNAM4= <"">
##$SUBNAM5= <"">
##$SUBNAM6= <"">
##$SUBNAM7= <"">
##$SUBNAM8= <"">
##$SUBNAM9= <"">
##$SW= 239.972175391363
##$SWIBOX= (0..15)
0 1 3 0 0 0 0 0 0 0 0 0 0 0 0 0 
##$SW_h= 12077.2946859903
##$TD= 32768
##$TD0= 1
##$TE= 0
##$TE2= 300
##$TE3= 300
##$TEG= 300
##$TL= (0..7)
120 120 120 120 120 120 120 120 
##$TP= (0..7)
150 150 150 150 150 150 150 150 
##$TP07= 0
##$TPNAME0= <>
##$TPNAME1= <>
##$TPNAME2= <>
##$TPNAME3= <>
##$TPNAME4= <>
##$TPNAME5= <>
##$TPNAME6= <>
##$TPNAME7= <>
##$TPOAL= (0..7)
0.5 0.5 0.5 0.5 0.5 0.5 0.5 0.5 
##$TPOFFS= (0..7)
0 0 0 0 0 0 0 0 
##$TUNHIN= 0
##$TUNHOUT= 0
##$TUNXOUT= 0
##$USERA1= <user>
##$USERA2= <user>
##$USERA3= <user>
##$USERA4= <user>
##$USERA5= <user>
##$V9= 5
##$VALIST= <valist>
##$VCLIST= <CCCCCCCCCCCCCCC>
##$VD= 0
##$VDLIST= <DDDDDDDDDDDDDDD>
##$VPLIST= <PPPPPPPPPPPPPPP>
##$VTLIST= <TTTTTTTTTTTTTTT>
##$WBST= 1024
##$WBSW= 4
##$XGAIN= (0..3)
0 0 0 0 
##$XL= 0
##$YL= 0
##$YMAX_a= 154759620
##$YMIN_a= -46360259
##$ZGOPTNS= <>
##$ZL1= 120
##$ZL2= 120
##$ZL3= 120
##$ZL4= 120
##$ABSF1= 222.624
##$ABSF2= -17.3728
##$ABSG= 5
##$ABSL= 3
##$ALPHA= 0
##$AQORDER= 0
##$ASSFAC= 0
##$ASSFACI= 0
##$ASSFACX= 0
##$ASSWID= 0
##$AUNMP= <proc_1d>
##$AZFE= 0.1
##$AZFW= 0.5
##$BCFW= 0
##$BC_mod= 2
##$BYTORDP= 0
##$COROFFS= 0
##$CY= -3
##$DATMOD= 1
##$DC= 0
##$DFILT= <>
##$DTYPP= 0
##$F1P= 0
##$F2P= 0
##$FCOR= 0.5
##$FTSIZE= 32768
##$FT_mod= 6
##$GAMMA= 0
##$GB= 0
##$INTBC= 1
##$INTSCL= 4.134877e-10
##$ISEN= 128
##$LB= 2
##$LEV0= 0
##$LPBIN= 0
##$MAXI= 10000
##$MC2= 0
##$MEAN= 0
##$ME_mod= 0
##$MI= 0.1934396
##$NCOEF= 0
##$NC_proc= 2
##$NLEV= 6
##$NOISF1= 120.0001
##$NOISF2= 80.00006
##$NSP= 0
##$NTH_PI= 0
##$NZP= 0
##$OFFSET= 222.624
##$PC= 1.4
##$PHC0= -388.0178
##$PHC1= 30.96414
##$PH_mod= 1
##$PKNL= yes
##$PPARMOD= 0
##$PSCAL= 0
##$PSIGN= 0
##$REVERSE= no
##$SF= 50.3227315983092
##$SI= 32768
##$SIGF1= 140
##$SIGF2= 120
##$SINO= 11.81781
##$SIOLD= 32768
##$SREGLST= <13C.CDCl3>
##$SSB= 0
##$STSI= 32768
##$STSR= 0
##$SW_p= 12077.2946859903
##$SYMM= 0
##$S_DEV= 0
##$TDeff= 32768
##$TDoff= 0
##$TI= <>
##$TILT= no
##$TM1= 0
##$TM2= 0
##$TOPLEV= 0
##$USERP1= <user>
##$USERP2= <user>
##$USERP3= <user>
##$USERP4= <user>
##$USERP5= <user>
##$WDW= 1
##$XDIM= 32768
##$YMAX_p= 379309276
##$YMIN_p= -1914817
$$ End of Bruker specific parameters
$$ ---------------------------------
##NTUPLES= NMR SPECTRUM
##VAR_NAME=  FREQUENCY,     SPECTRUM/REAL,   SPECTRUM/IMAG
##SYMBOL=    X,             R,               I
##VAR_TYPE=  INDEPENDENT,   DEPENDENT,       DEPENDENT
##VAR_FORM=  AFFN,          ASDF,            ASDF
##VAR_DIM=   32768,         32768,           32768
##UNITS=     HZ,            ARBITRARY UNITS, ARBITRARY UNITS
##FACTOR=    0.368581032318806, 1,           1
##FIRST=     11203.0474430531, 0,            0
##LAST=      -874.247242937185, 0,           0
##MIN=       -874.247242937185, -1914817,    0
##MAX=       11203.0474430531, 379309276,    0
$$ Real data points
##PAGE= N=1
##DATA TABLE= (X++(R..R)), XYDATA
$$ [...]
15971c09610l8203L4156Q2003R6858N0082n4498p4825M2336J54611J52917J12993
$$ -309610 -347813 -313657 -231654 -134796 -84714 -139212 -214037 -171701 -17090 135827 248820
15960B48820J33574J51364R5380l6059j65602k36887k03811n5242Q7627J20256
$$ 248820 382394 533758 629138 593079 427477 190590 -13221 -68463 19164 139420
15950A39420R4432o842j60786j87143q9327J6245O1580K2001m2111n2015j7086
$$ 139420 233852 227010 66224 -120919 -210246 -194001 -132421 -110420 -152531 -204546 -221632
15939b21632L6241M8367J918l1278n8763j07916j26106n9546M3487P1404M919
$$ -221632 -185391 -137024 -135106 -166384 -225147 -333063 -459169 -518715 -475228 -403824 -398905
15928c98905m2296K7376J13696O3825k4286k239K5509J5527l765o2160j28521
$$ -398905 -441201 -413825 -300129 -236304 -260590 -262829 -237320 -221793 -225558 -287718 -416239
15917d16239j66722j84422j44666m0845R0806J79060J51735O6437M8914N7660
$$ -416239 -582961 -767383 -912049 -952894 -862088 -683028 -531293 -464856 -415942 -358282
15907c58282K3003j3493j7444K292M1245N9699N3819N3951O0344K3558o4595p5409
$$ -358282 -335279 -348772 -366216 -363924 -322679 -262980 -209161 -155210 -94866 -71308 -135903 -211312
15895b11312j4517M3030Q5030P3095M284l7026P078O8059Q4942N7681J2737m3656
$$ -211312 -225829 -182799 -97769 -24674 -20390 -57416 -50338 17721 102663 160344 173081 129425
15883A29425o0075q465J4102l2248k7605L6502P1856J0958o2829m8504R804N3709
$$ 129425 69350 60885 74987 42739 15134 51636 123492 134450 71621 23117 32921 86630
15871H6630J04353J45200P4217q3502j77436j41541q0956l3744j8739n5105j35180
$$ 86630 190983 336183 410400 326898 149462 7921 -73035 -106779 -125518 -180623 -315803
15860c15803j66325j14105n3162O474M9053J06824J91338K13370J46079K2172
$$ -315803 -482128 -596233 -649395 -642921 -593868 -487044 -295706 -82336 63743 85915
15850H5915o7919n7862N024P9529P1774r226p3210j27338j60395j60310j16856
$$ 85915 17996 -39866 -34842 44687 116461 107235 34025 -93313 -253708 -414018 -530874
15839e30874p765J79841L01914K15146K42j38358j45233r7972l6946q036k4595
$$ -530874 -538639 -358798 -56884 158262 158504 20146 -125087 -223059 -260005 -268041 -292636
15828b92636p4681j45759j72398j53717j76757j69200m0814J22850K19570K07138
$$ -292636 -367317 -513076 -685474 -839191 -1015948 -1185148 -1225962 -1103112 -883542 -676404
15818f76404J21504P2323O8938M8506K7208J2333J4014L3883K7845O532l8490
$$ -676404 -554900 -482577 -413639 -365133 -337925 -325592 -311578 -277695 -249850 -243318 -281808
15807b81808r4563r3790k6093L4299M2451M0301N1008J2593k0070J4770M1360
$$ -281808 -376371 -470161 -496254 -461955 -419504 -379203 -328195 -315602 -335672 -320902 -279542
15796b79542q312o5079m7889n7474r1189p0492k644O3253J12229J09081P4408
$$ -279542 -287854 -352933 -400822 -458296 -549485 -619977 -622621 -559368 -447139 -338058 -263650
15785b63650Q5035R4659Q6748J06423P4731m757k5139k319m0694m2163P7119J30217
$$ -263650 -178615 -83956 2792 109215 183946 179189 154050 151731 111037 68874 145993 276210
15773B76210K1895r2195j32172j28082p0538l3029K108R0432J02444j9926j35561
$$ 276210 298105 205910 73738 -54344 -124882 -157911 -155803 -65371 37073 17147 -118414
15762a18414j55582r6642n945N1237P1608P3653K0087o5755j19185j07139K6973
$$ -118414 -273996 -370638 -376583 -325346 -253738 -180085 -159998 -225753 -344938 -452077 -425104
15751d25104K32579L77873L62714K11725L2226r5939j57675j37894j19322j64428
$$ -425104 -192525 185348 548062 759787 792013 696074 538399 400505 281183 116755
15741A16755j45054L112J14297Q5050K2011J2249L4434N4142M6072P003k8116
$$ 116755 -28299 -25187 89110 174160 196171 208420 242854 296996 343068 350071 321955
15730C21955m2593l8958K4612R4620N9799m5866j00807o8139j919N0555P5710
$$ 321955 279362 240404 265016 359636 419435 373569 272762 204623 202704 253259 328969
15719C28969N0513l1115j21689j30231k4403N7381J7096o1206q9932p4352j12553
$$ 328969 379482 348367 226678 96447 72044 129425 146521 85315 -4617 -78969 -191522
15708a91522j94361j88156j27546j58867j78370l1476J84690L30542L37027K36636
$$ -191522 -385883 -574039 -701585 -860452 -1038822 -1070298 -885608 -555066 -218039 18597
15698A8597J20594K2408k7592o181J5053K7202M7709n388j24843k08610j51571
$$ 18597 139191 161599 134007 127826 142879 170081 217790 212402 87559 -121051 -272622
15687b72622L2944K15602L09354K31087M1579r0994j41842j59490j32026n3210
$$ -272622 -239678 -24076 285278 516365 557944 466950 325108 165618 33592 -19618
15677a9618o839K5107R6636J54542J21196L9006j9o0014j37330j57009j34066
$$ -19618 -26457 -1350 95286 249828 371024 410030 410011 349997 212667 55658 -78408
15666g8408n7035O7518J27414J37733J64435J53028O8357m8647j55699k01151
$$ -78408 -135443 -67925 59489 197222 361657 514685 583042 534395 378696 177545
15656A77545j06827M337J359m5748p8989n7912P509K9829j6878n5702n6645o1464
$$ 177545 70718 75055 76414 30666 -48323 -106235 -98726 -68897 -85775 -141477 -198122 -259586
15644b59586l4744J7180K5554L3625R2823J35935J09711N8340j2027r5955j32397
$$ -259586 -294330 -277150 -251596 -217971 -125148 10787 120498 178838 166811 70856 -61541
15633f1541j15900o7549j6882K1801J05753K05291K09712J47248J42354J48436
$$ -61541 -177441 -244990 -261872 -240071 -134318 70973 280685 427933 570287 718723
15623G18723M1786j31804j88700j03933j5962l6484j01735p8424K3260R8353Q1677
$$ 718723 760509 628705 440005 336072 320110 283626 181891 103467 126727 225080 306757
15612C06757k697p5049j28794j53667j02154J59R4129J55383J37665O6795K3903
$$ 306757 304060 229011 100217 -53450 -155604 -155445 -61316 94067 231732 298527 322430
15601C22430R876J9277L3562J1380J9509O2018Q0166P4911K6421l4224m8119n6734
$$ 322430 332306 351583 385145 396525 416034 478052 558218 633129 659550 625326 577207 520473
15589E20473l1160M1040O2538o284j55931k63454k44837j71891n4656Q4017J62682
$$ 520473 489313 530353 592891 586607 430676 167222 -77615 -249506 -304162 -220145 -57463
15578e7463J64894J12978P0576J12739J80540J22557n1918k07898k88613l08979
$$ -57463 107431 220409 290985 403724 584264 706821 654903 447005 158392 -150587
15568a50587l12064k46562q8943P5004J36818N9263m965M7779R6970L9451n1731
$$ -150587 -462651 -709213 -798156 -723152 -586334 -527071 -532036 -484257 -387287 -347836 -399567
15557c99567p4187q1305j06408r4968j8670N6098P7287R9565P7735J2376m7535
$$ -399567 -473754 -555059 -661467 -756435 -775105 -719007 -641720 -542155 -464420 -452044 -499579
15546d99579q4307p0133m4590l9999p5271j06569m4296P1450J43469J07978l4
$$ -499579 -583886 -654019 -698609 -738608 -813879 -920448 -964744 -893294 -749825 -641847 -641881
15535f41881l7673j2815r773k4148p25N8342Q0237O4906Q1352J94681L04004K87990
$$ -641881 -679554 -692369 -702142 -726290 -727015 -668673 -588436 -523530 -442178 -247497 56507 344497
15523C44497K00964R9134l7767j83175k41143j98742j13251k0393M4068P1844
$$ 344497 545461 644595 606828 423653 182510 -16232 -129483 -149876 -105808 -33964
15513c3964R9132J40767Q9062k2804l8354j2155k0038l981r996o9470j30207r3139
$$ -33964 65168 205935 294997 272193 233839 221684 201646 197665 187669 118199 -12008 -105147
15501a05147K2160N6682n822p6486r6511n3294L9690J04520O0100m475Q380P2299
$$ -105147 -82987 -26305 -32127 -108613 -205124 -258418 -218728 -114208 -54108 -58583 -50203 22096
15489B2096J40857J40996R9768J01559J15020P2105j2251q7506j18396n7167K7234
$$ 22096 162953 303949 403717 505276 620296 692401 680150 592644 474248 417081 444315
15478D44315N175j30636k32023k20900j75091j65171k05562k12823j06929N9033
$$ 444315 449490 318854 86831 -134069 -309160 -474331 -679893 -892716 -999645 -940612
15468i40612K16563K91235K65478J73044O4520K5513P5666J49990J44066J0735
$$ -940612 -724049 -432814 -167336 5708 70228 95741 171407 321397 465463 476198
15458D76198j41948k02044j78815j21805o6757l0629M0006J38965J40928P2064
$$ 476198 334250 132206 -46609 -168414 -235171 -265800 -225794 -86829 54099 126163
15448A26163j844n3015r3209p7064l599K5799r342n6191p5328o5342n1572k5687
$$ 126163 124319 71304 -21905 -98969 -102568 -76769 -86111 -142302 -217630 -282972 -334544 -360231
15436c60231R0305K31889K81819J66556k3167n6722M3345R1506N9583l2422j35459
$$ -360231 -269926 -38037 243782 410338 387171 330449 373794 465300 524883 492461 357002
15425C57002j62019j18693r1466n6589K7864J38220J66808P8829k169n0740j25791
$$ 357002 194983 76290 -15176 -71765 -43901 94319 261127 339956 337787 287047 161256
15414A61256j34553o3964q8497j23386p2724Q910P2570P2404O360L45N7290M6993
$$ 161256 26703 -37261 -125758 -249144 -321868 -312958 -240388 -167984 -161624 -161279 -103989 -56996
15402e6996j8381o4754k8375Q5123J71030J72395J20844O5638R583q4798j92834
$$ -56996 -75377 -140131 -168506 -83383 87647 260042 380886 446524 456107 371309 178475
15391A78475k38508j98341q1715p412k291L9470R4266J07657P0470K3267L4149
$$ 178475 -60033 -258374 -340089 -347501 -349792 -310322 -216056 -108399 -37929 -14662 19487
15380A9487Q1049Q0003R531o6812q9116p6168n9304o1187m4735M9028J14859P6415
$$ 19487 100536 180539 190070 123258 34142 -42026 -101330 -162517 -207252 -158224 -43365 33050
15368C3050K690l0785m7651p7565p9096p9507j37915j46243n460J62260K29601
$$ 33050 35740 4955 -42696 -120261 -199357 -278864 -416779 -563022 -568482 -406222 -176621
15357a76621J79455J19162J19186J38581J19385K4124o2383j35963k78805l76823
$$ -176621 2834 121996 241182 379763 499148 523272 460889 324926 46121 -330702
15347c30702l09593j26132M7557J35936J40950P3549K0235r752o1648q5860o7241
$$ -330702 -640295 -766427 -718870 -582934 -441984 -368435 -348200 -357952 -419600 -505460 -572701
15336e72701n3573p6604p8090j7221Q3673J83387K30382K48272K15740P1398r0332
$$ -572701 -626274 -702878 -780968 -798189 -714516 -531129 -300747 -52475 163265 234663 144331
15325A44331j49006j17164j02898j56956k22995k06279o4870R6943J97562K32763
$$ 144331 -4675 -121839 -224737 -381693 -604688 -810967 -875837 -778894 -581332 -348569
15315c48569J87269J04229Q0444R2389J2238j23303j24361N4518K27677K35304
$$ -348569 -161300 -57071 23373 115762 128000 4697 -119664 -65146 162531 397835
15305C97835O9401j44026k36540j84921l5072J08372J17971L7844Q492L5768M6242
$$ 397835 467236 323210 86670 -98251 -133323 -24951 93020 130864 139356 175124 221366
15294B21366M1332O6796R2749Q0794O1564K027j25754j96401j48519o3086J5439
$$ 221366 262698 329494 422243 503037 564601 566628 440874 244473 95954 32868 48307
15283D8307N8861M1143j0237m0527m6785n1544o6738q7593n1478M5868J47193
$$ 48307 107168 148311 138074 97547 50762 -782 -67520 -155113 -206591 -160723 -13530
15272a3530J93220J46372O9713J4167k7865p6882j09484q5228k2811L033j087
$$ -13530 179690 326062 395775 409942 382077 305195 195711 110483 87672 90705 89618
15261H9618K5833R1160J60048J73836O3271j68614l68908m10737l13114j78565
$$ 89618 115451 206611 366659 540495 603766 435152 66244 -344493 -657607 -836172
15251h36172p6180K9196J30784K02826K46201J97226J07808N6481J648m9756p2569
$$ -836172 -912352 -883156 -752372 -549546 -303345 -106119 1689 58170 59818 10062 -62507
15240f2507o6116l2418O3521J72508J65198L5260o8127j28232j74418j79085j42584
$$ -62507 -128623 -161041 -97520 74988 240186 275446 207319 79087 -95331 -274416 -417000
15229d17000o7578k0592l3486M1394K28212L01393J69275m8352k34882k81723
$$ -417000 -484578 -505170 -538656 -497262 -269050 32343 201618 153266 -81616 -363339
15219c63339j50986j4746J0883m387m3518r7282n2476Q8405J61524J28383K9405
$$ -363339 -514325 -529071 -518188 -522575 -566093 -663375 -715851 -627446 -465922 -337539 -308134
15208c08134o1989j02110m4746Q0392J77142K23476K09908J62165J21722J04595
$$ -308134 -370123 -472233 -516979 -436587 -259445 -35969 173939 336104 457826 562421
15198E62421P7251M4990j9057j22222j88322j90312j84605k00133j91280j48397
$$ 562421 639672 684662 665605 543383 355061 164749 -19856 -219989 -411269 -559666
15188e59666j34995j44046j16743n6523o413r084k4017j4676K5345J08840K25507
$$ -559666 -694661 -838707 -955450 -1011973 -1018386 -1027470 -1051487 -1066163 -1040818 -931978 -706471
15177g06471L15193L26030K18546K5025j25199k19490k46764j55272o728R9517
$$ -706471 -391278 -65248 153298 178323 53124 -166366 -413130 -568402 -575130 -475613
15167d75613J75219J80066J09327M2705k6191o9621q1147j02823j24254j04802
$$ -475613 -300394 -120328 -11001 31704 5513 -64108 -145255 -248078 -372332 -477134
15157d77134r039P5107P9440L8557k5341q3841j19716q4550j3395J8674K2663
$$ -477134 -486173 -411066 -331626 -293069 -318410 -402251 -521967 -606517 -619912 -601238 -578575
15146e78575j1682m3536j1734O7723J48352J84640J40983L9545q3591j65343j44845
$$ -578575 -590257 -633793 -645527 -577804 -429452 -244812 -103829 -64284 -147875 -313218 -458063
15135d58063k079J59315J80874P1307o4754r9439o392R9984J39211J07597O6188
$$ -458063 -460142 -300827 -119953 -48646 -113400 -212839 -219231 -119247 19964 127561 193749
15124A93749M4837M2319Q8029J07494M9309o537l8517l8798L0895M2522n8380
$$ 193749 238586 280905 368934 476428 525737 519200 480683 441885 472780 515302 456922
15113D56922j78719j97749j35369j07751j33162j07845L4023J25021M5787j23850
$$ 456922 278203 80454 -54915 -162666 -295828 -403673 -369650 -244629 -198842 -322692
15103c22692k31441j98787p6400j8564k9499n93K4917O5300J65301K35563J94166
$$ -322692 -554133 -752920 -829320 -847884 -877383 -877976 -853059 -787759 -622458 -386895 -192729
15092a92729P8171M417j795k9815r2630j40785j38162o1610K4991P1157J28337
$$ -192729 -114558 -110141 -111936 -141751 -234381 -375166 -513328 -574938 -549947 -478790 -350453
15081c50453J60441J07223K2993o2808j11670q2030m0004m8658o9957o6154k9209
$$ -350453 -190012 -82789 -59796 -122604 -234274 -316304 -356308 -404966 -474923 -541077 -570286
15070e70286J3502Q5419J88887K04223J15196P3410Q0058K4895n5461q1710j00873
$$ -570286 -556784 -471365 -282478 -78255 36941 110351 190409 215304 159843 78133 -22740
15059b2740j18374l8059Q7847Q9857m2419j36764p1970L5597N8201N7178Q3272
$$ -22740 -141114 -179173 -91326 -1469 -43888 -180652 -252622 -217025 -158824 -101646 -18374
15048a8374Q7482O5518O4562R7328J06146P3831K8607k1869P797R0880R0553N7182
$$ -18374 69108 134626 199188 296516 402662 476493 505100 483231 491028 581908 672461 729643
15036G29643N0493L9979J3319n3148j48296k19589j97335q7477l8923j26025k58165
$$ 729643 780136 820115 833434 780286 631990 412401 215066 127589 88666 -37359 -295524
15025b95524k23426l7925O0278N3588L7737p411o1486m5375k9946o2296m9521
$$ -295524 -518950 -556875 -496597 -443009 -405272 -412683 -474169 -519544 -549490 -611786 -661307
15014f61307j884K8123L1893N5219J04395J18316R8929O9329l527j47401k55046
$$ -661307 -663191 -635068 -603175 -547956 -443561 -325245 -226316 -156987 -160514 -307915 -562961
15003e62961k68408j97091q1847J8584R5797J40677J41924J37279J40721J00679
$$ -562961 -831369 -1028460 -1110307 -1091723 -995926 -855249 -713325 -576046 -435325 -334646
14993c34646M906j14473k19399k27675p8167J36572K34888J86539J10143N1605
$$ -334646 -329740 -444213 -663612 -891287 -969454 -832882 -597994 -411455 -301312 -249707
14983b49707m1187j13024p1219J3500L2162J813l0238k3691J220K2919O1854J02737
$$ -249707 -290894 -403918 -475137 -461637 -429475 -427662 -457900 -481591 -480371 -457452 -395598 -292861
14971b92861J28253J16264R1176Q9244J00850R1853P9089M8675k4649r3324j40551
$$ -292861 -164608 -48344 42832 132076 232926 324779 403868 452543 427894 334570 194019
14960A94019j34654n6712J6909L8929O524n3162j13468j19279p8199r1255j38132
$$ 194019 59365 2653 19562 58491 65015 11853 -101615 -220894 -299093 -390348 -528480
14949e28480j13966k9164M2799N6922K5540k6046m2313J6494J35798K37797K14344
$$ -528480 -642446 -671610 -628811 -571889 -546349 -572395 -614708 -598214 -462416 -224619 -10275
14938a0275R4169Q083r395P057K0196k1174o3605o8897p7189p1459m320P2525
$$ -10275 83894 91977 82582 89639 109835 88661 25056 -43841 -121030 -192489 -196809 -124284
14926a24284Q1587N6539L7156L768p3423j68244j91008j30473l7573M3349R9066
$$ -124284 -42697 13842 50998 54766 -18657 -186901 -377909 -508382 -545955 -502606 -403540
14915d03540J42943J65463J27708P7598Q2606J04042Q7783M9329K4884o926n9751
$$ -403540 -260597 -95134 32574 110172 192778 296820 384603 433932 458816 451890 392139
14904C92139o0232O735L6842l313l5217j8044M0838O5642K4332n354j9059k1115
$$ 392139 331907 338642 375484 372171 336954 318910 359748 425390 449722 444368 425309 404194
14892D04194L7238Q4146K9194o6212j10300j40408k31955l03261k91654j86487
$$ 404194 441432 525578 554772 488560 378260 237852 5897 -297364 -589018 -775505
14882g75505O582J67490J82881Q4614j0421o7217r0000l1348Q9488J57407J10837
$$ -775505 -768923 -601433 -418552 -333938 -344359 -411576 -501576 -532924 -443436 -286029 -175192
14871a75192L6422N0645J18660J21615M4703l5192j27741k76493l24206j59461
$$ -175192 -138770 -88125 30535 152150 196853 161661 33920 -242573 -566779 -726240
14861g26240L2089N0916l3005m1705j0938r897J5250J06704K37061K85215J78569
$$ -726240 -694151 -643235 -676240 -717945 -728883 -738780 -723530 -616826 -379765 -94550 84019
14850H4019L0050l7111o5890j09224j08225o9889n2487n1089k6895j5346j02444
$$ 84019 114069 76958 11068 -98156 -206381 -276270 -328757 -379846 -406741 -422087 -524531
14839e24531j84009j07307M1720J23361J18372N5405K0654N5641Q3716L7300r837
$$ -524531 -708540 -815847 -774127 -650766 -532394 -476989 -456335 -400694 -316978 -279678 -289515
14828b89515j288L0279Q0336R2518P3415Q6848J20299J63128J50696Q9269L3368
$$ -289515 -290803 -260524 -180188 -87670 -14255 72593 192892 356020 506716 595985 629353
14817F29353k3856o2487k4949L6143K3172J593O337N784M34k9864q7735j36143
$$ 629353 605497 543010 518061 554204 577376 578969 585306 591090 591524 561660 473925 337782
14805C37782j68062j64662j23424n7295K9927J00759R4010L8193j5022r2402j60087
$$ 337782 169720 5058 -118366 -175661 -145734 -44975 49035 87228 72206 -20196 -180283
14794a80283j88089k04018j86639j42104j05511n1753M9065J70891K59039K52709
$$ -180283 -368372 -572390 -759029 -901133 -1006644 -1058397 -1009332 -838441 -579402 -326693
14784c26693J50757M7089J1487N2677J06575J10395J14799J15849O9283K5584
$$ -326693 -175936 -128847 -117360 -64683 41892 152287 267086 382935 452218 477802
14774D77802r460j15415k00296j55155m8083L0746M8431P3841J06714P1017j630
$$ 477802 468342 352927 152631 -2524 -50607 -19861 28570 102411 209125 280142 278512
14763B78512n3881o5648n6782r5L8700l2000q4559n6865n5546j18734j47194j10881
$$ 278512 224631 158983 102201 102106 140806 108806 24247 -32618 -88164 -206898 -354092 -464973
14751d64973l1403N9076J00180Q4611K2888l4185k3510K5620M9591Q8824J61038
$$ -464973 -496376 -437300 -337120 -252509 -229621 -263806 -287316 -261696 -212105 -123281 37757
14740C7757J68311N8894j42165l24568l44052k10420o2643r55R3688K45995L06277
$$ 37757 206068 264962 122797 -201771 -545823 -756243 -818886 -819841 -726153 -480158 -173881
14729a73881K11266L6394j66774l19045k89236j24173k381L4392N8272M3442o878
$$ -173881 37385 73779 -92995 -412040 -701276 -825449 -827830 -793438 -735166 -691724 -698602
14718f98602J127K0047l3809o6601l5892M5874J13316O2806l6190k7759N1318
$$ -698602 -697475 -677428 -711237 -777838 -813730 -767856 -654540 -591734 -627924 -655683 -604365
14707f04365Q5847Q8398J29645J34454N6713L623R970P661k0177j3412K8002R2883
$$ -604365 -518518 -430120 -300475 -166021 -109308 -105685 -95715 -88054 -108231 -121643 -93641 -758
14695g58J92544K43123J85866N7597r5479j68603j13782l2239l7172p7959m8904
$$ -758 191786 434909 620775 678372 582893 414290 300508 268269 231097 153138 104234
14684A04234p129j5376l8624l596L2389l2878j19601j73664j91644j31672p4146
$$ 104234 97105 81729 43105 39509 71898 39020 -80581 -254245 -445889 -577561 -651707
14673f51707r3662j11943o1013J634L6789N6710K8621l4180q2446q9732l3159
$$ -651707 -745369 -857312 -918325 -916691 -879902 -823192 -794571 -828751 -911197 -1000929 -1034088
14662a034088J9331J6108J2493J3974L8698O7346N4061K655k1531L6565J20672
$$ -1034088 -1014757 -998649 -986156 -972182 -933484 -866138 -812077 -809422 -830953 -794388 -673716
14651f73716J58199J49258J15967Q7942N2207k9222j08340j30329j11790p9066
$$ -673716 -515517 -366259 -250292 -162350 -110143 -139365 -247705 -378034 -489824 -568890
14641e68890o0644m1531K6599J08947Q5889k3046o0692k1109M8550J01714J10660
$$ -568890 -629534 -671065 -644466 -535519 -449630 -472676 -533368 -554477 -505927 -404213 -293553
14630b93553J61024K37610K35845J80055J06439M1480j1938p9943j80049k25502
$$ -293553 -132529 105081 340926 520981 627420 668900 656962 577019 396970 171468
14620A71468j86820j13537l6890m3748r7100q0021K4497J29836K11131K35158
$$ 171468 -15352 -128889 -165779 -209527 -306627 -386648 -362151 -232315 -21184 213974
14610B13974J27631k2383q8163m6858M9370P0940k2671j10513j25665p4335N4034
$$ 213974 341605 319222 231059 184201 233571 304511 281840 171327 45662 -28673 25361
14599B5361J80622J91909R7083j4159o4683o0265n1347q2127j09271m6666K0933
$$ 25361 205983 397892 494975 480816 416133 355868 304521 222394 113123 66457 87390
14588H7390m9356j68333j73555j09860q7910j14372r9871m0218j2857K417K7070
$$ 87390 38034 -130299 -303854 -413714 -501624 -615996 -715867 -756085 -768942 -766525 -739455
14577g39455K2733l1029r1197o3329K8857K8913j7413L3322J15874J31593J04082
$$ -739455 -716722 -747751 -838948 -902277 -873420 -844507 -861920 -828598 -712724 -581131 -477049
14566d77049J11246J65984J57677L1802q5449k6736J46492K05089N1188j67201
$$ -477049 -365803 -199819 -42142 -10340 -95789 -122525 23967 229056 280244 113043
14556A13043k47309j92254q9454L9585J80335K23048J45975K8178r0669j51277
$$ 113043 -134266 -326520 -415974 -376389 -196054 26994 172969 201147 110478 -40799
14546d0799j20390k9953J0790o9113j89551j92822q0359J2636L8916L0840J7673
$$ -40799 -161189 -191142 -180352 -249465 -439016 -631838 -712197 -699561 -660645 -629805 -612132
14535f12132L7182P3363O1219K3949n744k4881l7665p4343p6349J7835J22690
$$ -612132 -574950 -501587 -440368 -416419 -422163 -447044 -484709 -559052 -635401 -617566 -494876
14524d94876J12553K0088m2145l2293J2181J4339K6815R5257J27099N3326q7299
$$ -494876 -382323 -362235 -404380 -436673 -424492 -410153 -383338 -288081 -160982 -107656 -194955
14513a94955j61879j36643r5767n4843J2361M8228N7135J00543J64901K29057
$$ -194955 -356834 -493477 -589244 -644087 -631726 -583498 -526363 -425820 -260919 -31862
14503c1862K68747K72639K16366J21922M3666J378m1374r3124j28509j57595j71183
$$ -31862 236885 509524 725890 847812 891478 892856 851482 758358 629849 472254 301071
14492C01071j17321q1278r2587j04181q0410n5322q6316r5043k3734N7974P8896
$$ 301071 183750 102472 9885 -94296 -174706 -230028 -316344 -411387 -435121 -377147 -298251
14481b98251K5049n4101n6077K10M2443N0030O1014M0749n7545j47327j59479
$$ -298251 -273202 -327303 -383380 -383170 -340727 -290697 -229683 -188934 -246479 -393806 -553285
14470e53285j25100n2420j501k7336m5790K8787R7898O5050j769p607L9820O2112
$$ -553285 -678385 -730805 -732306 -759642 -805432 -776645 -678747 -613697 -615466 -623073 -583253 -521141
14458e21141L9517J8085J8969K9058L2700K306n6828n5093q025K6331Q1313J14256
$$ -521141 -481624 -463539 -444570 -415512 -382812 -380506 -437334 -492427 -500452 -474121 -392808 -278552
14446b78552J18284J35675J50870J46164P6180n5839j55284j81049j15298J7843
$$ -278552 -160268 -24593 126277 272441 348621 292782 137498 -43551 -158849 -141006
14436a41006R1350M4358m4181o8035k2682P318J5221K8919P5249J10096J08013
$$ -141006 -49656 -5298 -49479 -117514 -140196 -132878 -117657 -88738 -13489 96607 204620
14425B04620J20483P8495m633n3120r5378j08298k4301P0339L9908k5192o297
$$ 204620 325103 403598 398965 345845 250467 142169 117868 188207 228115 202923 196626
14414A96626M3509N5113O407m4203q0518j12490j23975r3694l1187N5251J12583
$$ 196626 240135 295248 301655 257452 176934 64444 -59531 -153225 -184412 -129161 -16578
14403a6578N9732m9771j34287j53603j65336j90430j25150j0814M5042K6271k8855
$$ -16578 43154 -6617 -140904 -294507 -459843 -650273 -775423 -786237 -741195 -714924 -743779
14392g43779o6905p8150o9767n5983k6563M7254J80875K81603K15069J5728j39880
$$ -743779 -810684 -888834 -958601 -1014584 -1041147 -993893 -813018 -531415 -316346 -300618 -440498
14381d40498j63236r4762l3215j3471Q234Q6834J60490J42046N6091q236l7219
$$ -440498 -603734 -698496 -731711 -745182 -736948 -650114 -489624 -347578 -291487 -299723 -336942
14370c36942p4907n4136K5833M6201k4926j39021j54355n0424L8028Q4884J28583
$$ -336942 -411849 -465985 -440152 -393951 -418877 -557898 -712253 -762677 -724649 -639765 -511182
14359e11182J53667R7365l097r3121j38714r8849p346O5812P7721L8344O95n611
$$ -511182 -357515 -260150 -263247 -356368 -495082 -593931 -601277 -535465 -457744 -419400 -418705 -424316
14347d24316K1905K0308o1711r1672j3927M5932L0001J8195O8430J43996J70324
$$ -424316 -402411 -382103 -443814 -535486 -549413 -503481 -473480 -455285 -386855 -242859 -72535
14336g2535J23531M3776p038j5967o6019j42539j80127j92724j63319o0736K0444
$$ -72535 50996 94772 87734 71767 5748 -136791 -316918 -509642 -672961 -733697 -713253
14325g13253R884k7261J0365J14981J83643J71124J04447O0896J12159J16655
$$ -713253 -703369 -730630 -720265 -605284 -421641 -250517 -146070 -85174 26985 143640
14315A43640K4443l01N3507O8621P2773J29041J82048J62422P1199n5013j67768
$$ 143640 168083 167782 221289 289910 362683 491724 673772 836194 907393 852380 684612
14304F84612k49310l03853k88191j67166n1370K9627Q2236R6267Q9632J10077
$$ 684612 435302 131449 -156742 -323908 -375278 -345651 -263415 -167148 -77516 32561
14294C2561J63055J08258k4003j01450r7358l4831p467l9693n0048l4950l3172
$$ 32561 195616 303874 279871 178421 81063 46232 38765 -928 -50976 -85926 -119098
14283a19098n3004n1668l2745k3392L388L4368J03568J84099J58982N8502l6562
$$ -119098 -172102 -223770 -256515 -279907 -276519 -242151 -138583 45516 204498 263000 226438
14272B26438r3559j26550j51698j02146Q386P3399O1972K7231K5946M4728Q4079
$$ 226438 132879 6329 -145369 -247515 -239129 -165730 -103758 -76527 -50581 -5853 78226
14261G8226J29957J04441O786q2017r5924o0739o7469m9879P2112J70490J45689
$$ 78226 208183 312624 319410 237393 141469 80730 13261 -36618 35494 205984 351673
14250C51673N7925k3426n6219n9566o5260q0761q5312r2993r2347r6650j24585
$$ 351673 409598 386172 329953 270387 205127 124366 39054 -53939 -146286 -242936 -367521
14239c67521j01914n0211l2725j0927K5404P915l6456l7420l3141K1159R9018
$$ -367521 -469435 -519646 -552371 -563298 -537894 -529979 -566435 -603855 -636996 -615837 -516819
14228e16819J01645P3028P2982R1189P3726J0031p5710r4926m8086J8327J17600
$$ -516819 -415174 -342146 -269164 -177975 -104249 -94218 -169928 -264854 -312940 -294613 -177013
14217a77013J71555J37521O9475o9325j97636j86118j19975k5680P9742Q4862
$$ -177013 -5458 132063 201538 132213 -65423 -251541 -371516 -397196 -317454 -232592
14207b32592q212o1596l2589k353J2594L3145J8982m65M5808J07145R0458K7103
$$ -232592 -240804 -302400 -334989 -337342 -324748 -291603 -272621 -273086 -227278 -120133 -29675 -2572
14195b572m6923o3249N402Q0287P5929J9660l5564q2189q8706l0622N0994J01475
$$ -2572 -49495 -112744 -107342 -27055 48874 68534 32970 -49219 -137925 -168547 -117553 -16078
14183a6078J05435J15339J65960J75881R7019L1406M8358N1730l9396j79502k33757
$$ -16078 89357 204696 370656 546537 643556 674962 723320 775050 735654 556152 322395
14172C22395k56332l24560l29367k39544j40638m8299O9998J83305K53636K44815
$$ 322395 66063 -258497 -587864 -827408 -968046 -1016345 -946347 -763042 -509406 -264591
14162b64591J44889K024p6154o9797o5199k8611L3860N6446M2354J9035J4699
$$ -264591 -119702 -117678 -193832 -263629 -328828 -357439 -323579 -267133 -224779 -205744 -191045
14151a91045M8150R7601J31917J65492J36148M8605N707k7722o8940m4639L6827
$$ -191045 -142895 -45294 86623 252115 388263 436868 442575 414853 345913 301274 338101
14140C38101R1958P6918N8094R7886J16623Q7258K5998q6912j76913k11183j93150
$$ 338101 430059 506977 565071 662957 779580 866838 892836 805924 629011 417828 224678
14129B24678j13844o2267p1267r5679j15596j09060m8466M3741J02651J22982
$$ 224678 110834 48567 -22700 -118379 -233975 -343035 -391501 -347760 -245109 -122127
14119a22127R2109K9916n1817j26005r7374J0217Q6341Q7095O1303Q2911J28313
$$ -122127 -30018 -102 -51919 -177924 -275298 -265081 -178740 -91645 -30342 52569 180882
14108A80882P6795k8223n2203O507L2859j2099p7667j78271k49532j86429K0738
$$ 180882 257677 229454 177251 183758 216617 204518 126851 -51420 -300952 -487381 -466643
14097d66643K06842K37506J59590Q1893M8895J8612n79l4643j08236j75735j35333
$$ -466643 -259801 -22295 137295 219188 268083 286695 286116 251473 143237 -32498 -167831
14086a67831L5952J81860K06615J38667L2970r0406j77873j87566j82117j40961
$$ -167831 -131879 49981 256596 395263 428233 337827 159954 -27612 -209729 -350690
14076c50690m1651O8884J42599Q9737m2598j40118j41528n8071k222J8489J3622
$$ -350690 -392341 -323457 -180858 -91121 -133719 -273837 -415365 -473436 -475658 -457169 -443547
14065d43547l9456p5827k3283O7023O4512o2471k16296k48028j06681O3532J07817
$$ -443547 -483003 -558830 -582113 -515090 -450578 -513049 -729345 -977373 -1084054 -1020522 -912705
14054i12705M4962K72M6435J40432J97981J55678N6842j3126q8842j49086j03892
$$ -912705 -867743 -867471 -821036 -680604 -482623 -326945 -270103 -283229 -372071 -521157 -625049
14043f25049k6024J1042P4171J19036N0389j9316m1582o7432n9214K2550J18432
$$ -625049 -651073 -640031 -565860 -446824 -396435 -415751 -457333 -524765 -583979 -561429 -442997
14032d42997J85126K20787J79288N5955p7468j68984j10873J7030n5617k19571
$$ -442997 -257871 -37084 142204 198159 120691 -48293 -159166 -142136 -197753 -417324
14022d17324j95023k173J84498K56897K21425J45862L7049q8300j09605m7669
$$ -417324 -612347 -614520 -430022 -173125 48300 194162 231211 142911 33306 -14363
14012a4363o0084j04028n4773M7710J60400K24742J80459J00240J6878o7939r4163
$$ -14363 -74447 -178475 -233248 -185538 -25138 199604 380063 480303 497181 429242 335079
14001C35079q5750j03121j09459n0815N4250J57029K24754K46135J99166M8475
$$ 335079 249329 146208 36749 -14066 40184 197213 421967 668102 867268 915743
13991I15743j37767k35150k32295j48704O552J36047J19723r4020l67515n03823
$$ 915743 777976 542826 310531 161827 168379 304426 424149 330129 -37386 -541209
13981e41209m50215k49205J197J25500O4522k1943N6233J92252J94894J03965
$$ -541209 -991424 -1240629 -1239432 -1113932 -1049410 -1071353 -1015120 -822868 -627974 -524009
13971e24009K9338k1297l5267J8852J04766J59309J48107J27342J51907K17377
$$ -524009 -494671 -515968 -551235 -532383 -427617 -268308 -120201 7141 159048 376425
13961C76425K51404J93097Q8566l6160j81984k90778k81554k06786j63803j36699
$$ 376425 627829 820926 909492 873332 691348 400570 119016 -87770 -251573 -388272
13951c88272q0427j445R4871J50178R1066o3270k07579k02093l1383J22627J62221
$$ -388272 -468699 -470144 -375273 -225095 -134029 -197299 -404878 -606971 -638354 -515727 -353506
13940c53506J34524J26858J57246J75172J33930J8680j75283l26889l33029k44833
$$ -353506 -218982 -92124 65122 240294 374224 392904 217621 -109268 -442297 -687130
13930f87130j33559j4499R7749J57707J64469J49104J06382K176j24022j63573
$$ -687130 -820689 -835188 -737439 -579732 -415263 -266159 -159777 -157601 -281623 -445196
13920d45196j27861p8672l6835K788O7591J76873K69486K15095M4722n7874l9552
$$ -445196 -573057 -651729 -688564 -685776 -618185 -441312 -171826 43269 87991 30117 -9435
13909i435K846P401m9035j13571q6863j239Q825l0500n3641o8921j02466q9105
$$ -9435 -6589 812 -48223 -161794 -248657 -249896 -241071 -271571 -325212 -394133 -496599 -585704
13897e85704k903R3755J62873J91486K12968J81616O8829m5857j02209p7573m0172
$$ -585704 -588607 -494852 -331979 -140493 72475 254091 322920 277063 174854 97281 57109
13886E7109m8389l1036K9461L4618q6892k34502k99866k86098k18006j11904K585
$$ 57109 8720 -22316 7145 41763 -45129 -279631 -579497 -865595 -1083601 -1195505 -1192920
13875a192920L9798k5155n9884K9372J53820J83462Q0011l3884j7156P4885R8131
$$ -1192920 -1153122 -1178277 -1238161 -1208789 -1054969 -871507 -791496 -825380 -842536 -767651 -669520
13864f69520O1205N3301Q8827J47225J37704M1952l9153n7587l6271K1480J14694
$$ -669520 -608315 -555014 -466187 -318962 -181258 -139306 -178459 -236046 -272317 -250837 -136143
13853a36143J48047R5339L7446K1404j6921r3108j43070j44125j05240p9142j02645
$$ -136143 11904 107243 144689 166093 149172 56064 -87006 -231131 -336371 -415513 -518158
13842e18158j05234p3428o5445k0306Q1846J39202J11760O8293O4768J6950j12455
$$ -518158 -623392 -696820 -762265 -782571 -700725 -561523 -449763 -381470 -316702 -299752 -412207
13831d12207j65914q1036k7827k7094j3387M7028J41548J92446K09861J47697
$$ -412207 -578121 -659157 -686984 -714078 -727465 -680437 -538889 -346443 -136582 11115
13821A1115k533r5035j01091r7510k7997J16532J92985J20088m12q8255j26611
$$ 11115 8582 -86453 -187544 -285054 -313051 -196519 -3534 116554 116142 27887 -98724
13810i8724o9100O7244J72174J24743n0551j98827k04734j38183p7427K9348J22602
$$ -98724 -167824 -100580 71594 196337 145786 -53041 -257775 -395958 -473385 -444037 -321435
13799c21435R5865O010l0696k5872j6464J381K5879K3566k6935p4608n9946R600
$$ -321435 -225570 -219560 -250256 -276128 -292592 -291211 -265332 -241766 -268701 -343309 -403255 -393655
13787c93655P8037R8287L2997n1979m4556K3982K2095n5933j13075q6518k4604
$$ -393655 -315618 -217331 -184334 -236313 -280869 -256887 -234792 -290725 -403800 -490318 -514922
13776e14922N6528J47846J88663J43195M9512l8787j45053k38024k40392j30823
$$ -514922 -458394 -310548 -121885 21310 70822 32035 -113018 -351042 -591434 -722257
13766g22257K3178Q7443L5476L997K1936L1011O5620J10808J11723L7125n8730
$$ -722257 -699079 -611636 -576160 -572163 -550227 -519216 -453596 -342788 -231065 -193940 -252670
13755b52670q5227m5798M1447J23808J50095J71019J62157J04440O0313L4389
$$ -252670 -337897 -383695 -342248 -218440 -68345 102674 264831 369271 429584 463973
13745D63973k6436o1578P269J19410K13490K60554J87667n698j87173k50724j49278
$$ 463973 437537 375959 383228 502638 716128 976682 1164349 1158651 971478 720754 571476
13734E71476M0135J52677J42470P0094j6357p8194j24102j45653j43756j19272
$$ 571476 611611 764288 906758 976852 960495 882301 758199 612546 468790 349518
13724C49518q8880o3794l2506n8365j13827r6418l1484p132K227L8968P1651J2451
$$ 349518 260638 196844 164338 105973 -7854 -104272 -135756 -142888 -140661 -101693 -30042 -17591
13712a7591q3197j51659k00378j96109j51657j05057o5270J7499J40504J66551
$$ -17591 -100788 -252447 -452825 -648934 -800591 -905648 -970918 -953419 -812915 -646364
13702f46364P4301j320n0670j52799k68914l17864k81831j89941p9415O879K8187
$$ -646364 -572063 -573383 -624053 -776852 -1045766 -1363630 -1645461 -1835402 -1914817 -1907938 -1879751
13691a879751M0559J04186K02104K34759J94595J92043K58104K82099K44347K09835
$$ -1879751 -1839192 -1735006 -1532902 -1298143 -1103548 -911505 -653401 -371302 -126955 82880
13681H2880J77115J25834M1060k5876j8601K9827J0201r5812j66137j41950j37596
$$ 82880 259995 385829 426889 401013 382412 412239 422440 326628 160491 18541 -119055
13670a19055j90918j79200j03724l5035k0849n8201o7306k655O5103Q0634J09002
$$ -119055 -309973 -489173 -592897 -627932 -648781 -706982 -774288 -776943 -711840 -631206 -522204
13659e22204J68821K22747K00583R7535j9603n1604j3638K3725K6822K1970L3095
$$ -522204 -353383 -130636 69947 167482 147879 96275 82637 106362 133184 155154 188249
13648A88249J1826k8931k5268P020L8039Q7613J62766J65326N2410n0882p4419
$$ 188249 200075 171144 145876 152896 190935 278548 441314 606640 659050 608168 533749
13637E33749p4677n3900k80K6637L7427N7562P0442M7105K6794n500q8810j64026
$$ 533749 459072 405172 404892 431529 468956 526518 596960 644065 670859 665359 576549 412523
13625D12523j86545j48524m8114Q0408J71516J66753Q8229k4456j65561k75668
$$ 412523 225978 77454 29340 109748 281264 448017 536246 511790 346229 70561
13615G0561k73931j37489M9271J56895J98418K10541J94195J03460l9876j34486
$$ 70561 -203370 -340859 -291588 -134693 63725 274266 468461 571921 532045 397559
13605C97559j52328j26644o9502l4408r8244j36640m6177O1355J11657J09489
$$ 397559 245231 118587 49085 14677 -83567 -220207 -266384 -205029 -93372 16117
13595A6117K5149r6737j28717n4826J6270J5399J952p94J619O0715R7843K5351
$$ 16117 41266 -55471 -184188 -239014 -222744 -207345 -205393 -206187 -204568 -143853 -46010 -20659
13583b0659l0362r256K4456M7523J5281q9866j51824j11812o2306l1173J5896
$$ -20659 -51021 -60277 -35821 11702 26983 -62883 -214707 -326519 -388825 -419998 -404102
13572d04102P6685J45195J82718J61345J10551N7316O1218Q5196Q4166M4918o2282
$$ -404102 -327417 -182222 496 161841 272392 329708 390926 476122 560288 605206 542924
13561E42924r8090j4530K1326o87k3735k1749j818j079p4220j65147j52678p4211
$$ 542924 444834 430304 451630 450943 427208 405459 403641 402562 328342 163195 10517 -63694
13549f3694k7309p6089j27586l9287J00681J44042J22875R2883P6037P7673L0932
$$ -63694 -91003 -167092 -294678 -333965 -233284 -89242 33633 126516 202553 280226 311158
13538C11158r7603j69591j17486r2569p2845L0550J06709P5324K1339j9628r6579
$$ 311158 213555 43964 -73522 -166091 -238936 -208386 -101677 -26353 -5014 -24642 -121221
13527a21221j75639j63698r5682m2088M087q090l1490J3074P5728O0002J5585
$$ -121221 -296860 -460558 -556240 -598328 -594241 -602331 -633821 -620747 -545019 -485017 -469432
13516d69432O9783J61996J52885P8794N1504R2812J00314O656p7567p0221j4205
$$ -469432 -399649 -237653 -84768 -5974 45530 138342 238656 245312 167745 97524 83319
13505H3319j3271m8231n2459m2103k3908n4510j55927k03546j81832j77643j61104
$$ 83319 70048 21817 -30642 -72745 -96653 -151163 -307090 -510636 -692468 -870111 -1031215
13494a031215p4978K4186R8491J72294J68973L1961j37425j86422p2596J22768
$$ -1031215 -1106193 -1082007 -983516 -811222 -642249 -610288 -747713 -934135 -1006731 -883963
13484h83963K03362J31239N1905Q6088J56118J47325P1212O560k5591p3426q8983
$$ -883963 -680601 -549362 -497457 -411369 -255251 -107926 -36714 -30154 -55745 -129171 -218154
13473b18154m4009m2877j39651k44550k79548k31611j04588L6714J34757J65286
$$ -218154 -262163 -305040 -444691 -689241 -968789 -1200400 -1304988 -1268274 -1133517 -968231
13463i68231J10711J6300o8333j11150n3716K8217K8867R192l9948j02508k2794
$$ -968231 -857520 -841220 -909553 -1020703 -1074419 -1046202 -1017335 -1008143 -1048091 -1150599 -1173393
13452a173393J75603K96471K64790J74079J24705J02324Q1036P2259N1977R603
$$ -1173393 -997790 -701319 -436529 -262450 -137745 -35421 45615 117874 169851 179454
13442A79454m3389m0628J8590M7146M011j01471j81729j75853j00073J679P4712
$$ 179454 136065 95437 114027 161173 165184 63713 -118016 -293869 -393942 -392263 -317551
13431c17551Q7550J05027J06104L4436p3563j43441q8315P0505J93469J93356
$$ -317551 -230001 -124974 -18870 15566 -57997 -201438 -289753 -219248 -25779 167577
13421A67577Q2843q6533k05779j98832r1182m097n4426j65852j78172q6581J8403
$$ 167577 250420 163887 -41892 -240724 -331906 -336003 -390429 -556281 -734453 -821034 -802631
13410h02631P0877J10907J11463k522j49402k03736j68978j10151l7870J145L0004
$$ -802631 -731754 -620847 -509384 -511906 -661308 -865044 -1034022 -1144173 -1182043 -1180898 -1150894
13399a150894J06414J86924J96979J55886J29088J25806J01469R9156J36410J11107
$$ -1150894 -1044480 -857556 -660577 -504691 -375603 -249797 -148328 -49172 87238 198345
13389A98345J1320q8521j48680j70971j20959K4909J56794J79799J47422R0065
$$ 198345 209665 121144 -27536 -198507 -319466 -294557 -137763 42036 189458 279523
13379B79523l984j04461j31307o8489R377O3134N4527l0876p2330o1144l0857
$$ 279523 275539 171078 39771 -28718 -19341 43793 98320 67444 -4886 -66030 -96887
13368i6887O3270J82029K33872J63613J534j84827k71393j99278p5997J6606N5870
$$ -96887 -33617 148412 382284 545897 547431 362604 91211 -108067 -184064 -167458 -111588
13357a11588N9594Q2120O2224M607J3184L6436J7926k1720r0069j27197r9523
$$ -111588 -51994 30126 92350 96957 110141 146577 164503 142783 52714 -74483 -174006
13346a74006r6083j38806j07823K7727J22574J13702J13476J14783Q5370N5791
$$ -174006 -270089 -408895 -516718 -488991 -366417 -252715 -139239 -24456 60914 116705
13336A16705m48n9951l8183O5053R3305K8105k9839k1606K9335O9956J26637J60172
$$ 116705 116257 56306 18123 83176 176481 204586 174747 153141 182476 252432 379069 539241
13324E39241J54209J36906O1999l1518p2257o7665m1153n2863j52088k64336k76177
$$ 539241 693450 830356 892355 860837 788580 720915 679762 626899 474811 210475 -65702
13313f5702j77521m0115Q7658J71364K39706K59829J62585N6923N6326R7425R4878
$$ -65702 -243223 -283338 -195680 -24316 215390 475219 637804 694727 751053 848478 943356
13302I43356O1553M316o6427m5026J9458J1906J0518R7314J78847J94481J62837
$$ 943356 1004909 1009225 942798 897772 917230 929136 939654 1036968 1215815 1410296 1573133
13291A573133R2104l6893j61445j76150j10331n2398l0289k7728j6996L6838O0224
$$ 1573133 1665237 1628344 1466899 1290749 1180418 1128020 1097731 1070003 1053007 1089845 1150069
13280A150069L5794Q832j8016m0408q4751j20613j38273k11832k80671k31226
$$ 1150069 1185863 1194695 1176679 1136271 1051520 930907 792634 580802 300131 68905
13270F8905j06781j1405M2212L8406j7331q7051r3728p226J00287J38357O4154
$$ 68905 -37876 -49281 -7069 31337 14006 -73045 -166773 -173999 -73712 64645 128799
13259A28799j3393l0976k1982R38L1099M7235K6473J4773O2484P1823m8980k00383
$$ 128799 115406 84430 62448 63386 94485 141720 168193 182966 245450 317273 268293 67910
13247F7910k21766r4489R0829K28642K65030K64237K42920J86481R0345k2297
$$ 67910 -153856 -248345 -157516 71126 336156 600393 843313 1029794 1120139 1097842
13237A097842o6291n0520o3314r9893j11348n7394L9403Q9017N0989o390m8779
$$ 1097842 1031551 981031 917717 817824 706476 649082 688485 777502 828491 822101 773322
13226G73322o4384o9187o6988o4458k7832O6590J28462J11295M6937l7920j13275
$$ 773322 708938 639751 572763 508305 480473 547063 675525 786820 833757 795837 682562
13215F82562r9753K259R535q6195j14761n1523N7740J18312Q2788K2318m105l6359
$$ 682562 582809 585068 594603 508408 393647 342124 399864 518176 600964 623282 619177 582818
13203E82818n3791M717P7317O9610l3011j50136j71779p8936L6964N2887l2311
$$ 582818 529027 533744 611061 680671 647660 497524 325745 246809 283773 336660 304349
13192C04349r8343r4073m9837J1077P2803J19210J16596O0454J2239j6503j4126
$$ 304349 206006 111933 62096 73173 145976 265186 381782 442236 454475 437972 423846
13181D23846M582R76L2520R5581Q7561j2386n9743j7878j0692k0605N0614J02649
$$ 423846 428428 429404 461924 557505 645066 632680 572937 555059 544367 523762 574376 677025
13169F77025K193j36050j69092j41273j46943j40731m8551L9041K4149k0191k5604
$$ 677025 679218 543168 374076 232803 85860 -54871 -103422 -64381 -40232 -60423 -86027
13158h6027j2682J65M4471J33687J97353K25539K40534J99182J43520J00992Q876
$$ -86027 -98709 -98544 -54073 79614 276967 502506 743040 942222 1085742 1186734 1195610
13147A195610j12707j81214j62970j06840L268J29857K07824K53462K73523K48579
$$ 1195610 1082903 901689 738719 631879 635147 765004 972828 1226290 1499813 1748392
13137A748392J48329M6185O067K383P858M5844R0073N1590o5144j88810k74263
$$ 1748392 1896721 1942906 1948973 1951356 1959214 2005058 2095131 2146721 2081577 1892767 1618504
13126A618504l10305k81216j49785K8162J53605J70093J27237P8431l8091j06734
$$ 1618504 1308199 1026983 877198 905360 1058965 1229058 1356295 1434726 1396635 1289901
13116A289901j5666Q7943Q1991j0037j04734j08978j3708N3010Q8764J57469J77162
$$ 1289901 1274235 1362178 1444169 1434132 1329398 1220420 1206712 1259722 1348486 1505955 1683117
13105A683117J01185J9609l7571q2776o9708M800R3885J27503Q6354O4621J04883
$$ 1683117 1784302 1803911 1766340 1683564 1613856 1618656 1712541 1840044 1926398 1991019 2095902
13094B095902J39436J00750j711j09434j52146j11654o4047L770Q5061J20596
$$ 2095902 2235338 2336088 2334377 2224943 2072797 1961143 1897096 1900866 1985927 2106523
13084B106523O9827l8329o4663k5004M721L7284L4607O3640J48590J36456L7498
$$ 2106523 2176350 2138021 2073358 2048354 2053075 2090359 2124966 2188606 2337196 2473652 2511150
13073B511150l7579l5720L1551J37574K22407J52679J3930m26N8883Q4334Q3908
$$ 2511150 2473571 2437851 2469402 2606976 2829383 2982062 2995992 2995566 3054449 3138783 3222691
13062C222691J06670Q0312m3011j76888k37792j64269l0465L9005N5138N6072
$$ 3222691 3329361 3409673 3366662 3189774 2951982 2787713 2757248 2796253 2851391 2907463
13052B907463J07361K02385K44951K05693J22475P8435P3484N6399O4030Q3215
$$ 2907463 3014824 3217209 3462160 3667853 3790328 3868763 3942247 3998646 4062676 4145891
13042D145891L9529Q32O0771J22007J06717M9652l684k9266m867M7614J13844
$$ 4145891 4185420 4186252 4247023 4369030 4475747 4525399 4521715 4492449 4487582 4535196 4649040
13031D649040J88753K04108J34703O5793P2682J08604J63805K26503K33639K06205
$$ 4649040 4837793 5041901 5176604 5242397 5315079 5423683 5587488 5813991 6047630 6253835
13021F253835J84932J82587K20116K73735L08827K83462K21099J79121J74985
$$ 6253835 6438767 6621354 6841470 7115205 7424032 7707494 7928593 8107714 8282699
13012H282699K13577K59708K55562K54786L40257M57677N36086N89035O17287
$$ 8282699 8496276 8755984 9011546 9266332 9606589 10064266 10600352 11189387 11806674
13003A1806674N88330N31738N31888O54726Q12453R18659J021327J157837J341156
$$ 11806674 12395004 12926742 13458630 14113356 14925809 15844468 16865795 18023632 19364788
12994A9364788J517439J661830J779020J882300K124466K534590L008705L548108
$$ 19364788 20882227 22544057 24323077 26205377 28329843 30864433 33873138 37421246
12986C7421246M182721M906547N729140O761035Q059295R624814J1504349J3768203
$$ 37421246 41603967 46510514 52239654 59000689 67059984 76684798 88189147 101957350
12978A01957350J6508990J9855737K3973178K8864026L4277045L9373979M2013438
$$ 101957350 118466340 138322077 162295255 191159281 225436326 264810305 306823743
12971C06823743L8595667K5607629L588215k0177870l6677335m2764057m1202100
$$ 306823743 345419410 371027039 374615254 354437384 317760049 274995992 233793892
12964B33793892l6090049l0204542k4827479k0293886j6580739j3567486j1128898
$$ 233793892 197703843 167499301 142671822 122377936 105797197 92229711 81100813
12957H1100813r201172p718439o559858n628695m877379m227687l636806l104956
$$ 81100813 71899641 64181202 57621344 51992649 47115270 42887583 39250777 36145821
12949C6145821k596975k216909k035204j921735j743335j513980j325122j209542
$$ 36145821 33548846 31331937 29296733 27374998 25631663 24117683 22792561 21583019
12941B1583019j092911r66472q67327p37130o05457m76689l46283k79948l23851
$$ 21583019 20490108 19523636 18656309 17919179 17313722 16837033 16490750 16210802 15886951
12932A5886951l97453l61883j79279L1132Q9909K1745k7220L4111J74252K61325
$$ 15886951 15489498 15127615 14948336 14979468 15069377 15091122 15063902 15098013 15272265 15533590
12922A5533590K94628L74785N47175P12697P83132P76520P68100P80661Q02601
$$ 15533590 15828218 16203003 16750178 17462875 18246007 19022527 19790627 20571288 21373889
12913B1373889Q72807R39388R08683Q05451P20380O58481O92141R37812J281667
$$ 21373889 22246696 23186084 24094767 24900218 25620598 26279079 26971220 27909032 29190699
12904B9190699J649776K079417K564587L078547L635289M293889N045374N943931
$$ 29190699 30840475 32919892 35484479 38563026 42198315 46492204 51537578 57481509
12896E7481509P032454Q282227R756185J1664058J4116819J7208595K1005224
$$ 57481509 64513963 72796190 82552375 94216433 108333252 125541847 146547071
12889A46547071K5487819L0630616L6136779M0882089M2373803L6677205K0573894
$$ 146547071 172034890 202665506 238802285 279684374 322058177 358735382 379309276
12882C79309276l554359k6692818m0567074m3937829m0631933l4803009k8815853
$$ 379309276 375754917 349062099 308495025 264557196 223925263 189122254 160306401
12875A60306401k3516106j9138803j5697985j2964412j0749605r075581p780631
$$ 160306401 136790295 117651492 101953507 88989095 78239490 69163909 61383278
12868F1383278o591627n475297m546146l840690l282403k831699k440742k014407
$$ 61383278 54791651 49316354 44770208 40929518 37647115 34815416 32374674 30360267
12860C0360267j632252j432661j350209j271176j193295j138569j028630r02807
$$ 30360267 28728015 27295354 25945145 24673969 23480674 22342105 21313475 20410668
12852B0410668q54362q64797q50323p50639o27895n06894m04331k80090j03424
$$ 20410668 19556306 18691509 17841186 17090547 16462652 15955758 15551427 15271337 15167913
12843A5167913l1122j17826k50749k99027k44222j53619n8974J7176J02591J94679
$$ 15167913 15136791 15018965 14768216 14469189 14224967 14071348 14012374 14029550 14132141 14326820
12833A4326820K48909K63584K76389L71912M78994N24262N58853O18949O88409
$$ 14326820 14575729 14839313 15115702 15487614 15966608 16490870 17049723 17668672 18357081
12824A8357081P64108Q71443J057368J276379J465306J672085J948038K277802
$$ 18357081 19121189 19992632 21050000 22326379 23791685 25463770 27411808 29689610
12816B9689610K571432K834041L188766L706961M388821N208330O175414P330324
$$ 29689610 32261042 35095083 38283849 41990810 46379631 51587961 57763375 65093699
12808F5093699Q706755J0390289J2500587J5081643J8211839K1990855K6462957
$$ 65093699 73800454 84190743 96691330 111772973 129984812 151975667 178438624
12801A78438624L1571917L6859071M0824613M0549201L2209356J3848342j0252774
$$ 178438624 210010541 246869612 287694225 328243426 360452782 374301124 364048350
12794C64048350l0728342m1303657m2610065l8604808l2812361k7141616k2240151
$$ 364048350 333320008 292016351 249406286 210801478 177989117 150847501 128607350
12787A28607350j8156333j4806746j2165087j0076363q375120p010480n976608
$$ 128607350 110451017 95644271 83479184 73402821 65027701 58017221 52040613
12780E2040613n205165m580694m021457l462213k938780k557377k332448k156601
$$ 52040613 46835448 42254754 38233297 34771084 31832304 29274927 26942479 24785878
12772B4785878j915544j619919j358667j189882j101659j055875j029793r73316
$$ 24785878 22870334 21250415 19891748 18701866 17600207 16544332 15514539 14541223
12764A4541223q96568q31828p72446p28615o90190n89181m17261k94901l07784
$$ 14541223 13644655 12812827 12040381 11311766 10621576 10032395 9615134 9320233 9012449
12755I012449l72220l58012k80485k18337k17926k54091k33457j77960j75343
$$ 9012449 8640229 8282217 8001732 7783395 7565469 7311378 7077921 6899961 6724618
12746F724618k44007k24617q6247j0263o7274j78558k53875k22777j00307l2380
$$ 6724618 6480611 6255994 6169747 6159484 6092210 5913652 5659777 5437000 5336693 5304313
12736E304313q9658j15843m4641l7448j22759k51232l95651m02476k84550j81019
$$ 5304313 5214655 5098812 5054171 5016723 4893964 4642732 4247081 3844605 3560055 3379036
12726C379036r3647j3892k7543j06910j52423j09994j1479L6100R530J9352K1084
$$ 3379036 3285389 3271497 3243954 3137044 2984621 2874627 2863148 2899248 2908778 2928130 2949214
12715B949214p6837j76791k10262j76404r9289L6316J23285O5941j1394m736M9119
$$ 2949214 2872377 2695586 2485324 2308920 2209631 2245947 2369232 2435173 2423779 2419043 2468162
12704B468162Q2959Q8499P0332O9141O7741K1091p757m2150q9770j18564j23109
$$ 2468162 2551121 2639620 2709952 2779093 2846834 2867925 2860168 2818018 2728248 2609684 2486575
12693B486575j05629j10573j13418j04532q1714o5611p3799j16737j61206j39076
$$ 2486575 2380946 2270373 2156955 2052423 1970709 1905098 1831299 1714562 1553356 1414280
12683A414280j14852o9480M2583J39110J62946J06978K7859j3614j2257m092p322
$$ 1414280 1299428 1229948 1272531 1411641 1574587 1681565 1709424 1695810 1683553 1679461 1672139
12672A672139J2092K1599k0847j14130j81045j50344o0492l5057j02576j44255
$$ 1672139 1684231 1705830 1684983 1570853 1389808 1239464 1178972 1143915 1041339 897084
12662H97084j29728q4776m3769l0579j2413O1681J57671K00711J53551R9834Q5401
$$ 897084 767356 682580 638811 608232 595819 657500 815171 1015882 1169433 1269267 1354668
12651A354668L6648p3071j41173n4429Q2212J38922J73974K13090J52784j5216
$$ 1354668 1391316 1318245 1177072 1122643 1204855 1343777 1517751 1730841 1883625 1868409
12641A868409j82781k33930j73700j13527p0232K717Q4807J08840N0462o1348
$$ 1868409 1685628 1451698 1277998 1164471 1094239 1096956 1181763 1290603 1341065 1279717
12631A279717j41702j39604j12543q4717l1280M5894Q5836N3948k9776r5385j03448
$$ 1279717 1138015 998411 885868 801151 769871 815765 901601 955549 925773 830388 726940
12620G26940l7305O6733J06782P9163R7105J38211J47150J22358M3697p9952j81551
$$ 726940 689635 756368 863150 942313 1039418 1177629 1324779 1447137 1490834 1410882 1229331
12609A229331k01418j45949q6151o0289m6357k5357p488m259m3676p9187n3960
$$ 1229331 1027913 881964 795813 735524 689167 663810 656322 652063 608387 529200 475240
12598D75240Q672K7027m3863j08226r6972m7184L558j8704j26668j83541o7077
$$ 475240 483912 510939 467076 358850 261878 214694 218252 199548 72880 -110661 -177738
12587a77738J01465J89139K25825K62144K82900K48502J55325O3078k074k7555
$$ -177738 -76273 112866 338691 600835 883735 1132237 1287562 1350640 1348566 1321011
12577A321011J4384N2288K0953m7956p9560l0461N9075R6755M7612Q961K4961
$$ 1321011 1335395 1387683 1408636 1360680 1281120 1250659 1309734 1406489 1454101 1463062 1488023
12566A488023K1962k6461q2377q7182k4367M4580M9331L594o304K1762O1994J14528
$$ 1488023 1509985 1483524 1401147 1313965 1289598 1334178 1383509 1387103 1380799 1402561 1464555 1579083
12554A579083J67431J83927R9179m5455j85686l13764m05317m08482l40247k88478
$$ 1579083 1746514 1930441 2029620 1984165 1798479 1484715 1079398 670916 330669 42191
12544D2191k82037k44500j28593R238R9336J46715J38263N0038l4630j8000M9153
$$ 42191 -239846 -484346 -612939 -603701 -504365 -357650 -219387 -169349 -203979 -221979 -172826
12533a72826R4270J21651J29546J14067P3319K0908N037J3537K434J4649R3374
$$ -172826 -78556 43095 172641 286708 360027 380935 385972 399509 401943 416592 509966
12522E09966J33701R0993L0478O863K938o3134j24945j12092l9372J3724o3231
$$ 509966 643667 734660 765138 772001 774939 711805 586860 474768 435396 449120 385889
12511C85889j40322j09144l0327J0620R0l9142p6693q0022o8799l0828J6123j4871
$$ 385889 245567 136423 106096 116716 116806 77664 971 -79051 -147850 -178678 -162555 -177426
12499a77426j16350j88053j82556j56917q5969Q0394K19069K17090J43778N7705
$$ -177426 -293776 -481829 -664385 -821302 -907271 -826877 -607808 -390718 -246940 -189235
12489a89235N0335R4248M1809o5076o2689J6697M3915N9411J32230J58489O7974
$$ -189235 -138900 -44652 -2843 -67919 -130608 -113911 -69996 -10585 121645 280134 348108
12478C48108o6529j55470j62430r9840k5544M2667J07242J42607J70078J82614
$$ 348108 281579 126109 -36321 -136161 -161705 -119038 -11796 130811 300889 483503
12468D83503J67936J10855Q411n9243q6434p9870q3041j12042o4974O5283J86906
$$ 483503 651439 762294 770705 711462 625028 545158 462117 350075 285101 350384 537290
12457E37290J90126R6089L0115p176m7808n0816l0739p2096j75687k58015k78893
$$ 537290 727416 823505 853620 846444 798636 747820 717081 644985 469298 211283 -67610
12446f7610j78316K5589J63162J71634J30986R9030O1164L4800N0538N8300R7510
$$ -67610 -245926 -220337 -57175 114459 245445 344475 405639 440439 490977 549277 646787
12435F46787J19384N7365p2282j68344j27992m4695j4111r336q697l9156j4953
$$ 646787 766171 823536 751254 582910 454918 410223 396112 386776 378079 338923 323970
12424C23970J00022J85693J56549O2460m3804j15967j34875j32887q5814o7245
$$ 323970 423992 609685 766234 828694 784890 668923 534048 401161 315347 248102
12414B48102j22307j02868m5703o5532j03820n7166M1200J08025J29113J06339
$$ 248102 125795 22927 -22776 -88308 -192128 -249294 -208094 -100069 29044 135383
12404A35383N2876K8880O9551O5427l5198r0017p6879j8106O3245J01548Q6700
$$ 135383 188259 217139 286690 352117 316919 226902 150023 131917 195162 296710 383410
12393C83410L2400m0937q5334n3318k0279J6197O7107J30177K65153L49188K00394
$$ 383410 415810 374873 289539 236221 215942 232139 299246 429423 694576 1043764 1244158
12382A244158n4754j84812k15471j98941j11421p3424r7588j05239n8143L8706
$$ 1244158 1189404 1004592 789121 590180 478759 405335 307747 202508 144365 183071
12372A83071J01188J06174P0176j0353j42122j82255o9495j364m1302p6246n5288
$$ 183071 284259 390433 460609 450256 308134 125879 56384 55020 13718 -62528 -117816
12361a17816Q53K9174K2367L370m451L930N9015J67716J94281J27440J06455J10165
$$ -117816 -116963 -87789 -65422 -62052 -66503 -62573 -3558 164158 358439 485879 592334 702499
12349G02499N309j24907j36216o0220L6754R9281O8057l7460j45829j88768j56968
$$ 702499 707808 582901 446685 386465 423219 522500 590557 553097 407268 218500 61532
12338F1532j11500m3806N1989O2339k0361q9358j15481j22792q5989K3894O3009
$$ 61532 -49968 -93774 -41785 20554 193 -89165 -204646 -327438 -413427 -389533 -326524
12327c26524m2336q3980n944M0626K5541J7929L3338L8807P1573J17860J03881
$$ -326524 -368860 -452840 -458784 -418158 -392617 -374688 -341350 -302543 -230970 -113110 -9229
12316i229P4939Q0134J19673J39340N3429n6556j35029k09638k23768j98327j83515
$$ -9229 65710 145844 265517 404857 458286 401730 266701 57063 -166705 -365032 -548547
12305e48547j59130j56414j12768j7942K0595K7020O5978P4081N3368M5472N9948
$$ -548547 -707677 -864091 -976859 -994801 -974206 -947186 -881208 -807127 -753759 -708287 -648339
12294f48339J31726K19723K21146J65738J39949Q8901l23p8895q4317o8259j12213
$$ -648339 -516613 -296890 -75744 89994 229943 318844 318521 239626 155309 87050 -25163
12283b5163j64547j65291j13699k9475J06707K57803K84463J45757l6743j40075
$$ -25163 -189710 -355001 -468700 -498175 -391468 -133665 150798 296555 259812 119737
12273A19737j63270j44879n5551O5544N7878n4499j07507q5462q1638j11426j01052
$$ 119737 -43533 -188412 -243963 -178419 -120541 -175040 -282547 -368009 -449647 -561073 -662125
12262f62125k2645P8654J70282J76010O6586o6305r7206l0573K8658M6663O2557
$$ -662125 -684770 -606116 -435834 -259824 -193238 -259543 -356749 -387322 -358664 -312001 -249444
12251b49444L2079o5303j43071j33840n1050L8323R9087J11706J4772j61180k27368
$$ -249444 -217365 -282668 -425739 -559579 -610629 -572306 -473219 -361513 -346741 -507921 -735289
12240g35289p6925J33770K05137J22088j362m2491N6229J93586K50901K18725
$$ -735289 -812214 -678444 -473307 -351219 -352581 -395072 -338843 -145257 105644 324369
12230C24369J43486M8904q478k913M240p0458j75052j88727j28368p2607l8999
$$ 324369 467855 516759 508281 505368 509608 439150 264098 75371 -52997 -125604 -164603
12219a64603o940N7843J46476J49810N1183k8466r2623j69049j74444q9497r002
$$ -164603 -171543 -113700 32776 182586 233769 205303 112680 -56369 -230813 -320310 -329312
12208c29312J584K4064J38646K37475J94320L5744q0884j31049j11425l8884Q596
$$ -329312 -327728 -303664 -165018 72457 266777 302521 221637 90588 -20837 -59721 -51125
12197e1125l4094o0995j2618K5544O3890P0770M8166P9807J34710R9534M3943
$$ -51125 -85219 -146214 -158832 -133288 -69398 1372 49538 129345 264055 363589 407532
12186D07532M9864P858j16180k14649k17654j70329j07598j3137Q8133J00375
$$ 407532 457396 465254 349074 134425 -83229 -253558 -361156 -374293 -286160 -185785
12176a85785n443j11929j14766L1159J86698K33155K10714J75921J58848P4673
$$ -185785 -191228 -303157 -417923 -386764 -200066 33089 243803 419724 578572 653245
12166F53245o3285j20473o4413L9616J19280J44285J38163J07693N1434N823l6517
$$ 653245 589960 469487 405074 444690 563970 708255 846418 954111 1005545 1011368 974851
12155I74851o1349j08899j69767j28010n0747o1133j38866j89327j12651P863
$$ 974851 913502 804603 634836 506826 456079 394946 256080 66753 -45898 -38035
12145c8035Q0724J26799J27036P5433J6832j7426l6286m4785l9147l3095m3338
$$ -38035 42689 169488 296524 371957 388789 371363 335077 290292 251145 218050 174712
12134A74712o5054n5435J0109R9534J67392J64114N6425p7696j85406j90744j16129
$$ 174712 109658 54223 64332 163866 331258 495372 551797 474101 288695 97951 -18178
12123a8178o6100p5825j44595j88925k13989k52002j64103P7317K42881J85619
$$ -18178 -84278 -160103 -304698 -493623 -707612 -959614 -1123717 -1046400 -803519 -617900
12113f17900N1070M394O9934J73435K36956J86707Q8149P6431R5877N7317o398
$$ -617900 -566830 -562436 -492502 -319067 -82111 104596 192745 269176 365053 422370 415972
12102D15972k1735m7847j22110j91824j83684j09473n7088l452N9816P3839P1671
$$ 415972 394237 346390 224280 32456 -151228 -260701 -317789 -321241 -261425 -187586 -115915
12091a15915P2849L7145o235k8525k1884M154P9144J78516J96144J19981P577
$$ -115915 -43066 -5921 -12156 -40681 -62565 -58411 20733 199249 395393 515374 522951
12080E22951r0482j41053j54194j54321j77188j49222n4184M8494J19718J19993
$$ 522951 432469 291416 137222 -17099 -194287 -343509 -397693 -349199 -229481 -109488
12070a09488R2489P9568N7465N8700P0984K392p0370o6572l7089Q101N9729M8194
$$ -109488 -16999 62569 120034 178734 249718 252110 181740 115168 78079 86180 145909 194103
12058A94103l2894p2196l3056M8092J15286J60761J97254J32369l0619j27690
$$ 194103 161209 89013 55957 104049 219335 380096 577350 709719 679100 551410
12048E51410n3270Q2037J16513L8887r6320k12690k32130j27794L1930R0320J3428
$$ 551410 498140 580177 696690 735577 639257 426567 194437 66643 98573 188893 202321
12037B02321o0211k7539R5237J75519N5513j25693j31077m949M6728k2488o7813
$$ 202321 142110 114571 209808 385327 440840 315147 184070 179121 225849 203361 135548
12026A35548k3319R001m1411j13448j36783q9869o7704j10020j07916l7587J9865
$$ 135548 112229 121230 79819 -33629 -170412 -260281 -327985 -438005 -545921 -583508 -563643
12015e63643N5697P7225N0068k6886j09962j66678j32285o3684n6097p1666n6455
$$ -563643 -507946 -430721 -380653 -407539 -517501 -684179 -816464 -880148 -936245 -1007911 -1064366
12004a064366O167R9646J31666O9850m708n406O2387J24400J45929J66760J95132
$$ -1064366 -1058199 -958553 -826887 -757037 -761745 -767151 -704764 -580364 -434435 -267675 -72543
11993g2543J91808J63946J43175J81219J97754J65478J40872J53846J93866K15036
$$ -72543 119265 283211 426386 607605 805359 970837 1111709 1265555 1459421 1674457
11983A674457J71482M3983j07470j87864k03116j96677j84202j77957j58193j34274
$$ 1674457 1845939 1889922 1782452 1594588 1391472 1194795 1010593 832636 674443 540169
11973E40169j27179j02106j7610R4862J44688J55061J47769R9887L8875q806n0948
$$ 540169 412990 310884 293274 388136 532824 687885 835654 935541 974416 965610 914662
11962I14662j04624j30823j10513r5948q9372o0798o7090j01273j36022j46119
$$ 914662 810038 679215 568702 472754 383382 322584 255494 154221 18199 -127920
11952a27920n9854N0271J01714J48109J68835J17294O9571Q6674J11415Q2460
$$ -127920 -187774 -137503 -35789 112320 281155 398449 468020 554694 666109 748569
11942G48569m912j21020j81526k02108k52901k55844j99016j62685j45753q9107
$$ 748569 743657 622637 441111 239003 -13898 -269742 -468758 -631443 -777196 -866303
11932h66303j0939K4624K9766O8873J71801K03079J05136K8532O1859J10835J32184
$$ -866303 -877242 -852618 -822852 -753979 -582178 -379099 -273963 -245431 -183572 -72737 59447
11921E9447J47948J10138O8004P6680O0285J273k2143p076K0372P1605Q6456Q3488
$$ 59447 207395 317533 385537 462217 522502 523775 501632 494556 514928 586533 672989 756477
11909G56477J26365P9408o1993j56582k35788k82951k34778j18597K2672J21307
$$ 756477 882842 962250 900257 743675 507887 224936 -9842 -128439 -105767 15540
11899A5540R2797k4506j27008j43071m5603Q5987J43424J28887J04912J00650
$$ 15540 108337 83831 -43177 -186248 -231851 -145864 -2440 126447 231359 332009
11889C32009J29872J46547P7073l7283j05206p4645K6197O6379M7622N6248L7915
$$ 332009 461881 608428 685501 648218 543012 468367 494564 560943 608565 664813 702728
11878G02728n4070j03713p1213k5915m893J0057K1129K3904N7530J10182J38345
$$ 702728 648658 544945 473732 447817 442924 452981 474110 498014 555544 665726 804071
11867H04071J32391R3434Q3035J10749R4756M4771J9540N9164J35107K24918L16914
$$ 804071 936462 1029896 1112931 1223680 1318436 1363207 1382747 1441911 1577018 1801936 2118850
11856B118850L67144L92403M07527M27954N27462P15671R26093J119539J326804
$$ 2118850 2485994 2878397 3285924 3713878 4241340 4957011 5883104 7002643 8329447
11847H329447J530305J728699J970859K191548K149344J740132J123322M65131
$$ 8329447 9859752 11588451 13559310 15750858 17900202 19640334 20763656 21228787
11839B1228787r2867l59413l98057n54869r35148j363874j707832j889778j855175
$$ 21228787 21135920 20776507 20378450 19823581 18888433 17524559 15816727 13926949 12071774
11830A2071774j666130j436999j220917j062185r30586p74907n77986m64784m78004
$$ 12071774 10405644 8968645 7747728 6685543 5754957 4980050 4402064 3937280 3459276
11821C459276m84681m27932l64551l24327k63213k03996j30775j2479O1342M9390
$$ 3459276 2974595 2546663 2182112 1857785 1594572 1390576 1259801 1247322 1308664 1358054
11811A358054j2603l6852k651P448l2321r9106r9414o4404p5836r1001n0075J5024
$$ 1358054 1345451 1308599 1305948 1313396 1281075 1181969 1082555 1018151 942315 851314 801239 816263
11799H16263N2540R0613J37119R4788K5527M5018O4355M7506P2586J11314J25706
$$ 816263 868803 959416 1096535 1191323 1216850 1261868 1326223 1373729 1446315 1557629 1683335
11788A683335R5735M5695k5201j27456j94474j90979j55196p5387M4294J31070
$$ 1683335 1779070 1824765 1799564 1672108 1477634 1286655 1131459 1056072 1100366 1231436
11778A231436J17093J9612m7554k068J42696L06985L56278K32554L4289r9982
$$ 1231436 1348529 1368141 1320587 1318519 1461215 1768200 2124478 2357032 2391321 2291339
11768B291339p4668J380M5741J29331K37302L30975M67419N86701O06890O30829
$$ 2291339 2216671 2218051 2263792 2393123 2630425 2961400 3428819 4015520 4622410 5253239
11758E253239P76697Q90861P92741N37189K33871j0652j11033p9331K5689K34065
$$ 5253239 6029936 6920797 7713538 8250727 8484598 8473946 8362913 8283582 8309271 8543336
11748H543336M88700P22246R04939J070469J398473J898678K407925K844044L317198
$$ 8543336 9032036 9754282 10659221 11729690 13128163 15026841 17434766 20278810 23596008
11739B3596008L948865M661841N202122N253637M567784L060942R31105j429062
$$ 23596008 27544873 32206714 37408836 42662473 47230257 50291199 51222304 49793242
11731D9793242l557103m929188n277767m894911m247872l601296k994072k446281
$$ 49793242 46236139 41306951 36029184 31134273 26886401 23285105 20291033 17844752
11723A7844752j999776j663621j482079j313844j040430q01930o15972m14948
$$ 17844752 15844976 14181355 12699276 11385432 10345002 9543072 8927100 8512152
11715H512152k03455k4643R6539J86426K05795J45312J02129J63386L15130M79528
$$ 8512152 8308697 8284054 8380593 8567019 8772814 8918126 9020255 9183641 9498771 9978299
11705I978299N84933M79826q910p44358j263768j341862j174162r57911p40275
$$ 9978299 10563232 11043058 11034148 10289790 9026022 7684160 6509998 5552087 4811812
11696D811812n71463m77192l91814l09924k90221k82226k18461j61457j49633
$$ 4811812 4240349 3763157 3371343 3061419 2771198 2488972 2270511 2109054 1959421
11687A959421j89898k72942l43736l20748k25160j55123j25743l4890J51153L00363
$$ 1959421 1769523 1496581 1152845 832097 606937 451814 326071 291181 442334 742697
11677G42697K80675J51116K8146l1251J2036P9788J06702J11276P6432o151j01019
$$ 742697 1023372 1174488 1202634 1171383 1183419 1263207 1369909 1481185 1557617 1551466 1450447
11666A450447j31105p7140l1722p7658j54781j42894m4951L6558L1292l3139j14300
$$ 1450447 1319342 1242202 1210480 1132822 978041 835147 790196 826754 858046 824907 710607
11655G10607k00167k20758j16647j0123j7355r1372j53860j56318o7526L0554
$$ 710607 510440 289682 173035 162912 145557 54185 -99675 -255993 -323519 -292965
11645b92965M7885J7314J4547K8013L9204J43862K90354L53937K88924J33228
$$ -292965 -245080 -227766 -213219 -185206 -146002 -2140 288214 642151 931075 1064303
11635A064303j223q5473r4353J3019J14400O7263n6772j67117k31452j89874j06613
$$ 1064303 1063080 977607 883254 896273 1010673 1077936 1021164 854047 622595 432721 326108
11624C26108m5012k8902r0501j44434j01712l4720j3768l7194j01519j43889j07785
$$ 326108 281096 252194 161693 17259 -84453 -119173 -132941 -170135 -271654 -415543 -523328
11613e23328k0851L6943N6209J00062J78204K17579J33560k5212j18683j21544
$$ -523328 -544179 -507236 -451027 -350965 -172761 44818 178378 153166 34483 -87061
11603h7061j09259o5838K4334J16839J02204k3040m0751O0284J21858J23988P8675
$$ -87061 -196320 -262158 -237824 -120985 -18781 -41821 -82572 -22288 99570 223558 302233
11592C02233N5681Q3239R8606R5831J16878Q5474k5339p1709l6345m3533j21362
$$ 302233 357914 441153 539759 635590 752468 837942 812603 740894 704549 661016 539654
11581E39654k29532l07424l00094k35680j61492j04516j8298R5357J56413J42687
$$ 539654 310122 2698 -297396 -533076 -694568 -799084 -817382 -722025 -565612 -422925
11571d22925Q3257L0316R866L179l0060q6599j17260j05150o5578l6238k8089
$$ -422925 -339668 -309352 -299486 -296307 -326367 -412966 -530226 -635376 -700954 -737192 -765281
11560g65281m0766l5021L6230J22199J14384L8915M082L3904P4154J13895J56101
$$ -765281 -806047 -841068 -804838 -682639 -568255 -529340 -525258 -491354 -417200 -303305 -147204
11549a47204J90568J74385J05289L9097k7127p2951o5263k6565K6786P6627R0159
$$ -147204 43364 217749 323038 362135 335008 262057 196794 170229 197015 273642 363801
11538C63801M4716j8252l6347j0297n120k4983k8178l6550q8252j25327r3066
$$ 363801 408517 390265 353918 343621 338501 313518 285340 248790 160538 35211 -57855
11527e7855j0404Q7205J55579J46072P0841M7281J06104J30929J7671j09433j41040
$$ -57855 -68259 18946 174525 320597 391438 438719 544823 675752 693423 583990 442950
11516D42950j54310k39896k88216k12848m1206J29645J96395J68937R4735J3834
$$ 442950 288640 48744 -239472 -452320 -493526 -363881 -167486 1451 96186 110020
11506A10020k5083r464J0853J7469J2201m455k0454n773M8190O4914j1575q1688
$$ 110020 84937 75473 86326 103795 115996 111541 91087 85314 133504 198418 186843 105155
11494A05155l9864M0209L2828m0625j38083k02773k04265j19003J6338J03109
$$ 105155 65291 105500 138328 97703 -40380 -243153 -447418 -566421 -550083 -446974
11484d46974J12397Q5306N7786P9649Q4321K1183p4768j68466j85062r0854K8044
$$ -446974 -334577 -249271 -191485 -111836 -27515 -6332 -81100 -249566 -434628 -525482 -497438
11473d97438J03414R5231K8406p271r259L982Q519k8505q8498p3306L6170J70296
$$ -497438 -394024 -298793 -270387 -277658 -286917 -282935 -274416 -302921 -391419 -464725 -428555 -258259
11461b58259K24372J31706l249o8528p4994p2811p0050o9012q5255p7442j5045
$$ -258259 -33887 97819 94570 26042 -48952 -121763 -191813 -260825 -346080 -423522 -438567
11450d38567M9883O7937N2351O0907O7617L1907k9002o1323l7408M2468J41160
$$ -438567 -388684 -320747 -268396 -207489 -139872 -107965 -136967 -198290 -235698 -193230 -52070
11439e2070J83482J54185R8125N2320j4219n8105j4778Q7232J82753K08342J62372
$$ -52070 131412 285597 383722 436042 421823 363718 348940 436172 618925 827267 989639
11428I89639Q5676j0111r7939j43009j11195k9629j4078o5867r9196r3595n4921
$$ 989639 1075315 1065204 967265 824256 713061 683432 669354 603487 504291 410696 355775
11417C55775L863N9670J32770J39570L9163n8020o5825J775Q0717P6053J5447
$$ 355775 359638 419308 552078 691648 730811 672791 606966 608741 689458 765511 780958
11406G80958K7068M0963j2852q2768j30849j56539j76153j70769j33674r2266
$$ 780958 808026 848989 836137 753369 622520 465981 289828 119059 -14615 -106881
11396a06881p4949q0630o9460n5677m3599N095P0411J10502Q9093K5809k8738
$$ -106881 -181830 -262460 -331920 -387597 -431196 -426101 -355690 -245188 -156095 -130286 -159024
11385a59024j30621j98192j29794l2408j3689l4152m7614p8513p2575L7939J69403
$$ -159024 -289645 -487837 -617631 -650039 -663728 -697880 -745494 -824007 -896582 -858643 -689240
11374f89240K35275K30778J33236q550j04929j26155n5372K3931M4708M1694K5094
$$ -689240 -453965 -223187 -89951 -98501 -203430 -329585 -384957 -361026 -316318 -274624 -249530
11363b49530L2153P9157Q6166K2397m1312k3644M7854M1528O673O8517J64699
$$ -249530 -217377 -138220 -52054 -29657 -70969 -94613 -46759 -5231 1442 69959 234658
11352B34658J66541M0591o9185q6855j11608j44934j05067j98J24819J88858R2679
$$ 234658 401199 441790 372605 285750 174142 29208 -75859 -76057 48762 237620 330299
11341C30299o1147j16196j21222j37270r6633j6001M9802P0513K9270n0056j05060
$$ 330299 269152 152956 31734 -105536 -202169 -218170 -168368 -97855 -68585 -118641 -223701
11330b23701r6748o2870j0901N7119R0063P5656M5670P956l608L780j1403n4630
$$ -223701 -320449 -383319 -394220 -337101 -247038 -171382 -125712 -117756 -121364 -117584 -128987 -183617
11318a83617o2154m0980q6898j64684j69815j19240p6310m0664K4304J07798J44425
$$ -183617 -245771 -286751 -373649 -538333 -708148 -827388 -903698 -944362 -920058 -812260 -667835
11307f67835J14976P9520R8352J21024R4219O1621O3768N5508j1257p7966r5194
$$ -667835 -552859 -473339 -374987 -253963 -159744 -98123 -34355 21153 9896 -68070 -163264
11296a63264m1871P1780J58415J42607L7777l0286n5829j22434j86099j64733
$$ -163264 -205135 -133355 25060 167667 205444 175158 119329 -3105 -189204 -353937
11286c53937j13777p2463J203N5810Q9502J37476J92063K13794J92214J47155
$$ -353937 -467714 -540177 -538974 -483164 -393662 -256186 -64123 149671 341885 489040
11276D89040R5517M1745K1092L4981O8022O3918j6711j15292j90608k32520j97604
$$ 489040 584557 626302 647394 682375 750397 814315 797604 682312 491704 259184 61580
11265F1580j39476j52999j91062j85552p8253Q7949J44953R8585J06951J53352
$$ 61580 -77896 -230895 -421957 -607509 -685762 -597813 -452860 -354275 -247324 -93972
11255i3972J39639O5269J3127j382l8350j06421j05032k7361J0347m231n4941
$$ -93972 45667 110936 124063 122681 84331 -22090 -127122 -154483 -144136 -148367 -203308
11244b03308j13182j16286n8418J3993O0706N5252K8909L9471R9439J70541J77524
$$ -203308 -316490 -432776 -491194 -477201 -416495 -361243 -332334 -292863 -193424 -22883 154641
11233A54641Q3203K5878J00862J61796P9752p6065j49601q0080P5344J88853K10871
$$ 154641 237844 263722 364584 526380 606132 530067 380466 300386 375730 564583 775454
11222G75454J87449P2294j80007l93132m20840l03350j61571m5697j8315n2600
$$ 775454 962903 1035197 855190 462058 41218 -262132 -423703 -469400 -487715 -540315
11212e40315m435R8802J53766J41081J02231M5524o0419j74448j49563P993J48020
$$ -540315 -544750 -445948 -292182 -151101 -48870 -3346 -63765 -238213 -387776 -379783 -231763
11201b31763J57000O2601k6691n5734n7664m7896k9593J8085Q4758J37347J24994
$$ -231763 -74763 -12162 -38853 -94587 -152251 -200147 -229740 -211655 -126897 10450 135444
11190A35444P1560P5241Q2019L8268j2316l4263m5857m4395j7232Q435J4817k2233
$$ 135444 207004 282245 364264 402532 390216 355953 310096 265701 248469 256904 271721 249488
11178B49488o9073m6642K3605Q2934R0232N5553j9578p1299q5040q0124m2050
$$ 249488 180415 133773 157378 240312 330544 386097 366519 295220 210180 130056 88006
11167H8006l4734n1054p3050j09658j36830o8119P1677J41307J18510J02564P2847
$$ 88006 53272 2218 -70832 -180490 -317320 -385439 -313762 -172455 -53945 48619 121466
11156A21466j1919o9873o3386l4069n0989p1995l5821M1945P9128M4703l0582
$$ 121466 109547 39674 -23712 -57781 -108770 -180765 -216586 -174641 -95513 -50810 -81392
11145h1392j13733j71630j46358l5852M6708P1576N5630K3121Q594K9148Q6232
$$ -81392 -195125 -366755 -513113 -548965 -502257 -430681 -375051 -351930 -343336 -314188 -227956
11134b27956J08654M0817p463O5256J23744P4600j5862j10789j35785q4805n1534
$$ -227956 -119302 -78485 -85948 -20692 103052 177652 161790 51001 -84784 -169589 -221123
11123b21123j27021j95570o5063J54997J95346Q4326R740m2781q0358p4359l4377
$$ -221123 -348144 -543714 -608777 -453780 -258434 -174108 -164368 -207149 -287507 -361866 -396243
11112c96243J7389N1726R4106J71022J98625J01453m1630j00172m5333N5420J26346
$$ -396243 -378854 -327128 -233022 -62000 136625 238078 196448 96276 50943 106363 232709
11101B32709R9358J7556l694L6573P9873P8271j4289j28517j53349r9319n1040
$$ 232709 332067 349623 345929 382502 462375 540646 526357 397840 244491 145172 94132
11090I4132j4261J9769P0770J10982J24638J18207O7756k0175r6183j15212j02005
$$ 94132 79871 99640 170410 281392 406030 524237 591993 571818 475635 360423 258418
11079B58418o5717n6171o3492m0768l3549o0722r8180p2621L4927R2031M6826
$$ 258418 192701 136530 73038 32270 -1279 -62001 -160181 -232802 -197875 -105844 -59018
11068e9018J2283P7952J48335J43662Q2117K7337K5299L032o8520j49005j94764
$$ -59018 -46735 31217 179552 323214 405331 432668 457967 460999 392479 243474 48710
11057D8710j64275p9558M1287J84434K51339J84884Q4486K0301j5232l1016O248
$$ 48710 -115565 -195123 -153836 30598 281937 466821 551307 571608 556376 525360 531608
11046E31608R8515J42023J02780N0213n088j7200j811l3496m653J30247J93973
$$ 531608 630123 772146 874926 925139 920051 902851 901040 867544 862891 993138 1187111
11035A187111K03692K23671J42829K1025L562L5389L1440l1191p4657p1690m7316
$$ 1187111 1390803 1614474 1757303 1778328 1781890 1817279 1848719 1817528 1742871 1671181 1623865
11024A623865k4464l0148L128Q9858J18908Q0889N5558M0396J4018l6796j51538
$$ 1623865 1599401 1569253 1572381 1662239 1781147 1862036 1917594 1957990 1972008 1935212 1783674
11013A783674j94852l7096J78100K98004K76840J62667K8720j01910k39260l22448
$$ 1783674 1588822 1551726 1729826 2027830 2304670 2467337 2496057 2394147 2154887 1832439
11003A832439k54879j32680j18780j42170r0755k2628K3013M1851M5172M6063
$$ 1832439 1577560 1444880 1326100 1183930 1093175 1070547 1093560 1135411 1180583 1226646
10993A226646Q2436J24113O0150k811J7316J220k8645K881J3873k3832o6839j48840
$$ 1226646 1309082 1433195 1493345 1490534 1507850 1509070 1480425 1483306 1497179 1473347 1406508 1257668
10981A257668k36460k46977j77840j08644q4194p7659k1088P4538Q9922M1482
$$ 1257668 1021208 774231 596391 487747 403553 325894 304806 379344 469266 510748
10971E10748N842j808k0161p5073q4018l6586j1594j9991n2107j01176j27443
$$ 510748 516590 514782 494621 419548 335530 298944 287350 267359 215252 114076 -13367
10960a3367r7302k8610K5503L9205M991k4308m287N048R266M6882R7311J40570
$$ -13367 -110669 -139279 -113776 -74571 -69580 -93888 -98175 -93127 -83861 -36979 60332 200902
10948B00902J44187P7260q350k0420L8086J2021j36617k49139j73279K8795J71140
$$ 200902 345089 422349 413999 393579 431665 443686 307069 57930 -115349 -86554 84586
10937H4586J55925K2303q0028j63829k97826l15373j43875J7967L3193m5422j07581
$$ 84586 240511 262814 182786 18957 -278869 -594242 -738117 -720150 -686957 -732379 -839960
10926h39960q9402m3286k0346j1220N2115J68589K47666J81952q206j82007j86297
$$ -839960 -929362 -972648 -992994 -1004214 -952099 -783510 -535844 -353892 -362098 -544105 -730402
10915g30402l0493J35436K12609J69028Q8464R5478J32495Q2015l2131j18777
$$ -730402 -760895 -625459 -412850 -243822 -155358 -59880 72615 154630 122499 3722
10905C722j16482n4991K8260R3735Q9587J0656p2215j27112j89136k04428j31742
$$ 3722 -112760 -167751 -139491 -45756 43831 54487 -17728 -144840 -333976 -538404 -670146
10894f70146m449R4000J15933J42938K11832K08699J10077J1684n4115o6043O031
$$ -670146 -674595 -580595 -464662 -321724 -109892 98807 208884 220568 166453 100410 106441
10883A06441J18320K23916K49997J25941m9082j78957k59452l00181l08246k53105
$$ 106441 224761 448677 698674 824615 775533 596576 337124 36943 -271303 -524408
10873e24408j48879k7374P2303J16171J81373K50854K61599K17133J40900N1797
$$ -524408 -673287 -700661 -628358 -512187 -330814 -79960 181639 398772 539672 591469
10863E91469K130l2071j11790j50545m6831R0760R8138L5256K1888j1683j29554
$$ 591469 593599 561528 449738 299193 252362 343122 441260 476516 498404 486721 357167
10852C57167k05296j15461L2756J14888J18394L8204l8392o7839o4701l7786k2272
$$ 357167 151871 36410 69166 184054 302448 340652 302260 234421 169720 131934 109662
10841A09662k9258p108M7067P2460K1779o2781j07487o7354L5512J02826P5174
$$ 109662 80404 73296 120363 192823 214602 151821 44334 -23020 12492 115318 190492
10830A90492m3503j49116j71093j59077j39685j11792n5643l5849j13980j69238
$$ 190492 146989 -2127 -173220 -332297 -471982 -583774 -639417 -675266 -789246 -958484
10820i58484j14333m2835K528R7695K21764K72259K11879P5972p817M5081J32613
$$ -958484 -1072817 -1115652 -1113124 -1015429 -793665 -521406 -309527 -233555 -241372 -196291 -63678
10809f3678J33470R0640R6129J36765J27121k0236k09058k60209j37142M2205
$$ -63678 69792 160432 256561 393326 520447 500211 291153 30944 -106198 -63993
10799f3993R7889K4669j4328k6513q4099r6134r1424j27383j50899j01993Q8476
$$ -63993 33896 58565 44237 17724 -66375 -162509 -253933 -381316 -532215 -634208 -545732
10788e45732L21492L70807K02859k537r5590q1735l2091l4041q1666o2572M2555
$$ -545732 -224240 146567 349426 346889 251299 169564 137473 103432 21766 -40806 1749
10777A749J25531J05959n5651k35949k08930q5722l5522L6725J29705J75558J34606
$$ 1749 127280 233239 177588 -58361 -267291 -353013 -388535 -351810 -222105 -46547 88059
10766H8059M1650j7591n4446q2755q8902n4800m566M3030P0898Q1288M5112n9366
$$ 88059 129709 112118 57672 -25083 -113985 -168785 -173351 -130321 -59423 21865 66977 7611
10754G611j34908j41724j00506J8665J16545J53025J88077K46372K70773J50251
$$ 7611 -127297 -269021 -369527 -350862 -234317 -81292 106785 353157 623930 774181
10744G74181n8110k08479k56156k40742k38840k25124j15285M5334J19345R4408
$$ 774181 716071 507592 251436 10694 -228146 -453270 -568555 -523221 -403876 -309468
10734c09468N5157J5962J0410N3379O8654O8049Q9192J07131P8696L6646L4231
$$ -309468 -254311 -238349 -227939 -174560 -105906 -37857 51335 158466 237162 273808 308039
10723C08039K9272Q457m0036j09581j30068q9066n6106r5013j40431j17022r0901
$$ 308039 337311 345768 305732 196151 66083 -22983 -79089 -174102 -314533 -431555 -522456
10712e22456p3463j4341Q2188J95885L08200K95192J08370p2008j28464p4062
$$ -522456 -595919 -610260 -528072 -332187 -23987 271205 379575 307567 179103 105041
10702A05041j0154m3080j18969j38204j36370j82698k02809j04287k3708n3739
$$ 105041 94887 51807 -67162 -205366 -341736 -524434 -727243 -831530 -855238 -908977
10692i08977r5793m0917J16087K29723J82774Q7206R9902J58815J72150J63276
$$ -908977 -1004770 -1045687 -929600 -699877 -517103 -429897 -329995 -171180 970 164246
10682A64246J72519J72745J34372Q0108L2355K886j1200m8258j29095j48468j08376
$$ 164246 336765 509510 643882 723990 756345 759231 748031 699773 570678 422210 313834
10671C13834p3973q9521j77736k35690k32922j58186o268J37091K05353J81624
$$ 313834 239861 150340 -27396 -263086 -496008 -654194 -660462 -523371 -318018 -136394
10661a36394R0706l1035j55042k20207j71767l6429P8500J01749L1569r0087k23063
$$ -136394 -45688 -76723 -231765 -451972 -623739 -660168 -581668 -479919 -448350 -538437 -761500
10650g61500k20328l4247J81546K52628J63758N7448J7975n504r8297k21093k38799
$$ -761500 -981828 -1016075 -834529 -581901 -418143 -360695 -342720 -348224 -446521 -667614 -906413
10639i06413j36648m5131l4768l4568m404P2286J26518J22637J08959J13489J61813
$$ -906413 -1043061 -1088192 -1122960 -1157528 -1161932 -1089646 -963128 -840491 -731532 -618043 -456230
10628d56230K58161K67429J22807j9192q9047j40660j73492r0080P0505J23389
$$ -456230 -198069 69360 192167 172975 83928 -56732 -230224 -320304 -249799 -126410
10618a26410K9538j09566j74774p7248O3778L7381o9948r0483q2529j07203j14724
$$ -126410 -96872 -206438 -381212 -458460 -394682 -357301 -427249 -517732 -600261 -707464 -822188
10607h22188p5430j1203J9473J176J5803J36325K73491L28614K41522P5399m1414
$$ -822188 -897618 -908821 -889348 -888172 -872369 -736044 -462553 -133939 107583 182982 141568
10596A41568r2801r4253q0171k7907P4351J44520J40087Q9024N802q5999j54821
$$ 141568 48767 -45486 -125657 -153564 -79213 65307 205394 294418 300220 214221 59400
10585E9400j80944j69639j61595j27436J2237J64089J91609J35742R7709R1239
$$ 59400 -121544 -291183 -452778 -580214 -567977 -403888 -212279 -76537 21172 112411
10575A12411J26162J48059Q8149J1698N6362J94218K59817K17216J10153J411
$$ 112411 238573 386632 474781 486479 542841 737059 996876 1214092 1324245 1325656
10565A325656l4251q6204k16450k76489k24482j32654n2541m049N9030J41027
$$ 1325656 1291405 1205201 988751 712262 487780 355126 302585 298536 357566 498593
10555D98593J80127O9844j49086k34602j29677j2116L537m8260n5637L074R2193
$$ 498593 678720 748564 599478 364876 235199 223083 226620 178360 122723 125797 217990
10544B17990J75041J61600O3298m4777j40277j59244n7807Q7689J49617J36556
$$ 217990 393031 554631 617929 573152 432875 273631 215824 303513 453130 589686
10534E89686J11086J02567P3362J889q0963j37394j52512j49004j99998k70288
$$ 589686 700772 803339 876701 878590 797627 660233 507721 358717 158719 -111569
10524a11569k72079k52125k31874j68773o8621J18680L56283M39677L35304J38012
$$ -111569 -383648 -635773 -867647 -1036420 -1105041 -986361 -630078 -190401 144903 282915
10514B82915n0654j40371r7288N5474J35753K0576j37126j81495j20786j917Q6813
$$ 282915 232261 91890 -5398 50076 185829 206405 69279 -112216 -233002 -234919 -148106
10503a48106J32806J79425J86361R1503m7016j04949r0800j09524j18970m9012
$$ -148106 -15300 164125 350486 441989 394973 290024 199224 89700 -29270 -78282
10493g8282J8910O0297P9747O5643K0516Q820P6251J58451J99765J57366n536
$$ -78282 -59372 925 80672 146315 166831 175651 251902 410353 610118 767484 761948
10482G61948j33275j01909k1124K9262O6640O5899K6708J8820N3720M0207l1780
$$ 761948 628673 526764 505640 534902 601542 667441 694149 712969 766689 806896 775116
10471G75116n2709m9065j02419j90132k66467k51921j28180J2886M1005k5303
$$ 775116 722407 673342 570923 380791 114324 -137597 -265777 -252891 -211886 -237189
10461b37189p4332n0494K2084M0514k5256o0205q008L5030K3174k5896p0099o3775
$$ -237189 -311521 -362015 -339931 -299417 -324673 -384878 -392886 -357856 -334682 -360578 -430677 -494452
10449d94452K5038J61075K63190K23256P4967j3007N209M7488L1861n6650j75619
$$ -494452 -469414 -308339 -45149 178107 253074 240067 245276 292764 324625 267975 92356
10438I2356k52014k23644o9284J12943J69627P2217n3865j00553p1861k8502J0522
$$ 92356 -159658 -383302 -452586 -339643 -170016 -97799 -151664 -252217 -324078 -352580 -342058
10427c42058M1298M3049P2070J49248J84753J53855J23592J14828N0515j12784
$$ -342058 -300760 -257711 -185641 -36393 148360 302215 425807 540635 591150 478366
10417D78366k41358k37225j73965p1327M4583P1724N1911Q8668P3105n0195j35236
$$ 478366 237008 -217 -174182 -245509 -200926 -129202 -77291 11377 84482 34287 -100949
10406a00949j06030O022J31669J38828J6569j07485j61630j38782m7550N9744
$$ -100949 -206979 -200957 -69288 69540 86109 -21376 -183006 -321788 -369338 -309594
10396c09594R4605O7101L7116K2679K0732L9108O7169O6113O4208R8829J10408
$$ -309594 -214989 -147888 -110772 -88093 -67361 -28253 38916 105029 169237 268066 378474
10385C78474R2917M0748o8221j59078j88868j63122q8566l2775N224L8931P0536
$$ 378474 471391 512139 443918 284840 95972 -67150 -155716 -188491 -183267 -144336 -73800
10374g3800O9886O572m7865j02449j60122j58415o5552N2665P7153K7855L0677
$$ -73800 -3914 2658 -45207 -147656 -307778 -466193 -531745 -479080 -401927 -374072 -343395
10363c43395Q6189J41460J62904J09238j2839j21317j23516n6472L7738J39962
$$ -343395 -257206 -115746 47158 156396 143557 22240 -101276 -157748 -120010 19952
10353A9952J68425J58764J49311J04824M8271j321N132M4182q839j47127k27872
$$ 19952 188377 347141 496452 601276 649547 648226 653358 697540 688701 541574 313702
10342C13702j15734O6322J04715K6669p5137j57673j78020j16987j9425M4062
$$ 313702 197968 264290 369005 395674 320537 162864 -15156 -132143 -151568 -107506
10332a07506M6642M9845R6733R9087M1789K4263O7400J00064M6555q3760j84739
$$ -107506 -60864 -11019 85714 184801 226590 250853 318253 418317 464872 381112 196373
10321A96373j48400m1463Q828K1953M2631L6401l0713r9766p7277k990P3549J14148
$$ 196373 47973 6510 15338 37291 79922 116323 85610 -14156 -91433 -94423 -20874 93274
10309I3274O0888n781o5191j14265j07250p0428n5266m5119k6355q370J6395K0282
$$ 93274 154162 148381 83190 -31075 -138325 -208753 -264019 -309138 -335493 -343863 -327468 -307186
10297c07186n53k07L6170N2214J1887n7989r7952p7673q6014j06350o7712m0356
$$ -307186 -307739 -307946 -271776 -219562 -207675 -265664 -363616 -441289 -527303 -633653 -701365 -741721
10285g41721j3873J04000K55271L28107L01257K19539Q1545r6841j99768j77372
$$ -741721 -755594 -651594 -396323 -68216 233041 452580 534125 437284 237516 60144
10275F0144j04896p9973j00544q1327n5717n8781k0123O7103J21400J13402P3307
$$ 60144 -44752 -124725 -225269 -306596 -362313 -421094 -441217 -374114 -252714 -139312 -66005
10264f6005L3845k1890j05300j45020r1985K4227J03372P0255J95K6190R4804
$$ -66005 -32160 -54050 -159350 -304370 -396355 -372128 -268756 -198501 -198306 -172116 -77312
10253g7312J05933N7102k6613o5750k7277k277n3441q3003m5425k1814l8509o9171
$$ -77312 28621 85723 59110 -6640 -33917 -36194 -89635 -172638 -218063 -239877 -278386 -347557
10241c47557n2807J3819N8645P2499N9440J0698o9596j31403j29021q2789n1715
$$ -347557 -400364 -386545 -327900 -255401 -195961 -185263 -254859 -386262 -515283 -598072 -649787
10230f49787m3286m1983n1190O20J58780L31100M06335L48771J52669n7854j66454
$$ -649787 -693073 -735056 -786246 -785626 -626846 -295746 110589 459360 612029 554175 387721
10219C87721j33760m9900L4453M9575j2763l5575J7015P6260L2110m8438o1831
$$ 387721 253961 204061 238514 288089 275326 239751 256766 333026 365136 316698 254867
10208B54867o4502o7703k1685J3612J0778p553q443L3225N6445J8226l8382m7044
$$ 254867 190365 122662 100977 114589 125367 117814 109371 142596 199041 217267 178885 131841
10196A31841r4494k41313l25534k45989r5306j253k1547j4431Q6393J30944L4789
$$ 131841 37347 -203966 -529500 -775489 -870795 -872048 -893595 -908026 -821633 -690689 -655900
10185f55900o7147o2399J4651J19845K15791K38240J59887M9613M85P685L645
$$ -655900 -723047 -785446 -770795 -650950 -435159 -196919 -37032 12581 13066 20751 24396
10174B4396l4832j11239j73137j24657R085J10921J71052K20037J78003L7751
$$ 24396 -10436 -121675 -294812 -419469 -410384 -299463 -128411 91626 269629 307380
10164C07380p6523j16567j10668r1317p0682o927J26140K14539J79658O3238j0661
$$ 307380 230857 114290 3622 -87695 -158377 -165304 -39164 175375 355033 418271 407610
10153D07610j2N0031P9631M5032m8064j26264j21255j13894j25548p3555l266
$$ 407610 407598 457629 537260 582292 534228 407964 286709 172815 47267 -26288 -29554
10142b9554k891m7452l3257O8202J54970J41374R5339O3688M1492J8216j2284
$$ -29554 -32445 -79897 -113154 -44952 110018 251392 346731 410419 451911 470127 457843
10131D57843m9557j08499j40018j03330p5216r9891j41516j28272n5107J4867
$$ 457843 408286 299787 159769 56439 -18777 -118668 -260184 -388456 -443563 -428696
10121d28696O4453P7384O9007O3485P5077J07488J05058O8684N6704O9709J09175
$$ -428696 -364243 -286859 -217852 -154367 -79290 28198 133256 201940 258644 328353 437528
10110D37528J80347K36571K43445K45456K82189L03665K95698K97114L02284K84821
$$ 437528 617875 854446 1097891 1343347 1625536 1929201 2224899 2522013 2824297 3109118
10100C109118J94631L5092r6927k20848l38262k84170j30786j12008j84189j92011
$$ 3109118 3303749 3338841 3241914 3021066 2682804 2398634 2267848 2155840 1971651 1779640
10090A779640j60796j25601j46101k37154k82791k40832j62492j14023j01565
$$ 1779640 1618844 1493243 1347142 1109988 827197 586365 423873 309850 208285
10081B08285q4460n0926k3863M047M208k0721m9523q3705r7861j11270j07281
$$ 208285 123825 72899 49036 53083 57291 36570 -12953 -96658 -194519 -305789 -413070
10070d13070p2046m2704l1201l8768K5304J55589J94052Q6458l019J130l139k706
$$ -413070 -485116 -527820 -559021 -597789 -572485 -416896 -222844 -136386 -139405 -138275 -141414 -144120
10058a44120J7463K1419j878j0949N6135J33336J55022J25619O7609M8820J7370
$$ -144120 -126657 -105238 -107116 -118065 -61930 71406 226428 352047 419656 468476 485846
10047D85846j08182k74563l61252l11395j65176J2473J16193J11462P3900K3109
$$ 485846 377664 103101 -258151 -569546 -734722 -722249 -606056 -494594 -420694 -397585
10037c97585p3618j29487q0054K4678Q3695O5666M1913M0921K8382K7654O8437
$$ -397585 -471203 -600690 -680744 -656066 -572371 -506705 -464792 -423871 -395489 -367835 -299398
10026b99398R4043J36040K00341K27536K08144J86483J52191O1702p8404k14506
$$ -299398 -205355 -69315 131026 358562 566706 753189 905380 967082 888678 674172
10016F74172k44734j74118o8230L2461Q0373J6778j03163j39329r3058o1128q852
$$ 674172 429438 255320 187090 219551 299924 316702 213539 74210 -18848 -79976 -88828
10005h8828P0072P8566K3220r611Q236M5686P4473O2689M2373L7788L3660O193
$$ -88828 -18756 59810 83030 73419 81655 127341 201814 264503 306876 344664 378324 384517
9993C84517j2906L1305R9749J03507M0897j748K0001P1648J21315J51332J71489
$$ 384517 371611 402916 502665 606172 647069 645321 665322 736970 858285 1009617 1181106
9982A181106J80818J62322J38071R7213Q2347J61812K38612K30389J67595J30470
$$ 1181106 1361924 1524246 1662317 1759530 1841877 2003689 2242301 2472690 2640285 2770755
9972B770755J10450N0500P6191K12449L39863M32929M85951N11519N33281N68896
$$ 2770755 2881205 2931705 3007896 3220345 3560208 3993137 4479088 4990607 5523888 6092784
9962F092784O07549O09874N50076M11481J88658j12854m38123o75745p77205p88926
$$ 6092784 6700333 7310207 7860283 8271764 8460422 8347568 7909445 7233700 6456495 5667569
9952E667569p21253o15491n52875n15423m50907l27914j76708j17171j69016j98574
$$ 5667569 4946316 4330825 3777950 3262527 2811620 2483706 2306998 2189827 2020811 1822237
9942A822237j85431k18820k52010k32034j77161j14906j24445k02729k35101j44181
$$ 1822237 1636806 1417986 1165976 933942 756781 641875 517430 314701 79600 -64581
9932f4581k6937Q3112J71398J44256K2711q1628j03769m6028M9265J15421J57186
$$ -64581 -91518 -8406 162992 307248 329959 248331 144562 98534 147799 263220 420406
9921D20406K21348K62661K33649J22830m5085j58157j59845p5472R963K0133q5239
$$ 420406 641754 904415 1138064 1260894 1215809 1057652 897807 822335 832298 852431 767192
9910G67192k31517k52856j96887j53225l5310O3407N4832K7795k0375r4697j77765
$$ 767192 535675 282819 85932 -67293 -102603 -39196 15636 43431 23056 -71641 -249406
9899b49406j89203p8735N8973J45832J01298k3105r4181l7082Q2590R8039M8402
$$ -249406 -438609 -517344 -458371 -312539 -211241 -234346 -328527 -365609 -283019 -184980 -136578
9888a36578Q9951J96776J94211P0342j7965j0892J0461l1967n3250k3977n784
$$ -136578 -46627 150149 344360 414702 396737 385845 396306 364339 311089 287112 281328
9877B81328m518n0010j44797k55905k65269j44237m9059m1184m2295p1320r0455
$$ 281328 276810 226800 82003 -173902 -439171 -583408 -632467 -673651 -715946 -787266 -877721
9866h77721p57J29330K12396K51702K39511J96817J71474J22491M6723J2425j4763
$$ -877721 -878478 -749148 -536752 -285050 -45539 151278 322752 445243 491966 504391 489628
9855D89628l8471l0037p5275j53174j53666q3331J1344M7313j8559o4953k8688
$$ 489628 451157 421120 345845 192671 39005 -44326 -32982 14331 -4228 -69181 -97869
9844i7869J0765M7252O0058M5948Q0801J19624J35103J00186L3843M9037J50460
$$ -97869 -87104 -39852 20206 66154 146955 266579 401682 501868 535711 584748 735208
$$ [...]
##END NTUPLES=NMR SPECTRUM
##END=
