##TITLE=C13_SR152_oil TFA2
 DMSO-d6, 22300 sc

 20.3.2023
##JCAMPDX= 6.0         $$ Bruker NMR JCAMP-DX V2.0
##DATA TYPE= NMR SPECTRUM
##DATA CLASS= NTUPLES
##ORIGIN= UXNMR, Bruker Analytische Messtechnik GmbH
##OWNER= root
$$ XWIN-NMR		Version 3.5
$$ Tue Mar 21 13:42:57 2023 Russian Standard Time (UT+4h)  she@DPX200
##.OBSERVE FREQUENCY= 50.327896
##.OBSERVE NUCLEUS= ^13C
##.ACQUISITION MODE= SIMULTANEOUS
##.ACQUISITION SCHEME= undefined
##.AVERAGES= 22301
##.DIGITISER RES= 17
##SPECTROMETER/DATA SYSTEM= spect
##.PULSE SEQUENCE= zgpg30
##.SOLVENT NAME= CDCl3
##.SHIFT REFERENCE= (INTERNAL, CDCl3, 0, 222.624)
##AUDIT TRAIL= $$ (NUMBER, WHEN, WHO, WHERE, WHAT)
$$ ##TITLE= Audit trail, XWIN-NMR		Version 3.5
$$ ##JCAMPDX= 5.01
$$ ##ORIGIN= Bruker BioSpin GmbH
$$ ##OWNER= she
$$ F:/spectra/data/she/nmr/c13/1/pdata/1/auditp.txt
$$ ##AUDIT TRAIL=  $$ (NUMBER, WHEN, WHO, WHERE, WHAT)
(   1,<2023-03-21 13:41:10.60 +0400>,<she>,<DPX200>,
      <created by zg, POWCHK disabled, PULCHK disabled
       terminated by command 'halt'
       configuration hash MD5:
       00 E9 B6 7A A2 85 ED C7 34 08 36 98 17 FE 4E 26
       data hash MD5: 32K
       43 17 E1 FA 24 28 76 83 0C 28 96 93 88 62 50 26>)
(   2,<2023-03-21 13:41:14.81 +0400>,<she>,<DPX200>,
      <Start of raw data processing
       efp BC_mod = 2 LB = 2 FT_mod = 6 PKNL = 1 PHC0 = -324.3032 PHC1 = 28.61809 SI = 32K 
       data hash MD5: 32K
       65 61 97 AF F0 4C A6 08 D3 40 6F BD 47 2D 96 CC>)
(   3,<2023-03-21 13:41:23.90 +0400>,<she>,<DPX200>,
      <abs ABSG = 5 
       data hash MD5: 32K
       D0 74 23 B4 D4 6E 31 65 BC F4 1D F2 B7 54 FD 2B>)
(   4,<2023-03-21 13:41:46.50 +0400>,<she>,<DPX200>,
      <pk PHC0 = 0.9231129 PHC1 = 4.400001 
       data hash MD5: 32K
       13 9A 30 1E 9A 1E 8B A7 49 2A 88 FE 56 1D EF F3>)
(   5,<2023-03-21 13:41:50.67 +0400>,<she>,<DPX200>,
      <abs ABSG = 5 
       data hash MD5: 32K
       99 22 FF D1 0C 52 E3 EE 55 6F 57 C6 59 25 58 DA>)
$$ ##END=
$$ 
$$ hash MD5
$$ 8F 2D 33 DF C7 BD DB 63 28 23 58 61 81 EF 46 4D
##$RELAX= 
##$RELAX= 
##$RELAX= 
##$RELAX= 
##$RELAX= 
##$RELAX= 
##$RELAX= 
##$RELAX= 
$$ Bruker specific parameters
$$ --------------------------
##$DU= <F:/spectra>
##$EXPNO= 1
##$NAME= <c13>
##$PROCNO= 1
##$TYPE= <nmr>
##$USER= <she>
##$AMP= (0..31)
100 100 100 100 100 100 100 100 100 100 100 100 100 100 100 100 100 100 
100 100 100 100 100 100 100 100 100 100 100 100 100 100 
##$AQSEQ= 0
##$AQ_mod= 1
##$AUNM= <au_zg>
##$AUTOPOS= <>
##$BF1= 50.322709
##$BF2= 200.13
##$BF3= 50.322709
##$BF4= 500.13
##$BF5= 500.13
##$BF6= 500.13
##$BF7= 500.13
##$BF8= 500.13
##$BYTORDA= 1
##$CFDGTYP= 0
##$CFRGTYP= 5
##$CHEMSTR= <none>
##$CNST= (0..31)
1 1 145 1 1 1 1 1 1 1 1 1 1 1 1 1 1 1 1 1 1 1 1 1 1 1 1 1 1 1 1 1 
##$CPDPRG= <waltz16>
##$CPDPRG1= <>
##$CPDPRG2= <waltz16>
##$CPDPRG3= <>
##$CPDPRG4= <mlev>
##$CPDPRG5= <mlev>
##$CPDPRG6= <mlev>
##$CPDPRG7= <mlev>
##$CPDPRG8= <mlev>
##$CPDPRGB= <>
##$CPDPRGT= <>
##$D= (0..31)
$$ [...]
##$SUBNAM4= <"">
##$SUBNAM5= <"">
##$SUBNAM6= <"">
##$SUBNAM7= <"">
##$SUBNAM8= <"">
##$SUBNAM9= <"">
##$SW= 239.972175391363
##$SWIBOX= (0..15)
0 1 3 0 0 0 0 0 0 0 0 0 0 0 0 0 
##$SW_h= 12077.2946859903
##$TD= 32768
##$TD0= 1
##$TE= 0
##$TE2= 300
##$TE3= 300
##$TEG= 300
##$TL= (0..7)
120 120 120 120 120 120 120 120 
##$TP= (0..7)
150 150 150 150 150 150 150 150 
##$TP07= 0
##$TPNAME0= <>
##$TPNAME1= <>
##$TPNAME2= <>
##$TPNAME3= <>
##$TPNAME4= <>
##$TPNAME5= <>
##$TPNAME6= <>
##$TPNAME7= <>
##$TPOAL= (0..7)
0.5 0.5 0.5 0.5 0.5 0.5 0.5 0.5 
##$TPOFFS= (0..7)
0 0 0 0 0 0 0 0 
##$TUNHIN= 0
##$TUNHOUT= 0
##$TUNXOUT= 0
##$USERA1= <user>
##$USERA2= <user>
##$USERA3= <user>
##$USERA4= <user>
##$USERA5= <user>
##$V9= 5
##$VALIST= <valist>
##$VCLIST= <CCCCCCCCCCCCCCC>
##$VD= 0
##$VDLIST= <DDDDDDDDDDDDDDD>
##$VPLIST= <PPPPPPPPPPPPPPP>
##$VTLIST= <TTTTTTTTTTTTTTT>
##$WBST= 1024
##$WBSW= 4
##$XGAIN= (0..3)
0 0 0 0 
##$XL= 0
##$YL= 0
##$YMAX_a= 141770251
##$YMIN_a= -41058194
##$ZGOPTNS= <>
##$ZL1= 120
##$ZL2= 120
##$ZL3= 120
##$ZL4= 120
##$ABSF1= 222.624
##$ABSF2= -17.3728
##$ABSG= 5
##$ABSL= 3
##$ALPHA= 0
##$AQORDER= 0
##$ASSFAC= 0
##$ASSFACI= 0
##$ASSFACX= 0
##$ASSWID= 0
##$AUNMP= <proc_1d>
##$AZFE= 0.1
##$AZFW= 0.5
##$BCFW= 0
##$BC_mod= 2
##$BYTORDP= 0
##$COROFFS= 0
##$CY= -3
##$DATMOD= 1
##$DC= 0
##$DFILT= <>
##$DTYPP= 0
##$F1P= 0
##$F2P= 0
##$FCOR= 0.5
##$FTSIZE= 32768
##$FT_mod= 6
##$GAMMA= 0
##$GB= 0
##$INTBC= 1
##$INTSCL= 4.134877e-10
##$ISEN= 128
##$LB= 2
##$LEV0= 0
##$LPBIN= 0
##$MAXI= 10000
##$MC2= 0
##$MEAN= 0
##$ME_mod= 0
##$MI= 0.1934396
##$NCOEF= 0
##$NC_proc= 3
##$NLEV= 6
##$NOISF1= 120.0001
##$NOISF2= 80.00006
##$NSP= 0
##$NTH_PI= 0
##$NZP= 0
##$OFFSET= 222.624
##$PC= 1.4
##$PHC0= -323.3801
##$PHC1= 33.01809
##$PH_mod= 1
##$PKNL= yes
##$PPARMOD= 0
##$PSCAL= 0
##$PSIGN= 0
##$REVERSE= no
##$SF= 50.3227315983092
##$SI= 32768
##$SIGF1= 140
##$SIGF2= 120
##$SINO= 11.81781
##$SIOLD= 32768
##$SREGLST= <13C.CDCl3>
##$SSB= 0
##$STSI= 32768
##$STSR= 0
##$SW_p= 12077.2946859903
##$SYMM= 0
##$S_DEV= 0
##$TDeff= 32768
##$TDoff= 0
##$TI= <>
##$TILT= no
##$TM1= 0
##$TM2= 0
##$TOPLEV= 0
##$USERP1= <user>
##$USERP2= <user>
##$USERP3= <user>
##$USERP4= <user>
##$USERP5= <user>
##$WDW= 1
##$XDIM= 32768
##$YMAX_p= 338751397
##$YMIN_p= -844027
$$ End of Bruker specific parameters
$$ ---------------------------------
##NTUPLES= NMR SPECTRUM
##VAR_NAME=  FREQUENCY,     SPECTRUM/REAL,   SPECTRUM/IMAG
##SYMBOL=    X,             R,               I
##VAR_TYPE=  INDEPENDENT,   DEPENDENT,       DEPENDENT
##VAR_FORM=  AFFN,          ASDF,            ASDF
##VAR_DIM=   32768,         32768,           32768
##UNITS=     HZ,            ARBITRARY UNITS, ARBITRARY UNITS
##FACTOR=    0.368581032318806, 1,           1
##FIRST=     11203.0474430531, 0,            0
##LAST=      -874.247242937185, 0,           0
##MIN=       -874.247242937185, -844027,     0
##MAX=       11203.0474430531, 338751397,    0
$$ Real data points
##PAGE= N=1
##DATA TABLE= (X++(R..R)), XYDATA
$$ [...]
11015b0277K8930L0713j1515l7351l1821k6115m1455o7877p4234l4020J2708J7936
11003b54378j979k0716k2546o511P893L1514M8044K8729k903j5696r411J3504
10991b04456M1788N4517L4810j5056n4456p7662p6298m4961q945J8867M8699Q7556
10979a95597J02092R1257P9858R3984J17156P0604j9983n5597l1076L400o4l4674
10967B21360o1067m8675j9478j2469mK0743J4694l1458q3087j03749p2282k692
10955a78164N6592M8037j7252o8325r0949q3093k0341N9600O1435m583m2860m1383
10943c21286k2177O243M3233O8129P9732Q0060M6370k862k4088l2283k9884j6599
10931a25412p473j1153k7890l8086k4448K4225Q1130J05583O9441k566m5065l0727
$$ plain form
11015 -20277 8653 39366 27851 -9500 -41321 -67436 -108891 -176768 -251002 -285022 -272314 -254378
11003 -254378 -256357 -277073 -299619 -306130 -298237 -266723 -218679 -189950 -192853 -208549 -217960 -204456
10991 -204456 -162668 -108151 -73341 -88397 -142853 -220515 -296813 -341774 -350719 -331852 -283153 -195597
10979 -195597 -93505 -2248 77610 171594 288750 359354 339371 283774 252698 256098 256034 221360
10967 221360 160293 111618 92140 79671 79667 100410 115104 83646 559 -103190 -175472 -178164
10955 -178164 -121572 -73535 -90787 -159112 -250061 -333154 -353495 -293895 -232460 -237043 -279903 -321286
10943 -321286 -343463 -337220 -293987 -225858 -146126 -66066 -19696 -22558 -46646 -78929 -108813 -125412
10931 -125412 -132885 -144038 -171928 -210014 -234462 -210237 -129107 -23524 45917 43351 -1714 -32441
10919c2441j8796n2286r8110j08390p5663k0487O0919J35860J51813J04018L5103
10908H1540k7310p9198r5144n9788k5801q48K6921K3923o828k4710k0519J2488
10896a95274M8493M4393J3435J6088P9912J14470O0156P311K3069K9514j2688
10885B28879l9855m6571o7526p5518l9953Q154J9872N423k0696n7075o2311m0402
10873a87579l7189n2528l4562K4482O5213O2800N2820L3937J8834K2332J1835
10862a9605r188l8564o6239p4121k5361Q1080J79857K22497J75211O4895k8390
10851D62072n6353l6319j3374j2492k4391m8813p2248l9515M740P970J893K4836
10839A98006N4896L9558l0745r1880j08783r3611l7193L3793N7099M1300K3863
$$ plain form
10919 -32441 -51237 -103523 -201633 -310023 -385686 -406173 -345254 -209394 -57581 46437 81540
10908 81540 54230 -24968 -120112 -179900 -205701 -206549 -179628 -155705 -162533 -187243 -207762 -195274
10896 -195274 -146781 -102388 -88953 -72865 7047 121517 181673 188984 212053 241567 228879
10885 228879 189024 142453 74927 -591 -40544 -32390 -12518 -7095 -27791 -84866 -147177 -187579
10873 -187579 -224768 -277296 -311858 -287376 -222163 -159363 -106543 -72606 -53772 -31440 -19605
10862 -19605 -28793 -67357 -133596 -207717 -233078 -151998 27859 250356 425567 490462 462072
10851 462072 405719 369400 356026 343534 319143 270330 198082 158567 163307 171277 173170 198006
10839 198006 252902 292460 261715 169835 61052 -32559 -69752 -35959 21140 62440 86303
10828H6303R666j1604m3658l9602K4502O9379O3156L8085j2817o2268o4526m0353
10816A6263k5011j419K7816M3662L7828j1867o3135m8850k3007m8201p8251o5030
10804b39202q969O6721J31695J35221Q8259L5618q512n4804p6217l6274J6495
10793E0031N3433Q7351J07423R2670M0204l010j6092k6387m2987n1367k3548L1326
10781B99047N9638L4043K6663N4117N1327K5188P190k054k5226n7916q3821r6906
10769B91290o5000J7852R6173J19364J01439P9460O2339N8074P6689R8710J08743
10758A045133R2216M5009k2373j08415j54896j38202j12453q8995o4525n3353
10748D39146l5571q768K576r18p905j0564r284M358M9596R5601R3133O0338M9934
$$ plain form
10828 86303 95969 84365 40707 1105 25607 94986 158142 196227 183410 121142 56616 16263
10816 16263 -8748 -10167 17649 61311 99139 87272 24137 -24713 -47720 -95921 -174172 -239202
10804 -239202 -248171 -181450 -49755 85466 173725 209343 200831 146027 69810 33536 50031
10793 50031 103464 190815 298238 390908 431112 428102 412010 385623 342636 291269 267721 299047
10781 299047 358685 392728 419391 473508 524835 550023 557213 555159 529933 472017 388196 291290
10769 291290 226290 244142 340315 459679 561118 640578 702917 760991 837680 936390 1045133
10758 1045133 1137349 1182358 1159985 1051570 896674 758472 646019 557024 492499 439146
10748 439146 403575 394807 397383 396465 388560 377996 368712 373070 422666 518267 611400 671738 721672
10735G21672M8172J2725l2075m8084m0797n0013p0461m9578M399L2914M5605N6816
10723F31295N4000N2750L8742K0716M5497Q6989P1436j3667j08651j46424r0839
10712F41844j0645J7094p587m1707n0259k7946j2145k1401l0413j4032K9227P8788
10700E50818J08580Q6097L8605K4207M3244N7718M5199K9130J4267Q286N557j3966
10688I97742l5332n8924o0489n0916k9792L7818J12634J34494J31629J49546J57448
10677A485858J56539J44128J05881J08008J61436J74749J23741O0932K3141L5543
10667B579956P0454P7189N0962K9848M5011R6365J34344J67245K58392L70810
10657C880576M55482N27342O00048O76068P48092P88357P31859M58906o4594o31553
$$ plain form
10735 721672 769844 782569 750494 702410 661613 611600 541139 491561 495960 528874 574479 631295
10723 631295 685295 738045 776787 797503 843000 929989 1001425 987758 879107 732683 641844
10712 641844 631199 648293 640706 598999 548740 520794 508649 487248 456835 442803 472030 550818
10700 550818 659398 745495 784100 808307 851551 909269 954468 983598 997865 1006151 1011708 997742
10688 997742 962410 903486 842997 792081 762289 800107 912741 1047235 1178864 1328410 1485858
10677 1485858 1642397 1786525 1892406 2000414 2161850 2336599 2460340 2521272 2544413 2579956
10667 2579956 2650410 2727599 2778561 2808409 2853420 2949785 3084129 3251374 3509766 3880576
10657 3880576 4336058 4863400 5463448 6139516 6887608 7675965 8407824 8866730 8802136 8170583
10647H170583r76421j047244r46878p77695o31395n41201m85435m40758l82743
10638A940813l05962k41793k15619k16400j82730j18222n6242j2179r8K3943M2425
10627F57936J2504m0741p8490p8626m6036p813Q791J3144K1874L4040L1599k4559
10615E03623j25888j70136j04038m345N5882P7289P9088O1105M2055L5435K5606
10604D75676M1281R5128J44451J55877J45022J38169J36788J34088J41271J58949
10594A766700J84096K34333K69945K29709R3312p6258j91017k32594k29012k09080
10584A840134j68533o8532P3619J73196J73021Q4221m7160j49067j92053j76464
10574A542382j45962j47455j32610j02485r9484r4806p6474q5468j00589q8937
$$ plain form
10647 8170583 7194162 6146918 5200040 4422345 3790950 3249749 2764314 2323556 1940813
10638 1940813 1634851 1393058 1177439 961039 778309 660087 603845 591666 591568 615511 657936
10627 657936 670440 629699 551209 472583 426547 418734 427525 440669 462543 496583 528182 503623
10615 503623 377735 207599 103561 99216 155098 232387 311475 372580 414635 450070 475676
10604 475676 516957 612085 756536 912413 1057435 1195604 1332392 1466480 1607751 1766700
10594 1766700 1950796 2185129 2455074 2684783 2778095 2701837 2510820 2278226 2049214 1840134
10584 1840134 1671601 1603069 1676688 1849884 2022905 2107126 2059966 1910899 1718846 1542382
10574 1542382 1396420 1248965 1116355 1013870 914386 819580 743106 657638 557049 468112
10564D68112p1371n5074l1582L006J7632J0971O52o978J787K4582J7808k0019
10552C59526l1664l5725n2668n8170n2353k2944J7970J4876j1347n265J9511N549
10540A47296n5773j06334j18415j20428j05031l7195L8606O8514O9978P3748R1272
10529e3762Q8693O0407N0550L3705j8373o8037o6106k1183K0901M7407O7859O0024
10517B02085M122n4897p7685o2335l1775P031L9754K5340j7955m3891m4843j4006
10505f9055J4958J3611L526j689j1576l6271o2291n9505l4065K940K5481L7457
10493a76479O4166Q2461N3302J1844K3346N8922N5498J9980o627j7897j1849K7298
10481A83965O4959P2280K9480m6595q5317p6796o8891p7204p1328m2253k5598
$$ plain form
10564 468112 396741 341667 310085 313091 330723 341694 342346 335368 337155 361737 379545 359526
10552 359526 327862 292137 239469 181299 128946 106002 123972 138848 127501 122236 141747 147296
10540 147296 91523 -14811 -133226 -253654 -358685 -395880 -357274 -288760 -218782 -145034 -53762
10529 -53762 34931 95338 145888 179593 161220 93183 27077 5894 26795 74202 142061 202085
10517 202085 206207 151310 73625 11290 -20485 -13454 26300 51640 33685 -10206 -55049 -69055
10505 -69055 -54097 -40486 -36960 -38649 -50225 -86496 -148787 -208292 -242357 -239417 -213936 -176479
10493 -176479 -112313 -29852 23450 35294 58640 117562 173060 193040 186413 168516 156667 183965
10481 183965 248924 321204 350684 304089 218772 141976 73085 -4119 -75447 -117700 -143298
10470a43298k9925k6254j1110J6291M0007J4249m8817q0954p0681m6846l6548
10459d23886l5730m4209m8660l1502R486N9645R2575J25035J48069J22915N9576
10448C3314l233k8381k4942k1481j9777r912J662j858j0656k4J7185J1409k9597
10435h6291p8070r0984m5601L1866O9804M6331m523l2984N881O1890M1884j7168
10423i7965l4314k0461O601K9109K5029K4013N0345O5720J8134l8565n1820n9028
10411h3202q5948r4581l9502M2511P3599O3041O0821N5814L2281N843j2107p626
10399A0944L676P22M145M2588P5484O5959M4984J4471k9364o0789p8215j06976
10387a2371j21803j00534n6190l5200l7083k0493q67m439j9061k9663m0715l6757
$$ plain form
10470 -143298 -173223 -199477 -210587 -194296 -154289 -140040 -188857 -269811 -340492 -387338 -423886
10459 -423886 -459616 -503825 -552485 -583987 -574501 -514856 -422281 -297246 -149177 -26262 33314
10448 33314 30081 1700 -23242 -44723 -64500 -74412 -72750 -74608 -85264 -85288 -68103 -56694 -86291
10435 -86291 -164361 -255345 -300946 -269080 -199276 -152945 -157468 -190452 -184571 -122681 -80797 -97965
10423 -97965 -132279 -152740 -146139 -117030 -92001 -67988 -17643 48077 66211 27646 -24174 -83202
10411 -83202 -169150 -263731 -303233 -260722 -187123 -124082 -63261 -7447 24834 30677 18570 10944
10399 10944 14620 15342 19487 62075 137559 203518 248502 262973 233609 172820 94605 -12371
10387 -12371 -134174 -234708 -290898 -326098 -363181 -383674 -384541 -388980 -408041 -437704 -478419 -515176
10375e15176r606L1582O6523Q3145Q7901M7502k3486m6336j2803M0199P1681M2952
10363a35922P804Q554N192j1310r610J5046J2703j9498m8191m7070l8236m1474
10351c02012k6463K8170R0088Q7377M8379J8874j8076o0781q4479j04207j02081
10340d25211n5189K270M7572P4480N7939J1061j6366k0539k1827j7588l4380m5141
10328d42919k4228O513L7054O8992P6051P0523P1368M4101j0948n3020n6465p999
10316b20977N1580N9425L3735J5389r542n5940q0188m5684L2962Q9807O7044J6366
10304d6023n067k2035j4025K4111K7583j2363o0968r5073r5114r4407j24502j25886
10292f43769m9276N9107J47072J76666J37711Q1469M7020J1901l0858n5264o4770
$$ plain form
10375 -515176 -524782 -493200 -426677 -343532 -255631 -208129 -231615 -277951 -290754 -250555 -178874 -135922
10363 -135922 -128118 -119564 -114372 -125682 -135292 -120246 -107543 -127041 -175232 -222302 -260538 -302012
10351 -302012 -328475 -300305 -210217 -122840 -74461 -55587 -73663 -134444 -218923 -323130 -425211
10340 -425211 -480400 -478130 -430558 -356078 -298139 -287078 -303444 -323983 -345810 -363398 -397778 -442919
10328 -442919 -467147 -460634 -423580 -354588 -278537 -208014 -136646 -92545 -103493 -156513 -212978 -220977
10316 -220977 -169397 -109972 -76237 -60848 -70390 -126330 -206518 -252202 -219240 -129433 -62389 -46023
10304 -46023 -51090 -73125 -87150 -63039 -35456 -47819 -108787 -203860 -298974 -393381 -517883 -643769
10292 -643769 -693045 -633938 -486866 -310200 -172489 -91020 -44000 -32099 -62957 -118221 -182991
10281a82991r6122j36668j33841q6268m149Q0813J31157J31018Q2404L1942J1343
10270a71362m541l7341n2629n4325k9591M4395J27002J48213J23220O7917j8057
10259A42901q3513j02164j15821j31174j01040m5197j0379J4077K5647J8320J2467
10248c75876K988j2706j7301j9700q867L20j0419L737M8235O6420M2456n532o2099
10235c48344r4360p2423M502O1303O3293O4316Q0602Q0059N9238L5554K9498J9587
10223a7175j197k0204n1752o4258m7052k3435M294M1976Q9308R8171M5227J1430
10211F5333O472j6955l1871r787K550j3203m4649q4935q8623n3427j0725J7155
10199b62665K8902M1144R1897J41302J26529N4479k3215o0808p5345o6815k1381
$$ plain form
10281 -182991 -279113 -415781 -549622 -635890 -640039 -559226 -428069 -297051 -214647 -182705 -171362
10270 -171362 -175903 -213244 -265873 -320198 -349789 -305394 -178392 -30179 93041 160958 142901
10259 142901 59388 -42776 -158597 -289771 -390811 -436008 -446387 -432310 -406663 -388343 -375876
10248 -375876 -372888 -385594 -402895 -422595 -431462 -431142 -441561 -437824 -389589 -323169 -280713 -286245 -348344
10235 -348344 -442704 -515127 -510625 -449322 -386029 -321713 -241111 -161052 -101814 -66260 -36762 -17175
10223 -17175 -18372 -38576 -90328 -154586 -201638 -225073 -220779 -178803 -89495 8676 53903 65333
10211 65333 71805 54850 22979 13192 15742 2539 -42110 -127045 -215668 -269095 -279820 -262665
10199 -262665 -233763 -192619 -100722 40580 167109 221588 198373 137565 62220 -4595 -25976
10188b5976K6173M9088L4104l38k6362l9519m1040n648L6564L1582N909J1517
10176E6054L2351L2169J8401k8982q7499r1369m9391l9888o7009n7873j7618O268
10164b94386r052k4337N807N4791J06305J54343J51817Q7823J9927n035k6914
10153B21089n3641n2257l6429k1290k8215l1979L028K9265K6588L9651Q1749J11944
10141B89503O8500l5885j13512j21361r3872p4857o7422n5220k5003M3457J11180
10130g4492J33431J15316O1666k1730p9299p9524k7818M2287P0621K0741n4282
10119A06917o7865m1173l4304l1695j4419j671p403l7247o9380n5809k4024j6593
10107b94666Q771O5404P5774M029j05198j70250j42755o2642L9616J40849J76900
$$ plain form
10188 -25976 197 49285 83389 83051 56689 17170 -23870 -29518 7046 38628 44537 56054
10176 56054 88405 120574 138975 109993 22494 -68875 -118266 -158154 -225163 -283036 -300654 -294386
10164 -294386 -303438 -327775 -321968 -267177 -160872 -6529 145288 233111 253038 248003 221089
10153 221089 167448 115191 78762 57472 29257 -2722 306 29571 56159 95810 177559 289503
10141 289503 358003 322118 208606 87245 -6627 -81484 -148906 -204126 -229129 -185672 -74492
10130 -74492 58939 174255 235921 214191 134892 55368 27550 69837 140458 161199 106917
10119 106917 39052 -2121 -36425 -68120 -82539 -84210 -91613 -128860 -198240 -254049 -278073 -294666
10107 -294666 -285895 -220491 -144717 -140688 -245886 -416136 -558891 -621533 -581917 -441068 -264168
10096b64168J29856N6029J3680L4689Q2319P4965K8798M761q504k0881j9394k4641
10084H7509m5645l5796K9346R3457J28757J27649P8016P225m0381m9276o8639
10073C12222j13197j18742l6752O7251R3550N4558L078n8042j05943j14305q0194
10062i6516m4571l7489m0153k7225N816L4353M4160O2381P3251M9100L4985M7746
10050A05838M0156l683m2925m7311k5641J5239M3531L4878k395m0471n9917k8649
10038a1350L0923L2038j0809l4090m0557n4553n5775j7767L2715O6870P2077M6338
10026E6060K8939j116l3009j7581P476J0612L2422N1629K7489m571k9861n3613
10014G4876o4560m5265P126N7902N7404L1298L1062L4550K262l1568N6O8070R4353
$$ plain form
10096 -264168 -134312 -78283 -64603 -29914 52405 127370 156168 160929 152425 131544 112150 87509
10084 87509 41864 6068 35414 128871 257628 385277 463293 470518 430137 380861 312222
10073 312222 199025 80283 43531 110782 204332 258890 261968 203926 97983 -16322 -96516
10062 -96516 -141087 -178576 -218729 -245954 -240138 -205785 -161625 -99244 -25993 23107 58092 105838
10050 105838 145994 142311 99386 52075 26434 41673 85204 120082 117687 77216 17299 -11350
10038 -11350 19573 51611 40802 6712 -33845 -88398 -144173 -161940 -129225 -62355 9722 56060
10026 56060 84999 83883 50874 33293 40769 51381 83803 135432 162921 158350 128489 74876
10014 74876 10316 -34949 -27823 30079 87483 118781 149843 184393 186655 155087 155143 223213 317566
10001C17566M8484l8679q5751p7156l9924j2562p001K442R224l09P776N4533P4301
9988B52944M0635j5440n6879n7078k8025j9140m5247o4938o0555l9889j5453l689
9976a12754J0178K3672K9559J5176j6638n1634r9425j02868m3932K6681N6645
9965b65340N5671O6497O6870L1522n638j4486k9585m5531k0857K944k4258n9507
9953b41698l0173L5748O3720M4172J0631l072K425N148j7751m5581m6855k3730
9941b47016n247j236q088p449R425J5482K6083N4583M8802Q462j7466Q6L1725
9928i1854L8431L2467K1902J5863P110j6669m6082o8121m4065P756J9320m108
9916a28050j0486k2557n5588n4361J196O1239P7644L6755m0989q5855m6051R313
$$ plain form
10001 317566 366050 327371 241620 164464 124540 111978 104977 107419 116643 116334 124110 178643 252944
9988 252944 293579 278139 221260 164182 136157 117017 71770 6832 -53723 -93612 -109065 -112754
9976 -112754 -102576 -78904 -49345 -34169 -50807 -102441 -201866 -304734 -348666 -321985 -265340
9965 -265340 -209669 -143172 -76302 -44780 -50418 -64904 -94489 -140020 -160877 -157933 -182191 -241698
9953 -241698 -271871 -236123 -172403 -128231 -117600 -120672 -118247 -113099 -130850 -176431 -223286 -247016
9941 -247016 -252263 -253499 -261587 -269036 -259611 -244129 -218046 -163463 -114661 -106199 -123665 -123579 -91854
9928 -91854 -53423 -20956 946 16809 23919 7250 -38832 -106953 -151018 -143262 -123942 -128050
9916 -128050 -138536 -161093 -216681 -271042 -269846 -208607 -130963 -94208 -135197 -221052 -267103 -257790
9904b57790J8876L9467P4374Q1875N0891P060j2961j91L1352N4079N3438M1467
9892A81937J5003j3113j5590J2025O0147N3837k9683r1295r4817n1195J3117L8381
9880G8754K9848L3334K4832m315n560K1022L9983L4192K4931K6520J3053j5221
9868C01373l656J5524J52p997N762J2207j7252q3853j43896j30656o2115q315
9856a22722K3184M3568N6684N2954K0831k0015m3000l4299l918K0499J5536n549
9844C753n2402r8362p7443j5706M550k6670n0302k0852K4599O0234R6737J12982
9832c8882Q5894L3600q734l1471l8566k5248K3879R0116J05174N6978j9043o7691
9820A66006q3611p2308k5336P46n48k9156o7449n0712J9212P4092Q4916P8526
$$ plain form
9904 -257790 -238914 -199447 -125073 -43198 7693 14753 1792 1601 32953 87032 140470 181937
9892 181937 196940 183827 168237 180262 240409 294246 264563 173268 78451 27256 40373 78754
9880 78754 108602 141936 166768 162453 156893 177915 217898 252090 277021 303541 316594 301373
9868 301373 297717 313241 313393 305396 311158 323365 306113 222260 78364 -52292 -114407 -122722
9856 -122722 -99538 -55970 714 53668 74499 54484 11484 -22815 -26733 -6234 9302 3753
9844 3753 -48649 -147011 -224454 -240160 -235610 -262280 -312582 -333434 -308835 -248601 -151864 -38882
9832 -38882 47012 80612 71878 40407 1841 -23407 472 90588 195762 252740 233697 166006
9820 166006 82395 10087 -15249 -14503 -15051 -44207 -111656 -162368 -143156 -69064 15852 94378
9808I4378N0633J3611j4477l6679o5828j13915j39378j25025r5869o7890k4754
9797e25193J1056J6450L4227O3665N9264N2129Q6272J22734J00682K1561n6440
9786a3593j00682j12168j08244r8571o6443k8625M684M0758P3980Q1102O8195
9775b59607O2389N8129L9383n03l3907l6286j5056o603j3522q862j231k142J2011
9762b05807N0560Q2598P6404L4686K3588M5716L0559k2995q1639j06810q9702
9751a62842m9312l2696m2312k6128L1659Q0241Q6820P3554N7697L9075K4946L2331
9739A13033P9698J15891Q7049N479j01693j60692j26104n0916n205Q377J5537
9728a9546K5907L6067L0893k0640p8115q1533m1500n256j1832k9086k6762j8943
$$ plain form
9808 94378 145011 158622 144145 107466 41638 -72277 -211655 -336680 -432549 -500439 -525193
9797 -525193 -514137 -497687 -463460 -399795 -340531 -288402 -202130 -79396 21286 42847 -13593
9786 -13593 -114275 -226443 -334687 -433258 -499701 -528326 -523642 -482884 -408904 -327802 -259607
9775 -259607 -197218 -139089 -99706 -100209 -134116 -170402 -185458 -192061 -205583 -214445 -215676 -217818 -205807
9762 -205807 -155247 -72649 3755 38441 62029 107745 138304 115309 33670 -73140 -162842
9751 -162842 -212154 -244850 -287162 -313290 -281631 -201390 -114570 -41016 16681 55756 80702 113033
9739 113033 192731 308622 395671 401150 299457 138765 12661 -38255 -43460 -35083 -19546
9728 -19546 6361 42428 73321 52681 -25434 -106967 -148467 -153723 -165555 -194641 -221403 -240346
9716b40346O56K9424M5800M6431K4847O270L225O867K7899O0792P6266N4148J7755
9703A60034p249l463K8828M8880K3006j5129j9998m095j7874n1448p1376o9653
9691D63l1929j2693k5398k1309j2001k1544l9041l4692j9042r265l3970p6396
9679c36817q5146m6189o514K1626O7811R9497P6077M8508L7206J5311p837j8692
9667a35159l7190q1946q9800p3631o5414m4705k4183j7579m865o68j6141k2521
9655f13802K0774Q9633J06544N9798n777k4654K1642P4925R6414Q2551M0435k0158
9643g1675p1293o2460l1812k7663k4719O345L9164M5948M2024L3953L8473M4476
9631c9239M5526L7939J8626L448k8539p8215j00706p7889k3945J9616J8040o363
$$ plain form
9716 -240346 -239690 -210266 -164466 -118035 -93188 -86918 -83693 -76826 -48927 11865 88131 142279 160034
9703 160034 152785 149322 178150 227030 250036 234907 214909 210814 192940 141492 70116 463
9691 463 -31466 -44159 -69557 -90866 -102867 -124411 -163452 -198144 -217186 -226451 -260421 -336817
9679 -336817 -421963 -468152 -474666 -453040 -385229 -285732 -209655 -161147 -123941 -108630 -116467 -135159
9667 -135159 -172349 -254295 -344095 -417726 -483140 -527845 -552028 -569607 -574472 -575140 -591281 -613802
9655 -613802 -593028 -503395 -396851 -337053 -342830 -367484 -345842 -270917 -174503 -91952 -51517 -71675
9643 -71675 -142968 -205428 -237240 -264903 -289622 -283277 -244113 -198165 -156141 -122188 -83715 -39239
9631 -39239 6287 44226 62852 66300 37761 -40454 -141160 -219049 -242994 -223378 -205338 -211701
9619b11701n2275j11021j33512r9100k7678M4151R5011J28389J06601N1259J0960
9608a98916k3295l3850M643O4275P9160K3033o5404j17386r4702l4717K4211N7219
9596c15729M3924J8468n679l0958r961L9573N5025K5245j7322j7142K839j3168
9584b24885l6921l4079j1846K9918P4922Q3015M5980j198l5560m2814j9086L4610
9572a37944O7120K9117l2673n9115n1573k1022J1010L2546N9290P1621L8745J0833
9560A7955L8333O5020L8319j3336p835M6732N8600L1160Q793j2286l0006l5499
9548B05950j6856K626o100k1492l5811m2035j4845K6239N2487L4739k1820o0423
9536A02659n9161n9043p2535o4220l4211m1896j01213j22358n0933M5959R2348
$$ plain form
9619 -211701 -263976 -374997 -508509 -607609 -635287 -591136 -496125 -367736 -261135 -209876 -198916
9608 -198916 -222211 -256061 -251418 -187143 -107983 -84950 -150354 -267740 -362442 -397159 -372948 -315729
9596 -315729 -271805 -253337 -259016 -289974 -299935 -260362 -205337 -180092 -197414 -214556 -211717 -224885
9584 -224885 -261806 -295885 -307731 -277813 -202891 -119876 -73896 -75094 -110654 -153468 -172554 -137944
9572 -137944 -70824 -41707 -74380 -133495 -185068 -206090 -195080 -162534 -103244 -31623 7122 17955
9560 17955 56288 121308 159627 146291 138456 185188 243788 274948 283741 271455 241449 205950
9548 205950 189094 191720 185620 164128 128317 86282 71437 97676 150163 184902 163082 102659
9536 102659 43498 -15545 -88080 -152300 -186511 -228407 -329620 -451978 -502911 -456952 -364604
9525c64604P8136L4315P122n518k8802m6226l7373j1523J0196K3340M5430M5796
9513b49711K3598M660l1555q0414q9992n7439j8754K0563N6471O7570N3853L2919
9501b68231L8179O1130O3343N9553Q2300J16347J09238O8648J1693m4585p5901
9490B21714p6420m7940j4915J8287O8015R2821N3139j6268o4185q7230p9888n9236
9478G894m3870k7267p265m168j2690n552j3749n4624o1389j2197L0118J6720l6248
9465b24287m9928R604O9351O1868R510k9228q657K7720K7004K5891O9420R5085
9453H3353N7593J2358k4284q8406j41797r9782J2426P4262M8765J2916L1118O5648
9441D4170N5486J1336k1718k8891k3399j9737J693O3165J05781N4820k6953l9299
$$ plain form
9525 -364604 -286468 -252153 -245031 -250549 -279351 -325577 -362950 -374473 -364277 -340937 -295507 -249711
9513 -249711 -226113 -221453 -253008 -333422 -423414 -480853 -499607 -479044 -422573 -355003 -301150 -268231
9501 -268231 -230052 -168922 -105579 -46026 36274 152621 261859 330507 342200 297615 221714
9490 221714 145294 97354 82439 100726 168741 261562 314701 298433 234248 147018 67130 7894
9478 7894 -35976 -63243 -70508 -74676 -87366 -92918 -106667 -161291 -222680 -234877 -204759 -188039 -224287
9465 -224287 -274215 -264611 -195260 -133392 -123882 -153110 -161767 -134047 -107043 -81152 -11732 83353
9453 83353 140946 153304 129020 40614 -101183 -200965 -188539 -114277 -65512 -52596 -21478 44170
9441 44170 99656 110992 89274 60383 36984 17247 18940 82105 187886 242706 215753 176454
9429A76454J1366P5241Q4433L1479j4947k5654m005J1808J20k6009m2380l7263
9417B40643k6064j5290j986j2639n5866q9731q2394l2229R606J2671o906j2739
9405g2924K847J1484P149M099K864K096J7515L9824P618m7281n9524m6884k5507
9392a56624N73m667j7342l511K9877O6571O3217K2944k1830m7272n1319l9671
9380a59054m600J5186l0858r1881r5494m8269Q476M8748O1213N1534M6686N0743
9368a47570L8535p072n2042p5134o6854k3678n484m2441o4524m6179j2141M4923
9356d59661Q9695Q3922O5031P3531Q1458N4421k459m7665n1698l6016j9148j6797
9344a85386j7688J3820O0100O8496L4092o933j1624J9961M2838N9045P8155P7248
$$ plain form
9429 176454 187820 263061 347494 378973 364026 338372 334367 346175 346295 320286 277906 240643
9417 240643 214579 199289 197303 184664 128798 39067 -43327 -75556 -65950 -53279 -60185 -72924
9405 -72924 -70077 -58593 -51444 -47345 -44481 -42385 -24870 14954 22572 -24709 -84233 -131117 -156624
9392 -156624 -156051 -160718 -178060 -181571 -151694 -85123 -21906 1038 -20792 -68064 -119383 -159054
9380 -159054 -163654 -148468 -179326 -271207 -366701 -414970 -406494 -357746 -296533 -244999 -198313 -147570
9368 -147570 -109035 -116107 -168149 -243283 -310137 -333815 -339299 -381740 -446264 -492443 -504584 -459661
9356 -459661 -369966 -286044 -221013 -147482 -66024 -11603 -14062 -61727 -113425 -149441 -168589 -185386
9344 -185386 -203074 -189254 -129154 -60658 -26566 -33499 -45123 -25162 17676 76721 154876 232124
9332B32124M5585j0522m8701m0897m4595r7624j17800p1682k9302j5768O263M1839
9320a51080O9193O8098J5407n3157n5111J1415N1954L0011j4909k7968J3318P2874
9308C0045Q7898N3073j7977q4044q8251o2585m2170j8855j6192m5317o8105n7089
9296c29569m4634n0346m3730n708N3301J16753J42133J04462M2447P992O496R601
9284I198J2704M3067R6147J05244N9242L070l2750n7730r8859j41574j51276j11776
9272b65293n6578K830O2259Q9351R0373Q2976M6354q119l8819m6381l9070k4219
9260a04336j7849k1971k7316j4977J1258L2449O0560Q9185R9269Q4945M2258Q152
9248B41627k1001n4102o5469m4370K425L1230K6315J9267K2284K9671M7392M9566
$$ plain form
9332 232124 277709 267187 218486 177589 132994 35370 -82430 -154112 -183414 -199182 -192919 -151080
9320 -151080 -81887 -13789 1618 -51539 -106650 -95235 -43281 -13270 -28179 -56147 -42829 30045
9308 30045 117943 171016 153039 68995 -19256 -81841 -124011 -142866 -159058 -204375 -272480 -329569
9296 -329569 -374203 -424549 -468279 -473987 -420686 -303933 -161800 -57338 -14891 -6899 -403 9198
9284 9198 21902 64969 161116 266360 325602 328672 295922 238192 139333 -2241 -153517 -265293
9272 -265293 -321871 -319041 -256782 -167431 -77058 5918 52272 44153 5334 -41047 -80117 -104336
9260 -104336 -122185 -144156 -171472 -186449 -175191 -142742 -82182 7003 106272 191217 233475 241627
9248 241627 220626 166524 101055 56685 59110 90340 116655 135922 158206 187877 235269 284835
9236B84835q823q6243j06561r2106j06530r5586l4077K8869O8995P0868M9111
9225b7248K0026k0358m1159k7544o677K5488O2240R2207R6323O3194K1445l782
9213B54155m1309q1899r7808j04673p6591R465J06041J53907J51956J15669M8887
9202D37800j2634l0069k8305m0166n7958p6189j20551j41713r2121l4444K1023
9191a75327Q5432R7597O8772P4016R1865N0453n218j4516j6Q058K881l005J426
9178B82418j6383n2160n5133j7432K5064M8703N9911O0133O6966M4743j7082n7376
9166C72372m1021J999K4201J4012n116j4706J510K8078M9487M9774L858n5340
9154D29108j01275j12862r9091q1369r9841j29563j02882k5054N6282J06220J27144
$$ plain form
9236 284835 276012 189769 83208 -8898 -115428 -211014 -245091 -216222 -147227 -76359 -27248
9225 -27248 -7222 -27580 -68739 -96283 -102960 -77472 -15232 76975 173298 236492 257937 254155
9213 254155 212846 130947 33139 -71534 -148125 -138660 -32619 121288 273244 388913 437800
9202 437800 425166 395097 366792 326626 268668 192479 71928 -69785 -161906 -196350 -175327
9191 -175327 -89895 7702 76474 150490 242355 292808 287590 273074 273058 281116 283997 280992 282418
9178 282418 266035 213875 158742 141310 166374 215077 274988 335121 402087 446830 429748 372372
9166 372372 331351 333350 357551 371563 366447 351741 353251 381329 430816 480590 484448 429108
9154 429108 327833 214971 115880 34511 -65330 -194893 -297775 -322829 -266547 -160327 -33183
9143c3183J15758P8073N2701M2915L9301K8930J5439J6684L7775P3946Q4067O0908
9131F13314P6714J24576J26871O1681k3887p9547j05257r9178p6393o1823o5968
9120D91103o1498m8793m7434o2607r4328j21928j02409n1099k1250j3450l403
9109a37096R760L1598N0066L8104j198l618M8549R4521J05456Q0927K1889l9014
9097B99944p3045p7031o9860m8468k8320l2263n0238n5471k7662K1207O7146J00457
9085B6396Q7808L4349p006j2668j0908k7433k3173K3460M5649J9440j4167l3941
9073A07806m3692n6961n4630p914O4806J14266J06050N4442J6569K8759N8450
9062C87951O8599O3039N1521K7310P035L1964Q0825J21799J04331M1699j1154
$$ plain form
9143 -33183 82575 160648 213349 256264 295565 324495 339934 356618 394393 468339 552406 613314
9131 613314 690028 814604 941475 1003156 979269 899722 794465 695287 618894 557071 491103
9120 491103 429605 380812 333378 270771 176443 54515 -47894 -98993 -120243 -133693 -137096
9109 -137096 -127336 -95738 -45672 -7568 -8766 -12384 36165 130686 236142 317069 338958 299944
9097 299944 226899 149868 80008 31540 3220 -29043 -79281 -134752 -162414 -141207 -74061 26396
9085 26396 114204 148553 141547 128879 117971 90538 67365 90825 136474 155914 141747 107806
9073 107806 64114 7153 -47477 -55391 9415 123681 229731 284173 300742 329501 387951
9062 387951 456550 519589 571110 598420 605455 637419 718244 840043 944374 986073 974919
9051I74919m4131l3371J2240L1469l370m0403n6109p1609p2605p9918j08389j27424
9039C81299j31197j15535o9884j7840J6146L3412N2859N9790L8054K2392L9239
9028C08735M1782J320m9092n5511j6657M76n0652j09378p9692j1660K1336J608
9016B615l0173l6734m7427o0456m0759J1158N6591Q9396J25361J37335Q0368k1564
9004B65711q5483o5700J0155P9482J10260Q5741J4340o8566j22082j25368o8276
8993C0214M5418J50638J57659Q5023J6728l1737q3103j26591j18626o5976k9049
8982C0598k3453k2215j6261J9321N3724L3266k5812q2668r0445m3793n415R567
8970a63586K9551N3829Q8510J05898O5541j332j9830K0924P3551J01521J18400
$$ plain form
9051 974919 930788 897417 909657 941126 937756 897353 841244 769635 697030 617112 508723 381299
9039 381299 250102 134567 64683 46843 62989 96401 149260 209050 247104 269496 308735
9028 308735 350517 351837 302745 247234 230577 231053 180401 71023 -8669 -20329 1007 2615
9016 2615 -27558 -64292 -111719 -172175 -212934 -201776 -145185 -55789 69572 206907 287275 265711
9004 265711 180228 114528 124683 204165 314425 400166 414506 345940 223858 98490 30214
8993 30214 75632 226270 383929 468952 485680 453943 370840 244249 125623 59647 30598
8982 30598 7145 -15070 -31331 -12010 41714 74980 49168 -33500 -123945 -167738 -173153 -163586
8970 -163586 -134035 -80206 8304 114202 179743 178411 158581 179505 253056 354577 472977
8959D72977J36879J32849J16863R1980N1177Q623n0139q5745p1346m4967m5028
8948G14123n4002n6916o9793n3135k4010l1079n4867q2523j16598j24045q4445
8937c7290k3297K5232O3124Q5333M5932m2097j01682j02966o0935j480L5125L8883
8925g6118L3885K3485J833q227M80P949L173l1392n9214m9521j2597L3656O6640
8912f5968Q0144P3246M7687j465o1552q3058o7530k7771Q949L5448Q1064J12158
8900A31352P8104n656p6161p8591l2027N870J0337J5430J4561j7536l5412j5098
8888d827Q456J5479N009j2607j0921P730K1365L7160N1823L8370J6722m099L804
8875A73464P2196J30947Q7557l1178r4147n1079j390j5688m1010r117K8780L0844
$$ plain form
8959 472977 609856 742705 859568 951548 1002725 1011348 961209 875464 804118 759151 714123
8948 714123 660121 603205 533412 480277 456267 425188 370321 287798 171200 47155 -37290
8937 -37290 -60587 -35355 27769 113102 159034 116937 15255 -87711 -148646 -150126 -115001 -76118
8925 -76118 -42233 -18748 -16915 -25142 -24662 -16713 -13540 -44932 -104146 -153667 -166264 -132608 -65968
8912 -65968 14176 87422 135109 133644 72092 -10966 -78496 -106267 -97318 -61870 19194 131352
8900 131352 209456 203800 127639 49048 17021 22891 33228 48658 63219 45683 10271 -4827
8888 -4827 3629 19108 24117 11510 589 8319 29684 66844 118667 157037 173759 169660 173464
8875 173464 245660 376607 464164 432986 338839 287760 286370 270682 229672 220555 249335 280179
8863B80179O124L814O1792R4422M7556j0701k5903m380K7373N0943O2631O6805
8851F60655N2837K5094J7691M5441R5172J16917Q7525N4959K1771l3253o0151
8840A084658k3577J4111J969k7596l1360l2829p0267j11987p8178K4103P9970
8829H29017M7688k8528j01226j27668j00485m7749j1373j6635m1988m6428k2251
8818C32374j80L507j0893j1446j3573o6354j43724j80247j58274r8859m4084r618
8806d01371K7793N4201L8552L20j335M9998R4126Q9755M4828Q387J8685M0066
8794F4005N9348O5594K8823j5469l5923n6644o1060l4302J7906O8262Q0760N2155
8782B33455K4689K7991P1282J05500Q0651M4531K7263K4455J5840Q716J6174M3834
$$ plain form
8863 280179 286303 290117 351909 446331 493887 483186 457283 452903 480276 531219 593850 660655
8851 660655 713492 738586 756277 801718 896890 1013807 1101332 1156291 1178062 1144809 1084658
8840 1084658 1061081 1075192 1077161 1049565 1018205 985376 915109 803122 724944 749047 829017
8829 829017 876705 848177 746951 619283 518798 471049 459676 443041 401053 354625 332374
8818 332374 332194 335701 324808 313362 299789 233435 89711 -90536 -248810 -347669 -391753 -401371
8806 -401371 -373578 -319377 -280825 -280505 -281840 -231842 -137716 -47961 -3133 5254 23939 64005
8794 64005 123353 188947 217770 202301 166378 109734 48674 14372 32278 100540 181300 233455
8782 233455 258144 286135 357417 462917 543568 588099 615362 639817 655657 664373 680547 724381
8770G24381O7116N2563L7819L0260P782k7626p3813j05397r4416m9644J4478P0121
8758F53624R2211P5657K2720o188K1015J2636o1391j06305p1621j2329O188L577
8746F29794j1141m3690n0887j1079J4057j4820p0363j18532j21761j01890p4713
8735B4975l4248J0500N6889O9412K9628k1026k4206j6108m8394p4716m9037j2327
8723h8658k202j3655l3867k6050L4847R1311R7161P0160M4649L3352K8201M7459
8711B82708P6284P0292K3968l7253p5450o5689k7014L94J6341K9057J7778j7094
8699B94322n0736n2150j9076n029k6601l4241k9475m1059m8112l3124K112K6515
8687a6654J0136j5622r402K4603K6506J1598J0003J2614K0829K6357M0962N8946
$$ plain form
8770 724381 791497 844060 881879 912139 919921 892295 818482 713085 618669 569025 583503 653624
8758 653624 745835 821492 844212 838024 859039 871675 810284 703979 632358 620029 626217 629794
8746 629794 618653 574963 524076 512997 527054 512234 441871 323339 201578 99688 24975
8735 24975 -9273 1227 58116 127528 157156 136130 111924 95816 47422 -27294 -76331 -88658
8723 -88658 -90860 -104515 -138382 -164432 -129585 -38274 58887 129047 173696 207048 235249 282708
8711 282708 358992 429284 453252 415999 340549 274860 247846 248240 264581 293638 311416 294322
8699 294322 243586 191436 172360 167331 140730 106489 77014 35955 -12157 -45281 -43169 -16654
8687 -16654 -6518 -22140 -31542 -6939 19567 31165 41168 53782 74611 100968 141930 200876
8675B00876O1889M4891L2695L3189K2364j3812m7711l5707n180k1209p3477r8991
8663I9817q1963m1155J1894O3026Q4253O6941M2877L1040J9275o847l1881k3309
8651B33968J1166J4006j8526m2509m2184n2082p5668q6979p5961l1902L8971J05998
8639b1702J42962J27724O5478l917m5683m5260q823O982m4898j06586j18962p5809
8627a28494r026J0160K522K1665L1717K5716L9029N7672O0071O5374P3222P5447
8615C25075P5635P8903P8217Q1154O4167K0873p835O785M3184L6531r207p0387
8603G23095j17018j24972j01621o4633k3000Q199Q857j7990n0461o6351m7677
8592A26428k08J5918l2570p8356o3717k3344j3892k6006p153N4396J15293J38546
$$ plain form
8675 200876 262765 307656 340351 373540 395904 382092 334381 298674 293494 272285 198808 99817
8663 99817 17854 -23301 -11407 51619 135872 202813 245690 276730 296005 289158 257277 233968
8651 233968 245134 259140 240614 198105 155921 103839 28171 -58808 -134769 -166671 -127700 -21702
8639 -21702 121260 248984 314462 310545 264862 219602 210779 217761 172863 66277 -52685 -128494
8627 -128494 -137520 -127360 -124838 -103173 -71456 -45740 -6711 50961 111032 176406 249628 325075
8615 325075 400710 479613 557830 638984 703151 724024 716189 722974 766158 802689 793482 723095
8603 723095 606077 481105 379484 314851 291851 300050 308907 290917 240456 174105 126428
8592 126428 126220 142138 109568 31212 -32505 -55849 -69741 -95747 -102900 -48504 66789 205335
8580B05335J43842J14063M1850j4374j3516K6721N8890M8774K713l0090l3220
8569E50988m3465p2540q1435n5397m4696m7474k7453n828k2102m7917m3924k4534
8557C4223q460n107k7104m2719o884M2026N9744P0156P4734O4711M7286M7851
8545C50457N8824M5439L9569N0587K8660j0721j4659L285M36k1578k1152J5273
8533E24420M1228J0761m647M4393O5034R092o1419p0742k1581R396j4016m7623
8521D84296l4270o134j7354l2198k6181J066L1471J7347j9471n1689q4600j01147
8509A61136n0450K4193M0751L6712M7370O4055O3872L0205k1218m8370k9147Q015
8497C27124K4774J9512m389n4954j15635j42030j16822l1936P9570J42597J09454
$$ plain form
8580 205335 349177 463240 505090 490716 477200 503921 562811 611585 614298 584208 550988
8569 550988 507523 434983 353548 298151 253455 205981 178528 172700 150598 102681 58757 34223
8557 34223 25763 20656 -6448 -49167 -56051 -14025 45719 115875 190609 255320 302606 350457
8545 350457 409281 454720 494289 544876 573536 562815 548156 551441 551877 530299 509147 524420
8533 524420 565648 576409 571762 616155 681189 690281 628862 558120 536539 545935 531919 484296
8521 484296 450026 443892 426538 394340 368159 369225 400696 418043 398572 346883 262283 161136
8509 161136 110686 134879 175630 212342 259712 323767 387639 417844 396626 348256 319109 327124
8497 327124 351898 371410 367021 312067 196432 54402 -62420 -94356 -14786 127811 237265
8486B37265J1713n7251n6175k3666P466L9926N2435L8517J4446j1547l3506l0460
8474A89163K051J8549j836l5007m0259j4367J5314K2377J552k4700k50O0534J00143
8461B93264J13136J12206Q8574J4902p8035j08352l9033O2721J08095O8898k862
8450F33514m8167n6567n0775m1002k9293j5072K027j5871n6865p4585o3398l5683
8438A48263k6762m1162m1439l1830k0545J0594L7453J8537k5643l0942p775n246
8426a6497P259M8189Q7704R2573O5474M4390K8699K08j4618n753j0670m1662m3447
8413B41849J347M0721Q0986J12968J17629J13736J01935Q2497O0990L574r2554
8402H65678j71783j86324j45165p3074J1562P9861J11213O9958j9287o1948l2738
$$ plain form
8486 237265 248978 191727 135552 111886 119352 159278 211713 250230 264676 253129 219623 189163
8474 189163 191214 209763 207927 172920 132661 118294 133608 155985 157537 132837 132587 193121 293264
8461 293264 406400 518606 607180 622082 544047 435695 396662 459383 567478 636376 633514
8450 633514 585347 528780 478005 437003 407710 392638 394665 378794 321929 247344 183946 148263
8438 148263 121501 80339 38900 7070 -13475 -2881 34572 53109 27466 -3476 -11251 -16497
8426 -16497 -9238 38951 126655 219228 284702 329092 357791 357999 343381 337628 326958 285296 241849
8413 241849 243196 283917 364903 477871 595500 709236 811171 893668 954658 958232 865678
8402 865678 693895 507571 362406 289332 300894 380755 491968 561926 542639 480691 447953
8391D47953J4322L1434K4122Q267j2865n3813p9979m8234N657L2821L2210J5129
8379D17024R81R87M672J9472K2073r476m0329l5143L220L3357J7585k2014m9918
8366C62491l0807J1541J5868j0442l3715l5152k311J8410K091k9476n5026m4411
8354A69061Q157P9243J27211J11874N8775J0080j8805j8647j614K0341M2172P0533
8342F58381P0665K0960m7135q8541p2906j4461K3117L0592N4053J12197J49047
8331H95969J23699P3185Q978k0970K379J9627L629k6773n1657o8010o2776k4991
8319H72289J3603K2761L1875O9899J04702N6828o4135j55236j54734p5669j0983
8308G11200q371l4394n9097n9315m2287l7184l1033j1567J9596L4966J808l0763
$$ plain form
8391 447953 462275 493709 517831 526098 513233 459420 379441 331207 336864 369685 401895 417024
8379 417024 418005 418992 423664 443136 465209 455733 415404 380261 383481 416838 434423 412409 362491
8366 362491 331684 343225 359093 348651 314936 279784 277473 295883 297974 268498 213472 169061
8354 169061 177218 256461 383672 495546 554321 564401 545596 526949 525335 545676 587848 658381
8342 658381 729046 750006 702871 614330 541424 526963 550080 580672 634725 746922 895969
8331 895969 1019668 1092853 1101831 1080861 1083240 1102867 1106496 1079723 1028066 960056 897280 872289
8319 872289 885892 908653 940528 1010427 1115129 1171957 1107822 952586 797852 722183 711200
8308 711200 702829 668435 609338 550023 507736 470552 439519 427952 447548 482514 484322 453559
8296D53559O010O1291O2228L5052r008n1835l3483L0522O1971N0188K5985O94
8284F93174k0597k0862j2587k6390n6273m6226K2057Q3513Q6903P7265O7387P039
8272H54403n6979p0361l1611J0699N657m1262o7354l9189k0322j3546J7802M7447
8260E95384M9781K8233O433j5487l9976m7253k0731J6343L9409N9402N3367J5655
8248G40560j9665l1485k7960j9926M668M9060Q1771O6066L3978J7430K357j5039
8236H81815k1462k1332k6222m7057o1099k1148M9871J13668J68981J98001J80277
8225A394293J31567N3913k8457q4809j17691j20032j05762q7871p9136o4041j0699
8214H81275N4862Q0884Q7463R0563P8031L8804j2923k1492Q418M9773P4967O3315
$$ plain form
8296 453559 459569 520860 583088 618140 609132 557297 523814 554336 616307 666495 692480 693174
8284 693174 672577 651715 639128 612738 556465 510239 532296 615809 702712 779977 847364 854403
8272 854403 797424 727063 695452 706151 711808 670546 603192 564003 543681 530135 547937 595384
8260 595384 645165 673398 679831 664344 624368 577115 556384 572727 612136 671538 724905 740560
8248 740560 720895 689410 661450 641524 646192 695252 777023 843089 877067 894497 896854 881815
8236 881815 860353 839021 812799 765742 704643 683495 733366 847034 1016015 1214016 1394293
8225 1394293 1525860 1579773 1551316 1466507 1348816 1228784 1123022 1035151 956015 891974 881275
8214 881275 936137 1017021 1104484 1195047 1273078 1311882 1298959 1277467 1285885 1335658 1410625 1473940
8202A473940L3048p79l143L3561M1824J7801j4025m7663p3839o4753k2048Q318
8190A382242n471j9448L443L5420M9760M8680M1043K9367J128j0358K3254M9407
8178A628467K4443n266o928j0478l0352p1643j09296q5315k8140j9190m3852o0183
8166A182267o0568m5148k6147J0096P0090J23930J34427P5935R134j627J0838
8155A483227j7181o6224p5195m5641j5254K2913Q6580J34963J44304J37140J22276
8144A911908R5953P4079M2322j5694m8435l3459O927J9421l1430q6472q5904m5133
8132A804083L324J1418o74N837K1696K8046L0265M6402N3877N3723N4516M0107
8120B152620R710K2257P0364P1086J7162o2262j41222j77287j56200j00788l4675
$$ plain form
8202 1473940 1506988 1506209 1503066 1536627 1578451 1596252 1582227 1534564 1460725 1395972 1373924 1382242
8190 1382242 1376771 1357323 1360766 1396186 1445946 1494626 1535669 1565036 1566164 1555806 1579060 1628467
8178 1628467 1652910 1647644 1640716 1630238 1599886 1528243 1418947 1333632 1305492 1286302 1242450 1182267
8166 1182267 1121699 1076551 1050404 1060500 1130590 1254520 1388947 1464882 1474016 1472389 1483227
8155 1483227 1466046 1399822 1324627 1278986 1263732 1286645 1373225 1508188 1652492 1789632 1911908
8144 1911908 2007861 2081940 2124262 2108568 2060133 2026674 2033601 2053022 2021592 1935120 1849216 1804083
8132 1804083 1807407 1818825 1818151 1823988 1845684 1873730 1903995 1950397 2004274 2057997 2112513 2152620
8120 2152620 2162330 2184587 2254951 2326037 2343199 2280937 2139715 1962428 1806228 1705440 1670765
8109A670765L5829R1118Q4070J8075k5849o891K7270L3576K2519J1140J1796J6569
8097A989987K2369P883k2203k8697l1282m2103k8891j244Q822K4980L8083K2542
8085A960246R141J4221M975k2667l8212l3933j172L6962M9801O4042Q6379Q8319
8073B218102P9984P2173N9027M2769J0q4492j39343j01355n400Q5125J45461J80172
8061B552233J69189Q6673j9666r6736j22142j12710j10631q7281j7562O8958J03807
8050B414132J00089R0518P3858O3378M0986j8766p5836q5583o3723m6472m3088
8039B449493m5764k9271J9099L4552L5154O6811Q6959P6700O5402N7769L9526
8028B856430L0156P0392J30473J31129N6786k9546o5116n2853j5321J1420M131
$$ plain form
8109 1670765 1706594 1797712 1881782 1899857 1874008 1867117 1894387 1927963 1950482 1961622 1973418 1989987
8097 1989987 2012356 2020239 1998036 1969339 1938057 1895954 1867063 1865819 1874641 1899621 1937704 1960246
8085 1960246 1969387 1983608 1988583 1965916 1927704 1893771 1892599 1929561 1979362 2043404 2129783 2218102
8073 2218102 2298086 2370259 2429286 2472055 2472065 2387573 2248230 2146875 2141475 2226600 2372061 2552233
8061 2552233 2721422 2808095 2788429 2691693 2569551 2456841 2346210 2258929 2241367 2310325 2414132
8050 2414132 2514221 2604739 2678597 2741975 2782961 2764195 2688359 2602776 2539053 2492581 2449493
8039 2449493 2403729 2374458 2393557 2428109 2463263 2530074 2617033 2693733 2759135 2816904 2856430
8028 2856430 2886586 2956978 3087451 3218580 3275366 3245820 3180704 3127851 3112530 3123950 3128081
8017C128081j6567k5554l0997l2392j2368O790m030l0593m3747J0685R8443J29153
8005C176904J41465J80571K06611J76737J12743N5274M992k6339l2739k6870q503
7994C960846L4699J07497J45842J24767R2518Q8885J24909J79087K19347J95808
7984E274205J38898J24258J35852J54556K13895K76730K94097K94722K97806L13057
7974G518076L40967L60155L60595L66776M04844M89363O16599P40256Q37074R36387
7964A2971092J077563J259798J479461J724671J988387K293364K645670L043666
7956B8483672L448261L784290L971313L912869L509476K698468J533302J67027
7948E1508678j217054k434123l293751l732298l817548l635128l242866k745027
$$ plain form
8017 3128081 3111514 3085960 3054963 3022571 3010203 3016993 3012963 2982370 2938623 2949308 3047751 3176904
8005 3176904 3318369 3498940 3705551 3882288 3995031 4050305 4055297 4028958 3996219 3969349 3960846
7994 3960846 3995545 4103042 4248884 4373651 4466169 4555054 4679963 4859050 5078397 5274205
7984 5274205 5413103 5537361 5673213 5827769 6041664 6318394 6612491 6907213 7205019 7518076
7974 7518076 7859043 8219198 8579793 8946569 9351413 9840776 10457375 11197631 12034705 12971092
7964 12971092 14048655 15308453 16787914 18512585 20500972 22794336 25440006 28483672
7956 28483672 31931933 35716223 39687536 43600405 47109881 49808349 51341651 51508678
7948 51508678 50291624 47857501 44563750 40831452 37013904 33378776 30135910 27390883
7940B7390883k270407j881374j564302j282031j028461p97731n95985m40810l53031
7931A7176751k84545j85363q6380m915K2245j1046m1202k2101L6040J18286K13062
7920A6930832K99935L56035M23132N43673P05099R15070J130431J305867J484582
7911B4094656J723076K020510K347832K724035L166492L684567M297566M999229
7903D9057963N790766O707785P789896R046446J0363903J1494343J2154797J2020123
7895A24426022J0810713Q393744M835733N21614l890615p726951j0490204j1955750
7887A14924306j2193313j1514760j0294027q883208p520529o293825n217810m290749
7879D8716085l501977k817047k210595j674706j221729r01390p34970o78030o48225
$$ plain form
7940 27390883 25120476 23239102 21674800 20392769 19364308 18566577 17970592 17529782 17176751
7931 17176751 16892206 16706843 16620463 16615548 16637793 16626747 16585545 16563444 16599484 16717770 16930832
7920 16930832 17230767 17586802 18009934 18553607 19258706 20173776 21304207 22610074 24094656
7911 24094656 25817732 27838242 30186074 32910109 36076601 39761168 44058734 49057963
7903 49057963 54848729 61556514 69346410 78392856 88756759 100251102 112405899 124426022
7895 124426022 135236735 143630479 148466212 148987826 145097211 137370260 126880056 114924306
7887 114924306 102730993 91216233 80922206 72038998 64518469 58224644 53006834 48716085
7879 48716085 45214108 42397061 40186466 38511760 37290031 36388641 35653671 34975641 34327416
7870C4327416n97821n18186m30315l30011k04493o4225J13452L42692N87864Q41791
7860C4068164J116560J395196J635339J887402K217213K620686L082653L611957
7852E1635170M264866N083041O052850P125330Q319002R710848J1354296J3306424
7844A16851827J5537742J7954954K0406595K2585651K3979475K3889938K1634246
7837B62840428J6842335R702096J063121p794266j5545041k1144972k4143763
7830B21819938k4732956k3520264k1222450j8439453j5628402j3078220j0867220
7823I4330973q988471p399931o065728m960956m017990l209427k580270k130807
7815E4977393j796684j562825j442361j378453j311009j196967j019779p93280
$$ plain form
7870 34327416 33729595 33211409 32781094 32451083 32246590 32182365 32295817 32638509 33226373 34068164
7860 34068164 35184724 36579920 38215259 40102661 42319874 44940560 48023213 51635170
7852 51635170 55900036 60983077 67035927 74161257 82480259 92191107 103545403 116851827
7844 116851827 132389569 150344523 170751118 193336769 217316244 241206182 262840428
7837 262840428 279682763 289384859 290447980 282653714 267108673 245963701 221819938
7830 221819938 197086982 173566718 152344268 133904815 118276413 105198193 94330973
7823 94330973 85342502 77942571 71876843 66915887 62897897 59688470 57108200 54977393
7815 54977393 53180709 51617884 50175523 48797070 47486061 46289094 45269315 44476035
7807D4476035n21110k01553J34249M75306Q30293J179635J558949J983481K405808
7798E2321093K836840L348458M006643M797049N701117O735693P941670R361523
7790I7050086J1041390J3001760J5272412J7870343K0710868K3600463K6208056
7783B24755378K7918932K7905733K5374506J9851465J1544242J401141r118585
7776C29632812j8419279k5226909k8937662k9713793k8230904k5368225k1975208
7769A51760832j8631894j5604365j2974562j0771966q948261p420472o175110
7762G1234202n172352m317947l592163l004044k531946k173856j923582j715339
7754D6802973j512027j323215j113213q73067o27139l40348j4117K84315N36806
$$ plain form
7807 44476035 43954925 43753372 43887621 44362927 45193220 46372855 47931804 49915285 52321093
7798 52321093 55157933 58506391 62513034 67310083 73011200 79746893 87688563 97050086
7790 97050086 108091476 121093236 136365648 154235991 174946859 198547322 224755378
7783 224755378 252674310 280580043 305954549 325806014 337350256 338751397 329632812
7776 329632812 311213533 285986624 257048962 227335169 199104265 173736040 151760832
7769 151760832 133128938 117524573 104550011 93778045 84829784 77409312 71234202
7762 71234202 66061850 61743903 58151740 55147696 52615750 50441894 48518312 46802973
7754 46802973 45290946 43967731 42854518 41981451 41354312 41013964 40999847 41284162 41820968
7745D1820968P67590J058014J452337J884660K348945K879224L451735M043775
7737E9707248M730953N572807O600399P832239R255504J0923079J2831385J4951672
7729A32405286J7297552J9744499K1955791K3398356K3386444K1273040J6671337
7722B76132305R744388J249707p607705j5473018k1309784k4602134k5429971
7715A92703788k4324175k2007719j9167409j6269859j3598711j1339878r521273
7708G6474764q024809o746013n652438m743634m001746l396384k905413k504794
7700C8499533k170352j889623j644020j431496j254127j094198r41026p75236
7692B7299455o05124m37515k61989p3519J26208L18999N09802P40718R96246J252489
$$ plain form
7745 41820968 42588558 43646572 45098909 46983569 49332514 52211738 55663473 59707248
7737 59707248 64438201 70011008 76611407 84443646 93699150 104622229 117453614 132405286
7729 132405286 149702838 169447337 191403128 214801484 238187928 259460968 276132305
7722 276132305 285876693 287126400 279518695 264045677 242735893 218133759 192703788
7715 192703788 168379613 146371894 127204485 110934626 97335915 85996037 76474764
7708 76474764 68449955 61703942 56051504 51307870 47306124 43909740 41004327 38499533
7700 38499533 36329181 34439558 32795538 31364042 30109915 29015717 28074691 27299455
7692 27299455 26694331 26256816 25994827 25921308 26047516 26366515 26876317 27617035 28613281 29865770
7682B9865770J544378J871240K219483K630141L132579L737714M451601N279031
7674E4731937O219518P281841Q452725R662970J0763451J1474531J1476990J0486212
7666A30550175Q290402M899652O43604l832710p816898j0777262j2423943j2777256
7658I6755764j2162563j1007765r647455q286069p011807n881213m919682m137609
7650C3701601l506190k961549k507179k138563j816689j546887j347453j198645
7642A6678446j056355q95934p56959o73502o15953n30421m03600k91891k23801
7633A1230030j60581o3941N6600J40024J84958K38263L14028M00110M73368N70011
7623A3382870P01068Q47701J032756J242168J459504J712046K033800K430214
$$ plain form
7682 29865770 31410148 33281388 35500871 38131012 41263591 45001305 49452906 54731937
7674 54731937 60951455 68233296 76686021 86348991 97112442 108586973 120063963 130550175
7666 130550175 138840577 143740229 144383833 140551123 132734225 121956963 109533020 96755764
7658 96755764 84593201 73585436 63937981 55651912 48640105 42758892 37839210 33701601
7650 33701601 30195411 27233862 24726683 22588120 20771431 19224544 17877091 16678446
7642 16678446 15622091 14726157 13969198 13295696 12679743 12149322 11745722 11453831 11230030
7633 11230030 11069449 11005508 11062108 11202132 11387090 11625353 11939381 12339491 12812859 13382870
7623 13382870 14083938 14931639 15964395 17206563 18666067 20378113 22411913 24842127
7615B4842127K829295L173893L455845L641894L639784L346525K706440J684468
7607D9320271L47908j066989k315543l252452l814768m007915l899946l586009
7599B7724557l147879k688859k295327j952104j627280j363661j179897j034190
7591A2435360r12074q35932p76388p08511o43766n91641n59166n43834n07917
7582F356131m36843l78619l41412l11377k99464k98867l08877l09234k82212k38312
7572C150914j64562p8810k1813j7620o2039j38542j75370j32856p2684m4318m4965
7561B197335o5157j06338j44782j58024j69702j67927j39934j00914o7238l3542
7551A043777Q408L0620M1199M0127J1985k3372l5569l0943m6994n0933l33L3868
$$ plain form
7615 24842127 27671422 30845315 34301160 37943054 41582838 44929363 47635803 49320271
7607 49320271 49668179 48601190 46285647 43033195 39218427 35210512 31310566 27724557
7599 27724557 24576678 21887819 19592492 17640388 16013108 14649447 13469550 12435360
7591 12435360 11523286 10687354 9910966 9202455 8558689 7967048 7407882 6864048 6356131
7582 6356131 5919288 5540669 5199257 4887880 4588416 4289549 3980672 3671438 3389226 3150914
7572 3150914 2986352 2907542 2885729 2868109 2806070 2667528 2492158 2359302 2286618 2242300 2197335
7561 2197335 2132178 2025840 1881058 1723034 1553332 1385405 1245471 1144557 1077319 1043777
7551 1043777 1052185 1082805 1124004 1164131 1176116 1152744 1117175 1086232 1039238 988305 987972 1021840
7539A021840J4874k3541o7048r6408r5736p5050n6746n2804n2849l2078k0695
7528D63759l4248k9402J0500L2282p259n6021o4255l7396p171L3730Q6288J01659
7516D92466P8709M3317o001o4544j05765r3575n2678m8164n7739l7846n511L8061
7504A80730R9891J26041R0087N2958M2457J4311k3100r309M6514O1439J5630l7400
7492F60249n8398l9638p403N473k723p950j039J449r705k8929m8611r0947j31289
7479B40539j04764l3744J1073L7162O8329O6112L8470K1919Q741k7754m7303k995
7467B75785M5069N7966O8407P7964P6771N9408J6108k3503k3464O330L6690Q3347
7455G56878J41874J76194J85893J45997N6013l1347p6140q3758p3888o9453o7698
$$ plain form
7539 1021840 1036714 1013173 946125 849717 753981 678931 622185 569381 516532 484454 463759
7528 463759 429511 400109 410609 442891 435632 379611 315356 277960 270789 304519 390807 492466
7516 492466 571175 614492 608491 543947 438182 344607 291929 243765 186026 148180 142669 180730
7504 180730 280621 406662 496749 549707 592164 606475 583375 574066 620580 682019 697649 660249
7492 660249 601851 562213 554810 560283 557560 549610 548571 550020 540315 511386 462775 371828 240539
7479 240539 135775 102031 113104 150266 218595 284707 323177 345096 353837 326083 278780 275785
7467 275785 320854 378820 447227 525191 601962 661370 677478 653975 630511 636841 673531 756878
7455 756878 898752 1074946 1260839 1406836 1462849 1431502 1355362 1271604 1197716 1128263 1060565
7444A060565p4690p3721l6284J1437J2007m2718q6527j12207j38121j10237j2831
7433C96673Q0731J33576J67182J53330N9528j7914J0681P1817O0215j0036o1869
7422A043914o4435n2690n6263o4999o3359n7187m7358l4484l1402k8703j8004
7411E25030j3501k8754l9814j2803J1372K772o622k312R352K9304L4507J4699
7399E23230l850k254J2840K0783J4156J0072Q200Q012J2482K3992P503o3743j32680
7386D38743j37366q1249q922K5517K1604J4599o741p2555j32901j13739k1896
7375g4906O4860O7440K389m6268l3441J391L1145M9011L9369j197j9811L2565
7363A12547R4721J02790N5230J752k7333n8412r6197j21339j25424q2315Q452
$$ plain form
7444 1060565 985875 912154 875870 887307 899314 856596 770069 657862 519741 409504 396673
7433 396673 477404 610980 778162 931492 991020 973106 983787 1055604 1115819 1105783 1043914
7422 1043914 979479 926789 870526 805527 742168 684981 637623 603139 571737 543034 525030
7411 525030 511529 482775 442961 430158 441530 444302 437680 435368 444720 474024 508531 523230
7399 523230 519380 517126 529966 550749 564905 574977 583177 591189 603671 627663 635166 571423 438743
7386 438743 301377 220128 211206 236723 258327 272926 266185 193630 60729 -53010 -74906
7375 -74906 -10046 57394 59783 13515 -19926 -18535 12610 61621 100990 99793 79982 112547
7363 112547 207268 310058 365288 367040 339707 281295 185098 63759 -61665 -143980 -135528
7352a35528P2404O4602O673n1436n5328J1034R7040J50538J45962J05480O1296
7341D72737J7549p209O347K2018J0537j7596m8327p0949p3903q0797q3629o7636
7329G9142n2556l3186J1189N5289M9374O197l2430m2003m2360l6721N884N5406
7317B3225O9866P4285P1738N2559N2936O2337L6848l477m5765j01799j28421r1791
7305G2541l7561j4009j0612P489K4464k39k7575p453L1448N8390P1692O1829J2073
7292B42477l7237l6074J934L3105L2452K5125K992m6293o7335o4432o9338m5858
7280b8482K5892P7813N5240P196j5585j6215j6677j7689l824j91k3443l8678l0059
7267b4702O85M1188Q2531J05303Q8248L5153l3863q2014r2202o0913j3851m340
$$ plain form
7352 -135528 -63124 1478 8151 -43285 -98613 -87579 9461 159999 305961 411441 472737
7341 472737 490286 483077 489424 511442 521979 504383 456056 385107 311204 230407 146778 79142
7329 79142 26586 -6600 4589 59878 109252 115449 83019 41016 -1344 -38065 -32181 23225
7317 23225 93091 167376 239114 291673 344609 406946 443794 440317 394552 292753 164332 72541
7305 72541 34980 20971 10359 17848 42312 42073 14498 7045 38493 96883 168575 230404 242477
7292 242477 205240 169166 171100 204205 236657 261782 264774 218481 151146 86714 17376 -28482
7280 -28482 -2590 75223 130463 137659 122074 105859 89182 71493 67669 67478 44035 5357 -24702
7267 -24702 -24017 17171 99702 205005 293253 328406 294543 212529 120327 59414 45563 41223
7255D1223j0287R788K4390L0575M5365K9625j7443n2823p9116q9738l3802Q3984
7243a8259J52619J19212O0690L6033K5969J7180K129k7055l3718Q142N5222M7516
7231D45680j4449q4325r9481o0210k3155m0068q8913j05164r5128o9705q976N9112
7219a84782O3324M4349N0989M7594J8722j7292l8308p895N2033P3004N7065L4708
7207A93511L1042P0926J07843O5819j0010m3046l5523k7994j5128L0646P5882
7196D43968J01128J13176R7095J0921j09272j67330j26178n3152m019K0461l525
7185C23273l9044l1541j839m823m6856q6514r4376o7546l0453J1671M1555M0443
7173A3950N1626Q1123R3343Q7084Q0443O5444L6960p405n3722n6342l7636k9053
$$ plain form
7255 41223 30936 40724 65114 95689 141054 170679 153236 100413 21297 -68441 -102243 -18259
7243 -18259 134360 253572 314262 350295 376264 393444 395573 368518 334800 342942 398164 445680
7231 445680 431231 346906 247425 187215 164060 123992 35079 -70085 -165213 -234918 -243894 -184782
7219 -184782 -121458 -77109 -26120 21474 40196 22904 -15404 -23299 28734 101738 158803 193511
7207 193511 224553 295479 403322 469141 459131 416085 380562 352568 337440 368086 443968
7196 443968 545096 658272 755367 766288 657016 489686 363508 310356 306337 326798 323273
7185 323273 284229 252688 250849 246026 199170 112656 18280 -49266 -79719 -68048 -26493 13950
7173 13950 65576 146699 240042 327126 407569 473013 509973 502568 448846 392504 354868 325815
7161C25815k2800l9950o8499p0861n7095j6661N2746N3897k4831p1265n0036l631
7149F829L0123L5919Q782k0029k6563o598J4022n365l4435l7008j3564K6185M3614
7136B1912K5329J9938L1998J8848Q356L2564L6991k8350r3646p7346l383O3106
7124E6317P5272K5980m5588o8634m0877K021L2448K2352j4417k1131J2653K9574
7112F5970J5789j0864l7287l6386k7047j8812K2080Q8123J29271J04554M554r9999
7100A99946j20994o9183N986M5283K7712J6114K1207J982l1124q6757j51992j48548
7088b90368n6004L7343Q1943P6955K9764q822k2353k2377j9124k2950k3038j6526
7076b55557l6568m7073k066O2664P4257L2587k150k5763m1725m4824n3764m6250
$$ plain form
7161 325815 303015 263065 194566 123705 66610 49949 102695 156592 131761 60496 10460 6829
7149 6829 36952 72871 81653 61624 35061 28463 42485 37120 2685 -34323 -47887 -21702 21912
7136 21912 47241 67179 99177 118025 126381 158945 195936 167586 73940 -3406 -6789 56317
7124 56317 131589 157569 111981 43347 2470 4491 36939 59291 44874 23743 36396 65970
7112 65970 81759 70895 33608 -2778 -29825 -48637 -26557 61566 190837 295391 299945 199946
7100 199946 78952 9769 15755 61038 88750 104864 126071 128053 96929 10172 -141820 -290368
7088 -290368 -346372 -309029 -227086 -150131 -120367 -129189 -151542 -173919 -193043 -215993 -239031 -255557
7076 -255557 -292125 -339198 -341264 -278600 -204343 -171756 -173906 -199669 -241394 -286218 -339982 -386232
7064c86232J933O7708J08797J14624Q5550J8840k0460N709K5980k2713p7729o3771
7052a41764j1117N0318R2524R8626R8918Q4506M1807l081k8047l1155l3824l4455
7040A83256l4247l6904l0696n183K4784L4444J5505p390l221o343j7772r240J030
7027A08023m931l0619l6995j1928M752m957j106K6943L3077K410j8425K630J2395
7014H1269m451m134p44j6709l3617k8918n716J8291L9240P4323J02004Q9725N9537
7001C70100N2149M5658J7382j9053k9616k46K4772M5014O7169O0076N795n6783
6989E82417q1817o0012k9712j5012J2032O5245J15685J18907O1992j0586o0610
6978F98529p2096p1204q7955j03131r0193m5930J0874M2355M1699J7053j2001
$$ plain form
7064 -386232 -384299 -316591 -207794 -93170 -7620 11220 -9240 -3531 22449 -264 -77993 -141764
7052 -141764 -152881 -102563 -10039 88587 187505 272011 313818 310737 282690 251535 217711 183256
7040 183256 149009 112105 81409 76226 101010 135454 150959 143569 140348 134005 116233 106993 108023
7027 108023 103092 72473 35478 23550 28302 23345 22239 49182 82259 84669 66244 68874 81269
7014 81269 76818 72684 71940 55231 21614 -7304 -13020 5271 44511 118834 220838 310563 370100
7001 370100 422249 467907 485289 466236 436620 436374 461146 506160 573329 633405 639200 582417
6989 582417 500600 440588 410876 395864 407896 473141 588826 707733 769725 759139 698529
6978 698529 626433 555229 467274 364143 273950 228020 238894 281249 322948 340001 328000
6967C28000j5331J4825L9240M0853L8805M8212P4493R8148J01183P6495M1780
6956H86703J3569q800J389M2990O8861Q2350Q1033P1436O4302N8720P0752J14188
6944A547493J32744R9669O2164L2427N163N930L7210O1185N1869J5616l6958o8436
6932A946076m0820K2933P5457R6529J04283Q9796L2459k5992l3698L343K5008
6921B295374j4693o2121q4895j25300j61752j62819j21811n0587p093j2066l6050
6910A456187m4887l0190j6318k7899n6646q2628j02827r4599o2236o1047o7945
6899H08965n7815m3717k9969k5223k2297l5177q0701j19444j18599q4915m3640
6888A47468j7326k2847n6036o7501k9146Q455K5657M1636M9332J2725m2191o4143
$$ plain form
6967 328000 312669 327494 366734 407587 446392 494604 569097 667245 768428 844923 886703
6956 886703 900272 891472 892861 935851 1004712 1087062 1168095 1239531 1303833 1362553 1433305 1547493
6944 1547493 1680237 1779906 1842070 1874497 1879660 1885590 1922800 1983985 2035854 2051470 2014512 1946076
6932 1946076 1905256 1928189 2003646 2100175 2204458 2294254 2326713 2300721 2267023 2270366 2295374
6921 2295374 2280681 2218560 2133665 2008365 1846613 1683794 1561983 1511396 1504303 1492237 1456187
6910 1456187 1411300 1381110 1364792 1336893 1280247 1197619 1094792 1000193 937957 876910 808965
6899 808965 751150 707433 677464 652241 629944 594767 514066 394622 276023 191108 147468
6888 147468 130142 107295 51259 -16242 -45388 -36933 -11276 30360 79692 92417 50226 -13917
6876a3917m1910l466M3337Q1871O9208K5840J326J7710K8616N020m295J8285Q431
6863B36056n7822q8904n9609l9886n1655l8039K695J2082p841k2428k7478k2571
6851a65400j1283Q315M0594M7983k224n2979n1466r161L7050N4103K9433k0923
6839i5958n7631n3888j0943L4404O6413P6597O2377L6954L0561L5444j567m9249
6827G3514l2751J0556R972k8624m5179j2856L3174O5132O8783O1808O8177M2179
6815C13885j5770m3908m0720m9301o8063o6882m7855k2234M447j7728n9843m5844
6803a59816o855L3734O5755M4069K899j4387k3813l4429k3555K2866M2039j5393
6791f6886q3033q5023k2696O1680J08790P6033j2021p6136n2824K3327O7550O6023
$$ plain form
6876 -13917 -55827 -59293 -15956 65915 135123 160963 162289 179999 208615 213635 209340 227625 236056
6863 236056 178234 89330 29721 -10165 -61820 -99859 -97164 -85082 -92923 -115351 -142829 -165400
6851 -165400 -176683 -168368 -127774 -79791 -82015 -134994 -186460 -195621 -158571 -104468 -75035 -95958
6839 -95958 -153589 -207477 -218420 -184016 -117603 -41006 21371 58325 88886 124330 122763 73514
6827 73514 40763 51319 61291 32667 -12512 -25368 7806 72938 141721 203529 271706 313885
6815 313885 298115 254207 213487 164186 96123 29241 -18614 -40848 -36401 -54129 -113972 -159816
6803 -159816 -166671 -132937 -67182 -23113 -20214 -34601 -58414 -92843 -116398 -93532 -51493 -66886
6791 -66886 -149919 -234942 -257638 -195958 -87168 -11135 -23156 -99292 -152116 -128789 -61239 4784
6779D784M0675J8475N153P393L04l4413o6108n6685o971L2323L7347K8200J7067
6766B7544K0553L9456L5871J0578Q79r327l8985o1035n5893l8378k6398k4871
6754a20006m3747m8882k831O5467J01571R8855Q1752N6421J1536l7376n9695o3774
6742C9291n7869k8993J5511M4713L3859N408j9599l1300p388Q304j1417k3930
6730c3410l568N3515P9451L9578K932N164K1185M206k6579j8559Q419J5783p324
6717A40793l1556k3905J0730K7676R145l2640p3249r0381q0749m7289J0463J00725
6705h0237J84693J94471J33232O2751M0588M5679N2895P8885J09017J42269J46945
6694A111188J22732J04350P7995L2701J4787O4001J39402J61434J09236N8783
$$ plain form
6779 4784 45459 63934 69087 76480 76784 42371 -23737 -80422 -87393 -55070 -17723 10477 27544
6766 27544 48097 87553 123424 134002 134881 125554 86569 25534 -30359 -68737 -95135 -120006
6754 -120006 -163753 -212635 -215466 -149999 -48428 50427 132179 188600 200136 162760 103065 39291
6742 39291 -18578 -47571 -32060 12653 46512 51920 32321 1021 -6367 1937 -9480 -33410
6730 -33410 -36978 16537 95988 135566 138498 143662 164847 169053 142474 123915 132334 148117 140793
6717 140793 109237 85332 96062 123738 132883 100243 26994 -63387 -144136 -191425 -180962 -80237
6705 -80237 104456 298927 432159 494910 535498 581177 634072 712957 821974 964243 1111188
6694 1111188 1233920 1338270 1416265 1448966 1463753 1527754 1667156 1828590 1937826 1996609
6684A996609N5687O0807M8981L6254M1204P1826J10452J31535J63737K29301K98425
6673C244818L62054M05224L93256L20816K21017J21622J4680j16139k46050l27118
6663D394180l37520k61141j55377j04506j07070j31452j70499k19781k65566k79383
6653B361885k73140k69305k30661j43493p7824o8747o3972n0774l5122j7066p484
6642A124297J682L2378M1102k261m0375l5891j2316j5055n1392p3453q0471p6506
6630H11739m7105l2816o1677j03838j06264j12210j27136o8717K6817Q1182Q4601
6619C44576P2728N4164K1588R047K0597R035k9984n6376m8959k774M4628P4350
6607E12620O9944J4797p0968j47980j98105k13381j57063m6183N7377O7801j1342
$$ plain form
6684 1996609 2052296 2113103 2162084 2198338 2239542 2311368 2421820 2553355 2717092 2946393 3244818
6673 3244818 3606872 4012096 4405352 4726168 4947185 5068807 5083487 4967348 4721298 4394180
6663 4394180 4056660 3795519 3640142 3535636 3428566 3297114 3126615 2906834 2641268 2361885
6653 2361885 2088745 1819440 1588779 1445286 1367462 1298715 1234743 1183969 1148847 1131781 1124297
6642 1124297 1125979 1158357 1199459 1197198 1156823 1120932 1108616 1093561 1042169 968716 888245 811739
6630 811739 764634 731818 670141 566303 460039 347829 220693 151976 178793 259975 344576
6619 344576 417304 471468 493056 502103 522700 531735 501751 445375 396416 393642 438270 512620
6607 512620 582564 597361 526393 378413 180308 -33073 -190136 -236319 -178942 -111141 -122483
6596a22483p2211o6231j3395L0349N0069P3202R3070P7992K3121m016m61q257
6584F0749k5459l4189k6448k7809l6276l416N3904O8876K9436l867K638J7928
6572G6067J5485K646o779m433j7478m1304m5069j7432J7434J1748j9125l2584
6560f0824k2164k3556n6754r5292j04849o3290q35K8567m090n4847n4994p918
6548e20846L7319O0874Q2574J19762J21462P2899K9643K7527J9112m5907r5535
6537i1116p1737l0713O13L6238O4762R8364J18050J01210P5795N9790K8279j9167
6525C70368n9340q4966j06281j03783m8169J0561M7129Q2703J13935J02265L0516
6514C54938m5892q8657q0810l2033L523j1833l1885r380J4633K5186L8376L7879
$$ plain form
6596 -122483 -194694 -260925 -274320 -243971 -193902 -120700 -27630 50362 73483 69467 69006 60749
6584 60749 35290 1101 -25347 -53156 -89432 -92848 -38944 29932 59368 55501 58139 76067
6572 76067 91552 94198 87419 82986 65508 24204 -20865 -38297 -20863 -9115 -28240 -60824
6560 -60824 -82988 -106544 -163298 -258590 -363439 -426729 -427564 -398997 -403087 -457934 -512928 -520846
6548 -520846 -483527 -422653 -340079 -220317 -98855 -25956 3687 31214 50326 4419 -91116
6537 -91116 -162853 -193566 -192953 -156715 -91953 6411 124461 225671 301466 361256 389535 370368
6525 370368 311028 226062 119781 15998 -32171 -21610 25519 108222 222157 324422 354938
6514 354938 309046 220389 139579 107546 111069 99236 67351 57971 72604 97790 136166 174045
6502A74045K5436J1303k4642o9464q6813p0714j4848P9163J48451J25856K6903
6491C24676n7254o1641j7415J4726J1637n928j7193j0058M110k5350p3764o9150
6479A7396k3942R03j6199m4873n8337o1373l7602K3242N8751N3555K9915m290
6467f2854k4971k924N8213J27871J49116Q7567J708n1382p1248p0789n2397l7129
6455E0781j2671L6250P6918P7905M6307R398k6690m8266n9074o8028o9280l7583
6443b4033J5582O7596R2319Q5806O8384M4134K0593q853l3392l5618l5052l5367
6431B22099l9625n2383p1972j02130j12302o6463L975N3613N4395L9092N6002
6420a5699O4688L3820L31J4051N6365O7669M2792K7283P463n2068r9793j04986
$$ plain form
6502 174045 199481 210784 186142 116678 29865 -40849 -55697 23466 171917 297773 324676
6491 324676 267422 205781 188366 203092 214729 208801 191608 181550 185660 160310 86546 17396
6479 17396 -6546 -5643 -21842 -66715 -125052 -186425 -224027 -200785 -142034 -88479 -58564 -62854
6467 -62854 -87825 -90749 -32536 95335 244451 332018 333726 282344 211096 140307 87910 50781
6455 50781 38110 74360 151278 229183 275490 284888 258198 209932 150858 82830 13550 -24033
6443 -24033 -8451 59145 151464 237270 305654 349788 370381 361528 328136 292518 257466 222099
6431 222099 182474 130091 58119 -44011 -156313 -222776 -218801 -165188 -110793 -71701 -15699
6420 -15699 48989 82809 83140 97191 153556 221225 264017 291300 298763 246695 146902 41916
6408D1916r1691o1531k317N2644O0656M3577K4965P744p443j8222j7217J0154
6396D3235M4868N4347N9614M1727j2472l8249j4118K3865L6152Q411k9988o3264
6384A54128q3736q7063o4700j026P0514J16313J23419R8614Q4541P6610O2662
6373E50276M2103J5651j7769n7004q6729j08200j13431q9360l3855L4118Q2288
6362B18088P9789K8768j6550k7234l5221m7410l5412p178O266K0255M0438K1996
6350B46595k6415m4917k659M8194N9880L4540j0628m1688l5041n007L0079M1265
6338B94198L7068M7431L9828K6936O5718J40553J65511R4684J8294R659M5509
6327I85389R9484J22071J10378R7820P4534O2502R8238J26437R8144L4475m106
$$ plain form
6408 41916 -49775 -111306 -113623 -60979 -323 43254 68219 75963 68520 50298 33081 43235
6396 43235 88103 142450 202064 243791 231319 193070 178952 202817 238969 247380 217392 154128
6384 154128 70392 -16671 -81371 -82397 -11883 104430 227849 326463 411004 487614 550276
6373 550276 592379 608030 590261 533257 446528 338328 224897 135537 101682 135800 218088
6362 218088 297877 326645 310095 282861 247640 200230 164818 157640 163906 184161 224599 246595
6350 246595 220180 175263 172604 220798 280678 315218 304590 262902 227861 222854 252933 294198
6338 294198 331266 378697 418525 445461 511179 651732 817243 911927 930221 939880 985389
6327 985389 1084873 1206944 1317322 1415142 1489676 1552178 1650416 1776853 1874997 1909472 1905366
6316A905366K9844J04585J29665P1871j1911n6131m2747l2840o8278j17960j21857
6305A789607p1366j6128K8959N6096M5848K9395M9878Q9327Q1841L3272J0357
6294B127086J3297J3705J0754J8872L4812L5504K5995K5929L1543R095o1271j35510
6282B149811j92744k31319k17733j56527q6182m6937o5272r8699p3148J5906R0531
6271A087687J03548P9422N0843L4981L5351K9910r054m8280n4597m7883n4947
6260A206981n4116j7603M2553P6649N8944L3596K9556L7927N6082N2432n333p3632
6248A444036j06156p0747J9557P5529N8384M987m7847p5357r5191r7651q9776
6237A019768j17028j40147j11935o9452p8065j15404j29521j06870o5645r945
$$ plain form
6316 1905366 1935210 2039795 2169460 2241331 2229420 2173289 2130542 2097702 2029424 1911464 1789607
6305 1789607 1718241 1702113 1731072 1787168 1833016 1862411 1912289 2001616 2083457 2116729 2127086
6294 2127086 2140383 2154088 2164842 2183714 2218526 2254030 2280025 2305954 2337497 2346592 2285321 2149811
6282 2149811 1957067 1725748 1508015 1351488 1265306 1218369 1153097 1054398 981250 997156 1087687
6271 1087687 1191235 1270657 1321500 1356481 1391832 1421742 1412688 1364408 1309811 1261928 1206981
6260 1206981 1152865 1135262 1177815 1254464 1313408 1347004 1376560 1414487 1470569 1523001 1517668 1444036
6248 1444036 1337880 1267133 1286690 1362219 1420603 1425590 1377743 1302386 1207195 1109544 1019768
6237 1019768 902740 762593 650658 581206 503141 387737 258216 151346 85701 75756
6227G5756N4455P4436N2549M0631K8660l163L323N0312P4321M8146j5139p9113
6215D05174r6974m1619L3014N6542M8954N3897O2387O9654P7036O8442L6964L495
6203G76966l9692r9181j33567j18349o5616n464L5284N4327O5453O0286J0211
6192E40658n5437p9709m0311K0208N7465P5346O4648L5370j3594p7382j04098
6181D23164p7502m5295m2753o3159r3644j05237p6055m3429j5941J4318L4793
6170i0740M2203L4610L1534N2596O6839M7036L8393N2501P2562J04260J22574
6159E74368J00865M4499k1081o2905p5105p1844o1451l7286N494K4152J408l2227
6147C88887m3008k6132j9248l6515n0165k8393O239L1447M2644J4235l3730l8678
$$ plain form
6227 75756 130211 204647 257196 297827 326487 323324 326647 376959 451280 499426 484287 405174
6215 405174 308200 266581 299595 356137 405091 458988 521375 591029 668065 736507 773471 776966
6203 776966 737274 638093 504526 386177 320561 315097 350381 404708 470161 530447 540658
6192 540658 485221 405512 365201 385409 442874 518220 582868 618238 604644 527262 423164
6181 423164 345662 300367 257614 194455 100811 -4426 -80481 -123910 -139851 -125533 -90740
6170 -90740 -48537 -13927 17607 70203 137042 184078 222471 274972 347534 451794 574368
6159 574368 675233 719732 698651 635746 560641 488797 427346 390060 395554 419706 421114 388887
6147 388887 345879 319747 300499 263984 213819 185426 191665 223112 265756 279991 246261 207583
6135B07583M836N2805P3336M1953j152j7168l5102m8417j9908N406K117m948l4513
6122B26828n9717k8454K5804M3001L470j0312J4165J6323K582r265j4835j6806
6110A92784r496J1632M0211M7511L7312N0124Q0348P4438L4329j3773p1316r6707
6098C77397p6708l7561l381K5259P3088R3538P2355O2574Q5987J13170Q6140L5376
6086I07234J0380K1215M4943M7283L4034L5643M4222K3625j0465j7612j2914l1313
6074A096275l1358m437l0154o9121m5784q932j1644j1294K0349N8458P4981M3934
6062A081273j2508m3956k3117J3294L3378J4715l8256p0933o1537m5104m6607
6051H00642l0192l925j1025o1653r8496p2846j1284K5445L185m3753p3614p6783
$$ plain form
6135 207583 212419 265224 338560 380513 379361 362193 327091 278674 258766 264172 266289 261341 226828
6122 226828 167111 138657 164461 207462 210932 200620 214785 231108 233690 224425 209590 192784
6110 192784 183288 194920 235131 282642 319954 370078 450426 524864 559193 545420 474104 377397
6098 377397 300689 263128 259747 285006 358094 451632 523987 586561 672548 785718 871858 907234
6086 907234 917614 938829 983772 1031055 1065089 1100732 1144954 1168579 1158114 1140502 1127588 1096275
6074 1096275 1064917 1060480 1030326 961205 915421 906489 894845 883551 903900 962358 1037339 1081273
6062 1081273 1068765 1024809 1001692 1014986 1048364 1063079 1024823 953890 892353 847249 800642
6051 800642 770450 766525 755500 693847 595351 522505 511221 536666 539851 496098 422484 345701
6039C45701m6692n574J0833M956n195j1433l0915p9449j04140n1613J0287L2443
6027F9209L1800J3635J208K1319N1259N7971L2983j7163n9154q1600p0936j1435
6015C9096O5466R8981Q7612O8047M1934L058l7590n1087j5327L4594M2456J3242
6003C90482l279J5742J3354j0963O917N3700P3817O3018M9697L4509J962n1141
5991F37815q4202p7820m3634j2268j434K0072L8077K2607j7240l5495r726L9389
5979D76141N3398j276n8307n4206K68N4726N9244K0481j7994j7009j082J4521
5967E28905M7538M3498j5121k3155M2860J06264J20920P5500j0437p4685q5159
5956G56928m8301p392r470n4568j07508j31520j16279j13681j43140j42844j08263
$$ plain form
6039 345701 299009 293435 304268 309224 304029 292596 261681 182232 78092 26479 36766 69209
6027 69209 101009 114644 115852 137171 188430 246401 279384 262221 203067 121467 50531 39096
6015 39096 104562 203543 291155 359202 401136 404194 366604 315517 300190 334784 377240 390482
6003 390482 387203 402945 416299 405336 412253 465953 539770 602788 652485 686994 688956 637815
5991 637815 553613 475793 432159 419891 418457 438529 476606 499213 481973 446478 436752 476141
5979 476141 529539 528263 469956 415750 416018 470744 529988 550469 532475 515466 514384 528905
5967 528905 576443 619941 604820 581665 624525 730789 851709 927209 916772 842087 756928
5956 756928 708627 701235 691765 637197 529689 398169 281890 168209 25069 -117775 -226038
5945b26038p4548n0101j5502L3074Q5454J18257J12828P0099K1136K769P949J4226
5933I9603R876p422n1202r4132j09430q2706L215R3425J41664J50113J06855K0722
5921B80581q4390j57755j63287j19581m8985M413N280k2427j3257M3235P4492
5910b01681N4162J4311M66L2903O0612M8862J4894k1414l7770l6141j0753L7154
5898d4395O1167N2785M6799N8419M0514P909J406q207j7977k8750n4693r5087
5886A9890j11567o1623l853K710j6555l0354k9316j957O2995J06483R4660O8910
5874A00423N7180L3446r469m7154o8039p8455o9749k4445J2004Q297l2069q7143
5862b05173j00244n1499J4127M1725M2656N2174L7722K1219N5434P6560O3514
$$ plain form
5945 -226038 -300586 -350687 -366189 -333115 -247661 -129404 -16576 53523 74659 77428 85377 99603
5933 99603 109479 102057 50855 -43277 -152707 -235413 -232198 -138773 2891 153004 259859 280581
5921 280581 196191 38436 -124851 -244432 -293417 -289004 -283724 -306151 -319408 -276173 -201681
5910 -201681 -147519 -133208 -132742 -99839 -39227 9635 24529 3115 -34655 -70796 -81549 -44395
5898 -44395 16772 69557 116356 174775 215289 223198 224604 216397 198420 169670 114977 19890
5886 19890 -91677 -153300 -157153 -154443 -170998 -201352 -230668 -232625 -169630 -63147 31513 100423
5874 100423 157603 191049 181580 134426 66387 -12068 -81817 -106262 -94258 -85961 -118030 -205173
5862 -205173 -305417 -356916 -342789 -301064 -258408 -206234 -168512 -147293 -91859 -15299 48215
5851D8215M8613L8003L2534Q247l9077j01833j43707j50416j35131o4815J6936
5840d42431M1272O2563J22206J61004J51930J22247P2262J7929j7956n0581q2373
5829A58072r7344r7103r6928q6378n4888k0906J4239M1844M3273K6407q494m0996
5817b19202n2144k4582M3090J01293J13559R4706O9968N7607O2352M3527m996
5806B85178m0771n7670p1005o8275l2025J8868M8552K2173k2135k1063j3618k5218
5794B2991r817J2259J9123J4292j3469l1471p365K8798L7950K9146J7688K4695
5782A44820L5152K4490k2105o6019m8984j9265l6170p6874q6976m8898J0915M9175
5770a40739K6505l1976p0811o3441m5137l5368O9O7174J11215R5447N0535m873
$$ plain form
5851 48215 96828 134831 167365 175612 136535 34702 -109005 -259421 -394552 -459367 -442431
5840 -442431 -401159 -338596 -216390 -55386 96544 218791 291053 308982 291026 240445 158072
5829 158072 60728 -36375 -133303 -219681 -274569 -295475 -281236 -239392 -196119 -169712 -178206 -219202
5817 -219202 -271346 -295928 -252838 -151545 -37986 56720 126688 184295 246647 290174 285178
5806 285178 244407 186737 115732 47457 15432 34300 82852 105025 82890 61827 48209 22991
5794 22991 13174 25433 44556 58848 45379 13908 6543 35341 73291 102437 120125 144820
5782 144820 179972 204462 182357 116338 67354 48089 11919 -64955 -151931 -200829 -189914 -140739
5770 -140739 -114234 -146210 -217021 -280462 -325599 -360967 -360898 -293724 -182509 -87062 -36527 -41400
5758d1400m5085n2138m4831j5862N388m399j1709K4430R0295J16013O2753m5274
5746C8181j15955r1292j2670O2123R4985O7408L4724L7116K5149k1293o2330p8122
5734b1976p9589r3977j04090q1777o2096l4800K779K4326L7857O5874Q6958O8575
5722a91936J5751k4317m0956n0024o4543o4304k4237K0436L4223L9820M9650L8289
5710b62148Q670J206J9575J5536l4240q9476r1149l9929K0086M9258L0526p556
5698c79641m214L2655P0043J10851J31483R9602M4267J6295j1689l6773O940O8253
5686A48072N8359J3929p426k8015n1251o6714m8517O713L4032J7011L607J00j1226
5673F8674k8996o2639r0313n6048J7525N9974N2120M5818M8895L1314o855n4654
$$ plain form
5758 -41400 -86485 -138623 -183454 -199316 -193928 -198327 -210036 -185606 -95311 20702 83455 38181
5746 38181 -77774 -169066 -181736 -119613 -24628 42780 77504 114620 139769 118476 56146 -21976
5734 -21976 -101565 -195542 -299632 -381409 -443505 -478305 -475526 -451200 -413343 -347469 -260511 -191936
5722 -191936 -176185 -200502 -241458 -291482 -356025 -420329 -444566 -424130 -389907 -350087 -300437 -262148
5710 -262148 -253478 -252272 -232697 -217161 -251401 -340877 -432026 -471955 -451869 -402611 -372085 -379641
5698 -379641 -383855 -351200 -281157 -170306 -38823 60779 105046 121341 109652 72879 79819 148072
5686 148072 206431 220360 212934 184919 133668 66954 18437 25150 59182 76193 79800 79900 68674
5673 68674 39678 -22961 -113274 -169322 -151797 -91823 -39703 6115 55010 86324 79469 24815
5661B4815o4380l7509o367K9k7929l7297n678j099o1466j22443q7821K6545J01620
5648b98980R3059O7308L8298R772J8943N0389N6782K1323j4505j3753j1522m6681
5636b9567p7291n4439o906K0616N0632Q0227Q1263O9855O0596L3824O532j820
5624B33522j6299l3987l7925m3555m1504k7136l0154n5069n0181k5091j0873q236
5612a46488M752K6209L0329N870m4089o1282j3893L7607L4006q332m3751l7108
5600b16170J4704M1797J7921l039Q683M6723O8789M9359J6806P281N990j2713
5588D6131l4831l7613k1616j2975k6866m7569m0625j8161j4233j985L9851P8772
5576i1720O5781N564m1661n8234p1148o4411l1218k0517m3346n3323l2895l6551
$$ plain form
5661 24815 -39565 -77074 -83441 -83412 -111341 -148638 -154316 -155415 -216881 -339324 -427145 -400600 -298980
5648 -298980 -205921 -138613 -100315 -90543 -71600 -21211 35571 56894 42389 28636 17114 -29567
5636 -29567 -106858 -161297 -168203 -147587 -96955 -16728 64535 134390 194986 228810 235342 233522
5624 233522 217223 183236 145311 101756 60252 33116 2962 -52107 -102288 -127379 -138252 -146488
5612 -146488 -141736 -115527 -85198 -79328 -123417 -184699 -198592 -160985 -126979 -135311 -179062 -216170
5600 -216170 -201466 -159669 -141748 -144787 -136104 -89381 -20592 28767 45573 52854 58844 46131
5588 46131 11300 -26313 -47929 -60904 -87770 -135339 -175964 -194125 -208358 -210343 -170492 -91720
5576 -91720 -25939 -20375 -62036 -120270 -191418 -255829 -287047 -307564 -350910 -404233 -437128 -473679
5564d73679o8313n7951n574M2259L9578j4412o0954n3447p818M7300O9734O3824
5552d79453L9411R556J3589K7887L0856Q996k2042k3622j2056J1739M5894N0737
5540b98508P214m6382m8485J2426Q8140J03453O1151J3376k3136q0774j29566
5529c41091q9410K4149J13600J14579N7348J5146P000J0288K5323N4236M8453
5518C9621Q139l1374p6777j04332p1660J5742P4576N8574L1795L8937M3497R191
5506C5929l3463k8660K053K049k6003k6175R448K3206q137n5032p4348l3012L3814
5493a78331O7048O8961P8910R5179Q5615L5555m1734j07094j58580j84663j43745
5482c82879n7030o459j4722r954L9138R7855J05431M6113m1178r0916p1982m1874
$$ plain form
5564 -473679 -541992 -599943 -605517 -563258 -523680 -538092 -599046 -652493 -660311 -613011 -543277 -479453
5552 -479453 -440042 -430486 -416897 -389010 -358154 -349158 -371200 -394822 -406878 -395139 -349245 -298508
5540 -298508 -291294 -337676 -386161 -373735 -285595 -182142 -120991 -107615 -130751 -211525 -341091
5529 -341091 -430501 -406352 -292752 -178173 -120825 -105679 -98679 -88391 -63068 -8832 39621
5518 39621 47760 16386 -60391 -164723 -236383 -220641 -146065 -87491 -55696 -16759 26738 35929
5506 35929 2466 -26194 -24141 -22092 -48095 -74270 -64822 -41616 -49753 -104785 -179133 -212145 -178331
5493 -178331 -111283 -42322 36588 131767 217382 252937 211203 104109 -54471 -239134 -382879
5482 -382879 -439909 -446368 -461090 -471044 -431906 -334051 -228620 -182507 -223685 -314601 -386583 -428457
5470d28457j8720J5864J9549m06J1917K6193M190r914J1945N1262P4791M7607
5458a94179O890r018k7661o0917o8377m1230j4311k2305n9494p2066l8923J5667
5446e85924N1997N6805L3291r115l1839j3997K5050N1277O9626P9709M0958k3971
5434b56133l9982j0712Q045n121j7715m506J0136K1369K3932j3444o1793m4407
5422c90331n84J3924J2771K1951M8584P2135R1706J06768P8160P059o2922j04359
5410a05138j04657r4897j03966q2860j1549N5401Q2245P9761Q1929O5109K9104
5399a09518L2895P9059J29009J26993M6416k4245m1340n4567m4613q617l916n6365
5387G1191j03809o4207J9719N5503L4154q068l2047l6638o2044p6021l3268K1844
$$ plain form
5470 -428457 -447177 -431313 -411764 -412170 -400253 -374060 -369870 -379784 -367839 -316577 -241786 -194179
5458 -194179 -187289 -196307 -223968 -284885 -353262 -394492 -408803 -431108 -490602 -562668 -601591 -585924
5446 -585924 -533927 -477122 -443831 -452946 -484785 -498782 -473732 -422455 -352829 -273120 -232162 -256133
5434 -256133 -296115 -306827 -298782 -303903 -321618 -326124 -315988 -294619 -270687 -284131 -345924 -390331
5422 -390331 -390915 -376991 -364220 -342269 -293685 -221550 -129844 -23076 55084 62143 -779 -105138
5410 -105138 -209795 -304692 -408658 -491518 -503067 -447666 -365421 -285660 -203731 -138622 -109518
5399 -109518 -76623 2436 131445 258438 304854 280609 239269 184702 140089 131472 127556 71191
5387 71191 -32618 -96825 -77106 -21603 12551 4483 -27564 -64202 -126246 -202267 -235535 -213691
5375b13691L6141L6918M5212L7856m89m7679n8250m4765n6675q5388p8910n0389
5363d80109k1359p493r389r631J259L2345N9887P8944R8314J27293J42846R2909
5351A05816j60o7066n8915j807K9554J1451k0887j3636J4704J9028J2583p47j9121
5338A0797j1247Q016P136n433k47L7351P7155P4242J1926q4168j30720j04852
5326a10044o4341m2836j5390J9937M0657N3127N6119L6566K4523J6642k5069o2777
5314g2886m0226Q672k130n4250q3738o8724m1012k6918Q18L3246M7568M5712L0411
5301b23457J7988K0556K0016J9509J6772K3199M0812K7264k5868n7063j6920M1567
5289i5625M6826L9781N5356O0684M0204R233k726j958j2192p001L7120O9562Q0499
$$ plain form
5375 -213691 -177550 -140632 -95420 -57564 -58053 -105732 -163982 -208747 -265422 -350810 -429720 -480109
5363 -480109 -501468 -508961 -518350 -527981 -526722 -494377 -434490 -355546 -257232 -129939 12907 105816
5351 105816 105656 38590 -20325 -22132 7422 18873 -2014 -15650 -946 18082 30665 29918 10797
5338 10797 -450 7566 14702 9269 9022 46373 123528 197770 209696 125528 -5192 -110044
5326 -110044 -174385 -217221 -232611 -212674 -172017 -118890 -62771 -26205 -1682 14960 -10109 -72886
5314 -72886 -113112 -104440 -106570 -160820 -244558 -313282 -354294 -381212 -380394 -347148 -299580 -253868 -223457
5301 -223457 -205469 -184913 -164897 -145388 -128616 -105417 -64605 -37341 -63209 -120272 -137192 -95625
5289 -95625 -48799 -9018 46338 107022 147226 156459 153733 151775 139583 132582 169702 239264 319763
5276C19763J09468J34677R7082k2512j44553j89130j62336j28374j10335q2878
5266a79128m7443k5621o96M8592N5239K8835N4240J04494J31997J13562L8106
5255C22177n9769j27684j20466p3776k7574K2557M8339L2698K7154M8479O1597
5244A53732O2249M7167J3096j9593m2762k3544K3401J3962n7041j06627p5985
5233a1945q684J6477J3761P528j3710l8768m1445k1919J372J6058Q932J3571K7456
5220c1316K4721J6635R548q48l1097o9179o5911k0373K6426N6146P0727P1358
5208E6837M7639R109j244p824n5906j15125j33309r7865l3640L4294P0043O2707
5196a64284L3733L318q453j8755l6769n5428p4142o5026m1029k4280p233L0843
$$ plain form
5276 319763 429231 563908 660990 638478 493925 304795 142459 14085 -96250 -179128
5266 -179128 -226571 -252192 -252888 -204296 -149057 -120222 -65982 38512 170509 284071 322177
5255 322177 262408 134724 14258 -59518 -87092 -64535 -16196 16502 43656 92135 153732
5244 153732 215981 263148 276244 256651 213889 190345 213746 227708 170667 64040 -11945
5233 -11945 -20629 -4152 9609 17137 3427 -35341 -76786 -98705 -97333 -81275 -72343 -58772 -31316
5220 -31316 -6595 10040 19588 18740 -12357 -81536 -147447 -167820 -141394 -85248 -14521 56837
5208 56837 104476 113585 112341 104517 48611 -66514 -199823 -297688 -331328 -297034 -226991 -164284
5196 -164284 -130551 -127233 -135686 -154441 -191210 -246638 -320780 -385806 -426835 -451115 -458348 -427505
5184d27505R7560J33480Q0701j2831p0261q6166j05467j17283p6667J6142J07961
5173d60336J50357J20334K4157m7362o1754n5164l8686k472O0512R9923J07875
5162a02616R4960N3154J6767k520k303J5830Q656l8583p7233o7497m1530k9134
5150a72049j5922M4657J28189J68879J42934O6030k8144j17369j47134j22640
5140e2569q2202l0609K0422N2792N0594L0187M24k6935l8574m8226n6447l1087
5128b12230J2536L5611K5045m329l2352m3860l6241k8879k1555k0218j3503J0941
5116c29034J8923k518j620L3321M9471M3423L7759M1307L5429o778n6510p8071
5104b14898l6886N6297J11322R1360L8599j7516n7992m1962J7433K9090j5111
$$ plain form
5184 -427505 -329945 -196465 -115764 -128595 -198856 -285022 -390489 -507772 -584439 -568297 -460336
5173 -460336 -309979 -189645 -165488 -212850 -274604 -329768 -368454 -370926 -310414 -210491 -102616
5162 -102616 -7656 45498 62265 59745 57442 73272 81928 43345 -33888 -101385 -142915 -172049
5150 -172049 -187971 -143314 -15125 153754 296688 362718 334574 217205 70071 -52569
5140 -52569 -134771 -165380 -144958 -92166 -41572 -11385 -10961 -37896 -76470 -124696 -181143 -212230
5128 -212230 -199694 -164083 -139038 -143367 -175719 -219579 -255820 -284699 -306254 -326472 -339975 -329034
5116 -329034 -310111 -312629 -314249 -280928 -231457 -188034 -150275 -108968 -73539 -80317 -136827 -214898
5104 -214898 -251784 -195487 -84165 7195 45794 28278 -29714 -71676 -54243 -25153 -40264
5093d0264j7645L5809Q4096R3770N7316l507o9400j28138j31482n8165K6408N1081
5081a00121N2738N2840k216p2190r4351p8258k9706L0096M2928K7498J0406j3441
5069a73777nN5190R7815P0299j2500q0532j10635q0995k3313J8413M4031M3076
5057a52933K9678K8955K7184M138k0281j8012K6795O8851P0468N4274L1539j0381
5045A40275m9346l8106J2286N9411N0682j6809p7840q4682l1232O2312J18676
5034A45627R1038J9077m0593m4617k0959j8772k2204N252M7845N3607K7382j9623
5022B23060q8404j35102j15203p7393n6475m8162n7446p5072p7702n6848j3024
5011e77771M0786Q0792Q9406O8711L7381L7841O7282Q1290P3519M9760K1313p344
$$ plain form
5093 -40264 -57909 -22100 61996 155766 213082 209575 140175 12037 -119445 -177610 -151202 -100121
5081 -100121 -47383 5457 3241 -68949 -163300 -241558 -271264 -241168 -198240 -170742 -160336 -173777
5069 -173777 -173782 -118592 -20777 49522 37022 -43510 -154145 -235140 -258453 -240040 -196009 -152933
5057 -152933 -123255 -94300 -67116 -62978 -83259 -101271 -74476 -5625 64843 119117 150656 140275
5045 140275 90929 52823 65109 124520 175202 158393 80553 -4129 -35361 26951 145627
5034 145627 236665 255742 215149 170532 149573 130801 108597 113849 161694 215301 242683 223060
5022 223060 134656 -446 -115649 -193042 -249517 -297679 -355125 -430197 -507899 -564747 -577771
5011 -577771 -536985 -456193 -366787 -298076 -260695 -222854 -155572 -74282 -763 48997 70310 62966
4999F2966m5012n8378k7933N373M0584Q3508Q5851M0752M068j960q660m4833p6873
4986E9453o9658j1835N6210P4574N1938L7452N8831O4709J3737o5695j09000q8439
4974G2277p1165m8892K3876R9940J22577R0993N7182N8751P2264M4291q420n7652
4962D56022r8519j04909r0774r3586j13482j19224r2999l7928K9271R5771J38578
4951c1779J29575O6836l268j3524K4364N4834O8988P0073K5897n3832r9283p6995
4939A61886o47Q3975J34494J28876R9550Q9190N7272k1694q3573q9430o5064n1005
4927D43830l9848l3222n6149o1369j8153L0580M7060J3950m1045q4363j02705
4916I8566j13964j07445q1505m8935k2600k1464o529N8307J13713J23025J07532
$$ plain form
4999 62966 17954 -40424 -68357 -62984 -22400 61108 146959 187711 191779 189819 181159 136326 59453
4986 59453 -10205 -22040 34170 108744 160682 198134 256965 321674 335411 269716 160716 72277
4974 72277 1112 -47780 -23904 76036 198613 289606 346788 405539 477803 522094 513674 456022
4962 456022 357503 252594 161820 68234 -45248 -164472 -257471 -295399 -266128 -170357 -31779
4951 -31779 97796 164632 161364 147840 172204 227038 296026 366099 391996 338164 238881 161886
4939 161886 161239 245214 379708 508584 608134 697324 754596 732902 649329 559899 494835 443830
4927 443830 403982 370760 314611 253242 235089 265669 312729 326679 285634 201271 98566
4916 98566 -15398 -122843 -204348 -253283 -275883 -297347 -303876 -245569 -131856 -8831 98701
4905I8701P5911N0368J8180j7012k2662j2518J0293L0572L98n9439q8443p4441
4893I908j1720N8364N3665j4026q0676r7643n5681J544K6971R014n733O362J7369
4880h2282j511j2023o831j6885j9112j7060l7002o6353p2194n5863j7824K3734
4868c81206N0883N5911K8139M918J3484K9015N1826M0540k5840p7386o8571n918
4856b84205O0083P0866K8188J7294O2890P1108K7384m351R187M8031N3443L1500
4844A91418L1523M8212M6998L0028l955o1484q4372q3834r6816q6006k8999M3879
4832e3408Q3523P0546K0669j7122n114L410k6201m1085L136N9663M8296K0182
4820A66495J592l7062o9893p4536n4577l8183l4200k9322k1266r325J0144J6390
$$ plain form
4905 98701 174612 224980 243160 226148 203486 190968 201261 231833 232231 172792 84349 9908
4893 9908 -1812 56552 110217 96191 15515 -82128 -137809 -136265 -109294 -100280 -106013 -99651 -82282
4880 -82282 -83793 -95816 -102647 -119532 -138644 -155704 -192706 -259059 -331253 -387116 -404940 -381206
4868 -381206 -330323 -274412 -246273 -241355 -227871 -198856 -147030 -106490 -132330 -209716 -278287 -284205
4856 -284205 -224122 -153256 -125068 -107774 -44884 26224 53608 49257 58444 106475 159918 191418
4844 191418 222941 271153 318151 348179 344224 282740 198368 114534 17718 -68288 -97287 -53408
4832 -53408 30115 100661 121330 104208 99094 102504 76303 35218 38354 98017 146313 166495
4820 166495 168087 131025 61132 -13404 -67981 -106164 -140364 -169686 -190952 -200277 -190133 -173743
4808a73743l703m4636n6858l6778k8638l5477l8638j0445M5232O4729L0995j4900
4796c02860k5754J6858N1362N5980M3493K8013K1901K0769J1634j8367p3595j12225
4784b82791q5260l2863j9626m5070o8232p2756m8631q093K5677O5762P9290M3793
4772d48800K7569M5898O1710N4943L0696p912m6370m8632N322P3968Q7201L4276
4760a30131l4391o9628o5395j9918K7312K9561j1197p0248q0905j4526N4531Q9195
4748b95740J18360J32705R3055J7560j7272r332j1635n1944j04373j23313r8882
4737c50811l7905J8004K3105k3427n7760l2455R797J0560r694n58L3776M7062
4725c70306K9120M550P854L9772O3618N9291L4656K2897M2483M7262q84n8986
$$ plain form
4808 -173743 -177446 -222082 -278940 -315718 -344356 -379833 -418471 -428916 -383684 -318955 -287960 -302860
4796 -302860 -328614 -311756 -260394 -204414 -160921 -132908 -111007 -90238 -78604 -96971 -170566 -282791
4784 -282791 -368051 -400914 -420540 -465610 -533842 -606598 -655229 -663322 -637645 -571883 -492593 -448800
4772 -448800 -421231 -375333 -313623 -258680 -227984 -235896 -282266 -330898 -325576 -251608 -164407 -130131
4760 -130131 -164522 -234150 -299545 -319463 -292151 -262590 -273787 -344035 -424940 -439466 -384935 -295740
4748 -295740 -177380 -44675 48380 65940 48668 39336 27701 -24243 -128616 -251929 -350811
4737 -350811 -388716 -370712 -347607 -371034 -428794 -461249 -451452 -440892 -450586 -451144 -417368 -370306
4725 -370306 -341186 -336636 -328782 -289010 -225392 -166101 -131445 -108548 -66065 -18803 -19687 -78673
4713g8673n6993j5725n986q914J9285O1595P4006O9051O0179L8218P043k3700
4701A39386l3098k9542m9504o4823n9473o0223n9057l0695Q878M6530Q0754P6050
4689c4817K4655j7353l485L0344L3136J0246j0060J2325P2837J05853O7846J0915
4677C02442k2453n3762p1120m5732N079L6866J8348m1777q1210n5497j889L3025
4665B2320N6731R0059J27729J31496Q4281M1518K9623J7368J902L3166R0433Q9942
4653H16568N3258L6571K9427L32j9127j706J5606j2662m5727m6369m5273p0494
4641G10404o9654k1123q847l2385l9501k9692j8164k9228o1904o0474Q260R5345
4629D43037J24495R7265K8629q0856j46505j05324k4137K0266K5168L6494N0298
$$ plain form
4713 -78673 -135666 -151391 -157377 -166291 -147006 -85411 -11405 57646 117825 156043 163086 139386
4701 139386 106288 76746 27242 -37581 -97054 -157277 -216334 -247029 -238151 -191621 -110867 -34817
4689 -34817 -10162 -27515 -31000 -656 32480 42726 32666 44991 117828 223681 291527 302442
4677 302442 279989 226227 155107 109375 114454 151320 169668 127891 46681 -8816 -10705 22320
4665 22320 79051 169110 296839 428335 512616 554134 583757 601125 603027 636193 726626 816568
4653 816568 869826 906397 935824 936156 917029 915323 930929 918267 872540 826171 780898 710404
4641 710404 640750 619627 610780 578395 538894 509202 491038 461810 399906 339432 347692 443037
4629 443037 567532 664797 693426 612570 466065 360741 336604 356870 382038 418532 468830
4618D68830K8477R373K8960N8156P5242R4011J01345M7209m8683j17780j27704
4607F17436r4815o2931k5817K0747N6838P5603N6903q837r8168j48402j20894
4596B67663n0814n687j3561l5335l2387k5880l6985m8839m2852j1312K8237O0410
4584E2658P8057O9557O0091L7156j3331m5086k0579K7814K6137J2622L9382O4433
4572C88911N0586o710n9627m5932q429k7476n7322n4044m3839k4006j8553n9808
4560C3751j01888j29158j38952j15320p0252k4119j462J9421O1508R3466P7500
4549b95505N6034P8532J00600P0593K2554j7867n1550p4836p7841o2789m8978
4538c01053n5046q0073p8830k4695L5570M7281J8288k097k7084o0261o8693l0770
$$ plain form
4618 468830 497307 506680 535640 593796 669038 763049 864394 911603 862920 745140 617436
4607 617436 522621 459690 433873 454620 511458 587061 643964 635127 536959 388557 267663
4596 267663 216849 211162 197601 162266 129879 103999 67014 18175 -24677 -35989 -7752 52658
4584 52658 130715 200272 260363 297519 284188 239102 218523 246337 272474 285096 324478 388911
4572 388911 439497 432787 373160 327228 318799 291323 234001 179957 136118 112112 93559 33751
4560 33751 -68137 -197295 -336247 -451567 -521819 -545938 -547400 -527979 -466471 -373005 -295505
4549 -295505 -239471 -160939 -60339 10254 32808 14941 -36609 -111445 -189286 -252075 -301053
4538 -301053 -356099 -436172 -515002 -539697 -504127 -456846 -438558 -440655 -467739 -528000 -596693 -627463
4526f27463K5894N7296M8839J1665J228K7330L2811K2027K6802M8143M7388l511
$$ plain form
4526 -627463 -601569 -544273 -495434 -483769 -482541 -455211 -422400 -400373 -373571 -325428 -278040 -281551
$$ [...]
##END NTUPLES=NMR SPECTRUM
##END=
