##TITLE=C13_SR146_k3
 CDCl3, 22400 sc

 27.10.2022
##JCAMPDX= 6.0         $$ Bruker NMR JCAMP-DX V2.0
##DATA TYPE= NMR SPECTRUM
##DATA CLASS= NTUPLES
##ORIGIN= UXNMR, Bruker Analytische Messtechnik GmbH
##OWNER= root
$$ XWIN-NMR		Version 3.5
$$ Fri Oct 28 13:41:12 2022 Russian Standard Time (UT+4h)  she@DPX200
##.OBSERVE FREQUENCY= 50.327896
##.OBSERVE NUCLEUS= ^13C
##.ACQUISITION MODE= SIMULTANEOUS
##.ACQUISITION SCHEME= undefined
##.AVERAGES= 22401
##.DIGITISER RES= 17
##SPECTROMETER/DATA SYSTEM= spect
##.PULSE SEQUENCE= zgpg30
##.SOLVENT NAME= CDCl3
##.SHIFT REFERENCE= (INTERNAL, CDCl3, 0, 222.653)
##AUDIT TRAIL= $$ (NUMBER, WHEN, WHO, WHERE, WHAT)
$$ ##TITLE= Audit trail, XWIN-NMR		Version 3.5
$$ ##JCAMPDX= 5.01
$$ ##ORIGIN= Bruker BioSpin GmbH
$$ ##OWNER= she
$$ F:/spectra/data/she/nmr/c13/1/pdata/1/auditp.txt
$$ ##AUDIT TRAIL=  $$ (NUMBER, WHEN, WHO, WHERE, WHAT)
(   1,<2022-10-28 13:39:25.18 +0400>,<she>,<DPX200>,
      <created by zg, POWCHK disabled, PULCHK disabled
       terminated by command 'halt'
       configuration hash MD5:
       00 E9 B6 7A A2 85 ED C7 34 08 36 98 17 FE 4E 26
       data hash MD5: 32K
       E3 E7 BF D0 29 BB B3 D0 6F 3B 29 E0 BD 3E D4 64>)
(   2,<2022-10-28 13:39:29.59 +0400>,<she>,<DPX200>,
      <Start of raw data processing
       efp BC_mod = 2 LB = 1 FT_mod = 6 PKNL = 1 PHC0 = -299.5746 PHC1 = 29.56394 SI = 32K 
       data hash MD5: 32K
       DE D0 29 96 75 41 14 5A C3 FC 18 BD 04 8C 5A 0E>)
(   3,<2022-10-28 13:39:33.12 +0400>,<she>,<DPX200>,
      <abs ABSG = 5 
       data hash MD5: 32K
       69 BE 0E 2D C5 C2 EC 75 7A 51 45 CD 30 AF 6A F0>)
(   4,<2022-10-28 13:39:51.23 +0400>,<she>,<DPX200>,
      <pk PHC0 = -0.3597711 PHC1 = 3.000003 
       data hash MD5: 32K
       B8 83 8D DF 84 9F C2 34 DA DE CF C4 5D 0C 75 C4>)
(   5,<2022-10-28 13:39:54.98 +0400>,<she>,<DPX200>,
      <abs ABSG = 5 
       data hash MD5: 32K
       DA 02 AD A4 3D 13 98 A4 B1 48 C4 02 34 F1 D3 AB>)
(   6,<2022-10-28 13:40:43.75 +0400>,<she>,<DPX200>,
      <pk PHC0 = -7.974962 PHC1 = 12.8 
       data hash MD5: 32K
       40 06 DC 57 8A E4 C9 64 D0 84 76 58 D6 F2 2F F7>)
(   7,<2022-10-28 13:40:46.51 +0400>,<she>,<DPX200>,
      <abs ABSG = 5 
       data hash MD5: 32K
       23 7D 91 2C E8 6D C7 CE E5 14 B0 2C 30 D0 82 77>)
$$ ##END=
$$ 
$$ hash MD5
$$ 0D C6 51 40 7F 1B A3 88 C5 A1 1E 62 C0 71 7B 99
##$RELAX= 
##$RELAX= 
##$RELAX= 
##$RELAX= 
##$RELAX= 
##$RELAX= 
##$RELAX= 
##$RELAX= 
$$ Bruker specific parameters
$$ --------------------------
##$DU= <F:/spectra>
##$EXPNO= 1
##$NAME= <c13>
##$PROCNO= 1
##$TYPE= <nmr>
##$USER= <she>
##$AMP= (0..31)
100 100 100 100 100 100 100 100 100 100 100 100 100 100 100 100 100 100 
100 100 100 100 100 100 100 100 100 100 100 100 100 100 
##$AQSEQ= 0
##$AQ_mod= 1
##$AUNM= <au_zg>
##$AUTOPOS= <>
##$BF1= 50.322709
##$BF2= 200.13
##$BF3= 50.322709
##$BF4= 500.13
##$BF5= 500.13
##$BF6= 500.13
##$BF7= 500.13
##$BF8= 500.13
##$BYTORDA= 1
##$CFDGTYP= 0
##$CFRGTYP= 5
##$CHEMSTR= <none>
$$ [...]
##$SUBNAM4= <"">
##$SUBNAM5= <"">
##$SUBNAM6= <"">
##$SUBNAM7= <"">
##$SUBNAM8= <"">
##$SUBNAM9= <"">
##$SW= 239.972175391363
##$SWIBOX= (0..15)
0 1 3 0 0 0 0 0 0 0 0 0 0 0 0 0 
##$SW_h= 12077.2946859903
##$TD= 32768
##$TD0= 1
##$TE= 0
##$TE2= 300
##$TE3= 300
##$TEG= 300
##$TL= (0..7)
120 120 120 120 120 120 120 120 
##$TP= (0..7)
150 150 150 150 150 150 150 150 
##$TP07= 0
##$TPNAME0= <>
##$TPNAME1= <>
##$TPNAME2= <>
##$TPNAME3= <>
##$TPNAME4= <>
##$TPNAME5= <>
##$TPNAME6= <>
##$TPNAME7= <>
##$TPOAL= (0..7)
0.5 0.5 0.5 0.5 0.5 0.5 0.5 0.5 
##$TPOFFS= (0..7)
0 0 0 0 0 0 0 0 
##$TUNHIN= 0
##$TUNHOUT= 0
##$TUNXOUT= 0
##$USERA1= <user>
##$USERA2= <user>
##$USERA3= <user>
##$USERA4= <user>
##$USERA5= <user>
##$V9= 5
##$VALIST= <valist>
##$VCLIST= <CCCCCCCCCCCCCCC>
##$VD= 0
##$VDLIST= <DDDDDDDDDDDDDDD>
##$VPLIST= <PPPPPPPPPPPPPPP>
##$VTLIST= <TTTTTTTTTTTTTTT>
##$WBST= 1024
##$WBSW= 4
##$XGAIN= (0..3)
0 0 0 0 
##$XL= 0
##$YL= 0
##$YMAX_a= 133941263
##$YMIN_a= -31878687
##$ZGOPTNS= <>
##$ZL1= 120
##$ZL2= 120
##$ZL3= 120
##$ZL4= 120
##$ABSF1= 222.6533
##$ABSF2= -17.34351
##$ABSG= 5
##$ABSL= 3
##$ALPHA= 0
##$AQORDER= 0
##$ASSFAC= 0
##$ASSFACI= 0
##$ASSFACX= 0
##$ASSWID= 0
##$AUNMP= <proc_1d>
##$AZFE= 0.1
##$AZFW= 0.5
##$BCFW= 0
##$BC_mod= 2
##$BYTORDP= 0
##$COROFFS= 0
##$CY= -3
##$DATMOD= 1
##$DC= 0
##$DFILT= <>
##$DTYPP= 0
##$F1P= 0
##$F2P= 0
##$FCOR= 0.5
##$FTSIZE= 32768
##$FT_mod= 6
##$GAMMA= 0
##$GB= 0
##$INTBC= 1
##$INTSCL= 4.134877e-10
##$ISEN= 128
##$LB= 1
##$LEV0= 0
##$LPBIN= 0
##$MAXI= 10000
##$MC2= 0
##$MEAN= 0
##$ME_mod= 0
##$MI= 0.1934396
##$NCOEF= 0
##$NC_proc= 2
##$NLEV= 6
##$NOISF1= 120.0001
##$NOISF2= 80.00006
##$NSP= 0
##$NTH_PI= 0
##$NZP= 0
##$OFFSET= 222.6533
##$PC= 1.4
##$PHC0= -307.9094
##$PHC1= 45.36394
##$PH_mod= 1
##$PKNL= yes
##$PPARMOD= 0
##$PSCAL= 0
##$PSIGN= 0
##$REVERSE= no
##$SF= 50.322730123286
##$SI= 32768
##$SIGF1= 140
##$SIGF2= 120
##$SINO= 11.81781
##$SIOLD= 32768
##$SREGLST= <13C.CDCl3>
##$SSB= 0
##$STSI= 32768
##$STSR= 0
##$SW_p= 12077.2946859903
##$SYMM= 0
##$S_DEV= 0
##$TDeff= 32768
##$TDoff= 0
##$TI= <>
##$TILT= no
##$TM1= 0
##$TM2= 0
##$TOPLEV= 0
##$USERP1= <user>
##$USERP2= <user>
##$USERP3= <user>
##$USERP4= <user>
##$USERP5= <user>
##$WDW= 1
##$XDIM= 32768
##$YMAX_p= 392310473
##$YMIN_p= -2255737
$$ End of Bruker specific parameters
$$ ---------------------------------
##NTUPLES= NMR SPECTRUM
##VAR_NAME=  FREQUENCY,     SPECTRUM/REAL,   SPECTRUM/IMAG
##SYMBOL=    X,             R,               I
##VAR_TYPE=  INDEPENDENT,   DEPENDENT,       DEPENDENT
##VAR_FORM=  AFFN,          ASDF,            ASDF
##VAR_DIM=   32768,         32768,           32768
##UNITS=     HZ,            ARBITRARY UNITS, ARBITRARY UNITS
##FACTOR=    0.368581032318806, 1,           1
##FIRST=     11204.5221812756, 0,            0
##LAST=      -872.772504714734, 0,           0
##MIN=       -872.772504714734, -2255737,    0
##MAX=       11204.5221812756, 392310473,    0
$$ Real data points
##PAGE= N=1
##DATA TABLE= (X++(R..R)), XYDATA
$$ [...]
15944C80769n9923n2975j17188o0900p9617P9241M77582Q6453R4344J76249j87077
15933G36958l70525k38620l20705k75251K14180L35361j73369K14694L08952J78815
15923F10490k53419k96496m15888j85616j8891Q9282l14771n00969K72251Q64209
15913a49818N26343n2331m62320p21193o62900j2016M19392L38854L11929j29926
15903e93986k01325n1444K81280M76786K11456k24150p9962J79348J4738J05391
15893A18132Q3013L6944J18633N8059n5746j43455k27964o3154K14230j65864
15883b7172m53183l10056L83741N87944J37041N7386l14193l46896m929m00282
15873f90599m48772k54644k19533J01493J99741M96329L60372j68449J96192O41463
$$ y = [380769, 320846, 267871, 150683, 89783, 10166, 89407, 566989, 653442, 747786, 924035, 736958, 366433, 127813, -192892, -468143, -253963, 81398, -91971, 122723, 431675, 610490, 357071, 60575, -355313, -540929, -559820, -470538, -785309, -1286278, -1014027, -149818, 376525, 324194, -138126, -859319, -1522219, -1534235, -1114843, -775989, -464060, -593986, -795311, -846755, -565475, -88689, 122767, -101383, -181345, -1997, 12741, 118132, 201145, 238089, 356722, 414781, 359035, 215580, -12384, -75538, 138692, -27172, -480355, -790411, -406670, 181274, 318315, 375701, 61508, -285388, -290317, -690599, -1139371, -1394015, -1613548, -1512055, -1312314, -815985, -455613, -624062, -427870, 213593]
15863B13593K23693l47447j48571j15243P9621M30203L14960Q9533J42702L96728
15853A279772K15970L714k9267k82210n61287p16555J22778L84061M09527K63327
15843A089830m52545n14636j65155l05118n5455K35784K50662J84283o483m65236
15833b04069o59645N9217O34525N98656l6909n72552j94420k04761J52037J82532
15823b45389j43437L27994J23327k15293j85522J73288L81613R3984k22218m00941
15813c12594n29035j80590J07290K56171L77221K16663m3522r4366J4779K55955
15803F7972J30306L22265J53366n47758m89844L26510J80654k96134j36L47194
15793A94395K53114L47970M04373J88618l95979n83894n21996j83661o1340k71793
$$ y = [213593, 437286, 89839, -58732, -173975, -94354, 335849, 650809, 740342, 883044, 1279772, 1495742, 1499456, 1470189, 1187979, 626692, -89863, 32915, 416976, 826503, 1089830, 637285, 122649, -42506, -347624, -403079, -167295, 83367, 267650, 261167, -204069, -863714, -804497, -169972, 428684, 391775, -180777, -375197, -579958, -427921, -245389, -388826, -60832, 62495, -152798, -338320, -165032, 216581, 310565, 88347, -312594, -841629, -1022219, -914929, -658758, -281537, -64874, -108396, -202762, -187983, 67972, 198278, 520543, 673909, 126151, -363693, -37183, 143471, -152663, -152799, 194395, 447509, 795479, 1199852, 1388470, 992491, 408597, -113399, -297060, -358400, -630193]
15783f30193O8364j48746k36530j19239N8049N52818J29586k61559K31286K32796
15773a23368k40408M10924N71603R4222j92907l67836o65610k54196K42083L6269
15763d89224O76474O33692k01001m73924m06803q3648N3776k15306l4745K2460
15753e18249Q7553O05757N08401l0793k63420l03680j50992j54937K5473J47229
15743d7658o3159j31468N1925K67618j61275l66250m01970j23150M72361L69321
15733a33705M28398L32863R1978K69102K75223j28818m43521o28875k59075J97940
15723A510P5323m62309m32923O5820K50416J87142K80880N81890J37749k45629
15713D39869l64903K23403K0067k50255j48593L43233J60979J606m15936k86273
$$ y = [-630193, -561829, -710575, -947105, -1066344, -1008295, -455477, -325891, -587450, -356164, -123368, -363776, 47148, 618751, 712973, 520066, 152230, -513380, -767576, -525493, -489224, 187250, 820942, 619941, 146017, -260786, -344434, -290658, -505964, -540709, -518249, -430696, 175061, 683462, 652669, 389249, 85569, -65423, -220360, -194887, -47658, -110817, -242285, -190360, 77258, -84017, -450267, -852237, -975387, -503026, -133705, 294693, 627556, 719534, 988636, 1263859, 1135041, 691520, 62645, -196430, 1510, 76833, -385476, -818399, -752579, -502163, -315021, -34141, 547749, 685498, 439869, 74966, 298369, 318436, 68181, -80412, 262821, 423800, 425406, 9470, -276803]
15703b76803L90604L24033o1895k032J24089l21776l38725Q8856M66147L59974
15693G52472j0790m09703l74154j93893r1809N3570M59466K81052L1184k83597
15683B13798k06946l07140m65758L7855J18911j08751l0867J29365M40445M22197
15673B43109J34328J9219p5208j12611L9534Q8677P5812l63465l35962N0076M00628
15662A64137P2528l99208k92705K65153K56981R3808k0292O4692J32556O333n1339
15651B92644j84402l04078j18053k77436j21735l50343l00060O51057Q63678Q293
15641A59565k62277K68264K19895J63310O22456J37572l08316k30275n28124k26855
15631A5215K55924j94094j59136Q2703P3843l26400o2965j40697m6109L39632
$$ y = [-276803, 113801, 437834, 375939, 373907, 497996, 176220, -162505, -73649, 392498, 752472, 741682, 331979, -42175, -236068, -327877, -274307, 185159, 466211, 497395, 213798, 6852, -300288, -766046, -728191, -609280, -718031, -748898, -619533, -179088, 243109, 377437, 396656, 321448, 208837, 248371, 337048, 412860, 49395, -286567, -236491, 164137, 236665, -162543, -455248, -190095, 66886, 160694, 140402, 205094, 337650, 343983, 292644, 108242, -195836, -313889, -591325, -713060, -1063403, -1363463, -712406, 151272, 159565, -102712, 165552, 385447, 548757, 1171213, 1308785, 1000469, 770194, 242070, 15215, 271139, 77045, -82091, 612, 74455, -251945, -314910, -455607, -501716, -162084]
15621a62084M60713J50600n1456k10527K0994j62933l75987k5314M8917k26245
15611e33322l62109J40604N73334M28026j33302J18202J32994o4267q7036k29791
15601a6667l19678j8389M79916O60734J61706n08256n16512k40071R3125Q225
15591b15867l85918K6622K68544r426l26288L9441R8417J17034j10100j79847
15581f77388N6629M96143K01089n11878l37410j479p3920R0619Q2610l18200k54190
15570a247375O9912J28203J94654M59704K98422n5933O7669J89478M6372J74801
15560C25907M61828J01759l50929n41334o18518k30572n7357J19436M23245J45254
15550b21281j324j77062L42881N29640J26125M8365m24653l95832L01043K0653
$$ y = [-162084, 298629, 449229, 397773, 187246, 208240, 45307, -330680, -355994, -307077, -533322, -895431, -754827, -181493, 246533, 113231, 231433, 364427, 300160, 213124, -16667, -336345, -354734, 125182, 785916, 947622, 439366, -77146, -317217, -224092, -215867, -601785, -575163, -306619, -316045, -642333, -602892, -504475, -387441, -497541, -677388, -620759, -124616, 76473, -435405, -772815, -774294, -848214, -757595, -674985, -993185, -1247375, -1177463, -1049260, -854606, -394902, -96480, -152413, -84744, 104734, 151106, 325907, 787735, 889494, 538565, -2769, -621287, -851859, -909216, -789780, -366535, -221281, -222605, -399667, -56786, 472854, 598979, 647344, 222691, -173141, 127902, 148555]
15540A48555j87602j28399j87265k9302J40459J58158r2644j3335O4448P0154
15530e6773j30825l59230n05924r9924L21290O55908O69892M93598J16626k34626
15520H70012J62624N12559n0978k79441Q5244r4723m0215K30561M75386N35860
15510B406889O04750M95572L70695L49695Q12352J559457J130093N67896l72129
15501G925270j278048j283776j029085j030417p65091m45858n50264j44595N2734
15492A450870M1584m12597k66445l54946j80429J5342k9238l16723k29115j26578
15482d08275k34825L17307O75132R0664K24056M00711L45342j02154j33637m08072
15472G66249n46471R8914J54242j63613k00444R1096l11779l01692R9181J65948
$$ y = [148555, -39047, -167446, -354711, -384013, -243554, -85396, -178040, -191375, -126927, -56773, -187598, -546828, -1052752, -1152676, -831386, -175478, 494414, 988012, 1104638, 870012, 1032636, 1545195, 1494217, 1214776, 1300020, 1205297, 1165082, 1395643, 1871029, 2406889, 3011639, 3507211, 3877906, 4227601, 5039953, 6599410, 7729503, 8297399, 7925270, 6647222, 5363446, 4334361, 3303944, 2538853, 2092995, 1542731, 1398136, 1450870, 1492454, 1079857, 813412, 458466, 278037, 293379, 264141, -52582, -281697, -408275, -643100, -325793, 349339, 440003, 664059, 1064770, 1410112, 1307958, 1174321, 766249, 219778, 318692, 472934, 309321, 108877, 199973, -111806, -413498, -314317, -148369]
15462a48369L68922J76777J85703O6339k77118m33837k34501N5389K81671K73515
15452C14491o6532j7904n551r1471k2027m3557j0003l76728m35879J85976N13841
15441e5344L74955L47332Q1856K5645j76663l39518m26388p74786l92672k0461
15431a356044K38114K87294K29594J56742l40655l28662K15334L83012K69045
15422b46226J05437m9691l6457K4377k20205j37078K04335L71252j42162j22723
15412b49141L15556J40679j64581k56343J65637M38645J74737K14210J865n08884
15402B72380l67219k1756p3930l70349p7560P1054k4707q2611O7983L76932K69053
15391C9270J70488j4785r9029K16490M09220m8968m72349n37005k81382M10254
$$ y = [-148369, 220553, 397330, 583033, 649372, 372254, -61583, -296084, -240695, 40976, 314491, 247959, 230055, 224504, 133033, 111006, 67449, 57446, -319282, -755161, -569185, -55344, 319611, 666943, 748799, 774444, 597781, 258263, -168125, -942911, -1335583, -1356044, -1117930, -830636, -601042, -444300, -784955, -1113617, -898283, -515271, -246226, -140789, -190480, -226937, -202560, -422765, -559843, -355508, 15744, -126418, -249141, 66415, 207094, 42513, -213830, -48193, 390452, 565189, 779399, 781264, 272380, -94839, -116595, -190525, -560874, -638434, -567380, -592087, -674698, -606715, -229783, 39270, 209758, 194973, 95944, 312434, 721654, 672686, 200337, -336668, -618050, -207796]
15381b07796K03003l19297l90943K04874P01935K22249J3306q3054l75974k77841
15371c09538m0440j48951q2911l03793l20774q7724o2607L00675P81554O07095
15361C32586q350j46995L07095l50618m60793k33791j86584L3226J38516J50131
15351d25577j503j12678q477L01297M10334k16541k79451m44069p49592k36166
15341a762423M97427P57009O74512K09324j06096j4482j78781k54046m65850j49717
15331g93123N20246K73960l1477m92768p28456k43337K42557M41070N29563J81770
15321i9995n5600K13197N8982M95461L85295j70409r1689l47784l00394J6801
15311A03865N4026j67194M0247j03746m44117j76500Q6691K42484M10712K38435
$$ y = [-207796, -4793, -324090, -715033, -510159, 191776, 414025, 427331, 344277, -31697, -309538, -349978, -498929, -581840, -885633, -1206407, -1294131, -1356738, -1056063, -274509, 332586, 324236, 177241, 484336, 133718, -327075, -560866, -747450, -714224, -575708, -425577, -427080, -539758, -548235, -246938, 163396, -53145, -332596, -776665, -1526257, -1762423, -1264996, -507987, 166525, 375849, 269753, 255271, 76490, -177556, -643406, -793123, -272877, 1083, -30394, -523162, -1251618, -1494955, -1252398, -811328, -281765, -99995, -155595, 57602, 116584, 612045, 997340, 826931, 735242, 387458, 87064, 103865, 157891, -9303, 30944, -72802, -516919, -693419, -606728, -364244, 46468, 284903]
15301B84903l05810n19643j65551L62054K28454J27806K94835K702o6532l44697
15291a01479n11824r2167J93156L31953K32173j5246o9939k9163J23851k53244
15281a91929l59286j5483K85074L40580K18747j20384k33849l32959r5887K76333
15271b29043O71775O66761M0231o01733n76789j5954K57005K25492m3831j20717
15261B73197j17504k42276l99643k69992O8012N17299K88611k10904k79612n238
15251c78050J06519J62503k15515j92707j68239J13953J15303K89475N27779M82019
15241H43040K88893m19010o15570p1783J92152j67324l25559K5616K09772M566
15231c5207j66850j80082J00692L26060K11698J50465j69382p17286p5735J42138
$$ y = [284903, -20907, -540550, -706101, -344047, -115593, 12213, 307048, 309750, 243218, -101479, -613303, -705470, -512314, -180361, 51812, 36566, -33373, -62536, 61315, -191929, -551215, -566698, -281624, 58956, 277703, 157319, -76530, -409489, -505376, -229043, 442732, 1109493, 1149724, 547991, -28798, -44752, 212253, 437745, 393914, 273197, 155693, -86583, -486226, -756218, -688206, -170907, 117704, -93200, -372812, -378050, -271531, -109028, -324543, -517250, -685489, -571536, -456233, -166758, 361021, 843040, 1131933, 712923, 97353, 25570, 217722, 50398, -275161, -249545, -39773, -35207, -202057, -382139, -281447, 44613, 256311, 406776, 237394, -479892, -555627, -413489]
15221d13489j5237R7343j39886j83434K53170N09859K61851j67853J77927L26170
15211G06421k68858j76767j09136l17286J91765K72714O3850J83247J05520K63234
15201I14704N04106k9766n63341n01391m9945m77752m42590k06056l50373Q5594
15191a116810L15058L36327L05695K51490p9574O7587J64866l48978k69818O3500
15181c10657K07078K94545Q268l87533l15657J65328L63771j6794n6497J5723
15171c2425j20078j04843K81985M0731k15680j3149J3733J02895o6653o6345K09942
15160C0113j57267l61800J19531M2640n50400k90736N91763N67331j66810J79617
15150C982M38627O6118K10616J14634n65345n89811j7360o9324j46011K04285
$$ y = [-413489, -428726, -331383, -471269, -654703, -401533, 108326, 370177, 202324, 380251, 706421, 437563, 260796, 151660, -165626, 26139, 298853, 362703, 545950, 651470, 914704, 1418810, 1389044, 825703, 324312, 274367, -203385, -645975, -852031, -1202404, -1116810, -801752, -465425, -159730, 91760, 12186, 79773, 244639, -104339, -374157, -310657, -103579, 190966, 199234, -188299, -503956, -338628, 25143, 8349, -48148, -32425, -152503, -257346, 24639, 65370, -150310, -163459, -149726, -46831, -113484, -179829, 30113, -127154, -488954, -369423, -326783, -877183, -1167919, -576156, -8825, -175635, 3982, 442609, 508727, 719343, 833977, 268632, -321179, -338539, -407863, -553874, -349589]
15140c49589K66716R9943J24711l80981m70412K6850K47810M14997Q71088M71620
15130A322753j74379r38235m91120P3061L71507K38709m27279l54558K25181O06432
15120D52072j20153l55137j21271j02075q9581l13002m22890k17892K57282J057766
15110B5119P55426k43384m92126k82368k29561j5155J9925K82415L30825O1546
15100B12662K68142L65573J78145k50840m14307j58033J00379k40727n48158m32902
15090i20066M53991P45301J19723l224O327k18861k46349j95642K10687N0320
15080B207l99503k61354m6725K98255L03791L54968L25161n5766k05606j79264
15070A36164j97651o5672O4412j7734j33509Q2840R9022l30224n84268l61530
$$ y = [-349589, -82873, 17070, 141781, -239200, -709612, -682762, -434952, -19955, 851133, 1322753, 1148374, 210139, -280981, -207920, 163587, 402296, -24983, -379541, -154360, 452072, 331919, -23218, -144489, -246564, -336145, -649147, -1072037, -1289929, -1032647, 25119, 780545, 537161, 45035, -237333, -466894, -482049, -462124, -179709, 151116, 212662, 480804, 846377, 1024522, 773682, 359375, 201342, 301721, 60994, -487164, -920066, -466075, 279226, 398949, 395725, 402052, 183191, -63158, -258800, -48113, 2207, -397296, -658650, -705375, -407120, -103329, 251639, 576800, 521034, 315428, 136164, -61487, -127159, -62747, -80481, -213990, -131150, -32128, -362352, -946620, -1308150]
15060a308150j5751K00058O06901L51667l06850j28065Q4955K41593K33503n4443
15050i4582j60030k57127K98701L68535p8357j12119j45336n6976P5189j07497
15040b69599M9700k13760k84077k68370m55574k07447K4147L69941J99126n86414
15030a642327j93091L88178M74664L39819O22245M71289O6283l42330p21210k90501
15020h26981j40771L33494M61638J94601J61152p881j92093k80650N3140K60150
15010A5799n4132q2011J75312J372K63788k10205o20722j076O6955q1492k68546
14999g94958L60993Q03996N42360J78434k14263o08875j58254N34354m3174j66152
14989D34461j46720Q9346M15780O1843k88599m15821l33587l56692j42455l08010
$$ y = [-1308150, -1323901, -1123843, -516942, -165275, -472125, -600190, -515235, -273642, -40139, -94582, -254612, -511739, -213038, 155497, 77140, -34979, -180315, -237291, -162102, -269599, -219899, -433659, -717736, -986106, -1441680, -1649127, -1624980, -1255039, -1055913, -1642327, -1835418, -1447240, -972576, -632757, -10512, 460777, 527060, 184730, -536480, -826981, -967752, -634258, -172620, 21981, 183133, 175252, -16841, -297491, -244351, 15799, -38333, -120344, 54968, 56340, 320128, 109923, -510799, -511875, -444920, -526412, -794958, -433965, 370031, 912391, 1090825, 876562, 267687, 109433, 643787, 600613, 434461, 287741, 377087, 792867, 854710, 566111, 150290, -183297, -539989, -682444, -990454]
14979i90454l69266k99435j91986L05443Q23344O65349M3182j15080p7064j0411
14969b16378o1286L48059M48113l2056k82503q6888O388j71859l46698J47307
14959b47801N1010j64073l29972l00001J55107N16909J31970j24752J45161j18520
14949b84962l17992j71526Q4181K63496K06997j39619l3678p1994J11668K80189
14939g3240Q3997j36543j03855m7397K03694K77005j6981j48166j40387P7329
14929b4544n4630j64240J14929K24017m6438p608r1878k78716J58399L00283O8153
14918A97727J88049K98628K54989k072K7834N2868l8805k12464k86165k5952K75390
14907G30027k40585n39827k20054o08974m01021m3671K58036L80665N61851L27757
$$ y = [-990454, -1359720, -1659155, -1851141, -1545698, -722354, -57005, -13823, -128903, -205967, -216378, -277664, 70395, 518508, 486452, 203949, 117061, 123449, -48410, -395108, -247801, -196791, -360864, -690836, -990837, -835730, -318821, -186851, -311603, -166442, -284962, -602954, -774480, -690299, -426803, -219806, -359425, -393103, -465097, -353429, -73240, 10757, -125786, -229641, -277038, -73344, 203661, 186680, 38514, -101873, -24544, -79174, -243414, -128485, 95532, 49094, 41486, -50392, -329108, -170709, 129574, 197727, 385776, 684404, 939393, 937321, 965155, 1018023, 979218, 766754, 480589, 454637, 730027, 489442, -50385, -270439, -879413, -1280434, -1324105, -1066069, -685404, -123553, 204204]
14897B04204K43576J50621o6262k96954m00844k93075J36294R4893j78537j0155
14887d16239K0210J40480L44942J28893j52268K5417Q4815Q7824l18614l20390
14877c74930k0583K03588K28440M2099K74829L38544P4809k13446l5231j51977
14867C66142j82246m88577m56863k84892k32768K10527R20192J032077j6709n54493
14857C12390l37579m7708O9306L6631L64322J09271m05580n8520j9480n2097j29486
14846a58530k81619k0737R6064R8454J51065j41366k81262J89324R2788r4095
14836c49914j63381J68278L28640J32412j5177O4581p1507r4242j05416l51801
14826d57527k74900J51751O0105j29610J59762O09389O87241K50776R159q8996
$$ y = [204204, 447780, 598401, 532139, 235185, -165659, -458734, -322440, -227547, -406084, -416239, -396029, -255549, 89393, 218286, 66018, 91435, 176250, 264074, -54540, -374930, -395513, -191925, 36515, 78614, 353443, 691987, 766796, 553350, 518119, 366142, 183896, -304681, -761544, -1046436, -1279204, -1068677, -148485, 883592, 866883, 312390, -25189, -72897, -3591, 33040, 397362, 506633, 101053, 42533, 23053, -29044, -158530, -440149, -460886, -364822, -266368, -115303, -256669, -537931, -348607, -255819, -349914, -513295, -345017, -16377, 116035, 100858, 165439, 93932, -310, -105726, -457527, -732427, -580676, -520571, -650181, -490419, 118970, 806211, 1056987, 1066146, 977150]
14816I77150l61290l39504J22174K22702l37580l88218j08881N1661K62363K47519
14806C48096O08351L39238k17754o26411m20221j53655R4614J71930q3208k05487
14796a44507j10007N3078L49466L46845K45349J04425L73651k8182l55589j48895
14786F85634R0327k4854o33828p09808r6018L99769M09672R3941j85546O422L7801
14775G3512M2592L9831j46701n05817k41319K11037L43315j18739q4480m5250
14765d32019j8171k38200n0013k6097l32721P7555K25784K66287k03452j89647
14755i20694L9272J29470J95778O116r9464j86680j72841J6267K20236j8649J11424
14744f79765M09742M13523K86655J75007p0946j6055J6548q886L8279M0049L0574
$$ y = [977150, 615860, 276356, 398530, 621232, 283652, -104566, -213447, -161786, 100577, 348096, 956447, 1295685, 1077931, 451520, 31299, -122356, -27742, 144188, 60980, -144507, -254514, -201436, 148030, 494875, 740224, 844649, 1218300, 1190118, 834529, 685634, 775961, 751107, 117279, -592529, -688547, -288778, 120894, 214835, 29289, 35711, 73512, 116104, 155935, 9234, -496583, -737902, -526865, -183550, -302289, -386769, -432019, -450190, -688390, -738403, -764500, -1097221, -1019666, -793882, -527595, -731047, -920694, -881422, -751952, -556174, -550058, -649522, -836202, -1009043, -992776, -772540, -791189, -679765, -270023, 143500, 430155, 605162, 534216, 518161, 534709, 525823, 564102, 604151, 634725]
14733F34725J65205r8302k19164m00525k4067M19226K38068L77164p9024j84504
14723H28802j33416l32218n8501K50605q9789j40568k30468l29911j22280j51141
14713e08885k0272k023k73957k10580q8635o2779K68059N90953L03916m9882j92875
14702b46960j3160P3396J41713L55440J78176j58881j34638Q378j85330m07282
14692c89148k44553K83074K41255l56604n71392l5917L61517K83199m6497l04757
14682g79823l2553K73705K93189L22190j58021m91000j08419P9942J91013K420
14672d07357k43024P6310Q36299Q20453l9560o43648l65999r5171J13143K5964
14662G7410k56936l39242k00808l34651j02195K18208R9220j16027K88347K70796
$$ y = [634725, 799930, 701628, 482464, 81939, 57872, 477098, 715166, 1092330, 1013306, 828802, 695386, 363168, 304667, 555272, 465483, 324915, 94447, -235464, -357744, -508885, -529157, -531180, -805137, -1015717, -1104352, -1167131, -899072, -308119, -4203, -54085, -246960, -260120, -186724, -45011, 310429, 488605, 329724, 195086, 203464, 18134, -389148, -633701, -350627, -109372, -465976, -1037368, -1073285, -711768, -428569, -475066, -779823, -812376, -538671, -245482, 76708, -81313, -572313, -680732, -600790, -409777, -407357, -650381, -574071, 262228, 1082681, 1043121, 399473, 33474, -61697, 51446, 77410, -179526, -518768, -719576, -1054227, -1156422, -938214, -838994, -955021, -666674, -395878]
14652c95878K58618M41565j06302l95576o16770j87439M9313K74895M21152M04255
14642A47833N78411J88843l0761j58141k38926J70774M0785l56930j90595J78220
14632C29513p227l51687K59329K93405k92842j95562K76654r0896q8150K59095
14622C91632K89061P8416m42398l94785J06390L50137j90957l19572K26323J47369
14612B41616j69864l75764K23629M91357j16987j05590n7958J5907j70049j08055
14602a31758O4043K9485J14414N38989J82700p0191k95689m12928k32582J68208
14592d5309R5132l13109O7605J70464K39519K2015l09162p662j49259j98312k59958
14581f88036n6277J96532P9102J13238L80958K12980m27100n7356M50079K78099
$$ y = [-395878, -137260, 304305, 198003, -197573, -814343, -1001782, -952469, -677574, -256422, 147833, 726244, 915087, 884326, 726185, 487259, 658033, 698818, 341888, 151293, 329513, 322286, -29401, 229928, 523333, 230491, 34929, 311583, 220687, 132537, 391632, 680693, 759109, 316711, -78074, 28316, 378453, 187496, -132076, 94247, 241616, 71752, -304012, -80383, 410974, 293987, 188397, 130439, 146346, -23703, -131758, -67715, -38230, 76184, 615173, 797873, 727682, 431993, 19065, -213517, -45309, 49823, -263286, -195681, -25217, 214302, 236317, -72845, -80507, -229766, -428078, -688036, -744313, -547781, -468679, -355441, 25517, 238497, -188603, -245959, 204120, 482219]
14571D82219m95872m06419K50492O11451K37970k45911m27787l24011p27522o54070
14561a699460k68910M02994N81203L53725K96590K88351J31050l57224N6899J81316
14551c3466m2432N0614m8901l07312k65276m24381P7615N38114J83252j26856
14541c99029M83791P18950J18166o96846o83112j27528J08664K10534K65665k7520
14531b8265l71465l08333O04675M65527k06034n01091j5381O10170K75878l96095
14521A29586j72462k84039m19712k99494J79119L45649j73318j94117Q9406J48924
14511f50458n7336k88026m31194J91479O01975M78209J97535O0200J62464J32541
14501C97389k07997k07433j37805K49277M10527J03114L19031M38532k99072k37183
$$ y = [482219, -13653, -420072, -169580, 441871, 679841, 433930, 6143, -317868, -1045390, -1699460, -1968370, -1565376, -984173, -630448, -333858, -45507, 85543, -271681, -214782, -33466, -75898, -25284, -74185, -381497, -646773, -1071154, -993539, -455425, -272173, -399029, 84762, 803712, 921878, 225032, -458080, -585608, -476944, -266410, -745, -28265, -399730, -708063, -103388, 362139, 156105, -344986, -360367, 249803, 525681, 129586, -42876, -326915, -746627, -1046121, -867002, -521353, -694671, -888788, -799382, -650458, -707794, -995820, -1427014, -1235535, -633560, -155351, 42184, 102384, 264848, 397389, 189392, -18041, -155846, 93431, 503958, 607072, 926103, 1364635, 1065563, 828380]
14491H28380j50871k51310m27222l29024J99866M84147N994k54710q6638J0574
14481B9186n2055K85411K94498l4860j59650J8294K02348L62401P4591m62064
14471E58100n13382R6522r1445q78463o60468n2545J26843j17304J11965M39345
14461i80832M92206J18072J28906K87848K8876K64674L06644n4137j56821O7583
14451E03019K10618j27468k6649O1560l69184l33679q489N37577K96175l32886
14441D10594n93963k14154r6866N5477J59445J8455n4637j872l9962J57639p0389
14430b70233J56912L98338L87439J45478l17224k99913k3961L11327M22658J25058
14420A035879l91467m80704k31597j25734q8218l1098k03422Q8982L49015M13826
$$ y = [828380, 677509, 426199, -1023, -330047, -130181, 353966, 359960, 105250, 18612, 29186, -22869, 262542, 557040, 522180, 362530, 380824, 583172, 945573, 1020164, 558100, 44718, 141240, 49795, -828668, -1489136, -1541681, -1414838, -1532142, -1420177, -980832, -488626, -370554, -241648, 46200, 75076, 339750, 646394, 592257, 435436, 503019, 713637, 586169, 559520, 621080, 251896, -81783, -90272, 447305, 743480, 410594, -183369, -397523, -494389, -438912, -279467, -261012, -315649, -317521, -357483, -199844, -270233, -113321, 285017, 672456, 817934, 500710, 200797, 176836, 488163, 910821, 1035879, 644412, 163708, -67889, -193623, -281841, -312939, -516361, -427379, -78364, 335462]
14410C35462J60990j07995P9008K68026K18613l76064p70120J79585N24854k389
14400E09970n79718n24467O1309L49259K81791O23122L48288k29185k04750j24446
14390E11173O9974K81149k20778l93889o8249j1378k12648k01732k45572J35580
14380c56370K36205j15825j4932K33791J88935j48463J17119K66789k74041n73331
14370d40123K1229L64640j31412j32805L64721K64563J60461m28852n47987J72445
14360c33120L91818j60888q7867J96128J33769J11655M4886J62852k1362l4290
14350D03581n8628k17661l47324Q6339R3689P7166J92844o6869L55624O19490
14340A138251J51274k06468n37764p15892n14711J3706L77035J96682R3579L39481
$$ y = [335462, 496452, 388457, 467465, 735491, 954104, 578040, -192080, -12495, 512359, 509970, -69748, -594215, -532906, -183647, 98144, 721266, 1069554, 840369, 635619, 511173, 581147, 862296, 641518, 247629, 179380, 168002, -44646, -246378, -491950, -356370, -120165, -235990, -250922, -17131, 171804, 23341, 140460, 407249, 133208, -440123, -418894, -54254, -185666, -318471, 46250, 310813, 471274, 42422, -505565, -333120, 58698, -102190, -190057, 6071, 139840, 251495, 296381, 459233, 437871, 403581, 344953, 127292, -220032, -133693, -40004, 37162, 230006, 163137, 518761, 1138251, 1289525, 1083057, 545293, -170599, -685310, -671604, -294569, -97887, -4308, 335173]
14330C35173J18157n28331j91981J19729k5014j82863m8184j81475j75322K80594
14320d79517J64970j93901o0537M49325J06337K0219L01367K71251q3712r0651
14310D05151o2359k91148o5560j4395J14292J37586p12K80833j16531o44170n02300
14299g59313J82186N36647Q5131l82425j75891J25702J38145M1073k6838N01671
14289B66088K15949o5430l62O8334j56311l81248p0150p151j12191k34861J47475
14278c29858N3818j56383J13588K8321j4176J50761K43041P1684k20135j80408
14268b39747l6142R9345j48308p7110l85450k40604J7032j08731J9567J87907
14258i12241L61427K00358k4720j63007R3051P4857K14735q3108l34998J80615
$$ y = [335173, 453330, -75001, -266982, -147253, -172267, -355130, -403314, -584789, -760111, -479517, -314547, -508448, -568985, -119660, -13323, 6896, 308263, 579514, 495802, 405151, 342792, 51644, -13916, -28311, 85981, 223567, 222855, 503688, 387157, -257013, -759313, -577127, -40480, 44651, -337774, -513665, -387963, -249818, -208745, -235583, 266088, 482037, 416607, 416245, 484579, 328268, -52980, -123130, -130281, -242472, -477333, -329858, -276040, -432423, -318835, -290514, -304690, -153929, 89112, 160796, -59339, -239747, -275889, -176544, -324852, -401962, -787412, -1028016, -1010984, -1119715, -1100148, -912241, -550814, -350456, -375176, -538183, -445132, -370275, -155540, -238648, -573646, -393031]
14248c93031M82753O26893M28124K90238k29540k42406k27441k37320r4968j49766
14238B53536l54019l49997Q1249l3304J83779M13645K14094J39219j58468j11891
14228B77843j49446l82868n66736m74803j3435M77537K01277R5812K68688L50480
14218H4349K99767L87742J88069k7832m86927p37875m20537n5055L0347k26436
14208i64388j59013j4564K93827K78063K17953L12492L14292J73816k06988r4872
14198A50618j2539m3927j4948O2135L07043N17930q6644j98435K42817o198k75761
14187F42091R9102J10131m06006p15815k58516K19718K75119J51135j44391j37103
14177a64535q8273q9129J3727N36041K41934J53167J19356k97066m35734j09018
$$ y = [-393031, 89722, 716615, 1144739, 1434977, 1205437, 963031, 735590, 498270, 403302, 253536, -100483, -450480, -369231, -402535, -218756, 194889, 408983, 548202, 389734, 277843, 128397, -254471, -821207, -1296010, -1309445, -831908, -630631, -534819, -266131, 84349, 384116, 771858, 959927, 932095, 445168, -292707, -713244, -768299, -737952, -964388, -1123401, -1137965, -844138, -566075, -348122, -35630, 278662, 452478, 245490, 150618, 138079, 94152, 79204, 141339, 448382, 966312, 879668, 681233, 924050, 917852, 642091, 741193, 851324, 445318, -270497, -529013, -309295, -34176, 116959, -27432, -164535, -252808, -341937, -328210, 207831, 449765, 602932, 722288, 425222, -10512, -119530]
14167a19530k5090k3004J68200J59848k02172j33737m21067m12268j44476j17126
14157a270422o1761j41140j46957J29286K15213R0011L23545k470l8549K72605
14147f30639J1592K16669K48833J71596o547m41035l65883p053N76631N19773
14137B93937k21101L82156L22172k24738k41331p6222L79509K48732k06247k75979
14127C80888o69008l01125K20151M58821J94626j45265j38659o2765L8446r8490
14117a22380L7984m240n390N9268M51832K33180n93785k66519j93506Q7450K08356
14106a07750K52987J46938L60469J51801m48818k99705k10665r4028j4124n32705
14096g95600k15985K31565K47740N04206L96648j3204k45486j72200j93198j00884
$$ y = [-119530, -144620, -167624, 576, 160424, -41748, -175485, -596552, -1008820, -1153296, -1270422, -1332183, -1473323, -1620280, -1490994, -1275781, -1185770, -862225, -864695, -903244, -630639, -619047, -402378, -153545, 18051, 11504, -429531, -795414, -802467, -225836, 293937, 72836, 454992, 777164, 552426, 311095, 234873, 614382, 863114, 656867, 380888, -288120, -589245, -369094, 89727, 284353, 139088, 429, -62336, -23890, -122380, -84396, -88636, -94026, -34758, 417074, 650254, 56469, -210050, -403556, -316106, -107750, 145237, 292175, 652644, 804445, 355627, 55922, -154743, -248771, -262895, -795600, -1011585, -780020, -532280, -28074, 368574, 355370, 109884, -62316, -255514, -356398]
14086c56398K5762K50282L36643o8963k64592m7678K48162L73924J21197R1214
14076G09553j11716k38417l36737n2111K40645J48804l54963k33111N8719J19770
14066d9564L72535l9182j90451J19673J03625l88868o49318l11072j0457K34302
14056h08777L82149J42010l11309p8312N1832k39091j25455L18728J99826l08446
14046g76845K37541M64218j38906j32842J47460M4826N1202L42674K91235J08685
14036F39248Q4135k173m58476k02950J59743M7695m7518j19030O2632K31783K28027
14025F23116J82431j15948j18932k00558o5602M81262N61503J2050l89686k54710
14015G14926J24943m3220o02691o07238k23926r687K09796J58783o7841l22931
$$ y = [-356398, -330636, -80354, 256289, 187326, -77266, -124944, 123218, 497142, 618339, 709553, 597837, 359420, 22683, -29428, 211217, 360021, 5058, -228053, -169334, -49564, 322971, 283789, 93338, 213011, 316636, -72232, -721550, -1032622, -1043079, -808777, -426628, -284618, -595927, -674239, -622407, -861498, -986953, -668225, -468399, -776845, -539304, -75086, -213992, -346834, -199374, -154548, -103346, 239328, 530563, 639248, 723383, 721210, 262734, 59784, 219527, 267222, 219704, 100674, 163306, 395089, 623116, 805547, 689599, 570667, 370109, 304507, 785769, 1347272, 1359322, 969636, 714926, 839869, 796649, 193958, -413280, -637206, -646893, -437097, -278314, -346155, -669086]
14005f69086l33177J7022L98084O13735N06792J03182K21758K16823j49062m5634
13995H80437P9145j07229l04776k43678j01419n48729k6497O4650j0759K23775
13985i5080P6709j96915j36087k11853K0078N27137O79415L57151l7413j91883
13975G91259p1775P2252j06455j0314k54571j59345K90123K86647j86211l77534
13965B74076j85678j87987J49670M94563J55288m89530k14843m8009Q5299J14450
13955A47299o5301j08767q0246j17632k37632R4878J53385L64028J55470j06156
13945A99326K0074O065k40827O4141N05807K10865k96163k22492j15779j00427
13935C0590J63823J1454j50297k78767k76930J07084m32929n79524j33254K91912
$$ y = [-669086, -1002263, -985241, -587157, 26578, 533370, 636552, 858310, 1075133, 926071, 880437, 959582, 852353, 547577, 303899, 202480, -346249, -372746, -308096, -318855, -95080, -18371, -215286, -351373, -563226, -543148, -16011, 663404, 1020555, 983142, 791259, 719484, 791736, 685281, 674967, 420396, 261051, 551174, 837821, 651610, 274076, 88398, -99589, 50081, 544644, 699932, 210402, -4441, -52450, 32849, 147299, 81998, -26769, -107015, -224647, -462279, -367401, -214016, 150012, 305482, 199326, 219400, 225465, -15362, 48779, 554586, 765451, 469288, 246796, 131017, 30590, 194413, 205867, 55570, -223197, -500127, -393043, -825972, -1405496, -1538750, -1246838]
13925a246838J37022J46274K80169N34226P46943M87819k57945l78992j59019
13916B89659j8219O1679J91669J06165M74242L69677j67068o58409p37941k81614
13906c70160K01133J71596J11835Q3865m41173k97715k76236k37262K89801L96017
13896c68299L17743L18940k58789o23247m683M01970L87334M49693L25609k4957
13886I21314o47891n45771O2292J41945k31599m30861j9764Q2770j06407L28008
13876d45964R2485o37952n51915O8797J76214K24930L77473J37523m02210m67463
13866a428082j54468M32297M83524N99434m7554R9101L41972j52465l49289j56344
13856c31874K82540N49943J95199p149J3751j63146j10813l163R0279q0206j22440
$$ y = [-1246838, -1109816, -963542, -683373, -149147, 597796, 1085615, 827670, 448678, 289659, 271440, 333119, 524788, 630953, 1105195, 1474872, 1307804, 649395, -88546, -370160, -169027, 2569, 114404, 198269, -242904, -540619, -816855, -1054117, -764316, -368299, -50556, 268384, 9595, -613652, -618335, -216365, 170969, 620662, 946271, 921314, 273423, -272348, -210056, -68111, -299710, -730571, -750335, -667565, -773972, -445964, -353479, -991431, -1543346, -1474549, -1298335, -1073405, -695932, -558409, -960619, -1428082, -1582550, -1150253, -666729, -67295, -114849, -15748, 326224, 173759, -175530, -331874, -49334, 500609, 695808, 688659, 702410, 539264, 428451, 425288, 515567, 435361, 312921]
13845C12921P6589J32270K68626J81179l94854n45405k90371l61392l46861j70651
13835a137949J93953L14998j32176k5442r7245k94077R7028J01299l02153l05776
13825a587540m6544L45801M74655K33351o7231j36441m2518M2680o6025K58276
13815e91536N48920M71181K6386J650j05351r2303j68268j89151j37489l752N4862
13804a84851J44870J92695J63185m95768n78643n7597J45649M28249L94289j4580
13794A37498j37895q3035K42957R3455p2708j40802K4997K8113n4585K13262j59694
13783I1563q11129p09522j28796N5049j74817K22553K60279j17380j44264n19739
13773a976203j90560M42826J91127k86102q3315J48788r5263K88460N23752L14532
$$ y = [312921, 389510, 521780, 790406, 971585, 576731, 31326, -259045, -620437, -967298, -1137949, -943996, -628998, -761174, -786616, -883861, -1177938, -1080910, -979611, -1281764, -1587540, -1634084, -1288283, -813628, -580277, -647508, -783949, -826467, -783787, -849812, -591536, -42616, 428565, 454951, 456601, 351250, 258947, 90679, -98472, -235961, -239713, -184851, -39981, 152714, 315899, -179869, -758512, -816109, -670460, -242211, 152078, 137498, -397, -83432, 159525, 252980, 180272, 39470, 64467, 92580, 37995, 251257, 91563, -719566, -1429088, -1557884, -1502835, -1677652, -1455099, -1194820, -1312200, -1456464, -1976203, -2166763, -1723937, -1532810, -1818912, -1902227, -1753439, -1848702, -1560242, -1036490, -721958]
13763g21958J00701o034L97424J63636J3898M88319M82986L5405m62309n20093
13753b8025l8936L0530k10853k80608k98310q3528N3060J32001K61802J77998
13743b84869K60972O3477J99432j08525m51890m42706l63903R7778M11601j0098
13733f28731o89410l88311J10168K87275N84788L46517j19650O3063M3193k61081
13723f52179j44561k55132k84253k96028M51622N61866J77815n2369k40021m84750
13713a217990j98321J52998N6002o50L94664K50693j78783j64489K45311L76443
13703b84122K6459L14632K62723J66927k0428l47596m94889P1739J84918M3719
13693g5918J37046k37400k35319L79981J65840J01529J58260j97962n88390k59222
$$ y = [-721958, -621257, -627291, -229867, -66231, -52333, 435986, 918972, 954377, 492068, -28025, -66961, -36431, -247284, -527892, -826202, -909730, -856670, -724669, -462867, -284869, -23897, 39580, 239012, 130487, -321403, -764109, -1128012, -1030234, -618633, -628731, -1318141, -1706452, -1596284, -1309009, -724221, -377704, -497354, -434291, -391098, -652179, -796740, -1051872, -1336125, -1632153, -1180531, -618665, -440850, -493219, -733240, -1217990, -1416311, -1263313, -1207311, -1207961, -813297, -562604, -741387, -905876, -660565, -284122, -257663, 56969, 319692, 486619, 466191, 118595, -376294, -304555, -119637, -75918, 61128, -176272, -411591, -31610, 134230, 235759, 394019, 196057, -392333, -651555]
13683f51555L40898K67472J35262k58382J4784J39899N6912N0511m4736k03241
13673a52176l08583j94347j0678J21186L78867K47870j10563n55848k75722j46414
13663a006408l59631k29904K44739K45184j3449k50182p2002N36191N40922J1934
13653c52606n38783n64690n1710j26095j50082L50417M84628M48960K93378J31544
13643g5039j48462m06584j36331L62561j45938l74170k45151J26797K06805J85466
13633f50046J83967L05619J55121k8981L86221L49715n3886L6605K03312Q7305
13623I74952l47501n96170o8709J59693J71054J26640k79372l11087J38361L22073
13613B89934L04719J47968J26836k58101k66877K92362J46348m18422l97801l76744
$$ y = [-651555, -310657, -43185, 92077, -166305, -151521, -11622, 45290, 95801, 51065, -152176, -460759, -655106, -665784, -544598, -165731, 82139, -28424, -584272, -859994, -1006408, -1366039, -1595943, -1351204, -1106020, -1119469, -1369651, -1441653, -905462, -364540, -352606, -891389, -1456079, -1507789, -1633884, -1783966, -1433549, -948921, -499961, -206583, -75039, -223501, -630085, -766416, -403855, -549793, -923963, -1169114, -1042317, -835512, -650046, -466079, -160460, -5339, -34320, 351901, 701616, 647730, 684335, 887647, 974952, 627451, 31281, -37428, 122265, 293319, 419959, 140587, -170500, -32139, 289934, 594653, 742621, 869457, 611356, 344479, 636841, 783189, 364767, -33034, -409778]
13603d09778l77075l1514j18599R7701K902r0789P6963M16611P28555L80814O8718
13592G44509j89684n14689l93047k99836J37225M51447L56108J33968l40760j68189
13582h2948K27269K89076J32772J74179J38793p1561k22623j4372K5521k51418
13572C44688k25705l87689k3510K23605n8957J60860L51494r2840j35945j34360
13562B1641m09751j39229j55738O6117R5027o7871K95408K00895o2805M7097n5821
13551a65030r1566J53870K67455J69008j78518n46280J0739M69803K61804K75456
13541F26741J41087k32210l94398l6763j263j33514k75821k73367k53949k54880
13531a088337j44856J23412K25346k07491L31542M60651J2822k1432K47937K77134
$$ y = [-409778, -786853, -818367, -936966, -839265, -836363, -927152, -850189, -433578, 294977, 675791, 744509, 554825, 40136, -352911, -652747, -515522, -64075, 292033, 426001, 85241, -82948, 144321, 433397, 566169, 740348, 879141, 807580, 584957, 570585, 596106, 344688, 118983, -268706, -292216, -68611, -127568, 33292, 384786, 291946, 156001, 21641, -388110, -527339, -683077, -616960, -521933, -589804, -294396, -93501, -156306, -109209, -165030, -256596, -102726, 164729, 333737, 155219, -391061, -380322, 89481, 351285, 626741, 767828, 535618, 141220, 104457, 103194, -30320, -306141, -579508, -833457, -1088337, -1233193, -1109781, -884435, -1091926, -760384, -299733, -286911, -308343, -60406, 216728]
13521B16728L4977j41837k91655M3331Q9966j62035K8040K76318J19007P5284
13511B88124K16802j29836j66904K65206p7760j53131j66900J10012l8598l46935
13501a99920O8876M1298P4724j32487J03441N56051K13249j03550L6918m8296
13491F10304n79238m92782J98319K59618k02746j23761L36385K35116k85187n67075
13481f11047j12154K27510L59075N53571O3668l88894l46097j36613Q5802J7303
13471b87876J35663L2699l7312q1999k40007L04214P30412K41561k19382o5968
13461E12005j53217j93558l96412Q6767K597j03557J31771J29308m58041j65013
13451f07350M76113O16819K44680l08397o0740R2352N8377M3000m12471m31106
$$ y = [216728, 251705, 109868, -181787, -138456, -48490, -210525, -182485, 93833, 212840, 288124, 504926, 375090, 208186, 473392, 395632, 242501, 75601, 185613, 147015, -199920, -131044, -89746, -15022, -147509, -44068, 511983, 725232, 621682, 658600, 610304, 31066, -461716, -263397, -3779, -206525, -330286, 6099, 241215, -43972, -611047, -723201, -495691, -136616, 416955, 480623, 91729, -254368, -390981, -305179, -287876, -152213, -119514, -156826, -238825, -478832, -174618, 555794, 797355, 577973, 512005, 358788, 165230, -231182, -144415, -141818, -245375, -113604, 15704, -442337, -607350, -131237, 485582, 730262, 421865, 361125, 453477, 511854, 554854, 142383, -288723]
13441b88723L13772K278j29775q5222L9121P8707J49909j07661o5542J04268P4094
13430H5226K7529N8376k79919j43730j598K3223j13110l73629k04038M36657K27106
13419b57907J21935K94626k53736o3400j24861j98542R4369q6712J51911K06497
13409a15820j33930m48511J32295P79880N94938j20659n55474j73848L13211k06207
13399F5875n87754j73897l9755p8208L95020K57199L1876J72542L46294K4195
13389D13387q7874k63217l06955J07704L30472J88556N3423L1767n62659m14745
13379e10141K50132M33747K36556M1900k34347m06874k11665k16581k17240J21044
13369g13469M66412P49941N09496j20569m09532O4252J5014j82279k81115J00040
$$ y = [-288723, 25049, 27327, -102448, -187670, -148549, -69842, 80067, -27594, -93136, 11132, 85226, 112755, 171131, -108788, -252518, -254116, -230893, -344003, -717632, -921670, -485013, -257907, -135972, 158654, -95082, -158482, -283343, -481885, -387516, -474228, -322317, -115820, -249750, -698261, -565966, 213914, 808852, 688193, 132719, -41129, 272082, 65875, -521879, -695776, -735531, -813739, -418719, -161520, -129644, 42898, 389192, 413387, 325513, 62296, -244659, -136955, 193517, 382073, 435496, 467263, -95396, -510141, -260009, 173738, 410294, 452194, 217847, -189027, -400692, -617273, -834513, -713469, -247057, 502884, 1012380, 891811, 482279, 546531, 561545, 379266, 98151, 198191]
13359A98191M40602k92315n51422q100K13P1677n6999Q2483M64707N91832r3651
13348H47218k59003J90155j13458p7814K26373K29439J69637J5643l7377j96989
13338I93824r9426q9288j5567k41476k23978K0843K7100n10898k19924j0988K30770
13327a39008L63379j76684p34051P3768K99519K26106P3310M2900M30787J94312
13317F54338N1171l37098o01538k10196J13475n2519k79263k6112L29230M09563
13307E1051L71077k34923m07660l03608j80922J61895L28507M11410O17621L43038
13297A157486j35114n9849k42440M7722L42278j8075n53325k71899j3255L01227
13287E54756M8995k38655l48126o59337K88156M60079n7949k25288k7446L20356
$$ y = [198191, 638793, 346478, -204944, -213044, -212831, -141154, -198153, -115670, 349037, 940869, 847218, 588215, 778370, 664912, 587098, 813471, 1042910, 1212547, 1228190, 1190813, 993824, 894398, 805110, 789543, 548067, 324089, 344932, 372032, -138866, -358790, -369778, -139008, 224371, 47687, -686364, -612596, -313077, -86971, -13661, 29239, 460026, 654338, 705509, 368411, -233127, -443323, -329848, -382367, -661630, -687742, -358512, 51051, 422128, 187205, -220455, -524063, -704985, -543090, -214583, 196827, 814448, 1157486, 1022372, 962523, 720083, 767805, 1110083, 1092008, 538683, 266784, 253529, 554756, 603751, 365096, 16970, -642367, -354211, 105868, 47919, -177369, -204815, 115541]
13277A15541r1458o0222P7467l1853l14183l08463p7289R5816q3338j03996N06174
13266b75804M54125L94344L46904N88981K77534k52975m20241o31242l98414K37226
13256C20438N85606K01149K90188J58997k26712M9064L169K87906L80713Q2781
13246B133299j59140j61130k4606o42144l14767J48978j3090K47684j49611j51018
13236I14455M4276J94747K34735k08279l27546m43139j60583J21120l75201j39861
13226a45276N81646L61409l45028k37742j0459k70938R8230J29864o6462P0837
13216A66081k5447J06531O40285O07873R5461k93095k13723O2152J92897j80892
13206A158123n79134j20504o0039L7592Q4274K33053M7137Q8823K79101J93214
$$ y = [115541, 24083, -36139, 41328, 9475, -304708, -613171, -690460, -594644, -677982, -781978, -275804, 178321, 572665, 919569, 1508550, 1786084, 1533109, 1112868, 481626, 83212, 320438, 906044, 1107193, 1397381, 1556378, 1329666, 1378730, 1381899, 1669805, 2050518, 2133299, 1974159, 1813029, 1788423, 1146279, 831512, 980490, 967400, 1215084, 1065473, 914455, 958731, 1153478, 1388213, 1179934, 852388, 409249, 248666, 369786, -5415, -145276, 436370, 797779, 452751, 215009, 204550, -66388, 31842, 161706, 95244, 166081, 140634, 247165, 887450, 1495323, 1590784, 1297689, 1083966, 1146118, 1339015, 1158123, 578989, 458485, 398446, 436038, 520312, 753365, 800502, 889325, 1168426, 1361640]
13196A361640l10512n15606l13983o7177L80616K95221N34770L09026l594N10327
13186B180728L7852p47772r12554k5958M48664N3317L3479K96461J98948L84775
13176A947940K38731k33463n75624j51200j94675l99475k9241o5084M1497q5973
13166D93433O7120p8736q3996o9924l7077K52305Q5922j90974P8519K76202p7479
13155G15315n5873J36678R8042j69320r8898J34363J09314j89150j02965j81181
13145C96325k67162J36689L82288L26492J46851o3638m5186l38146m54892j70455
13135D9166N2613L20293N18946K05933j14277J96298L52235J07002k6924j29307
13125A531978j33019l98805k69887j68339j24035K90760O47797M14397Q6862K82155
$$ y = [1361640, 1051128, 535522, 221539, 154362, 534978, 830199, 1364969, 1673995, 1670401, 2180728, 2218580, 1470808, 558254, 532296, 980960, 1034277, 1067756, 1364217, 1563165, 1947940, 2186671, 1953208, 1377584, 1226384, 1031709, 632234, 602993, 537909, 579406, 493433, 560553, 481817, 397821, 327897, 290820, 543125, 629047, 438073, 516592, 792794, 715315, 659442, 796120, 894162, 724842, 625944, 760307, 869621, 680471, 577506, 396325, 129163, 265852, 648140, 974632, 1121483, 1057845, 1012659, 674513, 219621, 49166, 101779, 422072, 941018, 1146951, 1032674, 1228972, 1581207, 1688209, 1661285, 1531978, 1398959, 1000154, 730267, 561928, 437893, 728653, 1376450, 1790847, 1877709, 2159864]
13115B159864p2936l27775p5331o7527k04483o2351L7296J35526R7535m5411J96160
13104A770567M19142K79177j36310j74811q3060j03821n8410l02653k34072J41275
13094A517024O59557K37681n3011k65416m21141n19960l43974L35346K16408J10226
13084A472740M7295J33469n1330j73466k43232k36619K31321P12822J89021J21135
13074B203156K0764j85335l0920l19982o5535L65555L0546j2267J34404M38137
13064B578523O63256j31287n25413n49322k05548M43020K36620J81827R3885K98316
13054C083877l9873l73913j7878N21618J75174l02494r8978J54819J48351M05014
13044C655717R2200k74663L0192J27204J23438k34569k21340K40905J0804k68077
$$ y = [2159864, 2086928, 1759153, 1683822, 1616295, 1411812, 1349461, 1386757, 1522283, 1619818, 1574407, 1770567, 2189709, 2468886, 2332576, 2157765, 2074705, 1970884, 1912474, 1609821, 1375749, 1517024, 2176581, 2414262, 2361251, 2095835, 1674694, 1154734, 810760, 1146106, 1362514, 1472740, 1520035, 1653504, 1602174, 1428708, 1185476, 948857, 1180178, 1893000, 2082021, 2203156, 2223920, 2038585, 2007665, 1687683, 1622148, 1987703, 2018249, 2005982, 2140386, 2578523, 3241779, 3110492, 2585079, 2035757, 1830209, 2273229, 2509849, 2691676, 2785561, 3083877, 3044004, 2670091, 2652213, 3173831, 3349005, 3046511, 2947533, 3102352, 3250703, 3655717, 3747917, 3473254, 3503446, 3630650, 3754088, 3519519, 3298179, 3539084, 3549888, 3281811]
13034C281811j37763M78287L85851L57156K10524O7940L69017L03552J59350l28290
13024E147435l14959R4562N73182L86251M06266J31643P5411N0809J89960N08822
13014G249382M16130J49005J02541J14203J92272L54520K05513K36302L55588
13005I375456K93467M74032P73608O60504P9676J35831M07451J124502J416257
12996A4740784J168316J066991R19310J007161P87396Q53744R14063J290377J755231
12987B4503373K311747K648832L400477L860395M109985M552772N303661O161275
12979E6852517O938240P942545R383592J1213571J3653433J6512265K0872993
12972A43369156K6096218L1960924L8988081M6259444M9559078M0998390J2678586
$$ y = [3281811, 3144048, 3622335, 4008186, 4365342, 4575866, 4643806, 5012823, 5316375, 5475725, 5147435, 4832476, 4927038, 5500220, 5886471, 6292737, 6424380, 6499791, 6550600, 6740560, 7249382, 7665512, 7814517, 7917058, 8031261, 8223533, 8578053, 8783566, 9019868, 9375456, 9668923, 10142955, 10916563, 11577067, 11656743, 11792574, 12200025, 13324527, 14740784, 15909100, 16976091, 17895401, 18902562, 19689958, 20543702, 21457765, 22748142, 24503373, 26815120, 29463952, 32864429, 36724824, 40834809, 45387581, 50691242, 56852517, 63790757, 71733302, 81116894, 92330465, 105983898, 122496163, 143369156, 169465374, 201426298, 240414379, 286673823, 336232901, 377231291, 389909877]
12965C89909877k6393234n2176804n6955517m9429786l9074053k9874235k2960190
12958A13046058j7649056j3957158j0907066q432265o821644o219486n285184
12951D3774199m257247l379467l234572l006369k450272k035344j480892j303458
12943B2626578j382987j267971j512595j390452o44828l19172m87935l86807l8694
12934A5195137J815k80065m20052p22438l59695l6338k05225l79952Q9339K42397
12924A3124923K61959K6861r8436P63095O94740K42543r5162O3953P51323J019072
12914A6754871J012517R11876Q02569O92275J216550J521107J943191K023542
12906B6878498J221715J62631n3415K59726J096374J650551K352064K588750K472156
$$ y = [389909877, 363516643, 311339839, 254384322, 204954536, 165880483, 136006248, 113046058, 95397002, 81439844, 70532778, 62100513, 55278869, 49059383, 43774199, 39516952, 36137485, 32902913, 29896544, 27446272, 25410928, 23930036, 22626578, 21243591, 19975620, 18463025, 17072573, 16427745, 16108573, 15620638, 15233831, 15195137, 15196952, 14916887, 14496835, 13774397, 13414702, 13378364, 13173139, 12793187, 12882526, 13124923, 13386882, 13413743, 13315307, 14078402, 14773142, 15015685, 14920523, 14984476, 15735799, 16754871, 17767388, 18679264, 19481833, 20174108, 21390658, 22911765, 24854956, 26878498, 28100213, 28262844, 28209429, 28469155, 29565529, 31216080, 33568144, 36156894, 38629050]
12897C8629050K885571L477026M479780N737602O113454O775538P936591R467642
12889H5502254J1567375J4111184J8154360K2548321K7582977L3942932M1450735
12882B54860138M8648025N0501728L6539483J761099l7256276n7604525n6799945
12875B40649727m7073117l6458604k8126335k1412800j5894460j2691165j0610897
12868F8382349q223800o739960n772702m903098m568789m121850l354852k641279
12860B8056019j836590j481000j469070j579984j347342j054088q48985j013654
12852A7425306j145464r89698j265806p54401m30702O3264p8858m18860j28946
12843A2275835k10170k05829o5307J28788J81829l3729J17376K83624n8078j62178
$$ y = [38629050, 41514621, 44991647, 49471427, 55209029, 61322483, 68098021, 76034612, 85502254, 97069629, 111180813, 129335173, 151883494, 179466471, 213409403, 254860138, 303508163, 354009891, 390549374, 392310473, 355054197, 297449672, 240649727, 193576610, 157118006, 128991671, 107578871, 91684411, 78993246, 68382349, 60158549, 53418589, 47645887, 42742789, 38174000, 34052150, 30697298, 28056019, 26219429, 24738429, 23269359, 21689375, 20342033, 19287945, 18438960, 17425306, 16279842, 15290144, 14024338, 13269937, 12839235, 12902499, 12823641, 12404781, 12275835, 12065665, 11859836, 11794529, 11923317, 12105146, 12071417, 12188793, 12472417, 12414339, 12252161]
12833A2252161q1709n1076K28841N92605P65954M17607M5788K73210N06256M78964
12823A5428601O62071Q83009J439794J281257R52858J503239J659741J226563
12815B5037133J216060J749391K168561K653526L257039L496815L846919M572603
12807D7998047N510879O474317P032570Q329348J0736911J2917245J5019507J8427660
12799A32446484K3583534K9308098L5508402M2511529M8792613M7394706K8766066
12792C88311432p608057m2582563n7753213n4318160m3562246l3547911k6431829
12785A22507453k0702745j5869592j2148742r774663p930100o693191n920229
12778D3468191m875709l999301l840533l419850k577966k024733j901400j574040
$$ y = [12252161, 12170452, 12119376, 12348217, 12940822, 13706776, 14124383, 14170171, 14443381, 14949637, 15428601, 16090672, 16973681, 18413475, 19694732, 20647590, 22150829, 23810570, 25037133, 26253193, 28002584, 30171145, 32824671, 36081710, 39578525, 43425444, 47998047, 53508926, 59983243, 67015813, 75345161, 86082072, 98999317, 114018824, 132446484, 156030018, 185338116, 220846518, 263358047, 312150660, 359545366, 388311432, 380703375, 338120812, 280367599, 226049439, 182487193, 148939282, 122507453, 101804708, 85935116, 73786374, 64011711, 56081611, 49388420, 43468191, 38592482, 34593181, 30752648, 27332798, 24754832, 22730099, 20828699, 19254659]
12770A9254659j422593j361828q67796o52178j068809j187853q59262n46631n09892
12761A0777817q34989r16170p64327k75909j02945k57975l58242m59500m53726
12752F354034m62175n01812m34792m97499j90977J52720J05856J04938J764k57536
12742D374521k81791k33069k8776J06121l31269l65933R7021K30573k55932o94086
12732B617380n27685J5296K21200l96447n10296M22267R99474L89282m6881j72175
12722C011415l45724l46297j12202J69929M49511j69575n43600k61259o0045r6048
12712A696105n79741k16737M02380L20412M05823J72840j01524j77247j97479
12703A724832n69373q23149k61815L94271O20566O55677M42675J24095l12048
$$ y = [19254659, 17832066, 16470238, 15602442, 14950264, 13881455, 12693602, 11834340, 11287709, 10777817, 9942828, 9026658, 8262331, 7986422, 7883477, 7625502, 7267260, 6807760, 6354034, 5891859, 5390047, 4955255, 4457756, 4266779, 4419499, 4525355, 4630293, 4632057, 4374521, 4092730, 3859661, 3830885, 3937006, 3605737, 3239804, 3336825, 3567398, 3311466, 2617380, 2089695, 2104991, 2326191, 1929744, 1419448, 1841715, 2841189, 3230471, 3183590, 3011415, 2665691, 2319394, 2207192, 2377121, 2826632, 2657057, 2113457, 1852198, 1792153, 1696105, 1116364, 899627, 1302007, 1622419, 2028242, 2201082, 2099558, 1922311, 1724832, 1155459, 332310, 70495, 464766, 1085332, 1741009, 2183684, 2307779, 1995731]
12694A995731j67181K18044q3255k33022j12809J8994l81696l15535j30525j5349
12684G93397K12373L08794P2897l29132l42625J64211L25233K72873P9866l97590
12674A160297l77462l1828m7128O809J47720l0387m21610m33851m10081j05538
12664e43059O5967k10998J58047M24335M09562O83282M00679k32484n73717m25202
12654A56412J903J35706M15607J59920m58910m92866J58064N80350J70944k44430
12644E82700l08741q1545K7733M51056J75148j89100p5914k67373m42631l09792
12634d38459k8729M49881K74694l20580P023L50510J74951L11163J90616l909
12624I67161k26961n35158j36676M88892K70325j12629l41575j60061Q0395M9780
$$ y = [1995731, 1828550, 2046594, 1963339, 1730317, 1617508, 1636502, 1254806, 939271, 808746, 793397, 1005770, 1314564, 1387461, 1058329, 715704, 879915, 1205148, 1478021, 1557887, 1160297, 782835, 751007, 703879, 710688, 858408, 828021, 406411, -27440, -437521, -543059, -477092, -688090, -530043, -105708, 303854, 987136, 1387815, 1155331, 581614, 156412, 158315, 294021, 709628, 869548, 410638, -82228, 75836, 656186, 827130, 582700, 273959, 192414, 220147, 671203, 846351, 657251, 581337, 313964, -128667, -438459, -467188, -17307, 257387, -63193, -56170, 294340, 469291, 780454, 971070, 967161, 740200, 205042, 68366, 557258, 827583, 714954, 373379, 213318, 293713, 343493]
12614C43493J64968J61581R799P4994P833K83737k6474j55319k08333J60565K17433
12603A034277j52880j10831J46919L49479Q976k00854o0083j18868j52148k20922
12593E23065l84336j63126j46561j7253M7514J54105K67520J96269j28858J75942
12583E24281K63235k07613k77657N7055J85966L81821J68225j47906K52386J77865
12573A377658M42746j62260o13900m18958k86057j25803R883j25325j40425N9004
12563A6563K38760j39725m38150m63987K80975K06065O1055J44602k4344r384
12553a27570j09980K9210K53880L79564K79451J72031j31779k33378o56497n31985
12543f77053K95238L75045K47964k57223n50477k00456R1985L28433N3781j38752
$$ y = [343493, 508461, 670042, 679841, 754835, 762668, 1046405, 1019931, 864612, 656279, 816844, 1034277, 881397, 770566, 917485, 1266964, 1275940, 1075086, 1015003, 896135, 743987, 523065, 138729, -24397, -170958, -188211, -140697, 13408, 280928, 477197, 348339, 524281, 787516, 579903, 302246, 359301, 545267, 927088, 1095313, 947407, 1199793, 1377658, 1820404, 1658144, 1044244, 625286, 339229, 213426, 223309, 97984, -42441, 16563, 255323, 115598, -322552, -786539, -505564, -299499, -238444, -93842, -118186, -127570, -237550, -208340, 45540, 425104, 704555, 876586, 744807, 511429, -145068, -677053, -381815, -6770, 241194, -16029, -566506, -766962, -674977, -346544, -292763, -431515]
12533d31515k81335q7063N40206M54002k8964j15265k21921k26312j88437j65585
12523g52189k52143P464j65135o2692M68832N18916j18026r4859j00920J7281
12513e33471j53000O3602N52429J80766l08497K6462M48807J65900k49043j07375
12503H6580M98829J50156m32800l13919j96543k18453M07438N66338k28959n28684
12493b10017k6704L33420K9068Q5662L104J34228J27330k25703k25845R9409j58956
12482c5004j61965o5059J09793l07725k84180M70499K95609j01177p0879j71856
12472c21944l7280L70023Q4770j26782j30647K09912P3077K10292K60878K52489
12462H44788Q644k57389K75221J44969p7051o34919l40724n8150J03203M19449
$$ y = [-431515, -712850, -799913, -259707, 194295, 165331, 50066, -171855, -398167, -586604, -752189, -1004332, -996868, -1162003, -1224695, -755863, -236947, -354973, -449832, -550752, -533471, -686471, -622869, -70440, 110326, -198171, -171709, 277098, 442998, 193955, 86580, 585409, 735565, 302765, -11154, -207697, -426150, -18712, 547626, 318667, -210017, -236721, 96699, 125767, 211429, 214533, 348761, 476091, 250388, 24543, 123952, -35004, -196969, -262028, -152235, -459960, -744140, -273641, 21968, -79209, -150088, -321944, -359224, 10799, 95569, -31213, -161860, 48052, 121129, 331421, 592299, 844788, 853432, 596043, 871264, 1016233, 939182, 304263, -36461, -94611, 8592, 428041]
12452D28041J82579l76194l17097r6733J38140j49596k14504j06104N9398J37149
12442c14921L94605J60247J24240N12300P18021k92059n77006j06764j90051J42593
12432E71205M99541j47109j99015l39095q78322m83819r0028J16877N37803N84550
12422A72588O0280q4885k23315m57145r1534J88032m0564K93444O45261N41909
12412A004071j12953l39605l71737m34740k49834Q9117O8161K01743R0090k03578
12402b59265l21997M25902O04135L81n5176J78400m4137j71381o300R6927n268
12391D42221l03922j12532M84297K27741L9375q7539J99966L28088l54639o39428
12381B23628k35609J90469P5325j3502j02877N4620R7419l27322J86681M02427
$$ y = [428041, 610620, 234426, -82671, -179404, -41264, -190860, -405364, -511468, -452070, -314921, 79684, 239931, 364171, 876471, 1594492, 1302433, 725427, 618663, 428612, 571205, 1070746, 923637, 724622, 385527, -492795, -976614, -1066642, -949765, -411962, 172588, 232868, 147983, -75332, -532477, -624011, -435979, -476543, -183099, 462162, 1004071, 891118, 551513, 179776, -254964, -504798, -415681, -347520, -145777, -55687, -259265, -581262, -155360, 448775, 449156, 393980, 572380, 528243, 356862, 350562, 447489, 442221, 138299, 25767, 510064, 737805, 777180, 689641, 889607, 1217695, 863056, 223628, -11981, 178488, 253813, 240311, 137434, 192054, 289473, -37849, 148832, 551259]
12371E51259m60607p01356m94188J9814K94817J76736J75096n6259j47846J51462
12361d91072L84208K84057k01620J08478K74789Q0519k10417m3944N20972L48422
12351A054392k80854l98774j53067j67397j58927j11871J4801N1050R3751p0931
12341a27827j66950l05381k60173r8759k010m37061k21392L26770O62951P17573
12331H7741O30704L69146K7623K19852k97123k72998l86589k30166r6168r1399
12321c9377l02380n75599k89558j95763N26076M63090L57990J2539j42227k89880
12311d75089k9702J97033J71596J01187k961L1601j25990M09461K58102j10100
12301D25138O1976j89671j64936j03256j01068J30647j14941m48062j52763o1410
$$ y = [551259, 90652, -610704, -1104892, -1085078, -790261, -613525, -438429, -494688, -642534, -491072, -106864, 177193, -24427, 84051, 358840, 439359, 228942, 184998, 705970, 1054392, 773538, 374764, 221697, 54300, -104627, -216498, -201697, -150647, -56896, -127827, -294777, -600158, -860331, -959090, -961100, -1398161, -1619553, -1292783, -629832, 87741, 718445, 1087591, 1115214, 1335066, 1037943, 764945, 378356, 148190, 52022, -39377, -341757, -917356, -1206914, -1402677, -876601, -413511, -55521, -42982, -185209, -475089, -504791, -307758, -136162, -34975, -37936, -6335, -132325, 277136, 535238, 425138, 487114, 297443, 132507, 29251, -71817, 58830, -56111, -504173, -656936, -718346]
12291g18346j36943K630L3702L02936J10283j93406j42930L83564O32142M18679
12281F92311M03232j60669l42717j23506l98434l03435M1074J84559O70370K97815
12271I60600l86695j27885p2188k04887j45644j3617K0019J09915J30266R0581
12261C60465R0594j21504L01305J71263o30882m21970O6165M55501J27617j19083
12251B79471j03222p5175K9027k67232K2130L52631J19419N9372r5448j49300
12241A71673N55185P79593K65857j43389n94170r02943k48771L37321J46920k57736
12231A09540K73498J99555m06057J83217O12601P6341k76733L5872n801m73730
12221C28303l12033j13857k77325j05974J69111j0531m99229q585M28470M94631
$$ y = [-718346, -855289, -852659, -818957, -516021, -405738, -599144, -742074, -358510, 273632, 692311, 1095543, 934874, 592157, 468651, 70217, -233218, -192144, -7585, 662785, 960600, 573905, 446020, 373832, 168945, 23301, 9684, 29703, 139618, 269884, 360465, 451059, 329555, 630860, 802123, 171241, -250729, -184564, 270937, 398554, 279471, 176249, 101074, 130101, -137131, -115001, 237630, 357049, 416421, 320973, 171673, 726858, 1506451, 1772308, 1628919, 1034749, 131806, -116965, 220356, 367276, 109540, 383038, 582593, 176536, 359753, 972354, 1048695, 771962, 807834, 802033, 328303, 16270, -97587, -374912, -480886, -311775, -322306, -821535, -830120, -401650, 92981]
12211I2981P07833o6725n14914j98371K00742O33010K86328r3896j83864j50487
12201G12637j65347l73303l69368k02480r6457P3703Q9492p8887J46185L49132
12191H5307n310N69336M06808j75608m55875m18421J5466Q2543M694l65910n42610
12180g99580l9997L43093J67250L17499M56774J14365j26707m00130k52795L15217
12170I4989p9438m20835j36473P4812K73563K84024J06736O1203K21476K89754
12160G69811j00866m59010m04501j15161l17808k93929l6604j71889k0958O55037
12150d95878O98117L16749j32817k58547J38732k45944l54052K98685j1141m74688
12140e20784l68246J16133N04216L25740Q5295J30729k29863j51919L88734P36
$$ y = [92981, 800814, 734089, 219175, 20804, 221546, 854556, 1140884, 1046988, 863124, 712637, 547290, 173987, -195381, -397861, -494318, -420615, -331123, -410010, -263825, 85307, 79997, 649333, 1056141, 880533, 424658, 6237, 21703, 104246, 108940, -256970, -799580, -839577, -496484, -329234, -11735, 445039, 559404, 432697, 32567, -220228, 94989, 15551, -405284, -541757, -466945, -193382, 90642, 197378, 258581, 480057, 769811, 668945, 209935, -194566, -309727, -627535, -921464, -958068, -1129957, -1150915, -495878, 202239, 518988, 386171, 127624, 266356, 20412, -333640, -34955, -46096, -520784, -889030, -772897, -268681, 57059, 142354, 273083, 43220, -108699, 280035, 280771]
12130B80771k47748k6862k36573k58526J92438J82165K9902l8870J8786J76002
12120G1485K49202L2120J84799M56925n5911j14310J8964L70099K32176k23782
12110A221767k18020k97483n02584j84915l58787j012942m76136P529L82485J76355
12100a262731k4916L62509J58943k57219j68409M05115N80455L38636n4650k25947
12090a48214j8334k77987k16099J37286n1516o5824j87449l50679n6485K01501
12080a033800M66104N68053J30824m66390m58535J32289K5914J94480L84920J93747
12070A37606k1581j62818k01991j65989j70989N3447m4540K70333L62791J32864
12060A89133J59566N61894j22681o86541o02392k15509K72556q0233l05195l39456
$$ y = [280771, 33023, 6161, -230412, -488938, -296500, -114335, -84433, -123303, -104517, 71485, 320687, 352807, 537606, 994531, 938620, 824310, 843274, 1213373, 1445549, 1221767, 1003747, 706264, 203680, 18765, -340022, -1352964, -1829100, -1821571, -1439086, -1262731, -1287647, -925138, -766195, -1023414, -1191823, -786708, -206253, 132383, 77733, -148214, -166548, -444535, -660634, -523348, -574864, -640688, -828137, -1178816, -1235301, -1033800, -567696, 357, 131181, -335209, -793744, -661455, -635541, -441061, -56141, 137606, 116025, -46793, -248784, -414773, -585762, -532315, -576855, -306522, 56269, 189133, 348699, 910593, 787912, 101371, -501021, -716530, -443974, -524207, -829402, -1168858]
12050a168858m79434k01794L73749m9556j13220K62529r5599j21901M36294L03651
12040h54139N20098N05147q7095j73057O4236L26379J39057j54631j70865r5591
12030A9539o756j26591Q0903k46193j28128L49911j31372M8926K54196J01002
12020B15437K77089J1120l69232l71002k63552N9741L6607Q8014K7705N1540j26440
12009c62973R6723J29500o9591M62686Q65143M34457k13978m62522o19358k85312
11999b5225j09556J89232L08594P5039j55211j98366m59001j17532K94106J34408
11989f3512J23532J96280K90443k3756j41301R5599J06327q0142Q937j12633k34631
11978A65143O5598K14571j70263k97560n8810J29606J5569l83776k2005k317j65093
$$ y = [-1168858, -1648292, -1850086, -1476337, -1525893, -1639113, -1376584, -1472183, -1594084, -1157790, -854139, -334041, 171106, 84011, -89046, -24810, 301569, 440626, 285995, 115130, 19539, 12783, -113808, -32905, -279098, -407226, -57315, -188687, -139761, 114435, 215437, 492526, 503646, 134414, -236588, -500140, -440399, -403792, -315778, -288073, -236533, -362973, -266250, -136750, -206341, 256345, 1121488, 1555945, 1341967, 879445, 260087, -25225, -134781, 54451, 363045, 438084, 282873, 84507, -374494, -492026, -197920, -63512, 60020, 256300, 546743, 522987, 381686, 477285, 583612, 503470, 512407, 399774, 165143, 230741, 445312, 275049, -22511, -81321, 48285, 63854, -319922, -341927, -344244, -509337]
11967e09337J42280J95452J30774J17141o825j85166J47721J22158l06563k51927
11957d04292q9429L39652J54961Q2895J83881k01238k40823J95710J05692j13397
11947A3612L86306L15999j1609k40646k75375K78906N40275L74577m0095l58032
11937I83918p08010n84310Q4407N67932L04095J05135m6709k26781p33372p13387
11927i67082l38735K91611P33738P10695K28368k12887k60650M1992K8447N0896
11917C06393N0890q1844J9058K15341K05427J74854Q9987J53952L2724j18261
11907A048521j30688o314K37997J29552R1477j37539n0174Q3210k68620l30131
11897F67291j47774K45475L80609K42138K3984j62560j11784K58988L40404m30413
$$ y = [-509337, -367057, -171605, -40831, 76310, 69485, -115681, 32040, 154198, -152365, -404292, -493721, -154069, 892, 83787, 267668, 66430, -174393, 21317, 127009, 13612, 399918, 715917, 704308, 463662, 188287, 467193, 1007468, 1382045, 1341950, 983918, 275908, -308402, -223995, 343937, 648032, 753167, 706458, 479677, -253695, -967082, -1305817, -1014206, -280468, 430227, 658595, 445708, 185058, 227050, 255497, 306393, 357283, 275439, 294497, 509838, 715265, 890119, 980106, 1134058, 1166782, 1048521, 917833, 911519, 1149516, 1279068, 1370545, 1233006, 1182832, 1266042, 997422, 667291, 519517, 764992, 1145601, 1387739, 1411723, 1249163, 1137379, 1396367, 1736771, 1306358]
11887A306358p24019M3521M82166L69932J2134j94374k45556J75427M41357J61556
11877A828502J89917M87628J74794j04727r2118P13329J265237Q62386N10725
11868E835673J65425J66424M73299Q58554R79207R51851R03072P81263J69339
11859A1284107l12788o47726o41185j96868m20648n56631n57021o93566n18303
11850F739371l03418l22398p27614o70167j39759j39274m46447o99293m43638
11841B847363n18117n43706p1703Q1249K91971L55128k9186r4306J28880j78383
11831B269190o75012n47735J40813P01450J71662m35163j930L50361J78117k0016
11821B131737j15547k55817k58412j33043j86839k08330j41146M56170M10878
$$ y = [1306358, 582339, 625860, 1108026, 1477958, 1490092, 1295718, 1050162, 1225589, 1666946, 1828502, 2018419, 2506047, 2680841, 2576114, 2483996, 3197325, 4462562, 5324948, 5835673, 6001098, 6167522, 6640821, 7499375, 8478582, 9430433, 10333505, 11114768, 11284107, 10971319, 10323593, 9682408, 9485540, 9064892, 8508261, 7951240, 7257674, 6739371, 6435953, 6113555, 5385941, 4715774, 4576015, 4436741, 3990294, 3291001, 2847363, 2329246, 1785540, 1713837, 1795086, 2087057, 2442185, 2412999, 2318693, 2447573, 2269190, 1594178, 1046443, 1187256, 1888706, 2060368, 1625205, 1623275, 1973636, 2151753, 2131737, 2016190, 1760373, 1501961, 1368918, 1182079, 973749, 832603, 1288773, 1699651]
11812A699651j49617j76842K40403J25376l67997j90065K02702N79326L93381
11803B356318q0295k84028j75271k13102j58794K36793J00867J87773L31495J91444
11793B493200J25779M0864j27410K84286Q77212O77302M45553k59629k08662q1206
11783D267289J84168M74330L42477K27748J13073m99418m83292K17393Q21532
11774E665300M52880K57105M04726M02872M06264M40038O89801J085126J007493
11765A0811605Q33900N63192Q98172J812341K064492K382247K679828K735208
11757B4780985L062381K993487K350521J576662L47057j277827k876773m286784
11749B6669709m006106l102182k717071k782051k817168k289369j416169p23362
$$ y = [1699651, 1550034, 1373192, 1613595, 1738971, 1370974, 1180909, 1383611, 1962937, 2356318, 2276023, 1991995, 1816724, 1603622, 1444828, 1681621, 1782488, 1970261, 2301756, 2493200, 2618979, 2659843, 2532433, 2816719, 3693931, 4371233, 4816786, 4557157, 4348495, 4267289, 4451457, 4925787, 5268264, 5496012, 5609085, 5109667, 4626375, 4843768, 5665300, 6118180, 6375285, 6780011, 7182883, 7589147, 8029185, 8718986, 9804112, 10811605, 11645505, 12208697, 13106869, 14919210, 16983702, 19365949, 22045777, 24780985, 27843366, 30836853, 33187374, 34764036, 35111093, 33833266, 30956493, 26669709, 22663603, 19561421, 16844350, 14062299, 11245131, 8955762, 7539593, 6816231]
11741F816231l32257n43881m05036m53673o00431o62346m13348J93225L17128
11732C915612j90245m60170n03948l04296k25206l8754k71961j17586M52645P4101
11722B330192r0045j06526k64256k6730J65815K46601R31748J199421J137724
11713E523944O07024p16171j127828o77090p68057n50049j34306o643m46022l32986
11703A371816O2789n8762j16575j98086k92767l01908K10304J26130k00803j95639
11693D06499J16725L71621J56851J99321K8492j37811k47658j1655j8874j18287
11683G45224l19181L44387K66637J84328J49281l35453l36743j37501q9707M0586
11673E11858J61640m79300n53846k91762k35234l2955K01598J29151k33748k60005
$$ y = [6816231, 6483974, 5940093, 5535057, 5081384, 4480953, 3818607, 3405259, 3598484, 3915612, 3725367, 3265197, 2761249, 2456953, 2231747, 2192993, 1921032, 1803446, 2256091, 2330192, 2240147, 2133621, 1869365, 1842635, 2008450, 2255051, 3186799, 4386220, 5523944, 6130968, 5414797, 4286969, 3609879, 2841822, 2291773, 2157467, 2150824, 1704802, 1371816, 1434605, 1375843, 1259268, 1061182, 768415, 466507, 676811, 802941, 602138, 406499, 523224, 894845, 1051696, 1251017, 1279509, 1141698, 894040, 882385, 863511, 745224, 426043, 770430, 1037067, 1221395, 1370676, 1035223, 698480, 560979, 471272, 511858, 673498, 194198, -359648, -651410, -886644, -919599, -718001, -588850, -822598, -1082603]
11663a082603J10355L20843L76652j3816J91882K61940J47282N14374P595l84760
11653D49744l74168p1965K23279L73362j46421k68624P2677N894j97154j93411
11643a26787M9179j12108j58680Q5785N1694j26196J02319M08013L44078k18384
11633B98913o66318n42021k30650K61741K78129J62755Q8722N3101N24910L29828
11623E59110P476K44568L77152j95778l99258l13395l50276o2519O42390K20459
11613G29929R5897j48865m16374j59976J24692k39556j61096N0407l51884l02373
11603g79199j48970K14140L69202P4290n29000l44577Q5506P7455L26476O29875
11593b4802K47853n117J75666j44645l92318k36629o4681L5744j47552j97112
$$ y = [-1082603, -972248, -651405, -274753, -288569, -96687, 165253, 312535, 826909, 834504, 449744, 75576, 3611, 226890, 600252, 453831, 185207, 257884, 263778, 66624, -126787, -77608, -189716, -348396, -262611, -210917, -337113, -234794, 173219, 517297, 298913, -367405, -909426, -1140076, -878335, -600206, -437451, -348729, -295628, 229282, 559110, 566586, 811154, 1188306, 992528, 593270, 279875, -70401, -132920, 509470, 729929, 825826, 676961, 260587, 100611, 225303, -14253, -175349, -124942, -476826, -779199, -928169, -714029, -344827, -270537, -799537, -1144114, -1058608, -981153, -654677, -24802, 223051, 217934, 393600, 248955, -143363, -379992, -444673, -408929, -556481, -753593]
11583g53593O7812J09908k271J68172N8813j55636Q3830J55948l1167N5324L30419
11572H7559K57000p4787L9426N15829Q06790K75284k88154p95015r08345p6148
11562a60561J45542J30369J92493K57178L31322k06770m57734J59602k6308m51704
11552h6571n28773j33466P0568M7287L07156J85933q5853l4845L58105N52303
11542F51844L67809j4404l03112l44695P5439o9664j71900L54345J10088j96902
11532D58848k01652j38205m26064j37197L73716Q0332j55565J53428M19628J18164
11522E45433l3433K28027J07215k26093j35954Q1941O8398k43668N5911o7325
11512C80452n00920l84631L4636M0950L91107M50190K82543K36810j97506l20161
$$ y = [-753593, -685781, -575873, -578144, -409972, -351159, -506795, -422965, -267017, -298184, -242860, 87559, 344559, 269772, 309198, 825027, 1631817, 1907101, 1618947, 823932, -84413, -160561, -15019, 115350, 307843, 565021, 896343, 689573, 231839, 391441, 365133, -86571, -615344, -748810, -678242, -630955, -323799, -137866, -223719, -258564, 99541, 651844, 1019653, 1005249, 702137, 357442, 432881, 363217, 191317, 545662, 655750, 458848, 257196, 118991, -307073, -444270, -70554, 9778, -145787, 7641, 427269, 545433, 512000, 740027, 847242, 621149, 485195, 567136, 635534, 391866, 447777, 380452, -120468, -505099, -470463, -429513, -38406, 411784, 694327, 931137, 733631, 413470]
11502D13470j42249k38702k98278J23110L07996J97715M16586L40834L65896K8615
11492A514993l60993j40704j72748j29836J68420Q29n70357n06846J57867L66500
11482C27125j52229m22653J88661N69262N32562j00528k01175l9911O9121p2074
11472F98161q4981J42154j96105k81499j63894k62770l69522J15773K32769l3903
11462b03817k87858m36757p6036Q4237K34711M81996K57314k4953K7183K73402
11452C29422K46829M91025N8509l74434k02032l03235K9069j84427n4126N3106
11442H9706j19555M69804O51929o4721k98809m28812p2979k23860l4559j25757
11432a57613m7895k29306O2098L48786n5371j09344J25556l20179k62823P81484
$$ y = [413470, 271221, 32519, -265759, -142649, 165347, 363062, 779648, 1120482, 1486378, 1514993, 1154000, 1013296, 840548, 710712, 879132, 879961, 309604, -197242, -39375, 327125, 174896, -247757, -59096, 510166, 1042728, 942200, 741025, 701114, 770235, 698161, 613180, 755334, 559229, 277730, 113836, -148934, -518456, -402683, -169914, -203817, -491675, -928432, -1004468, -920231, -685520, -203524, 53790, 28837, 56020, 329422, 576251, 1067276, 1125785, 751351, 549319, 246084, 275153, 90726, 36600, 89706, -29849, 439955, 1091884, 1027163, 728354, 299542, 226563, 2703, -31856, -157613, -205508, -434814, -372716, -23930, -79301, -188645, -63089, -383268, -646091, 135393]
11422A35393Q04263J46031L04007L68575J53223K59102l10011m91151k40967o84254
11412D44211l89635L20584j06535n42905j41176L04891R3477n1503m22171p6319
11402e67081L04119r8309m30079j89499P0038K57732R9971k83416K05444N96606
11392c4474q9554j86689K1929K15800J25173k02408k61960k61996L09089Q70083
11382E04993P9065l784R1945l9472m2179L8006k63100o6557m18253n43843o324
11371f69503j0362R8062J94607l1045k29215k84171K659L13392q0779p1620p5943
11360h43918m95995Q3532O06942O93714O08524P2263m29061l07598j84524p1216
11350b67337M69129K89062m72351n99064q0931j24756M1328K76087L68178o1721
$$ y = [135393, 939656, 1085687, 1389694, 1758269, 1911492, 2170594, 1860583, 1369432, 1128465, 444211, 54576, 375160, 268625, -274280, -415456, -110565, -17088, -68591, -490762, -567081, -262962, -361271, -791350, -980849, -910811, -653079, -553108, -836524, -631080, -34474, -124028, -310717, -288788, -72988, 52185, -150223, -412183, -674179, -365090, 504993, 584058, 580274, 672219, 632747, 590568, 628574, 365474, 298917, -119336, -663179, -669503, -679865, -581803, -387196, -418241, -647456, -931627, -928968, -615576, -696355, -767975, -843918, -1339913, -1256381, -649439, 44275, 652799, 725062, 296001, -11597, -196121, -267337, 201792, 490854, 18503, -580561, -661492, -786248, -744920, -468833, -100655, -162376]
11340a62376j39448M3263j40058q2646O46199N32204o9720p77862p84908M35681
11330d99671O86151K01036j47362K34110K1076j44750n1174j46066j44506k50726
11320b41882N2739J96928J31843K36276J09494l56967k65114J85591L02279J00376
11310D51563n00593m02190J21276J91165L67762j02422n19123r7289l0892m17904
11300i38647n40471k6801M76968P20568N59893K56108K7879j45578j34829K7734
11290B82824m39512l48812N31812L79668k27285j06117K90586M35127Q7792p9859
11280H06224Q7934J411L0887J2829o9100J08907k4417k13158j10242R231k09778
11269D30728k55008J40246K82386N25959J89937k62204l02712m1472J33491j24077
$$ y = [-162376, -301824, -258561, -398619, -481265, 164934, 697138, 627418, -150444, -935352, -499671, 186480, 387516, 240154, 474264, 495340, 350590, 299416, 153350, 8844, -241882, -189143, 7785, 139628, 375904, 485398, 128431, -136683, 48908, 351187, 451563, -49030, -451220, -329944, -138779, 228983, 126561, -392562, -489851, -520743, -938647, -1479118, -1505919, -1028951, -308383, 251510, 507618, 535497, 389919, 255090, 282824, -156688, -505500, 26312, 405980, 178695, 72578, 363164, 798291, 886083, 806224, 894158, 895569, 926456, 939285, 870185, 979092, 954675, 741517, 631275, 640506, 430728, 175720, 315966, 598352, 1124311, 1314248, 1052044, 749332, 707860, 841351, 717274]
11259G17274m90412k05589M9010k7683k21610j33889m59564o35330K37918Q59363
11249c10512P16281J15171r1046P9291q5492j74977k32805m18469r7987K60386
11239b40159L25678Q0796N3479o0661j38917k37375J10419J75807M8508J10504
11229B28079K84572k6451m22281n9557L29344L45285k64495j37069J23160j93745
11219B06842r5332K1274j38665K16374L53863L41780L50917n06855n19392R3307
11209C24113L55283j35957l95427j12321J78665M69323L39960n80413j44487N33080
11199H31819J88478J52229k39085j60399L11299K77676M00234L7772O0799m377
11189A856445r9593j33207k50828k58406k53630m25506r8249j58821j87366j6225
$$ y = [717274, 226862, 21273, 70283, 42600, -179010, -312899, -772463, -1407793, -1169875, -310512, 405769, 520940, 429894, 509185, 423693, 248716, 15911, -402558, -500545, -240159, 85519, 166315, 219794, 159133, 20216, -217159, -106740, 69067, 117575, 228079, 512651, 486200, 63919, 4362, 333706, 678991, 414496, 277427, 400587, 206842, 111510, 132784, -5881, 210493, 564356, 906136, 1257053, 750198, 230806, 324113, 679396, 543439, 148012, 35691, 214356, 683679, 1023639, 443226, 298739, 831819, 1020297, 1172526, 933441, 773042, 1084341, 1362017, 1762251, 1800023, 1860822, 1856445, 1756852, 1623645, 1372817, 1114411, 860781, 435275, 337026, 178205, -9161, -25386]
11179b5386M10596K03268j98981k03186l21598N2185J71582J24080k75405o49965
11169g12810P6403N16710L68510J44534m40756m67209l79510j21520j10621l149
11159a129418N26316M97078M8137J43466J24877K0112j45705k29215p4178L21747
11149A03217j3255k48874j09394J28826r8554r8569k23477o69439j17796M09338
11139i37977O53990Q89589J89456m98606k54626L45443M64280J43802k48949k16607
11129E29795J93757R8595j49761j23277O0276l13062l10893L02668J22121k86828
11119A23391n74820l44567R173N4002J5188J24097L87279L71439o1280l06284
11109b02382n24112j97488M35863M37638K96323N62352N6172r7476j72937k73926
$$ y = [-25386, 385210, 588478, 389497, 186311, -135287, -83102, 88480, 212560, -62845, -712810, -636407, -119697, 248813, 393347, -47409, -514618, -894128, -1015648, -1126269, -1129418, -603102, -106024, -57887, 85579, 210456, 230568, 84863, -144352, -218530, 103217, 89962, -158912, -268306, -139480, -238034, -336603, -560080, -1229519, -1347315, -937977, -283987, 605602, 795058, 296452, 41826, 387269, 851549, 995351, 746402, 529795, 723552, 822147, 672386, 549109, 609385, 296323, -14570, 288098, 410219, 123391, -451429, -795996, -786823, -732821, -717633, -593536, -206257, 165182, 103902, -202382, -726494, -923982, -488119, -50481, 245842, 808194, 864366, 766890, 593953, 320027]
11099C20027K05933M70998j3100n18012P8313M28696J15438Q3478J71083k07053
11089A135801l41617o78866l42954j13975k21160J34737M85938N23031N37575
11080A118510J81117o9774k08779l06098J10539l04334j42552k67425p7449J37913
11070A71668K36324M72078k19926l89179j35500l50236K24328M62676K26627m7098
11060F51762j7432O08906M35825k51295m26539j7379L2491k88339n11754J57729
11050C73975N48612r739k99147J07754K37836Q3006q8529N5383k3765l56607r6331
11039E32448N07067L99837K51006J67315J75740J64455j31641n32859m22386j99571
11029I11411l49351L19120O13963M1140m37347k71906N5996o9680j89856n4782
$$ y = [320027, 525960, 996958, 983858, 465846, 544159, 972855, 1088293, 1171771, 1342854, 1135801, 794184, 115318, -227636, -341611, -562771, -428034, 57904, 580935, 1118510, 1299627, 1229853, 1021074, 714976, 825515, 521181, 378629, 111204, 33755, 171668, 407992, 880070, 660144, 270965, 135465, -214771, 9557, 472233, 698860, 651762, 634330, 1243236, 1679061, 1427766, 1001227, 983848, 1016339, 728000, 216246, 373975, 922587, 912848, 613701, 721455, 959291, 1042297, 953768, 1009151, 985386, 628779, 532448, 1039515, 1439352, 1690358, 1857673, 2033413, 2197868, 2066227, 1533368, 1110982, 911411, 562060, 881180, 1495143, 1536283, 1098936, 827030, 883026, 813346, 623490, 568708]
11019E68708o4720K01503Q02299O48105N3011m35594p60895m73081l92432k4602
11009A22302M88095K28333N3849J10351J84502l3153j87216K2718J08259L87602
10999A485642L05077J92794j50867R0156L8398n9998J94741O43751Q55440N56037
10989D151171J53873O52543R14360O29380Q85726J332685J623767K160697K655290
10980A5159492K900154L375006L929081M375310N385638O209827O105024N775151
10972E3214683L865502m51401m974822p116283p645560p207316n976893m468115
10964A9239795l362008k882451k693887k007430j400630q19331m19781n44737
10956E109540p26498m00859l25256l29045p121L45805M52112M37335L73635j8238
$$ y = [568708, 503988, 705491, 1507790, 2155895, 2208906, 1773312, 1012417, 539336, 146904, 122302, 610397, 838730, 892579, 1002930, 1187432, 1154279, 967063, 989781, 1098040, 1485642, 1790719, 1983513, 1832646, 1922802, 1961200, 1901202, 2095943, 2739694, 3595134, 4151171, 4305044, 4957587, 5871947, 6501327, 7387053, 8719738, 10343505, 12504202, 15159492, 18059646, 21434652, 25363733, 29739043, 35124681, 41334508, 47439532, 53214683, 57080185, 56628784, 51653962, 44537679, 36892119, 29684803, 23707910, 19239795, 15877787, 12995336, 10301449, 8294019, 6893389, 6074058, 5654277, 5109540, 4383042, 3982183, 3656927, 3327882, 3320761, 3666566, 4118678, 4556013, 4929648, 4911410]
10946D911410K15873p528l24834j35621p16408j232279n38756J7465k49103k75487
10936A664732n6233J68040Q2471P1878J81391J56301j20661j86636M3628J9726
10926B024637r2047l72091l30815l96474m05814q314J93165m3509j0944L08896
10916H66690j19778k76537k05972j58289l310M97500N75273J84380j28683k43807
10906I87467j09030j88103k69098j76566M7286J67932K91678O27584j59121q96708
10896C23321r11768m4940L51117M61003K25701J1200l02458k22134r8521p5599
10886b83078j89640M757L33716J80571J164N2192o9137q86056p12385j93171M72357
10875a288710P70023O85026L41552l17494j04541p1181l2958K28388o3224L176
$$ y = [4911410, 5127283, 5119755, 4794921, 4659300, 3942892, 2710613, 2171857, 2189322, 1940219, 1664732, 1608499, 1776539, 1859010, 1930888, 2112279, 2268580, 2147919, 1961283, 2004911, 2024637, 1932590, 1560499, 1229684, 833210, 427396, 419082, 612247, 568738, 557794, 866690, 746912, 470375, 264403, 106114, 102804, 600304, 1175577, 1359957, 1231274, 987467, 878437, 690334, 421236, 244670, 291956, 459888, 751566, 1379150, 1220029, 323321, -588447, -633387, -282270, 178733, 404434, 415634, 113176, -108958, -207479, -283078, -472718, -467961, -134245, 46326, 47490, 99682, 30545, -855511, -1567896, -1761067, -1288710, -518687, 166339, 507891, 190397, 85856, 14675, -18283, 210105, 146881, 150057]
10865A50057K93286N30714P0280m59764o23499l43455k04685L61979P39527P5928
10855E90368m22343j0340L05846N6842m98885m30898K262k2045R0642M00682K79398
10844C41529K20329M38394N62430J050242N09137l44780l60130r9732l12074l89658
10834A615687l4619k52981o36695m43471l56486J69643Q4188K33696M63q9114
10824B90311J70493J54111j2603J79693M90995L03538p3335n00001n29337P1588
10814E45453J97912n7664n2360j59434j67961j40510l79231l45218Q7834K14859
10804b56320R0318m4311L53980N24847j04200l56500Q9626K70686J17020k16223
10794D68923j77074m99425j63851M15811K10867J4520k6065J17462L24239l08855
$$ y = [150057, 443343, 974057, 1044337, 584573, -38926, -382381, -587066, -225087, 514440, 590368, 168025, 157685, 463531, 520373, 21488, -409410, -407148, -429193, -338551, 62131, 341529, 561858, 1000252, 1562682, 2612924, 3122061, 2777281, 2417151, 2317419, 2005345, 1615687, 1581068, 1328087, 691392, 247921, -108565, 61078, 145266, 378962, 379425, 290311, 460804, 614915, 602312, 782005, 1273000, 1576538, 1503203, 1003202, 473865, 545453, 743365, 685701, 633341, 473907, 305946, 165436, -213795, -559013, -471179, -256320, -166002, -210313, 143667, 668514, 564314, 207814, 297440, 568126, 685146, 468923, 291849, -207576, -371427, 44384, 255251, 269771, 243706, 361168, 685407, 376552]
10784C76552k04589J05976m19258m80707K61424j62320l36524K03770K78764j0914
10774c87826l04928L8130L51616J43045j03573J77485M17132J02310J597L18349
10764G53337N57284K29312j02824n27147o99174l68083J32500K99703J68695J68443
10754F12046Q6921l1139n2174j79107j02859J91708j49990j17039K9215k03661
10744H3921O8042L64682J13497q356K21196L33205O7677j43456J95304N27364
10734A823076P10511N92861J82566J93439M36031R18019O70644O55077L92021
10725F574245K42025k68173j017227j277159o88818j25098l62569j87049l48281
10716B541896n58467m31376l8221n4320k55523j89910J24968K92518K46001p0051
$$ y = [376552, 171963, 277939, -141319, -622026, -360602, -522922, -859446, -655676, -376912, -387826, -692754, -654624, -303008, -159963, -263536, -86051, 331081, 433391, 434988, 753337, 1310621, 1539933, 1437109, 909962, 210788, -157295, -24795, 274908, 443603, 612046, 698967, 667828, 615654, 436547, 333688, 525396, 375406, 258367, 287582, 83921, 151963, 516645, 630142, 621786, 842982, 1176187, 1243864, 1100408, 1295712, 1823076, 2533587, 3126448, 3309014, 3502453, 3938484, 4856503, 5527147, 6182224, 6574245, 6816270, 6548097, 5530870, 4253711, 3564893, 3439795, 3077226, 2890177, 2541896, 1983429, 1552053, 1513832, 1459512, 1203989, 1014079, 1139047, 1431565, 1677566, 1607515]
10706A607515P4675N46905K54368k78178l64357l50784l79141n86374p42564j83025
10696d00960J6427K16019M14501j1024m88375k40755J59870L05998J68779K6613
10686A67093J18043J79063l00157m50572k78052k07864j82347R7649P32275M83124
10676C58255J18493J36392J68471p4122k03837K8527J48416l18372n20268J44679
10666a3366N17902L63726R6218j66436k56206o49631l10242j4365O10770N07082
10656F85452k55127n22421j8828L38533P49203L3709o98471r03140l71415k67422
10646a229927q6439N11727J37805L69919M95916L81587K89235j24053p58842o06027
10636f19099K16463N19680K53088l75889m6067J60862j40275l60642o31870N1439
$$ y = [1607515, 1682190, 2229095, 2483463, 2205285, 1840928, 1490144, 1111003, 524629, -217935, -400960, -384533, -168514, 245987, 234963, -253412, -494167, -334297, -28299, 140480, 167093, 285136, 464199, 164042, -286530, -564582, -772446, -954793, -857144, -124869, 358255, 476748, 613140, 781611, 707489, 503652, 532179, 680595, 362223, -158045, -13366, 504536, 868262, 964480, 798044, 541838, -107793, -418035, -432400, 178370, 685452, 430325, -92096, -110924, 227609, 976812, 1010521, 312050, -591090, -962505, -1229927, -1316366, -804639, -666834, -296915, 199001, 580588, 869823, 745770, -13072, -619099, -402636, 117044, 370132, -5757, -51824, 109038, -31237, -391879, -1023749, -972310]
10626i72310L70092N11028L3113k15651L7294o9158j85853n13173m41192j46644
10616a592454P8616M33476Q87968M48568K91734N52305J72942k69359k11119l78393
10606D14284l46786P752J32968M18400J51379j1535k70025k09005L31041R8221
10596G16694J26193L51295q8378n94253j74825J00611j4833l35505o66972o30387
10586a210360o9887L55593J31596J17865m9632l4162K15881K63479K2017l55831
10576f13441n73623k09686J18489O31165O17858K2116p27746o36121j73815K09871
10566a334933L73641P225M20498M11472K3248k8544J52852j42495k14429m3486
10556c74951Q1320L11539M0866o4810k6394J90778M4526k2884j3836K71434J24105
$$ y = [-972310, -602218, -91190, -58077, -273728, -236434, -305592, -491445, -1004618, -1445810, -1592454, -1513838, -1080362, -192394, 256174, 547908, 1100213, 1273155, 1003796, 792677, 414284, 67498, 75250, 208218, 626618, 777997, 766462, 496437, 287432, 618473, 716694, 842887, 1194182, 1105804, 511551, 336726, 437337, 422504, 86999, -579973, -1210360, -1280247, -924654, -793058, -675193, -724825, -758987, -543106, -279627, -257610, -613441, -1187064, -1396750, -1278261, -647096, -29238, -7122, -734868, -1370989, -1544804, -1334933, -961292, -954067, -533569, -122097, -98849, -127393, 25459, -117036, -331465, -374951, -293631, 17908, 58774, -6036, -32430, 158348, 202874, 179990, 166154, 437588, 561693]
10545E61693j3992j86169n73687m67837k175M37038M48359N6446k49312j47589
10535a37225l69356o23032k70335K56120L33537L13470J77633O5362J49015J83185
10525G8374n9763j84821q3509m97774k74516J82734L17046J43442l8327k5750
10515d42864M44854K41949j01288j93725k1573j4631p4702J1652j5144k4364J35767
10504e4069N72009J47107R3051K93730J6488m59365n33326m6379K96695k45417
10494H0524p50712k21219L73297L67079K0336Q878j98312j54398k3920n3409o511
10483e58367L02192L56502N872l04940m0703O47593j13841o08622l43545m17851
10473a075710j95949L95439O84643J19252m64317l62133L6160M4688L52499M67446
$$ y = [561693, 547701, 361532, -212155, -679992, -682167, -245129, 203230, 259676, 10364, -137225, -506581, -1129613, -1399948, -1143828, -810291, -496821, -319188, -253826, -104811, 78374, 18611, -166210, -249719, -747493, -1022009, -839275, -522229, -378787, -417114, -442864, 1990, 243939, 142651, -51074, -72647, -87278, -161980, -150328, -165472, -189836, -54069, 517940, 665047, 758098, 1051828, 1068316, 608951, 75625, 29246, 325941, 80524, -670188, -891407, -518110, -151031, -130695, -121817, -320129, -474527, -498447, -551856, -558367, -256175, 100327, 106199, -198741, -239444, 408149, 294308, -314314, -657859, -1075710, -1271659, -876220, -191577, -72325, -536642, -898775, -862615, -817927, -465428, 2018]
10463B018L52487J8760k45110l9916R8185M945k26055k85911j40523L14834J48865
10452B579P4232M3157k1565j21484m31326n76887k13765N99574N96881M06984
10442C58380J02461M8272K94097J11529l10420k29162R4430J19027K3921l34924
10432B77611k77913J75950K67098L27675N43651N3491l97791n03093m77857j18831
10422a30009K65778O2085J69139L9548k83167k75640k46417j03073L4329M3713
10412d23714l65403m5977K44770K98276K56602j44145m05759l83949k79647j30779
10402a379725o9161Q9185l7577j18847p3208J76570L2568J41976L88845M60855
10392c88519J39194j09477k25273Q4422J44486l68740j68551M62616K46961K53888
$$ y = [2018, 354505, 373265, 128155, 88239, 186424, 191369, -34686, -320597, -461120, -146286, 2579, 76811, 119968, 98403, -23081, -454407, -1031294, -1245059, -645485, -48604, 358380, 460841, 509113, 803210, 914739, 604319, 375157, 469587, 588614, 612535, 277611, -302, 175648, 442746, 770421, 1314072, 1367563, 969772, 466679, -11178, -130009, 135769, 197854, 366993, 406541, 123374, -152266, -398683, -501756, -467427, -423714, -789117, -835094, -590324, -292048, -35446, -179591, -585350, -969299, -1248946, -1379725, -1448886, -1359701, -1397278, -1516125, -1589333, -1412763, -1380195, -1238219, -849374, -388519, -249325, -358802, -584075, -499653, -355167, -723907, -892458, -429842, -182881, 71007]
10382G1007K52207k00017n1532J365j8394j35174J6500J59901K01819N03508J97884
10371I99074n9484o2117l58867l87566n00320k09452M29752N97072o1689j75655
10361B10748p0369k17558k11038L12780j91601p04631o04215j62798L90254K38629
10351a009799J67735M79892N68681K03181n82275n50011K84147N61011L94931
10342E17493j2462j1013k52347j73249M08900L81893l15155l42196m27294p78070
10332a003500l09865N46501L84954J56166N31642L6973m51607j39386J37861J83875
10322G3614O2479k41060p3998K59370J65642m03058l43985k50394l03063l05895
10312a360348J47901M39775M1307J56836L21685N03118L758l44338q5674j82947
$$ y = [71007, 323214, 123197, 71665, 73030, 54636, -80538, -64038, 95863, 297682, 801190, 999074, 939590, 877473, 518606, 131040, -369280, -578732, -148980, 448092, 386403, 210748, 140379, -77179, -288217, 24563, -167038, -871669, -1475884, -1638682, -1248428, -1009799, -842064, -362172, 206509, 409690, -172585, -722596, -438449, 122562, 517493, 505031, 494018, 241671, 68422, 477322, 859215, 544060, 201864, -225430, -1003500, -1313365, -766864, -381910, -225744, 305898, 342871, -108736, -248122, -110261, 73614, 136093, -104967, -178965, 80405, 246047, -157011, -500996, -751390, -1054453, -1360348, -1212447, -772672, -731365, -574529, -252844, 250274, 254032, -90306, -175980, -358927]
10302c58927k52706R3197M2487l80981l39983M57195O52888N2574j22172m6936
10292b03364J65762o1852k15187J88255M0892k79421l8K66266K84467L21040k74310
10281B32510o08928j86975K08201r8527J55662L43629k66977L4042M63022O8306
10271C43965p19352l56162K23531J36069k4151N7358J24411J15826m1359l03078
10261d42942n44871n92502q3135N63566N89230M500m86015k15800L91078O27954
10251a88937L53311P28458J48662m46030n28821l65696r6954p3567K75303K64130
10241F9859l17428k46888J43050O5468n15499l8657K86373Q6205M1557k2072k7667
10230d75699L54862J18901r5040p8597j63065n14163j54309M82544L13097J38640
$$ y = [-358927, -611633, -518436, -475949, -856930, -1196913, -739718, -86830, -34256, -156428, -203364, -37602, -99454, -314641, -126386, -85494, -364915, -364953, -98687, 185780, 506820, 232510, -376418, -563393, -355192, -453719, -298057, 45572, -221405, -187363, 275659, 343965, -375387, -731549, -508018, -371949, -396100, -338742, -214331, -98505, -139864, -442942, -987813, -1580315, -1663450, -1099884, -510654, -506154, -992169, -1207969, -816891, -188937, 164374, 892832, 1041494, 595464, 66643, -299053, -396007, -469574, -194271, 69859, -247569, -494457, -351407, -285939, -801438, -840095, -553722, -467517, -425960, -448032, -475699, -120837, -1936, -96976, -175573, -338638, -852801, -1007110, -524566, -211469, -72829]
10220g2829K7712L18878j38372l28988j0063k67487o7931L50765J64397k3837
10210d7755L42904L94582m7073J22778k6075o51821n44824j51671J50410M80679
10200B2134N70980J88003n14426q09151j93062N2786o2999J14449K56390L55964
10190a8932L84146j68705l16126j05626l65160j28862q0156k2592M26828K8281
10180c66904m15645l5960L8658P3291L47306N10803K77716p1499k01629k09629
10170e3492L9889j303l9418M12594L99338k16719l44000j50555L1234J23116K63082
10159D63766K07110m18703j70763L3883r1164o7478R5996L17682R8551k18642
10149B50238l02464l9369L67717M1638m55018l31399p3242J04461K05488j2323
$$ y = [-72829, -45117, 273761, 135389, -193599, -203662, -471149, -539080, -188315, -23918, -47755, 295149, 689731, 642658, 765436, 739361, 87540, -457284, -608955, -458545, 22134, 593114, 781117, 266691, -542460, -735522, -682736, -745735, -631286, -374896, -18932, 365214, 196509, -119617, -225243, -590403, -719265, -799421, -822013, -395185, -366904, -782549, -818509, -779851, -706560, -359254, 151549, 429265, 357766, 156137, -53492, -13603, -14906, -54324, 358270, 757608, 540889, 196889, 46334, 77568, 200684, 463766, 670876, 252173, 81410, 115293, 24129, -43349, 52647, 370329, 468880, 250238, -52226, -91595, 276122, 317760, -137258, -468657, -541899, -437438, -231950, -244273]
10139b44273J71677k27883k19080N3156J43787n1866k08900R7918J49971L096
10129c32397O8183j94829j61137l5043k53354j02435M8550l1622J28248K69115
10119e96721n4692k96895r9870K37100L85200L48490L26237M721M1075k08961
10109H5684l79293K24197J68491J94386j36102m07408j54886J8829P707K72133
10099a06262L97652l56231p85214j13385j02551j07514P7221K30823K53209J20520
10089d91732J82966L3623j99397l52145j63306M80113N97794Q4207m3876J21959
10079B50206O5180o1908m02886k09042L99744L31317J01629m60532p70538l80480
10069a137310J62202L47171M11172j11301l52705k18061J1473K36771J89248j42727
$$ y = [-244273, -72596, -300479, -519559, -466403, -322616, -374482, -583382, -485464, -335493, -332397, -264214, -459043, -620180, -655223, -908577, -1011012, -962462, -994084, -865836, -596721, -651413, -948308, -1048178, -811078, -425878, -77388, 248849, 253570, 294645, 85684, -293609, -69412, 99079, 293465, 157363, -250045, -404931, -386102, -378395, -106262, 291390, -64841, -850055, -963440, -1065991, -1173505, -1096284, -865461, -612252, -491732, -308766, -275143, -474540, -826685, -989991, -509878, 87916, 172123, 128247, 250206, 315386, 253478, -149408, -358450, 41294, 372611, 474240, 13708, -756830, -1137310, -975108, -627937, -216765, -328066, -680771, -898832, -887359, -650588, -461340, -604067]
10059f04067k6888k2761l77350m43920k36007K4706N30304O92382P6243J250L47889
$$ y = [-604067, -630955, -653716, -1031066, -1474986, -1710993, -1686287, -1155983, -463601, -387358, -386108, -38219]
$$ [...]
##END NTUPLES=NMR SPECTRUM
##END=
