##TITLE=C13_SR124_rek5T_1
 DMSO-d6, 22400 sc

 9.6.2022
##JCAMPDX= 6.0         $$ Bruker NMR JCAMP-DX V2.0
##DATA TYPE= NMR SPECTRUM
##DATA CLASS= NTUPLES
##ORIGIN= UXNMR, Bruker Analytische Messtechnik GmbH
##OWNER= root
$$ XWIN-NMR		Version 3.5
$$ Fri Jun 10 13:44:37 2022 Russian Standard Time (UT+4h)  she@DPX200
##.OBSERVE FREQUENCY= 50.327896
##.OBSERVE NUCLEUS= ^13C
##.ACQUISITION MODE= SIMULTANEOUS
##.ACQUISITION SCHEME= undefined
##.AVERAGES= 22401
##.DIGITISER RES= 17
##SPECTROMETER/DATA SYSTEM= spect
##.PULSE SEQUENCE= zgpg30
##.SOLVENT NAME= CDCl3
##.SHIFT REFERENCE= (INTERNAL, CDCl3, 0, 222.653)
##AUDIT TRAIL= $$ (NUMBER, WHEN, WHO, WHERE, WHAT)
$$ ##TITLE= Audit trail, XWIN-NMR		Version 3.5
$$ ##JCAMPDX= 5.01
$$ ##ORIGIN= Bruker BioSpin GmbH
$$ ##OWNER= she
$$ F:/spectra/data/she/nmr/c13/1/pdata/1/auditp.txt
$$ ##AUDIT TRAIL=  $$ (NUMBER, WHEN, WHO, WHERE, WHAT)
(   1,<2022-06-10 13:42:50.78 +0400>,<she>,<DPX200>,
      <created by zg, POWCHK disabled, PULCHK disabled
       terminated by command 'halt'
       configuration hash MD5:
       00 E9 B6 7A A2 85 ED C7 34 08 36 98 17 FE 4E 26
       data hash MD5: 32K
       19 8B 7E 1F AB 39 90 1A F8 69 E1 44 49 1F 8D 32>)
(   2,<2022-06-10 13:42:54.35 +0400>,<she>,<DPX200>,
      <Start of raw data processing
       efp BC_mod = 2 LB = 1 FT_mod = 6 PKNL = 1 PHC0 = -370.2645 PHC1 = 40.08472 SI = 32K 
       data hash MD5: 32K
       0F B6 DC B2 C7 B9 A8 75 FD DC 72 49 E0 8F E3 AE>)
(   3,<2022-06-10 13:42:57.48 +0400>,<she>,<DPX200>,
      <abs ABSG = 5 
       data hash MD5: 32K
       7B 27 BB 00 71 20 4C CF 00 21 FD 08 49 18 88 BD>)
(   4,<2022-06-10 13:43:47.82 +0400>,<she>,<DPX200>,
      <pk PHC0 = 7.192424 PHC1 = -8.599998 
       data hash MD5: 32K
       60 EF 58 16 63 94 48 82 39 55 E5 61 67 E9 E5 CC>)
(   5,<2022-06-10 13:43:50.89 +0400>,<she>,<DPX200>,
      <abs ABSG = 5 
       data hash MD5: 32K
       F1 34 FE 1C F7 0A 6E 85 14 8F 4A 47 85 6F A7 46>)
$$ ##END=
$$ 
$$ hash MD5
$$ 63 1C C1 D3 6D 8B 56 83 9D 8D D8 8F 0A BD 29 E5
##$RELAX= 
##$RELAX= 
##$RELAX= 
##$RELAX= 
##$RELAX= 
##$RELAX= 
##$RELAX= 
##$RELAX= 
$$ Bruker specific parameters
$$ --------------------------
##$DU= <F:/spectra>
##$EXPNO= 1
##$NAME= <c13>
##$PROCNO= 1
##$TYPE= <nmr>
##$USER= <she>
##$AMP= (0..31)
100 100 100 100 100 100 100 100 100 100 100 100 100 100 100 100 100 100 
100 100 100 100 100 100 100 100 100 100 100 100 100 100 
##$AQSEQ= 0
##$AQ_mod= 1
##$AUNM= <au_zg>
##$AUTOPOS= <>
##$BF1= 50.322709
##$BF2= 200.13
##$BF3= 50.322709
##$BF4= 500.13
##$BF5= 500.13
##$BF6= 500.13
##$BF7= 500.13
##$BF8= 500.13
##$BYTORDA= 1
##$CFDGTYP= 0
##$CFRGTYP= 5
##$CHEMSTR= <none>
##$CNST= (0..31)
1 1 145 1 1 1 1 1 1 1 1 1 1 1 1 1 1 1 1 1 1 1 1 1 1 1 1 1 1 1 1 1 
##$CPDPRG= <waltz16>
##$CPDPRG1= <>
##$CPDPRG2= <waltz16>
##$CPDPRG3= <>
##$CPDPRG4= <mlev>
##$CPDPRG5= <mlev>
##$CPDPRG6= <mlev>
##$CPDPRG7= <mlev>
##$CPDPRG8= <mlev>
##$CPDPRGB= <>
##$CPDPRGT= <>
##$D= (0..31)
$$ [...]
##$SUBNAM4= <"">
##$SUBNAM5= <"">
##$SUBNAM6= <"">
##$SUBNAM7= <"">
##$SUBNAM8= <"">
##$SUBNAM9= <"">
##$SW= 239.972175391363
##$SWIBOX= (0..15)
0 1 3 0 0 0 0 0 0 0 0 0 0 0 0 0 
##$SW_h= 12077.2946859903
##$TD= 32768
##$TD0= 1
##$TE= 0
##$TE2= 300
##$TE3= 300
##$TEG= 300
##$TL= (0..7)
120 120 120 120 120 120 120 120 
##$TP= (0..7)
150 150 150 150 150 150 150 150 
##$TP07= 0
##$TPNAME0= <>
##$TPNAME1= <>
##$TPNAME2= <>
##$TPNAME3= <>
##$TPNAME4= <>
##$TPNAME5= <>
##$TPNAME6= <>
##$TPNAME7= <>
##$TPOAL= (0..7)
0.5 0.5 0.5 0.5 0.5 0.5 0.5 0.5 
##$TPOFFS= (0..7)
0 0 0 0 0 0 0 0 
##$TUNHIN= 0
##$TUNHOUT= 0
##$TUNXOUT= 0
##$USERA1= <user>
##$USERA2= <user>
##$USERA3= <user>
##$USERA4= <user>
##$USERA5= <user>
##$V9= 5
##$VALIST= <valist>
##$VCLIST= <CCCCCCCCCCCCCCC>
##$VD= 0
##$VDLIST= <DDDDDDDDDDDDDDD>
##$VPLIST= <PPPPPPPPPPPPPPP>
##$VTLIST= <TTTTTTTTTTTTTTT>
##$WBST= 1024
##$WBSW= 4
##$XGAIN= (0..3)
0 0 0 0 
##$XL= 0
##$YL= 0
##$YMAX_a= 114377753
##$YMIN_a= -93026501
##$ZGOPTNS= <>
##$ZL1= 120
##$ZL2= 120
##$ZL3= 120
##$ZL4= 120
##$ABSF1= 222.6533
##$ABSF2= -17.34351
##$ABSG= 5
##$ABSL= 3
##$ALPHA= 0
##$AQORDER= 0
##$ASSFAC= 0
##$ASSFACI= 0
##$ASSFACX= 0
##$ASSWID= 0
##$AUNMP= <proc_1d>
##$AZFE= 0.1
##$AZFW= 0.5
##$BCFW= 0
##$BC_mod= 2
##$BYTORDP= 0
##$COROFFS= 0
##$CY= -3
##$DATMOD= 1
##$DC= 0
##$DFILT= <>
##$DTYPP= 0
##$F1P= 0
##$F2P= 0
##$FCOR= 0.5
##$FTSIZE= 32768
##$FT_mod= 6
##$GAMMA= 0
##$GB= 0
##$INTBC= 1
##$INTSCL= 4.134877e-10
##$ISEN= 128
##$LB= 1
##$LEV0= 0
##$LPBIN= 0
##$MAXI= 10000
##$MC2= 0
##$MEAN= 0
##$ME_mod= 0
##$MI= 0.1934396
##$NCOEF= 0
##$NC_proc= 2
##$NLEV= 6
##$NOISF1= 120.0001
##$NOISF2= 80.00006
##$NSP= 0
##$NTH_PI= 0
##$NZP= 0
##$OFFSET= 222.6533
##$PC= 1.4
##$PHC0= -363.0721
##$PHC1= 31.48472
##$PH_mod= 1
##$PKNL= yes
##$PPARMOD= 0
##$PSCAL= 0
##$PSIGN= 0
##$REVERSE= no
##$SF= 50.322730123286
##$SI= 32768
##$SIGF1= 140
##$SIGF2= 120
##$SINO= 11.81781
##$SIOLD= 32768
##$SREGLST= <13C.CDCl3>
##$SSB= 0
##$STSI= 32768
##$STSR= 0
##$SW_p= 12077.2946859903
##$SYMM= 0
##$S_DEV= 0
##$TDeff= 32768
##$TDoff= 0
##$TI= <>
##$TILT= no
##$TM1= 0
##$TM2= 0
##$TOPLEV= 0
##$USERP1= <user>
##$USERP2= <user>
##$USERP3= <user>
##$USERP4= <user>
##$USERP5= <user>
##$WDW= 1
##$XDIM= 32768
##$YMAX_p= 370745008
##$YMIN_p= -2598173
$$ End of Bruker specific parameters
$$ ---------------------------------
##NTUPLES= NMR SPECTRUM
##VAR_NAME=  FREQUENCY,     SPECTRUM/REAL,   SPECTRUM/IMAG
##SYMBOL=    X,             R,               I
##VAR_TYPE=  INDEPENDENT,   DEPENDENT,       DEPENDENT
##VAR_FORM=  AFFN,          ASDF,            ASDF
##VAR_DIM=   32768,         32768,           32768
##UNITS=     HZ,            ARBITRARY UNITS, ARBITRARY UNITS
##FACTOR=    0.368581032318806, 1,           1
##FIRST=     11204.5221812756, 0,            0
##LAST=      -872.772504714734, 0,           0
##MIN=       -872.772504714734, -2598173,    0
##MAX=       11204.5221812756, 370745008,    0
$$ Real data points
##PAGE= N=1
##DATA TABLE= (X++(R..R)), XYDATA
$$ [...]
$$ plain form
10557 678266 528205 170657 -324387 -772658 -1162619 -1148971 -446436 458986 937471 847566
10547 847566 535254 447639 316134 -516337 -828945 -926628 -1018020 -623346 -382130 -501843
10537 -501843 -221102 -647 -146338 38088 433616 352463 33806 217706 779204 990327
10527 990327 897603 993797 881616 338097 -111111 -47874 629541 1424156 1802222 1728543
10517 1728543 1864244 1620455 1284174 952197 248606 -317438 -747638 -1017152 -942856 -251960
10507 -251960 219398 175732 -70172 -200535 -205718 -275545 -280165 31965 317430 209903 114239
10496 114239 156029 -68989 -399478 -446615 -653017 -638301 -592591 -552599 -646058 -683676 -756169
10485 -756169 -744504 -551822 -831480 -669820 -392392 -572943 -546537 -311505 12662 411886
$$ packed form
10557F78266j50061l57548m95044m48271l89961J3648P02535R05422M78485q9905
10547H47566l12312q7615j31505q32471l12608r7683r1392L94674K41216j19713
10537e01843K80741K20455j45691J84426L95528q1153l18657J83900N61498K11123
10527I90327r2724R6194j12181n43519m49208O3237O77415P94615L78066p3679
10517A728543J35701k43789l36281l31977p03591n66044m30200k69514P4296O90896
10507b51960M71358m3666k45904j30363n183o9827m620L12130K85465j07527r5664
10496A14239M1790k25018l30489m7137k06402J4716M5710L9992r3459l7618p2493
10485g56169J1665J92682k79658J61660K77428j80551K6406K35032L24167L99224
$$ plain form
10475 411886 500111 432959 319729 590273 787589 560265 382276 170936 -184710 -556904
10465 -556904 -763722 -1104707 -1496303 -1939025 -2307419 -2334032 -2375615 -2209943 -1936120 -1555002
10455 -1555002 -996110 -742143 -582484 -592206 -518752 -308078 -410666 -588003 -232152 250897
10445 250897 265938 219327 425098 136666 -364921 -519772 -293109 -146140 -215464 32794
10435 32794 314606 50097 -248913 -305628 -99488 367534 732438 587966 210709 -90060
10425 -90060 -507616 -743250 -861589 -853215 -763481 -1057961 -1222899 -1122140 -701511 -458059
10415 -458059 -251858 -234261 -858135 -1441800 -1574304 -1382037 -582739 343482 624224 186646
10405 186646 -363715 -493119 -804960 -1441640 -2151457 -2527912 -2598173 -2510072 -2116730 -1443607
$$ packed form
10475D11886Q8225o7152j13230K70544J97316k27324j77989k11340l55646l72194
10465e56904k06818l40985l91596m42722l68394k6613m1583J65672K73823L81118
10455a555002N58892K53967J59659r722P3454K10674j02588j77337L55851M83049
10445B50897J5041m6611K05771k88432n01587j54851K26663J46969o9324K48258
10435C2794K81812k64509k99010n6715K06140M67022L64904j44472l77257l00769
10425i0060m17556k35634j18339Q374Q9734k94480j64938J00759M20629K43452
10415d58059K06201J7597o23874n83665j32504J92267P99298R26221K80742m37578
10405A86646n50361j29404l11841o36680p09817l76455p0261Q8101L93342O73123
$$ plain form
10395 -1443607 -842856 -635932 -628267 -508137 -804766 -1137204 -1082751 -1084495 -768976 -230117
10385 -230117 208016 550082 516901 123165 -300441 -295092 -225544 4375 118776 373032
10375 373032 357049 122877 270233 449761 437224 378789 159893 -323854 -253116 122447
10365 122447 123589 -352139 -743793 -987398 -1004788 -597079 -109691 -70944 -364277 -667443
10355 -667443 -735341 -415868 -354913 -493075 -392048 -119818 125233 194784 191240 136542 367764
10344 367764 175706 -139523 -60914 -192146 -339644 -271689 -83593 -228182 -504645 -264150
10334 -264150 113534 266921 172745 -288436 -999629 -1039823 -546532 -582599 -552247 -34486
10324 -34486 564027 831035 669434 602278 603603 237850 331573 491901 683650 274422
$$ packed form
10395a443607O00751K06924P665J20130k96629l32438N4453j744L15519N38859
10385b30117M38133L42066l3181l93736m23606N349O9548K29919J14401K54256
10375C73032j5983k34172J47356J79528j2537n8435k18896m83747P0738L75563
10365A22447J142m75728l91654k43605j7390M07709M87388L8747k93333l03166
10355f67443o7898L19473O0955j38162J01027K72230K45051O9551l544n4698K31222
10344C67764j92058l15229P8609j31232j47498O7955J88096j44589k76463K40495
10334b64150L77684J53387r4176m61181p11193m0194M93291l6067L0352N17761
10324c4486N98513K67008j61601o7156J325l65753R3723J60328J91749m09228
$$ plain form
10314 274422 -270153 -255418 241792 439330 -76934 -390969 -411872 -414191 -759114 -1195343
10304 -1195343 -1207084 -787793 -49787 546948 641482 523336 428959 441534 168530 -203227
10294 -203227 -559962 -677976 -799979 -556962 -341541 -608760 -909219 -806716 -390254 -359844
10284 -359844 -669306 -930995 -721179 -474176 -149085 175316 118058 -147610 -209848 -514859
10274 -514859 -1041889 -929390 -762477 -992111 -830915 -445964 -560586 -861777 -994316 -832486
10264 -832486 -658616 -651538 -976272 -1531124 -1355565 -824385 -733650 -925251 -938300 -664659
10254 -664659 -468790 -616098 -526739 -484024 -299496 74313 -61365 -470894 -762131 -940065
10244 -940065 -788972 -449284 -327783 -641347 -776739 -1223911 -1528198 -1333220 -974376 -897847
$$ packed form
10314B74422n44575J4735M97210J97538n16264l14035k0903k319l44923m36229
10304a195343j1741M19291P38006N96735R4534j18146r4377J2575k73004l71757
10294b03227l56735j18014j22003K43017K15421k67219l00459J02503M16462L0410
10284c59844l09462k61689K09816K47003L25091L24401n7258k65668o2238l05011
10274e14859n27030J12499J66913k29634J61196L84951j14622l01191j32539J61830
10264h32486J73870P078l24734n54852J75559N31180R0735j91601j3049K73641
10254f64659J95869j47308Q9359M2715J84528L73809j35678m09529k91237j77934
10244i40065J51093L39688J21501l13564j35392m47172l04287J94978L58844P6529
$$ plain form
10234 -897847 -841983 -371078 -99004 -102942 -40815 161892 211625 -256469 -758248 -785111 -546031
10223 -546031 -529360 -200376 -154617 -366241 -516372 -657023 -854319 -1073873 -806343 -642934
10213 -642934 -967947 -1057288 -644402 -336950 -310370 -313395 -322958 -209961 -273104 -416667 -670026
10202 -670026 -1047445 -1392476 -1383828 -1013726 -767731 -538244 -115399 353147 692567 737538
10192 737538 238724 -103099 257178 163135 -460734 -574062 -675188 -1245306 -1069641 -266259
10182 -266259 -191016 -507726 -600428 -306151 109209 405195 287149 -105270 -175912 -463920
10172 -463920 -647350 -440778 -356990 -511536 -726430 -554217 -588411 -659835 -380859 -272794
10162 -272794 -782318 -1120564 -1427704 -1546264 -1268841 -943628 -829654 -317002 49449 -223282
$$ packed form
10234h97847N5864M70905K72074l938O2127K02707M9733m68094n01779k6863K39080
10223e46031J6671L28984M5759k11624j50131j40651j97296k19554K67530J63409
10213f42934l25013q9341M12886L07452K6580l025r563J12997o3143j43563k53359
10202f70026l77419l45031Q648L70102K45995K29487M22845M68546L39420M4971
10192G37538m98814l41823L60277r4043o23869j13328j01126n70118J75665Q03382
10182b66259P5243l16710r2702K94277M15360K95986j18046l92419p0642k88008
10172d63920j83430K06572Q3788j54546k14894J72213l4194p1424K78976J08065
10162b72794n09524l38246l07140j18560K77423L25213J13974N12652L66451k72731
$$ plain form
10152 -223282 -688497 -574670 -375568 -318464 -207726 24235 122785 337754 334086 10172
10142 10172 -47342 132478 258687 -118001 -817307 -1182087 -1264134 -947192 -659715 -875166
10132 -875166 -1023866 -1174685 -1006986 -747603 -817090 -906739 -734300 -766053 -849033 -692807
10122 -692807 -208145 -292004 -823498 -630784 -473162 -692057 -883021 -757556 -611241 -712319
10112 -712319 -527262 -311917 -186463 207260 214935 -146102 -227548 -399645 -851744 -1199679
10102 -1199679 -1005167 -433858 131310 188940 -144824 -334249 -275594 -474820 -581560 -205222
10092 -205222 41526 18735 -200474 -522242 -615215 -416321 -725391 -1078025 -1416685 -1433111
10082 -1433111 -1219418 -993118 -519746 262140 661303 464760 -16587 -602614 -391119
$$ packed form
10152b23282m65215J13827J99102N7104J10738K31961R8550K14969l668l23914
10142A0172n7514J79820J26209l76688o99306l64780q2047L16942K87477k15451
10132h75166j48700j50819J67699K59383o9487q9649J72439l1753q2980J56226
10122f92807M84662q3859n31494J92714J57622k18895j90964J25465J46315j01078
10112g12319J85057K15345J25454L93723P675l61037q1446j72097m52099l47935
10102a199679J94512N71309N65168N7630l33764j89425N8655j99226j06740L76338
10092b05222K46748k2791k19209l21768r2973J98894l09070l52634l38660j6426
10082a433111K13693K26300M73372P81886L99163j96543m81347n86027K11495
$$ plain form
10073 -391119 167999 351902 180949 -53589 -172407 -178430 -247570 148796 646193 397131
10063 397131 -53755 -192749 40257 287169 547837 542280 -132527 -981490 -1072514 -891357
10053 -891357 -842396 -906652 -803447 -482852 -480665 -283842 -121439 -113410 -88627 70064 192366
10042 192366 -166498 -507106 -844216 -1037797 -1001956 -977604 -939905 -1167328 -1443828 -1213414
10032 -1213414 -888772 -893070 -843848 -881939 -1314556 -1651783 -1536383 -1231915 -826120 -457572
10022 -457572 -483265 -645098 -918204 -952392 -717719 -413028 45523 378978 211599 -13561
10012 -13561 -43578 78877 89549 -35524 28851 393235 546693 323340 -231244 -731279
10002 -731279 -605338 -115164 -239924 -557394 -340273 -120705 -182937 -573000 -1236223 -1134358
$$ packed form
10073c91119N59118J83903j70953k34538j18818o023o9140L96366M97397k49062
10063C97131m50886j38994K33006K46912K60668n557o74807q48963r1024J81157
10053h91357M8961o4256J03205L20595K187J96823J62403Q029K4783J58691J22302
10042A92366l58864l40608l37110j93581L5841K4352L7699k27423k76500K30414
10032a213414L24642m298M9222l8091m32617l37227J15400L04468M05795L68548
10022d57572k5693j61833k73106l4188K34673L04691M58551L33455j67379k25160
10012a3561l0017J22455J0672j25073O4375L64384J53458k23353n54584n00035
10002g31279J25941M90174j24760l17470K17121K19568o2232l90063o63223J01865
$$ plain form
9992 -1134358 -724291 -765889 -1174382 -1229463 -1265044 -1496851 -1376642 -1128524 -1042240 -1109652
9982 -1109652 -1308094 -1501698 -1454858 -1021423 -622774 -773137 -645064 -440953 -539463 -513182
9972 -513182 22794 353476 20684 -843637 -1269352 -1229730 -991337 -670805 -526597 -742404
9962 -742404 -1144954 -1380818 -1187495 -883374 -779125 -605684 -283434 104457 213170 61518
9952 61518 -184753 -189925 -15559 -254059 -436286 -180997 -378 -71600 -61037 -158557 -325613
9941 -325613 -584413 -957722 -1029260 -660392 50378 278982 -103486 -797373 -1393235 -1275061
9931 -1275061 -792279 -294332 -233052 -343132 -526675 -625560 -422570 -187596 -58292 -140169
9921 -140169 -374928 -503685 -804877 -1093248 -1086592 -1007917 -741553 -155916 376415 387685
$$ packed form
9992a134358M10067m1598m08493n5081l5581k31807J20209K48118Q6284o7412
9982a109652j98442j93604M6840M33435L98649j50363J28073K04111r8510K6281
9972e13182N35976L30682l32792q64321m25715L9622K38393L20532J44208k15807
9962g42404m02550k35864J93323L04121J04249J73441L22250L87891J08713j51652
9952F1518k46271n172J74366k38500j82227K55289J80619p1222J0563r7520j67056
9941c25613k58800l73309p1538L68868P10770K28604l82468o93887n95862J18174
9931a275061M82782M97947O1280j10080j83543r8885K02990K34974J29304q1877
9921a40169k34759j28757l01192k88371O656P8675K66364N85637N32331J1270
$$ plain form
9911 387685 64750 174030 305040 86268 -19805 -10609 228122 145621 201515 447676
9901 447676 254664 -379704 -673802 -438651 -390203 84411 642502 831565 447244 94299
9891 94299 107315 -191325 -861342 -861843 -725277 -671049 -724028 -787669 -558701 -517361 -605936
9880 -605936 -562414 -97878 451134 685288 397528 299898 261100 119572 -33951 45622
9870 45622 482552 892598 1191706 1198747 875864 691064 451414 169994 44304 15376
9860 15376 47989 290805 332227 -77168 -186148 -95332 203641 249359 84653 634492 919486
9849 919486 799472 957543 800721 598729 569740 607799 329718 -213750 -69006 562375
9839 562375 861719 341477 -45168 -86241 -242195 -66418 58271 -30901 156634 169326
$$ packed form
9911C87685l22935J09280J31010k18772j06073R196K38731q2501N5894K46161
9901D47676j93012o34368k94098K35151M8448M74614N58091J89063l84321l52945
9891I4299J3016k98640o70017n01J36566N4228n2979o3641K28968M1340q8575
9880f05936M3522M64536N49012K34154k87760r7630l8798j41528j53523P9573
9870D5622M36930M10046K99108P041l22883j84800k39650k81420j25690k8928
9860A5376L2613K42816M1422m09395j08980R0816K98973M5718j64706N49839K84994
9849I19486j20014J58071j56822k01992k8989L8059k78081n43468J44744O31381
9839E62375K99344n20242l86645m1073j55954J75777J24689q9172J87535J2692
$$ plain form
9829 169326 -137219 22522 360178 539793 809071 972188 617557 13204 -433935 -626756
9819 -626756 -168051 20597 -69038 -319570 -830291 -934178 -1044137 -963756 -713044 -511278
9809 -511278 -499649 -561151 -556166 -412462 -125136 -85434 -513055 -853235 -1122592 -1183230 -644591
9798 -644591 -487635 -342088 -344536 -404956 -395549 -973005 -946775 -532526 72682 72189 -681937
9787 -681937 -889482 -210911 283866 225704 517781 742954 743808 490122 265083 -42102
9777 -42102 -136770 203286 290551 181561 695706 1094836 1215398 1131371 720852 540986
9767 540986 197148 -151822 -405071 -566955 -545894 -378452 -77644 175432 119504 134652
9757 134652 424737 761653 1140462 1100194 789628 672096 274824 32900 76306 132463
$$ packed form
9829A69326l06545J59741L37656J79615K69278J63117l54631o04353m47139j92821
9819f26756M58705J88648q9635k50532n10721j03887j09959Q0381K50712K01766
9809e11278J1629o1502M985J43704K87326L9702m27621l40180k69357o0638N38639
9798f44591J56956J45547k448o0420R407n77456K6230M14249O05208m93p54126
9787f81937k07545O78571M94777n8162K92077K25173Q54k53686k25039l07185
9777d2102r4668L40056Q7265j08990N14145L99130J20562q4027m10519j79866
9767E40986l43838l48970k53249j61884K1061J67442L00808K53076n5928J5148
9757A34652K90085L36916L78809m0268l10566j17532l97272k41924M3406N6157
$$ plain form
9747 132463 103387 -76929 -466694 -944413 -993045 -352235 559521 851155 264731 -38241
9737 -38241 13350 -67635 -19096 88507 -76166 -263648 -522265 -604456 -536054 -498313 -269613
9726 -269613 -202031 -135641 -292746 -594458 -664319 -697325 -1119517 -1232270 -1291876 -1376426 -1486286
9715 -1486286 -1300392 -698710 -473244 -678636 -764580 -317857 78334 -211155 -1048396 -1326934
9705 -1326934 -1198576 -895815 -680698 -549040 -849619 -1197786 -1099173 -607083 -374425 -311757
9695 -311757 -391063 -398120 -10097 67087 328532 170927 -257746 -698058 -807507 -340706
9685 -340706 10207 -32711 -529160 -600909 -502584 -341088 -95021 -328351 -300246 -509567
9675 -509567 -970475 -1243592 -1280938 -1050123 -870267 -659424 -507497 -99566 41980 -88383
$$ packed form
9747A32463k9076j80316l89765m77719m8632O40810R11756K91634n86424l02972
9737c8241N1591q0985M8539J07603j64673j87482k58617q2191O8402L7741K28700
9726b69613O7582O6390j57105l01712o9861l3006m22192j12753n9606q4550j09860
9715a486286J85894O01682K25466k05392q5944M46723L96191k89489q37241k78538
9705a326934J28358L02761K15117J31658l00579l48167R8613M92090K32658O2668
9695c11757p9306p057L88023P7184K61445j57605m28673m40312j09449M66801
9685c40706L50913m2918m96449p1749R8325J61496K46067k33330K8105k09321
9675e09567m60908k73117l7346K30815J79856K10843J51927M07931J41546j30363
$$ plain form
9665 -88383 -426121 -645470 -560729 -225393 64655 184941 439953 367399 744017 1344274
9655 1344274 967631 45637 -494680 -641592 -648431 -385085 -261281 -399764 -647392 -630563
9645 -630563 -911019 -1071171 -774153 -1052307 -1121372 -849388 -296424 139149 -61429 -495163
9635 -495163 -782292 -948412 -1340406 -1602090 -1293921 -784892 -298621 -239747 -169153 -112259
9625 -112259 -260092 -262672 -231953 -424013 -582544 -660763 -974081 -1315060 -756185 -28109
9615 -28109 337772 359449 -142904 -667973 -1026639 -920997 -443014 -184488 27789 237317
9605 237317 -64731 -358411 -293766 -625536 -926707 -539864 -125539 202637 -145968 -499497
9595 -499497 -484104 -161192 -163534 -371781 -303083 -266234 -127049 -199582 -241750 99363 323261
$$ packed form
9665h8383l37738k19349Q4741L35336K90048J20286K55012p2554L76618O00257
9655A344274l76643r21994n40317j46912o839K63346J23804j38483k47628J6829
9645f30563k80456j60152K97018k78154o9065K71984N52964M35573k00578m33734
9635d95163k87129j66120l91994k61684L08169N09029M86271N8874P0594N6894
9625a12259j47833k580L0719j92060j58531p8219l13318l40979N58875P28076
9615b8109L65881K1677n02353n25069l58666J05642M77983K58526K12277K09528
9605B37317l02048k93680O4645l31770l01171L86843M14325L28176l48605l53529
9595d99497J5393L22912k342k08247O8698L6849J39185p2533m2168L41113K23898
$$ plain form
9584 323261 104896 -120888 14609 238205 574985 341806 -281869 -566768 -681998 -356914
9574 -356914 -500427 -755710 -354913 -166759 -367968 -497982 -636670 -518668 -106663 -188056
9564 -188056 -453028 -303702 -112997 103506 -108473 -435067 -444941 -114521 440191 640697
9554 640697 458438 561327 963324 704436 213566 279266 480242 447843 334768 191593
9544 191593 -69923 -326613 -345729 -15963 24335 -249245 -466937 -735972 -777034 -169509
9534 -169509 701960 1048877 701242 50321 -566985 -1037976 -1217462 -992882 -171566 197180
9524 197180 212710 658018 1010816 896868 736884 885733 922114 553716 -40676 -813459
9514 -813459 -1003704 -492192 -285977 -460946 -719520 -783588 -1056455 -1043967 -368253 -38523
$$ packed form
9584C23261k18365k25784J35497K23596L36780k33179o23675k84899j15230L25084
9574c56914j43513k55283M00797J88154k01209j30014j38688J18002M12005q1393
9564a88056k64972J49326J90705K16503k11979l26594r874L30420N54712K00506
9554F40697j82259J02889M01997k58888m90870O5700K00976l2399j13075j43175
9544A91593k61516k56690j9116L29766M0298k73580k17692k69035m1062O07525
9534a69509Q71469L46917l47635o50921o17306m70991j79486K24580Q21316L68746
9524A97180J5530M45308L52798j13948j59984J48849L6381l68398n94392p72783
9514h13459j90245N11512K06215j74969k58574o4068k72867J2488O75714L29730
$$ plain form
9504 -38523 14775 82639 -624793 -1295897 -1306333 -1015400 -610610 -220494 -335014 -356229 -265215
9493 -265215 -609871 -865807 -1036993 -1215973 -921664 -625371 -346929 -177401 -254264 -789971
9483 -789971 -1019456 -820756 -1059661 -1242413 -988181 -671475 -557608 -475636 -76806 -95164
9473 -95164 -577679 -590227 -381814 -555798 -787902 -776121 -722218 -756655 -854491 -787266 -997259
9462 -997259 -1104380 -1059768 -1142331 -1088070 -1233422 -1193111 -896261 -669405 -557334 -752116
9452 -752116 -707400 -769247 -904381 -912583 -1051822 -1207397 -1219145 -1212510 -1093911 -865901 -721667
9441 -721667 -618578 -401192 -174589 -77541 -35648 -170673 -395777 -415835 -161981 -59817
9431 -59817 29519 -245268 -597508 -523021 -332597 -311826 -455785 -866688 -910070 -649655 -640054
$$ packed form
9504c8523N3298O7864p07432o71104j0436K90933M04790L90116j14520k1215R1014
9493b65215l44656k55936j71186j78980K94309K96293K78442J69528p6863n35707
9483g89971k29485J98700k38905j82752K54232L16706J13867Q1972L98830j8358
9473i5164m82515j2548K08413j73984k32104J1781N3903l4437r7836O7225k09993
9462i97259j07121M4612q2563N4261j45352M0311K96850K26856J12071j94782
9452g52116M4716o1847j35134q202j39239j55575j1748O635J18599K28010J44234
9441g21667J03089K17386K26603R7048M1893j35025k25104k0058K53854J02164
9431e9817Q9336k74787l52240P4487J90424K0771j43959m10903m3382K60415R601
$$ plain form
9420 -640054 -603440 -359176 -155131 -361527 -589433 -887607 -1092774 -691621 -439298 -853271
9410 -853271 -928924 -558997 -289886 -308463 -516180 -376281 -49587 -262739 -402266 -369578
9400 -369578 -305499 -96886 -2671 -104025 -198715 -34615 -217151 -576482 -765610 -1082565
9390 -1082565 -707517 -259872 -411624 -220489 282850 -210426 -928967 -1351983 -1452993 -1044681
9380 -1044681 -517075 -399068 -745236 -1037547 -1112699 -986960 -887242 -1015375 -899179 -524446
9370 -524446 -749299 -1153193 -1096082 -550501 97833 471480 737403 739183 869812 875901 290446
9359 290446 -291801 -678786 -1015384 -1217632 -1014842 -662938 -752106 -471562 -42477 -382771
9349 -382771 -869818 -1020608 -806992 -787473 -662964 -781595 -1054442 -1221737 -999426 -893502
$$ packed form
9420f40054L6614K44264K04045k06396k27906k98174k05167M01153K52323m13973
9410h53271p5653L69927K69111j8577k07717J39899L26694k13152j39527L2688
9400c69578O4079K08613R4215j01354r4690J64100j82536l59331j89128l16955
9390a082565L75048M47645j51752J91135N03339m93276p18541m23016j01010M08312
9380a044681N27606J18007l46168k92311p5152J25739R9718j28133J16196L74733
9370e24446k24853m03894N7111N45581O48334L73647K65923J780J30629O089n85455
9359B90446n82247l86985l36598k02248K02790L51904q9168K80544M29085l40294
9349c82771m87047j50790K13616J9519J24509j18631k72847j67295K22311J05924
$$ plain form
9339 -893502 -1000946 -937214 -626282 -165558 188749 125883 -288741 -422979 -181172 -312054
9329 -312054 -348624 2178 184460 483868 490985 136479 373410 578481 413133 130935
9319 130935 -71381 -105676 89863 111728 -68681 -164879 -435325 -570438 -744231 -588290
9309 -588290 -567030 -904332 -824313 -510962 -363434 -484104 -837962 -858125 -705946 -521115
9299 -521115 -311038 -258566 -329727 -226591 -563783 -671828 -926267 -1448546 -1406551 -1053117
9289 -1053117 -642208 -737408 -825901 -110777 407473 396836 242161 -103078 -537617 -589463
9279 -589463 -710465 -476825 -124296 178739 151656 -234497 -484684 -438065 -571838 -598076
9269 -598076 -783960 -589252 283381 781670 847706 711734 339088 -236494 -800314 -1038747
$$ packed form
9339h93502j07444O3732L10932M60724L54307o2866m14624j34238K41807j30882
9329c12054l6570L50802J82282K99408P117l54506K36931K05071j65348k82198
9319A30935k02316l4295J95539K1865j80409r6198k70446j35113j73793J55941
9309e88290K1260l37302Q0019L13351J47528j20670l53858k0163J52179J84831
9299e21115K10077N2472p1161J03136l37192j08045k54439n22279M1995L53434
9289a053117M10909r5200q8493P15124N18250j0637j54675l45239m34539n1846
9279e89463j21002K33640L52529L03035k7083l86153k50187M6619j33773k6238
9269e98076j85884J94708Q72633M98289O6036j35972l72646n75582n63820k38433
$$ plain form
9259 -1038747 -868008 -826613 -1321823 -1505993 -1480232 -1292575 -1063269 -1057089 -1186017 -1317361
9249 -1317361 -1206245 -1225541 -697790 -13930 293893 189368 353537 680650 326672 16610
9239 16610 54294 548828 700265 159026 19415 -120339 -119299 -317982 -691443 -903177
9229 -903177 -726183 -496620 -40358 274573 143696 -47201 26215 -3979 -140197 -166199
9219 -166199 -371705 -190773 82455 -394777 -1149449 -1554578 -1540571 -1237941 -1090310 -1065960
9209 -1065960 -782141 -642087 -500393 -488909 -886948 -963754 -317757 227825 165408 155260
9199 155260 -129535 -230663 -308161 -358800 -256621 -271135 -214252 -294323 -561318 -956149 -949862
9188 -949862 -641741 -493782 -624971 -431713 -288744 54902 417609 428949 107937 -429124
$$ packed form
9259a038747J70739M1395m95210j84170K5761J87657K29306O180j28928j31344
9249a317361J11116j9296N27751O83860L07823j04525J64169L27113l53978l10062
9239A6610L7684M94534J51437n41239j39611j39754J040j98683l73461k11734
9229i03177J76994K29563M56262L14931j30877j90897P3416l0194j36218k6002
9219a66199k05506J80932K73228m77232p54672m05129J4007L02630J47631K4350
9209a065960K83819J40054J41694J1484l98039p6806O45997N45582o2417j0148
9199A55260k84795j01128p7498n0639J02179j4514N6883q0071k66995l94831O287
9188i49862L08121J47959j31189J93258J42969L43646L62707J1340l21012n37061
$$ plain form
9178 -429124 -428149 -448461 -692103 -936367 -1192832 -1581260 -1679439 -1399946 -816293 -161305 110347
9167 110347 85905 -326871 -488187 -330404 -317019 -687938 -1020871 -1184945 -930928 -708587
9157 -708587 -415981 -150537 -225605 -142934 -276426 -372433 -569615 -511723 -660809 -788754
9147 -788754 -664999 -1118753 -1562981 -1004765 -272957 -154548 -104704 -56409 -185159 -64757
9137 -64757 417906 399818 344713 -24578 -606150 -972141 -1092103 -764017 -298591 95357
9127 95357 56657 -225251 -474836 -628358 -765140 -1163839 -1128487 -1117965 -875613 -684097
9117 -684097 -649181 -330305 -210084 -253375 -421948 -789939 -985211 -916079 -1043569 -950362
9107 -950362 -641782 -757392 -800907 -673777 -441280 98182 238177 322119 629345 658427
$$ packed form
9178d29124R75k0312k43642k44264k56465l88428r8179K79493N83653O54988K71652
9167A10347k4442m12776j61316J57783J3385l70919l32933j64074K54017K22341
9157g08587K92606K65444p5068Q2671j33492r6007j97182N7892j49086j27945
9147g88754J23755m53754m44228N58216P31808J18409M9844M8295j28750J20402
9137f4757M82663j8088n5105l69291n81572l65991j19962L28086M65426L93948
9127I5357l8700k81908k49585j53522j36782l98699L5352J0522K42352J91516
9117f84097L4916L18876J20221m3291j68573l67991j95272O9132j27490R3207
9107i50362L08580j15610m3515J27130K32497N39462J39995Q3942L07226K9082
$$ plain form
9097 658427 710316 855148 690279 811982 917025 957952 1182726 1662093 1759456 1152429
9087 1152429 839287 868568 735630 682530 531458 715678 837010 1129106 1205344 1224166
9077 1224166 1125980 564907 45266 306617 866855 859574 658632 380331 278340 202342
9067 202342 74189 -117363 -125566 -213360 -551564 -716860 -1040997 -1227627 -989776 -591126
9057 -591126 -197795 -50395 4098 321316 787995 775411 211089 -423436 -717829 -524635
9047 -524635 -34875 580541 774370 595291 379519 -125791 -371977 -528935 -687570 -697999
9037 -697999 -780326 -778183 -248373 366740 415958 450119 911444 1092510 828586 264135 165317
9026 165317 636094 1066768 1184221 1281413 1334522 1344720 895229 923160 1412875 1542562
$$ packed form
9097F58427N1889J44832j64869J21703J05043M0927K24774M79367R7363o07027
9087A152429l13142K9281j32938n3100j51072J84220J21332K92096P6238J8822
9077A224166r8186n61073n19641K61351N60238p281k00942k78301j01991p5998
9067B02342j28153j91552q203q7794l38204j65296l24137j86630K37851L98650
9057e91126L93331J47400N4493L17218M66679j2584n64322o34525k94393J93194
9047e24635M89760O15416J93829j79079k15772n05310k46186j56958j58635j0429
9037f97999q2327K143N29810O15113M9218L4161M61325J81066k63924n64451r8818
9026A65317M70777M30674J17453R7192N3109J0198m49491K7931M89715J29687
$$ plain form
9016 1542562 1372383 1133832 1078363 1299166 1428570 1644075 1842993 1878997 1803518 1467634
9006 1467634 957173 483392 565863 806191 1072136 946007 478814 316794 690762 1106011
8996 1106011 1390321 1438334 1197527 785745 637061 564394 318270 -182573 -381450 -29919
8986 -29919 73626 -283283 -389647 -176899 234427 464213 647505 992845 1047554 863491
8976 863491 1032176 1284313 1086189 864082 585301 522196 676794 821733 1001072 1102071
8966 1102071 1216047 1394000 1064652 1122941 1710543 2316942 2229626 2349176 2538586 2441432
8956 2441432 2324060 2374983 2900899 2970497 2691321 2676384 2694902 2671001 2952076 2860770 2697371
8945 2697371 3023474 3378073 3306326 2832148 2284800 2106497 1813797 1392260 1326909 1244794
$$ packed form
9016A542562j70179k38551n5469K20803J29404K15505J98918L6004p5479l35884
9006A467634n10461m73781Q2471K40328K65945j26129m67193j62020L73968M15249
8996A106011K84310M8013k40807m11782j48684p2667k46124n00843j98877L51531
8986b9919J03545l56909j06364K12748M11326K29786J83292L45340N4709j84063
8976H63491J68685K52137j98124k22107k78781o3105J54598J44939J79339J00999
8966A102071J13976J77953l29348N8289N87602O06399q7316J19550J89410r7154
8956B441432j17372N0923N25916O9598k79176j4937J8518k3901K81075r1306j63399
8945B697371L26103L54599p1747m74178n47348j78303k92700m21537o5351q2115
$$ plain form
8935 1244794 975201 612266 493013 265956 164568 -31460 -106548 118318 353847 611803
8925 611803 933325 1508010 1675156 1095945 267398 -662229 -1021384 -652261 69485 385471
8915 385471 181437 148532 404486 1310419 2023483 1923147 1705697 1250005 1016669 1064625
8905 1064625 864198 517701 339139 815709 1254321 1678409 1907592 1591593 1153783 1266305
8895 1266305 1482354 1117480 782995 893304 1134789 941020 1249503 1675468 2118658 2722617
8885 2722617 2893632 2521420 2133326 2045814 2261170 2713382 2740011 2144454 1663215 1868384
8875 1868384 1892330 1504707 1346139 1508472 1561829 1631619 1130754 786900 939163 655550
8865 655550 528413 1221241 1512764 1339023 1071727 332700 -397927 -483039 -46691 202093
$$ packed form
8935A244794k69593l62935j19253k27057j01388j96028p5088K24866K35529K57956
8925F11803L21522N74685J67146n79211q28547r29627l59155L69123P21746L15986
8915C85471k04034l2905K55954R05933P13064j00336k17450m55692k33336M7956
8905A064625k00427l46497j78562M76570M38612M24088K29183l15999m37810J12522
8895A266305K16049l64874l34485J10309K41485j93769L08483M25965M43190O03959
8885B722617J71015l72212l88094q7512K15356M52212K6629n95557m81239K05169
8875A868384K3946l87623j58568J62333N3357O9790n00865l43854J52263k83613
8865F55550j27137O92828K91523j73741k67296p39027p30627q5112M36348K48784
$$ plain form
8855 202093 309371 500753 581814 566536 409872 -2647 -487744 -869150 -689774 -158656
8845 -158656 289258 369264 113233 51040 1453 -176007 -119112 -25046 -66744 57899 -6949
8834 -6949 -252872 -202354 374883 345033 29120 -152795 -172372 307350 983461 1030820 1056512
8823 1056512 1314311 1487073 1354237 1294210 1194928 1237804 1415084 1568676 1307291 1179306
8813 1179306 1233658 626763 597755 1138635 1437763 1118788 694605 810925 1142069 1348565
8803 1348565 1470019 1406579 1485319 1544133 1927957 2277887 2549723 2711365 2546934 2282903
8793 2282903 2623183 3167115 3227183 3027057 2882944 2617445 2160682 2242824 2620922 2638496
8783 2638496 2601259 2439761 1876914 1569578 1328610 911424 321978 308342 721220 1324537
$$ packed form
8855B02093J07278J91382Q1061j5278j56664m12519m85097l81406J79376N31118
8845a58656M47914Q0006k56031o2193m9587j77460N6895R4066m1698J24643o4848
8834f949k45923N0518N77237k9850l15913j81915j9577M79722O76111M7359K5692
8823A056512K57799J72762j32836o0027r9282M2876J77280J53592k61385j27985
8813A179306N4352o06895k9008N40880K99128l18975m24183J16320L31144K06496
8803A348565J21454o3440P8740N8814L83824L49930K71836J61642j64431k64031
8793B282903L40280N43932O0068k00126j44113k65499m56763Q2142L78098J7574
8783B638496l7237j61498n62847l07336k40968m17186n89446j3636M12878O03317
$$ plain form
8773 1324537 1486606 1213719 1305735 1296676 954718 1202841 1416559 1204164 842774 501408
8763 501408 254042 30166 674215 906191 464062 164391 591457 1104675 1103019 997138
8753 997138 532041 163388 -36843 18377 287771 710190 965915 588789 -23035 -210185
8743 -210185 -263396 -408543 -368188 -589032 -846218 -1125963 -849795 -513318 -882479 -1256616
8733 -1256616 -1049078 -691659 -462964 -298803 -208629 -359600 -449148 -357841 -355711 -178219
8723 -178219 -343405 -487273 -514517 -402028 -325300 -405557 -647195 -654035 -286096 -211869 -13072
8712 -13072 191970 706279 969743 786559 240194 -40251 -44852 -423795 -357621 83111
8702 83111 431473 408680 481153 517240 13350 -746316 -985173 -950072 -783249 -432408 -418543
$$ packed form
8773A324537J62069k72887R2016r059l41958K48123K13718k12395l61390l41366
8763E01408k47366k23876O44049K31976m42129k99671M27066N13218j656j05881
8753I97138m65097l68653k00231N5220K69394M22419K55725l77126o11824j87150
8743b10185n3211j45147M0355k20844k57186k79745K76168L36477l69161l74137
8733a256616K07538L57419K28695J64161R0174j50971q9548R1307K130J77492
8723a78219j65186j43868k7244J12489P6728q0257k41638o840L67939P4227J98797
8712a3072K05042N14309K63464j83184n46365k80445m601l78943O6174M40732
8702H3111L48362k2793P2473L6087n03890p59666k38857L5101J66823L50841J3865
$$ plain form
8691 -418543 -789628 -787220 -685004 -544900 -588854 -190045 114529 232544 430350 136613
8681 136613 -429448 -466424 -75785 -65077 -617307 -836329 -653567 -555218 -453642 -364514
8671 -364514 -241814 71103 379589 660689 889168 789565 473801 -72562 -281829 -164375
8661 -164375 77465 291931 140673 -13885 -171601 -323142 -91170 169800 346374 66291
8651 66291 -456994 -606268 -467059 -704363 -1002488 -716050 -254808 -21994 -179991 -332293
8641 -332293 -360016 -148209 -62435 -275997 -396407 -749900 -1096502 -912337 -525953 -280883
8631 -280883 -91058 -340319 -580452 -577248 -250722 -80189 109900 187523 -127054 -21817
8621 -21817 285552 115863 -344508 -718032 -1205255 -1340134 -952142 -257333 -7572 -409837
$$ packed form
8691d18543l71085K408J02216J40104m3954L98809L04574J18015J97806k93737
8681A36613n66061l6976L90639J0708n52230k19022J82762R8349J01576Q9128
8671c64514J22700L12917L08486K81100K28479r9603l15764n46363k09267J17454
8661a64375K41840K14466j51258j54558j57716j51541K31972K60970J76574k80083
8651F6291n23285j49274J39209k37304k98125K86438M61242K32814j57997j52302
8641c32293k7723K11807Q5774k13562j20410l53493l46602J84165L86384K45070
8631b80883J89825k49261k40133L204L26526J70533J90089P7623l14577J05237
8621b1817L07369j69689m60371l73524m87223j34879L87992O94809K49761m02265
$$ plain form
8611 -409837 -284426 183619 686218 849774 626135 198240 -733943 -1482741 -1403786 -1016723
8601 -1016723 -870308 -543861 -281547 -604925 -657447 -696683 -649277 -591718 -869693 -975187
8591 -975187 -790386 -203868 -38937 -505075 -721444 -920208 -1092539 -1360911 -1397980 -1508753
8581 -1508753 -1370277 -1264407 -1271544 -1007136 -409415 310229 526163 371741 427090 235258
8571 235258 -28956 -396992 -701466 -1071202 -1876108 -2301759 -1929394 -1060155 -207280 143161
8561 143161 -72312 -545606 -493070 -293897 -292726 -570562 -825189 -1169341 -944751 -688941
8551 -688941 -802597 -829810 -868182 -699173 -406378 -431045 -780417 -924557 -962226 -624272
8541 -624272 -564475 -978445 -1465231 -1855249 -1473937 -444149 -120057 -101391 107806 -245105
$$ packed form
8611d09837J25411M68045N02599J63556k23639m27895r32183p48798P8955L87063
8601a016723J46415L26447K62314l23378n2522l9236M7406N7559k77975j05494
8591i75187J84801N86518J64931m66138k16369j98764j72331k68372l7069j10773
8581a508753J38476J05870p137K64408N97721P19644K15934j54422N5349j91832
8571B35258k64214l68036l04474l69736q04906m25651L72365Q69239Q52875L50441
8561A43161k15473m73294N2536J99173J171k77836k54627l44152K24590K55810
8551f88941j13656k7213l8372J69009K92795k4667l49372j44140l7669L37954
8541f24272N9797m13970m86786l90018L81312J029788L24092J8666K09197l52911
$$ plain form
8531 -245105 -454608 -394550 -177894 -181013 -88979 590642 1071165 1385331 1841246 1980644
8521 1980644 1575879 1353675 1668481 2428446 3277686 3602053 3503048 3938137 4414406 4301864
8511 4301864 3621565 3079224 2607957 2337208 1974921 1541488 1110651 786286 500967 372261
8501 372261 307265 595082 345131 -170217 -405456 -422378 -512875 -545512 -459471 -582778 -407980
8490 -407980 -102418 -137876 -68442 224094 327403 183949 89582 263897 381803 384203 69212
8479 69212 -121331 77893 523874 769783 924401 978797 704675 116152 -331840 -37605
8469 -37605 187112 411450 479702 125868 30456 -222623 -528758 241322 699475 462921
8459 462921 462097 705064 890573 450052 -80721 -544465 -610463 -614395 -699645 -347562 -311682
$$ packed form
8531b45105k09503O0058K16656l119R2034O79621M80523L14166M55915J39398
8521A980644m04765k22204L14806P59965Q49240L24367r9005M35089M76269j12542
8511D301864o80299n42341m71267k70749l62287m33433m30837l24365k85319j28706
8501C72261o4996K87817k49951n15348k35239j6922r0497l2637Q6041j23307J74798
8490d07980L05562l5458O9434K92536J03309j43454r4367J74315J17906K400l14991
8479F9212j90543J99224M45981K45909J54618N4396k74122n88523m47992K94235
8469c7605K24717K24338O8252l53834r5412k53079l06135P70080M58153k36554
8459D62921q24K42967J85509m40521n30773m63744o5998l932q5250L52083L5880
$$ plain form
8448 -311682 -423290 -200979 -229755 -855410 -1745796 -2010528 -1513914 -918228 -878746 -1100015
8438 -1100015 -1184172 -758619 -315718 -261152 -124950 15413 -150290 -349766 -470290 -649031
8428 -649031 -814353 -733999 -841984 -1108092 -1354505 -1532680 -1216092 -916194 -774381 -560235
8418 -560235 -287573 -434574 -407158 101669 15523 -76929 405735 302334 -236182 -228581 -200116
8407 -200116 -191314 -215734 -370195 -39248 113358 -341584 -460680 -70480 17248 -236334
8397 -236334 -630271 -589871 -570628 -267387 126268 671237 1037765 677621 154876 -472446
8387 -472446 -801619 -568791 -52122 -90129 -190237 -476519 -1239084 -1539868 -1445388 -1334264
8377 -1334264 -1118738 -868291 -744587 -613339 -897747 -1234186 -1051781 -763000 -647083 -500705
$$ packed form
8448c11682j11608K22311k8776o25655q90386k64732M96614N95686L9482k21269
8438a100015q4157M25553M42901N4566J36202J40363j65703j99476j20524j78741
8428f49031j65322Q0354j07985k66108k46413j78175L16588K99898J41813K14146
8418e60235K72662j47001K7416N08827q6146r2452M82664j03401n38516P601K8465
8407b00116Q802k4420j54461L30947J52606m54942j19096L90200Q7728k53582
8397b36334l93937M0400J9243L03241L93655N44969L66528l60144n22745o27322
8387d72446l29173K32828N16669l8007j00108k86282p62565l00784R4480J11124
8377a334264K15526K50447J23704J31248k84408l36439J82405K88781J15917J46378
$$ plain form
8367 -500705 -483863 -623409 -673947 -708018 -690949 -335807 82849 397481 518661 572635 974939
8356 974939 657314 395332 439367 256033 167793 375885 762598 1030060 768993 521405
8346 521405 278821 47475 -232822 -553780 -740458 -730340 -280518 -286493 -280283 -51371 31670
8335 31670 184123 108889 -405153 -816110 -672964 -648631 -921803 -1010524 -870489 -575873
8325 -575873 -625554 -783619 -673278 -377343 77653 201096 366610 464213 10201 -237267
8315 -237267 -542726 -946442 -1389388 -1554380 -1036701 -582341 -455648 -159803 242310 136665
8305 136665 -113001 -121690 -73350 -328627 -601679 -513191 123807 546729 353244 -72574
8295 -72574 -311290 71401 367617 216377 25994 19027 -187240 -512891 -261657 257465
$$ packed form
8367e00705J6842j39546n0538l4071J7069L55142M18656L14632J21180N3974M02304
8356I74939l17625k61982M4035j83334q8240K08092L86713K67462k61067k47588
8346E21405k42584k31346k80297l20958j86678J0118M49822n975O210K28912Q3041
8335C1670J52453p5234n14042m10957J43146K4333k73172q8721J40035K94616
8325e75873m9681j58065J10341K95935M54996J23443J65514R7603m54012k47468
8315b37267l05459m03716m42946j64992N17679M54360J26693K95845M02113j05645
8305A36665k49666q689M8340k55277k73052Q8488O36998M22922j93485m25818
8295g2574k38716L82691K96216j51240j90383o967k06267l25651K51234N19122
$$ plain form
8285 257465 413599 147532 -275145 -656492 -1107701 -1931147 -2277553 -2129269 -1775908 -1160558
8275 -1160558 -692741 -407810 -497849 -547569 -915252 -1113898 -692564 -505751 -605875 -550219
8265 -550219 -201893 550892 985148 949404 610535 619829 771447 254710 -218281 -161694
8255 -161694 -297047 -752521 -1213168 -1078363 -833177 -1064602 -1034362 -861161 -718831 -518567
8245 -518567 -97558 247966 295850 79931 -217180 -409940 -132763 195456 416315 198204
8235 198204 -297973 -733112 -1058258 -976411 -798506 -488922 -212367 -253391 -107258 333354
8225 333354 402715 -475153 -992915 -861828 -686475 -580654 -559303 -123427 -19199 1886
8215 1886 87816 67995 -134470 -734236 -1063069 -887611 -716742 -976040 -1097824 -1204816
$$ packed form
8285B57465J56134k66067m22677l81347m51209q23446l46406J48284L53361O15350
8275a160558M67817K84931r0039m9720l67683j98646M21334J86813j00124N5656
8265e50219L48326P52785M34256l5744l38869R294J51618n16737m72991N6587
8255a61694j35353m55474m60647J34805K45186k31425L0240J73201J42330K00264
8245e18567M21009L45524M7884k15919k97111j92760K77177L28219K20859k18111
8235A98204m96177m35139l25146Q1847J77905L09584K76555m1024J46133M40612
8225C33354O9361q77868n17762J31087J75353J05821K1351M35876J04228K1085
8215A886Q5930j9821k02465n99766l28833J75458J70869k59298j21784j06992
$$ plain form
8205 -1204816 -1423198 -1289620 -847798 -490797 -262005 -333288 -584552 -686153 -852933 -672286
8195 -672286 -503403 -730208 -823879 -215275 562119 803589 881380 1176141 1530046 1824819
8185 1824819 1689277 1610557 1451043 1183376 698966 -58497 -791928 -1217467 -1241497 -1424107
8175 -1424107 -1462679 -1334149 -1096677 -584986 -327575 -37342 131054 -360543 -613105 -318459
8165 -318459 -547936 -920020 -537560 -41987 188575 154308 -67026 -353438 -748103 -893158
8155 -893158 -576818 -98724 238395 152037 -249522 -451182 -201650 -323620 -551188 -479386
8145 -479386 -382927 -499080 -453300 -497658 -806618 -1051354 -745256 -450598 -215996 47219
8135 47219 149832 308172 404526 -81061 -761071 -931279 -622397 -421976 -232919 -9163
$$ packed form
8205a204816k18382J33578M41822L57001K28792p1283k51264j01601j66780J80647
8195f72286J68883k26805r3671O08604P77394K41470P7791K94761L53905K94773
8185A824819j35542p8720j59514k67667m84410p57463p33431m25539k4030j82610
8175a424107l8572J28530K37472N11691K57411K90233J68396m91597k52562K94646
8165c18459k29477l72084L82460M95573K30562l4267k21334k86412l94665j45055
8155h93158L16340M78094L37119q6358m01559k01660K49532j21970k27568P1802
8145d79386R6459j16153M5780m4358l08960k44736L06098K94658K34602K63215
8135D7219J02613J58340R6354m85587o80010j70208L08882K00421J89057K23756
$$ plain form
8125 -9163 213069 302571 462032 757413 311043 -416472 -621223 -464110 -175337 170184
8115 170184 574868 673807 180424 -400206 -980779 -1285201 -1206374 -772216 -547728 -840300
8105 -840300 -826344 -676222 -252137 110470 380534 883414 606240 -116914 -744786 -772479
8095 -772479 -412224 -245913 105384 337146 -164650 -801249 -924823 -931427 -1148964 -1539483
8085 -1539483 -1320528 -411434 174694 300899 -14149 -242272 -370497 -618186 -986826 -1116834
8075 -1116834 -804261 -57542 463553 193725 -254846 -736110 -809462 -473363 36942 518293
8065 518293 581738 736814 765184 525632 136460 -488867 -849492 -633512 -469974 -788180
8055 -788180 -1031743 -798769 -945902 -1264155 -1463256 -1156100 -730906 -487161 -566626 -743242
$$ packed form
8125i163K22232Q9502J59461K95381m46370p27515k04751J57113K88773L45521
8115A70184M04684R8939m93383n80630n80573l04422P8827M34158K24488k92572
8105h40300J3956J50122M24085L62607K70064N02880k77174p23154o27872k7693
8095g72479L60255J66311L51297K31762n01796o36599j23574o604k17537l90519
8085a539483K18955R09094N86128J26205l15048k28123j28225k47689l68640j30008
8075a116834L12573P46719N21095k69828m48571m81264p3352L36099N10305M81351
8065E18293O3445J55076K8370k39552l89172o25327l60625K15980J63538l18206
8055g88180k43563K32974j47133l18253j99101L07156M25194K43745p9465j76616
$$ plain form
8045 -743242 -831089 -477507 -84734 87631 452138 783308 576785 434124 299864 236196
8035 236196 334369 545667 499515 29698 -400907 -595803 -414441 -347888 -411667 -200869
8025 -200869 -270822 -677820 -812720 -864026 -391725 136911 76696 -272232 -80358 110867
8015 110867 -191759 -333727 -224202 14101 108324 283843 443777 155532 -210903 -492012
8005 -492012 -436683 -491355 139072 601914 337842 14121 55527 361095 426293 207809
7995 207809 -70025 -130403 56646 -204618 -777002 -789193 -353954 -271333 -191255 104155
7985 104155 168675 160853 296153 213749 78226 376723 766245 867158 762835 244827
7975 244827 18772 285491 604783 745375 596529 216073 -87757 -618099 -944880 -839006
$$ packed form
8045g43242q7847L53582L92773J72365L64507L31170k06523j42661j34260o3668
8035B36196R8173K11298m6152m69817m30605j94896J81362O6553o3779K10798
8025b00869o9953m06998j34900n1306M72301N28636o0215l48928J91874J91225
8015A10867l02626j41968J09525K38303R4223J75519J59934k88245l66435k81109
8005d92012N5329n4672O30427M62842k64072l23721M1406L05568O5198k18484
7995B07809k77834o0378J87049k61264n72384j2191M35239Q2621Q0078K95410
7985A04155O4520p822J35300q2404j35523K98497L89522J00913j04323n18008
7975B44827k26055K66719L19292J40592j48846l80456l03830n30342l26781J05874
$$ plain form
7965 -839006 -507518 -63020 197265 185980 222693 392212 719031 912071 543854 301898
7955 301898 290416 249641 129551 84647 -200741 -372708 -353853 -199632 326807 833063
7945 833063 827906 451483 124648 -184094 -468943 -593654 -494987 -45069 233910 241762 320825
7934 320825 150133 85727 537133 690640 399404 -81534 -278250 -518278 -817654 -810000
7924 -810000 -719301 -262063 530008 914157 1188013 1365290 1120178 305683 -12021 117504
7914 117504 113383 248076 293592 48527 -279257 -404254 -462929 -158768 -82845 97843 152115
7903 152115 113450 -25925 -457002 -668468 -279602 16863 -62432 5803 -78148 -382135
7893 -382135 -432911 204543 338351 -309840 -745178 -1012083 -1093379 -773119 -268278 106679
$$ packed form
7965h39006L31488M44498K60285j1285L6713J69519L26819J93040l68217k41956
7955C01898j1482m0775j20090m4904k85388j71967J8855J54221N26439N06256
7945H33063n157l76423l26835l08742k84849j24711R8667M49918K78979P852P9063
7934C20825j70692o4406M51406J53507k91236m80938j96716k40028k99376P654
7924h10000R0699M57238P92071L84149K73856J77277k45112q14495l17704J29525
7914A17504m121J34693M5516k45065l27784j24997n8675L04161P5923J80688N4272
7903A52115l8665j39375m31077k11466L88866K96465p9295O8235q3951l03987
7893c82135n0776O37454J33808o48191m35338k66905q1296L20260N04841L74957
$$ plain form
7883 106679 200729 149496 143916 311014 431072 684009 904224 907034 766158 670986 458062
7872 458062 291183 287593 57813 46535 431627 693041 569814 743727 1105697 1273624
7862 1273624 1567700 1666077 1419623 1183380 1321977 1551444 1350400 1197296 1262148 1171221
7852 1171221 741243 659955 958406 1193611 1097571 1080351 1135304 842126 435855 119679
7842 119679 149363 381714 553227 873574 791060 575138 766919 1029397 1259105 1619760
7832 1619760 2027389 1664326 1182683 932901 683270 713877 701070 751938 910180 1300800
7822 1300800 1717548 1679666 1590649 1253006 889156 1629401 2628583 2894709 2976314 2772435
7812 2772435 2758899 3197031 3872814 4080711 3763953 3724421 4017703 4327489 4414977 4749450
$$ packed form
7883A06679R4050n1233n580J67098J20058K52937K20215K810j40876r5172k12924
7872D58062j66879l590k29780j1278L85092K61414j23227J73913L61970J67927
7862A273624K94076R8377k46454k36243J38597K29467k01044j53104O4852r0927
7852A171221m29978q1288K98451K35205r6040j7220N4953k93178m06271l16176
7842A19679K9684K32351J71513L20347q2514k15922J91781K62478K29708L60655
7832A619760M07629l63063m81643k49782k49631L0607j2807N0868J58242L90620
7822A300800M16748l7882q9017l37643l63850P40245R99182K66126Q1605k03879
7812B772435j3536M38132O75783K07897l16758l9532K93282L09786Q7488L34473
$$ plain form
7802 4749450 5516658 6519312 7627099 9050613 10515957 12608757 15535891 19196297
7794 19196297 23717483 28950358 34721390 40549205 45417633 49214403 51684252 51787139
7786 51787139 49836596 46154713 41557570 36805040 32684321 28928664 25032865 21865778
7778 21865778 19179802 16905177 15238876 14168865 13580541 12977110 11907696 10559575
7770 10559575 10158599 10267415 10376940 10648537 10760451 10431408 9805494 9214714 8750190
7761 8750190 8084879 7939881 8131565 8104397 8057644 8360653 8618383 8736666 8972285 9507598
7751 9507598 9878827 10534332 11507398 12604386 13901472 15661413 17830568 20155668 22984135
7742 22984135 26977574 32175903 38250636 45423161 54357735 65409199 79046455 95638357
$$ packed form
7802D749450P67208J002654J107787J423514J465344K092800K927134L660406
7794A9196297M521186N232875N771032N827815M868428L796770K469849J02887
7786E1787139j950543l681883m597143m752530m120719l755657l895799l167087
7778B1865778k685976k274625j666301j070011n88324o03431j069414j348121
7770A0559575m00976J08816J09525K71597J11914l29043o25914n90780m64524
7761H750190o65311j44998J91684k7168m6753L03009K57730J18283K35619N35313
7751I507598L71229O55505R73066J096988J297086J759941K169155K325100K828467
7742B2984135L993439N198329O074733P172525Q934574J1051464J3637256J6591902
$$ plain form
7734 95638357 113963917 131373878 145818806 155861955 159516734 156016948 146242502 132270535
7726 132270535 116213221 99554973 84377310 71583129 60887331 52481948 45600925
7719 45600925 39474901 34902871 31832312 29151108 26709598 25113185 23941369 23015694
7711 23015694 22169682 21536768 20928649 20545242 20175696 19471313 18753320 18234732 17794695
7702 17794695 17202845 17119999 16925850 17134832 17947154 18894844 19291548 19635719 20371854 21246079
7692 21246079 22553896 24672512 26999510 29902787 33892926 38604846 44469868 51544471
7684 51544471 59874634 69924029 82871942 99420910 120120143 146015506 177046513
7677 177046513 211785016 247545565 279576864 303015042 314719044 312244847 296042586
$$ packed form
7734I5638357J8325560J7409961J4444928J0043149L654779l499786r774446j3971967
7726A32270535j6057314j6658248j5177663j2794181j0695798q405383o881023
7719D5600925o126024m572030l070559k681204k441510j596413j171816r25675
7711B3015694q46012o32914o08119l83407l69546p04383p17993n18588m40037
7702A7794695n91850q2846j94149K08982Q12322R47690L96704L44171P36135Q74225
7692B1246079J307817K118616K326998K903277L990139M711920N865022P074603
7684E1544471Q330163J0049395J2947913J6548968K0699233K5895363L1031007
7677A77046513L4738503L5760549L2031299K3438178J1704002k474197j6202261
$$ plain form
7670 296042586 269911022 238104991 204988639 174163318 147040097 124168926 105453398
7663 105453398 90339350 78301859 68762463 61258399 54887568 49814642 46379610 43477108
7655 43477108 41026056 39381834 38003649 36829586 35895039 34780463 33097227 31508297
7647 31508297 30523699 29710847 28489639 27380856 26786583 26258560 25612698 25316816 25229014
7638 25229014 25649930 26581352 27975876 29837429 32382659 35804066 39257274 42509926
7630 42509926 46838582 52822259 60357607 69713230 80747814 94492779 112309996 135401507
7622 135401507 163760855 197662265 236263956 277614279 317047347 349306366 368559119
7615 368559119 370745008 356133662 328032424 291540134 251966225 213994256 179951474
$$ packed form
7670B96042586k6131564l1806031l3116352l0825321k7123221k2871171j8715528
7663A05453398j5114048j2037491r539396p504064o370831n072926l435032k902502
7655D3477108k451052j644222j378185j174063r34547j114576j683236j588930
7647C1508297r84598q12852j221208j108783n94273n28023o45862k95882q7802
7638B5229014M20916R31422J394524J861553K545230L421407L453208L252652
7630D2509926M328656N983677P535348R355623J1034584J3744965J7817217K3091511
7622A35401507K8359348L3901410L8601691M1350323L9433068L2259019J9252753
7615C68559119K185889j4611346k8101238l6492290l9573909l7971969l4042782
$$ plain form
7608 179951474 151136103 127374722 108197413 93041059 81305915 72027919 64191324
7601 64191324 58165477 53229893 49182461 45363443 42102237 39591390 37555978 36184498
7593 36184498 34822022 33537118 32458145 31545022 30257519 28665105 27315837 25902037
7585 25902037 24606465 23829356 23642990 24031457 25074193 25750560 26432177 27885988 29235158
7576 29235158 30793217 33258040 36543259 40676562 45716316 51773041 58869926 67843420
7568 67843420 79356590 93750815 111228352 133032478 159919508 191519966 226056754
7561 226056754 260266074 289943937 309817937 316141898 308822409 289079089 260551421
7554 260551421 227488758 193860961 163108881 136618438 115104438 98085957 84167554
$$ packed form
7608A79951474k8815371k3761381j9177309j5156354j1735144r277996p836595
7601F4191324o025847m935584m047432l819018l261206k510847k035412j371480
7593C6184498j362476j284904j078973r13123j287503j592414j349268j413800
7585B5902037j295572p77109j86366L88467J042736O76367O81617J453811J349170
7576B9235158J558059K464823L285219M133303N039754O056725P096885Q973494
7568F7843420J1513170J4394225J7477537K1804126K6887030L1600458L4536788
7561B26056754L4209320K9677863J9874000O323961p319489j9743320k8527668
7554B60551421l3062663l3627797l0752080k6490443k1514000j7018481j3918403
$$ plain form
7547 84167554 72589338 63140846 55814823 49479013 43689242 39236197 36110378 33540716
7539 33540716 31230812 29448659 27909875 26679473 26060687 24930909 23403832 22216602
7531 22216602 20963887 19970348 19012449 18153248 17782893 17574087 17141369 17014669 16975252
7522 16975252 17286404 18011020 18777012 19573873 20815999 22254135 23928220 25703759 28106746
7513 28106746 31108457 35052138 40552629 47565947 55576316 65251167 77654843 92330643
7505 92330643 108739697 125846919 141711324 153445657 158945824 157849510 149824901 136479544
7497 136479544 119968129 102795265 86806379 72652083 61199139 51767357 44233863
7490 44233863 38487742 33448627 28926475 25307289 22401652 20638337 18898838 17146126
$$ packed form
7547H4167554j1578216r448492p326023o335810n789771m453045l125819k569662
7539C3540716k309904j782153j538784j230402o18786j129778j527077j187230
7531B2216602j252715r93539r57899q59201l70355k08806m32718j26700l9417
7522A6975252L11152P24616P65992P96861J242126J438136J674085J775539K402987
7513B8106746L001711L943681N500491P013318Q010369R674851J2403676J4675800
7505I2330643J6409054J7107222J5864405J1734333N500167j096314q024609j3345357
7497A36479544j6511415j7172864j5988886j4154296j1452944r431782p533494
7490D4233863n746121n039115m522152l619186k905637j763315j739499j752712
$$ plain form
7482 17146126 15677828 14553499 13561933 12823130 11904467 10772974 9958075 9451975 9215071
7473 9215071 8790382 8181964 8119707 8203697 7839011 7652589 7809159 8254654 8664402 9093180
7463 9093180 9407268 9415229 9221213 9069073 8857872 9091276 9735244 10945433 12683358 14332715
7453 14332715 15824508 18279966 21476119 25230993 29914863 34915423 40235089 45760463
7445 45760463 50636488 53530678 53855350 51764931 47302877 42177714 36763536 31279067
7437 31279067 26491952 22505394 19010315 15901705 13580106 11955268 10604724 9543219
7429 9543219 8523667 7322702 6727460 6307906 6227098 6230603 5503273 5019477 4593535 4188871
7419 4188871 4212537 4085739 3551870 3094940 3026591 3272539 3442865 3339334 2928698 2424935
$$ packed form
7482A7146126j468298j124329r91566p38803r18663j131493q14899n06100k36904
7473I215071m24689o08418o2257Q3990l64686j86422J56570M45495M09748M28778
7463I093180L14088P961j94016j52140k11201K33404O43968J210189J737925J649357
7453A4332715J491793K455458L196153L754874M683870N000560N319666N525374
7445D5760463M876025K894190L24672k090419m462054n125163n414178n484469
7437C1279067m787115l986558l495079l108610k321599j624838j350544j061505
7429I543219j019552j200965n95242m19554q0808L505p27330m83796m25942m04664
7419D188871K3666j26798n33869m56930o8349K45948J70326j03531m10636n03763
$$ plain form
7409 2424935 2157946 2161327 1991671 1816773 1764302 1829647 1814363 1782294 1833867 1539608 1250040
7398 1250040 759522 477622 799185 970329 479602 12944 51163 241804 427740 738670
7388 738670 1296390 1952079 1929901 1170145 565987 566948 732954 743323 839066 622207 572625
7377 572625 1161602 1197380 1031530 1048143 677866 591778 851085 822299 1118476 1762986
7367 1762986 2088395 2294425 2461854 2439379 2627362 2933654 2800530 2700854 2541629 2711688
7357 2711688 2754253 2923120 3363235 3245759 2630433 2740113 2829199 2913069 2996389 2681229
7347 2681229 2628883 2560455 2095257 1781081 1767574 1694893 1573410 1499066 1520651 1080389 962412
7336 962412 1201316 1032981 669174 408101 381079 576078 796348 913846 906928 637280
$$ packed form
7409B424935k66989L381j69656j74898n2471O5345j5284l2069N1573k94259k89568
7398A250040m90518k81900L21563J71144m90727m66658L8219J90641J85936L10930
7388G38670N57720O55689k2178p59756o04158R61J66006J0369R5743k16859m9582
7377E72625N88977L5778j65850J6613l70277q6088K59307k8786K96177O44510
7367A762986L25409K06030J67429k2475J87983L06292j33124r9676j59225J70059
7357B711688M2565J68867M40115j17476o15326J09680Q9086Q3870Q3320l15160
7347B681229n2346o8428m65198l14176j3507p2681j21483p4344K1585m40262j17977
7336I62412K38904j68335l63807k61073k7022J94999K20270J17498o918k69648
$$ plain form
7326 637280 516488 638737 942428 1129733 1060082 704056 316545 89158 191900 119353
7316 119353 55446 314576 557899 940340 1284466 1331349 1513545 1756897 1530919 1338296
7306 1338296 1732266 1559870 739608 135648 243969 686204 925077 1146192 1035414 724614
7296 724614 342358 317061 504414 687891 853155 855295 1080258 1279826 774859 207189
7286 207189 90626 356835 506811 806828 799198 260942 -276115 121834 949599 1396500
7276 1396500 1411248 1307595 1185642 1157110 940610 684723 690282 972862 1459344 1853825
7266 1853825 2194771 2008663 1811357 1809414 1818123 1812600 1534602 1125457 766350 1095685 1662893
7255 1662893 1669991 1530969 1391055 1093240 883794 1414730 1795486 1833645 1788328 1786942 1832541
$$ packed form
7326F37280j20792J22249L03691J87305o9651l56026l87511k27387J02742p2547
7316A19353o3907K59130K43323L82441L44126M6883J82196K43352k25978j92623
7306A338296L93970j72396q20262o03960J08321M42235K38873K21115j10778l10800
7296G24614l82256k5297J87353J83477J65264K140K24963J99568n04967n67670
7286B07189j16563K66209J49976L00017p630n38256n37057L97949Q27765M46901
7276A396500J4748j03653j21953k8532k16500k55887N559K82580M86482L94481
7266A853825L40946j86108j97306j943Q709n523k77998m09145l59107L29335N67208
7255A662893P098j39022j39914k97815k09446N30936L80756L8159m5317j386M5599
$$ plain form
7244 1832541 1763811 1820634 1316687 577971 68156 158279 440964 549241 355048 478724
7234 478724 754854 1112183 1591254 1690189 1568351 1982129 2503884 2779652 2466529 1777840
7224 1777840 1486421 1868926 2094887 1992177 2303271 2573735 2591748 2669323 2822461 2144617
7214 2144617 1624759 1876166 2018764 2066045 2334681 2682266 2979889 3522096 4121997 4447077
7204 4447077 4634516 4831073 4875886 4429538 3583090 3691147 4319590 4660528 4951617 6010188
7194 6010188 7218118 8037134 8634876 9018679 9692331 10421017 11029629 11469503 11337622
7185 11337622 11012470 10452833 10330861 10833215 10965014 11185452 11381636 11623369 12292327
7176 12292327 12513627 11819287 10854523 10066805 9291802 8302077 7419940 6787982 6241050
$$ packed form
7244A832541o8730N6823n03947p38716n09815R0123K82685J08277j94193J23676
7234D78724K76130L57329M79071R8935j21838M13778N21755K75768l13123o88689
7224A777840k91419L82505K25961j02710L11094K70464J8013P7575J53138o77844
7214B144617n19858K51407J42598M7281K68636L47585K97623N42207N99901L25080
7204D447077J87439J96557M4813m46348q46448J08057O28443L40938K91089J058571
7194F010188J207930Q19016N97742L83803O73652P28686O08612M39874j31881
7185A1337622l25152n59637j21972N02354J31799K20438J96184K41733O68958
7176A2292327K21300o94340r64764p87718p75003r89725q82137o31958n46932
$$ plain form
7167 6241050 5458554 4466667 3819511 3659704 3518541 3086137 2814755 2664227 2495631 2223337
7157 2223337 2597901 3122522 3290215 3296877 3651401 4128240 4208512 3545258 3109336 3394661
7147 3394661 3777619 3549788 2892741 3016329 3371049 3189211 2764772 3008220 3309062 3300866
7137 3300866 3203110 3357093 3374768 3469437 3190981 2466263 2353925 2797821 3235234 3774120
7127 3774120 4106879 3908797 3731421 4366448 5294345 5570671 5321634 5528255 6320708 7238624
7117 7238624 7740302 8248359 9250847 10447018 11730278 12713945 13714910 14769144 16036714
7108 16036714 16933643 17201022 17427700 17202503 16308544 15004969 13872580 12935799 11902292
7099 11902292 10945776 10060456 9420618 9119325 8562053 7769963 7325968 6972838 6409945
$$ packed form
7167F241050p82496r91887o47156j59807j41163m32404k71382j50528j68596k72294
7157B223337L74564N24621J67693O662L54524M76839Q0272o63254m35922K85325
7147C394661L82958k27831o57047J23588L54720j81838m24439K43448L00842q196
7137C300866r7756J53983J7675R4669k78456p24718j12338M43896M37413N38886
7127C774120L32759j98082j77376O35027R27897K76326k49037K06621P92453R17916
7117G238624N01678N08057J002488J196171J283260R83667J000965J054234J267570
7108A6036714Q96929K67379K26678k25197q93959j303575j132389r36781j033507
7099A1902292r56516q85320o39838l01293n57272p92090m43995l53130n62893
$$ plain form
7090 6409945 5827642 5349692 5014580 4465406 4045522 3594790 3314864 2885825 2308972 2092459
7080 2092459 1884845 1891643 1968580 2373101 2521922 2524356 2644637 2404276 2129228 1944952
7070 1944952 2011153 2314041 2374516 2289170 2354830 2583198 2828458 2830145 2350810 1692884 1272954
7059 1272954 1381383 1248115 857385 1047783 1362027 1232918 1169116 1389406 1803760 1924010
7049 1924010 1915658 1726211 1399218 1269608 1223384 1077808 1037482 1024755 1016800 1455127 1659787
7038 1659787 1635579 1551867 1069025 725534 1063639 1114585 1226329 1149804 1281403 1222664
7028 1222664 1020048 1270094 1821472 1682879 1290003 1388499 1326202 1000095 744540 393207
7018 393207 309203 462370 722476 699994 787834 1033843 1143899 1192702 1332770 1569543
$$ packed form
7090F409945n82303m77950l35112n49174m19884m50732k79926m29039n76853k16513
7080B092459k07614O798P6937M04521J48821K434J20281k40361k75048j84276
7070A944952O6201L02888O0475q5346O5660K28368K45260J687m79335o57926m19930
7059A272954J08429j33268l90730J90398L14244j29109o3802K20290M14354J20250
7049A924010q352j89447l26993j29610m6224j45576m0326j2727p955M38327K04660
7038A659787k4208q3712m82842l43491L38105N0946J11744p6525J31599n8739
7028A222664k02616K50046N51378j38593l92876R8496o2297l26107k55555l51333
7018C93207q4004J53167K60106k2482Q7840K46009J10056M8803J40068K36773
$$ plain form
7008 1569543 1823615 2101570 1921982 1402802 827797 759306 1229030 1377599 1564697 1534897
6998 1534897 1469589 1620918 1292955 821897 757786 534575 510730 608910 377484 190921
6988 190921 21210 -243742 -321042 -41707 353588 492500 495917 429456 459808 831220 1208029
6977 1208029 1109119 605447 236367 -76576 -202123 -285154 90002 627072 1149005 1386540
6967 1386540 1360717 1002393 423469 241006 126875 -157614 -511473 -339698 114873 303951
6957 303951 482407 741286 952011 767882 848264 1240647 1156297 727381 557722 261941
6947 261941 127994 390081 686290 1170124 1614295 1595384 1805654 1740030 1005250 506507
6937 506507 1001436 1651307 1663727 1140080 635953 457480 179840 -456147 -460676 156559
$$ packed form
7008A569543K54072K77955j79588n19180n75005o8491M69724J48569J87098k9800
6998A534897o5308J51329l27963m71058o4111k23211k3845R8180k31426j86563
6988A90921j69711k64952p7300K79335L95295J38912L417o6461L0352L71412L76809
6977A208029r8910n03672l69080l12943j25547q3031L75156N37070N21933K37535
6967A386540k5823l58324n78924j82463j14131k84489l53859J71775M54571J89078
6957C03951J78456K58879K10725j84129Q0382L92383q4350m28916j69659k95781
6947B61941j33947K62087K96209M83834M44171j8911K10270o5624p34780m98743
6937E06507M94929O49871J2420n23647n04127j78473k77640o35987m529O17235
$$ plain form
6927 156559 502335 499218 559222 203656 -274539 -289325 -172416 -91258 -18111 537833 1024700
6916 1024700 1079475 1220278 1260295 951563 975751 778586 467820 454906 549520 253768
6906 253768 127947 580463 876310 809812 726024 599597 757695 648662 396111 558501
6896 558501 331545 130022 -222429 -704252 -985674 -961219 -1058828 -1110735 -1187623 -1190075 -1050633
6885 -1050633 -941766 -519093 -365954 -143324 268619 243721 289539 114629 188918 662313
6875 662313 1091781 1554221 1851030 1670272 827283 129031 -23786 -16924 245599 307497
6865 307497 99023 -62086 459576 908742 800973 639787 564033 229553 -151987 178759
6855 178759 160711 -160932 -21988 13352 -550613 -491349 -204012 -385640 -111909 298313
$$ packed form
6927A56559L45776l117O0004l55566m78195j4786J16909Q1158P3147N55944M86867
6916A024700N4775J40803M0017l08732K4188j97165l10766j2914R4614k95752
6906B53768j25821M52516K95847o6498q3788j26427J58098j09033k52551J62390
6896E58501k26956k01523l52451m81823k81422K4455r7609n1907p6888k452J39442
6885a050633J08867M22673J53139K22630M11943k4898M5818j74910P4289M73395
6875F62313M29468M62440K96809j80758q42989o98252j52817O862K62523O1898
6865C07497k08474j61109N21662M49166j07769j61186p5754l34480l81540L30746
6855A78759j8048l21643J38944L5340n63965N9264K87337j81628K73731M10222
$$ plain form
6845 298313 395388 503883 599748 721225 431358 -82907 -654394 -977732 -947221 -452304
6835 -452304 -119945 -90286 258531 499718 790614 745239 646613 522868 19467 -229209
6825 -229209 -178348 -123215 -190091 -128259 -119203 -141013 100051 556149 684927 449316 52892
6814 52892 -252378 -546373 -304677 -48965 -532627 -568818 -617801 -1000794 -713900 -19962
6804 -19962 148125 -103711 -117396 -105586 -68124 84715 338544 758079 884136 570761
6794 570761 227404 -210356 -533988 -733992 -1047636 -1269590 -1052584 -809061 -529374 -261398
6784 -261398 197251 676103 286504 -154430 -242113 -322992 -180165 28905 75792 5122
6774 5122 253146 643116 860667 786164 738403 1009685 957139 512143 136219 100277 285823
$$ packed form
6845B98313R7075J08495R5865J21477k89867n14265n71487l23338L0511M94917
6835d52304L32359K9659L48817K41187K90896m5375r8626j23745n03401k48676
6825b29209N0861N5133o6876O1832R056k1810K41064M56098J28778k35611l96424
6814E2892l05270k93995K41696K55712m83662l6191m8983l82993K86894O93938
6804a9962J68087k51836j3685J1810L7462J52839K53829M19535J26057l13375
6794E70761l43357m37760l23632k00004l13644k21954K17006K43523K79687K67976
6784b61398M58649M78852l89599m40934q7683q0879J42827K09070M6887p0670
6774E122K48024L89970K17551p4503m7761K71282n2546m44996l75924l5942J85546
$$ plain form
6763 285823 380850 439479 218314 239076 504188 600403 523256 392323 2212 -657913 -1011472
6752 -1011472 -880939 -624890 -570729 -530110 -820454 -895640 -699091 -432524 -333836 -719643
6742 -719643 -775401 -332595 -280845 -341964 -289173 -230028 -140408 16727 61219 -55673 162170
6731 162170 439849 192480 328864 287707 80154 -46353 -271720 -148740 35163 54441
6721 54441 -271170 -474175 -217944 -83014 -162054 -415599 -590260 -879562 -987258 -744160
6711 -744160 -731732 -906130 -1062235 -1105820 -1024307 -535664 203359 596024 605089 572544 534369
6700 534369 308002 -316213 -622103 -594444 -516020 -622721 -794183 -686433 -649356 -632176
6690 -632176 -977561 -1254881 -967254 -822846 -1217896 -1083390 -563277 -409319 -445322 -209733
$$ packed form
6763B85823R5027N8629k21165K0762K65112R6215p7147j30933l90111o60125l53559
6752a011472J30533K56049N4161M0619k90344p5186J96549K66567R8688l85807
6742g19643n5758M42806N1750o1119N2791N9145Q9620J57135M4492j16892K17843
6731A62170K77679k47369J36384m1157k07553j26507k25367J22980J83903J9278
6721E4441l25611k03005K56231J34930p9040k53545j74661k89302j07696K43098
6711g44160J2428j74398j56105m3585Q1513M88643P39023L92665R065l2545l8175
6700E34369k26367o24215l05890K7659P8424j06701j71462J07750L7077J7180
6690f32176l45385k77320K87627J44408l95050J34506N20113J53958l6003K35589
$$ plain form
6680 -209733 -62917 -189548 90471 615226 675060 796750 789638 866324 661058 -137458
6670 -137458 -662314 -1454355 -1377974 -726972 -318012 -135213 -40841 213571 476227 223983
6660 223983 -365153 -359870 -6354 627667 1086340 1161280 1209153 1357788 1343702 1067799 310606
6649 310606 -119471 -160647 -267765 -630648 -956163 -866918 -210954 447627 704611 613476
6639 613476 317792 194013 -43529 -185377 -178152 -72485 69513 -213074 -457549 -159339
6629 -159339 20521 -27097 237192 243136 50240 -110139 -18295 27072 -279446 -592191 -444724
6618 -444724 631 68039 -214312 -193404 254513 611129 762497 455462 316141 580509
6608 580509 472385 67537 46024 24244 98081 145683 -192020 -207717 188884 212850 95518
$$ packed form
6680b09733J46816j26631K80019N24755N9834J21690p112P6686k05266p98516
6670a37458n24856p92041P6381O51002M08960J82799R4372K54412K62656k52244
6660B23983n89136N283L53516O34021M58673P4940M7873J48635j4086k75903p57193
6649C10606m30077m1176j07118l62883l25515Q9245O55964O58581K56984r1135
6639F13476k95684j23779k37542j41848P225J05667J41998k82587k44475K98210
6629a59339J79860m7618K64289N944j92896j60379R1844M5367l06518l12745J47467
6618d44724M45355O7408k82351K0908M47917L56616J51368l07035j39321K64368
6608E80509j08124m04848k1513k1780P3837M7602l37703j5697L96601K3966j17332
$$ plain form
6597 95518 -8027 466 -78598 -9459 141957 -72645 -149941 55548 411205 548943 287956
6586 287956 69119 -2978 404977 563644 990674 1110138 693271 539888 596436 598254
6576 598254 673023 886173 1084237 941734 519118 342616 263630 409692 285722 146572
6566 146572 140432 260359 453001 738807 718826 444615 192647 167367 -84338 -699018
6556 -699018 -648754 -117200 161044 444725 675730 741968 627517 411642 239280 482747
6546 482747 766252 641339 412155 407551 336956 223807 239132 414190 365995 216961 427817
6535 427817 690678 771061 722064 672444 622337 695986 1075328 1298578 1320375 1328282 1265854
6524 1265854 1142278 801275 645355 461862 321894 202259 146816 7420 340430 480899
$$ packed form
6597I5518j03545Q493p9064O9139J51416k14602p7296K05489L55657J37738k60987
6586B87956k18837p2097M07955J58667M27030J19464m16867j53383N6548J818
6576E98254P4769K13150J98064j42503m22616j76502p8986J46062j23970j39150
6566A46572o140J19927J92642K85806j9981k74211k51968k5280k51705o14680
6556f99018N0264N31554K78244K83681K31005O6238j14451k15875j72362K43467
6546D82747K83505j24913k29184m604p0595j13149J5325J75058m8195j49034K10856
6535D27817K62861Q0383m8997m9620n0107P3649L79342K23250K1797P907o2428
6524A265854j23576l41003j55920j83493j39968j19635n5443j39396L33010J40469
$$ plain form
6514 480899 711278 1477824 1583359 1641745 1694527 1406867 1119815 1137550 919553 268152
6504 268152 -148184 -123745 -25833 -259165 -327841 -452881 -627391 -478139 -636210 -989671
6494 -989671 -850792 -568741 -223729 230595 269522 468200 746161 955680 1055607 864496
6484 864496 604797 271124 122489 186001 9086 -320608 -117595 68094 111243 291418
6474 291418 489504 711277 1062497 1414864 1452227 1262458 867041 500103 382011 504490
6464 504490 642640 392825 279431 770302 854830 574548 585014 542055 563846 480631 230767
6453 230767 455282 768548 769421 981933 904161 594647 317723 489731 682910 663993 697592
6442 697592 709150 698009 544387 648888 745854 857996 1176241 916409 401962 358860
$$ packed form
6514D80899K30379P66546J05535N8386N2782k87660k87052J7735k17997o51401
6504B68152m16336K4439R7912k33332o8676j25040j74510J49252j58071l53461
6494i89671J38879K82051L45012M54324L8927J98678K77961K09519R9927j91111
6484H64496k59699l33673j48635O3512j76915l29694K03013J85689M3149J80175
6474B91418J98086K21773L51220L52367L7363j89769l95417l66938j18092J22479
6464E04490J38150k49815j13394M90871Q4528k80282J0466m2959K1791q3215k49864
6453B30767K24515L13266Q73K12512p7772l09514k76924J72008J93179j8917L3599
6442F97592J1558j1141j53622J04501R6966J12142L18245k59832n14447m3102
$$ plain form
6432 358860 387412 670336 660088 463054 529612 169806 -63037 125020 706197 1176575
6422 1176575 1435026 1076988 369939 81768 -122249 77366 312526 353778 627679 900165
6412 900165 1206815 1023685 577124 328817 324223 -121088 -391035 -313577 148011 1115794
6402 1115794 1338309 878316 541118 415349 396943 429518 570284 536278 668092 994189
6392 994189 830195 751900 570142 757890 656529 298234 908790 1578099 1749848 1687243
6382 1687243 1340452 1216531 1033310 716247 521452 210467 -72907 157684 317000 98302
6372 98302 339579 981142 1545759 2306597 2881479 3075524 3433751 3589140 3375579 3092482
6362 3092482 3094465 2960499 3010480 3583082 4071373 4082119 4218158 4538173 5084507 5138205
$$ packed form
6432C58860K8552K82924j0248j97034O6558l59806k32843J88057N81177M70378
6422A176575K58451l58038p07049k88171k04017J99615K35160M1252K73901K72486
6412I00165L06650j83130m46561k48307m594m45311k69947P7458M61588R67783
6402A115794K22515m59993l37198j25769j8406L2575J40766l4006J31814L26097
6392I94189j63994p8295j81758J87748j01361l58295O10556O69309J71749o2605
6382A687243l46791j23921j83221l17063j94795l10985k83374K30591J59316k18698
6372I8302K41277O41563N64617P60838N74882J94045L58227J55389k13561k83097
6362C092482J983j33966M9981N72602M88291J0746J36039L20015N46334N3698
$$ plain form
6352 5138205 4802897 4645739 4434181 4310751 4408943 4157475 3805729 3355838 3052373 2870504
6342 2870504 2118908 1563120 1594488 1791200 1699522 1367500 1343648 1544258 1590971 1473498
6332 1473498 1647576 2313359 2579282 2246217 1961484 1814664 1534372 1032743 854126 1318294
6322 1318294 1843657 1789993 1235764 601408 302010 645325 859664 810835 892453 776859
6312 776859 550735 180875 -117467 -294916 -394325 -257237 -172947 -547319 -723913 -382656
6302 -382656 138920 367158 250921 -137644 -259637 269997 248619 371943 506409 319365
6292 319365 -63978 -170873 -133068 597821 1441171 1791707 2037795 2145571 1824160 1306829
6282 1306829 878780 678206 649345 294479 -98166 -150549 -4380 214430 351017 65327
$$ packed form
6352E138205l35308j57158k11558j23430R8192k51468l51746m49891l03465j81869
6342B870504p51596n55788L1368J96712r1678l32022k3852K00610M6713j17473
6332A473498J74078O65783K65923l33065k84733j46820k80292n01629j78617M64168
6322A318294N25363n3664n54229o34356k99398L43315K14339m8829Q1618j15594
6312G76859k26124l69860k98342j77449r9409J37088Q4290l74372j76594L41257
6302c82656N21576K28238j16237l88565j21993N29634k1378J23324J34466j87044
6292C19365l83343j06895L7805P30889Q43350L50536K46088J07776l21411n17331
6282A306829m28049k00574k8861l54866l92645n2383J46169K18810J36587k85690
$$ plain form
6272 65327 -38397 -70888 -479757 -934882 -964180 -602251 -451458 -595840 -699991 -304408
6262 -304408 -126373 -209577 -232247 -515659 -706150 -556831 -689113 -857131 -564921 -480005
6252 -480005 40135 819712 971818 820138 523636 504396 246670 -211280 98002 466906
6242 466906 283785 -203034 -221555 -29567 -113587 -200835 161955 701319 764241 620881
6232 620881 437090 296895 112545 132422 451725 794411 1360576 1661811 1584468 1435825
6222 1435825 1195135 914799 682403 620347 607947 955524 839970 794812 928113 790841
6212 790841 816480 1020287 1494135 1838022 1569247 1338454 1028243 621372 150706 -12169
6202 -12169 325595 721448 857433 985680 1047309 893220 697470 443153 271195 550212
$$ packed form
6272F5327j03724l2491m08869m55125k9298L61929J50793j44382j04151L95583
6262c04408J78035q3204k2670k83412j90491J49319j32282j68018K92210Q4916
6252d80005N20140P79577J52106j51680k96502j9240k57726m57950L09282L68904
6242D66906j83121m86819j8521J91988q4020q7248L62790N39364O2922j43360
6232F20881j83791j40195j84350J9877L19303L42686N66165L01235p7343j48643
6222A435825k40690k80336k32396o2056j2400L47577j15554m5158J33301j37272
6212G90841K5639K03807M73848L43887k68775k30793l10211m06871m70666j62875
6202a2169L37764L95853J35985J28247O1629j54089j95750k54317j71958K79017
$$ plain form
6192 550212 1194514 1773176 1699879 1132359 1034167 1350095 1691719 1920856 1458290 897240
6182 897240 453790 241631 179684 6527 -415724 -540337 -461886 -649439 -663246 -585864
6172 -585864 -313507 -469902 -649277 -531587 -286273 393444 751038 569253 612000 420028
6162 420028 425177 585786 680039 439100 -9937 -64487 -286869 -585331 -839585 -445018
6152 -445018 80860 296551 -8148 -55948 193109 82604 -176753 -74673 226003 400763
6142 400763 508916 346141 299488 242176 448326 881158 879891 821642 747936 680906 491597
6131 491597 255976 216758 -295135 -556866 -280673 -185295 114319 468548 560320 426831
6121 426831 370733 54000 -4003 345353 960532 1292079 1434142 1930733 2290293 2377263
$$ packed form
6192E50212O44302N78662p3297n67520r8192L15928L41624K29137m62566n61050
6182H97240m43450k12159o1947j73157m22251j24613P8451j87553j3807P7382
6172e85864K72357j56395j79375J17690K45314O79717L57594j81785M2747j91972
6162D20028N149J60609R4253k40939m49037n4550k22382k98462k54254L94567
6152d45018N25878K15691l04699m7800K49057j10505k59357J02080L00676J74760
6142D00763J08153j62775m6653n7312K06150M32832j267n8249p3706o7030j89309
6131D91597k35621l9218n11893k61731K76193R5378K99614L54229R1772j33489
6121D26831n6098l16733n8003L49356O15179L31547J42063M96591L59560Q6970
$$ plain form
6111 2377263 2257414 1995189 1665203 1908085 2228028 2443588 3007044 3703285 3807334 3579746
6101 3579746 3867515 4285969 4192704 4065858 3685317 3095696 2548885 2174487 2086243 1636609
6091 1636609 1432378 1438606 1082256 1222585 1300020 995270 968200 1305567 1642503 1706178
6081 1706178 1592302 1500354 1200286 677186 427007 513939 646345 582642 200131 -178841
6071 -178841 -118590 219771 512650 724470 909886 1183540 1235367 770140 210980 134532
6061 134532 474674 510136 386186 275949 93307 206891 -40437 289492 704091 259877
6051 259877 -252783 23836 453860 384994 219805 80613 427437 440091 222505 364747
6041 364747 500873 454862 570266 439432 237168 710390 784002 483954 258427 -42047
$$ packed form
6111B377263j19849k62225l29986K42882L19943K15560N63456O96241J04049k27588
6101C579746K87769M18454r3265j26846l80541n89621n46811l74398q8244m49634
6091A636609k04231O228l56350J40329P7435l04750k7070L37367L36936O3675
6081A706178j13876r1948l00068n23100k50179Q6932J32406o3703l82511l78972
6071a78841O0251L38361K92879K11820J85416K73654N1827m65227n59160p6448
6061A34532L40142L5462j23950j10237j82642J13584k47328L29929M14599m44214
6051B59877n12660K76619M30024o8866j65189j39192L46824J2654k17586J42242
6041C64747J36126m6011J15404j30834k02264M73222P3612l00048k25527l00474
$$ plain form
6031 -42047 -190718 -149853 -589938 -692333 -725092 -629150 -476503 -228378 -163154 -63181 234461
6020 234461 775101 749367 267949 322407 608224 233375 -234182 -481471 -286416 228333
6010 228333 109653 -37324 257113 700395 767671 404674 294609 353926 403142 393444 279528
5999 279528 204105 -8848 -388764 -361624 72603 270747 442481 576456 509262 424966
5989 424966 349930 587474 843638 1099527 870956 203090 -651161 -881527 -522764 -208698
5979 -208698 -225254 17194 566225 210522 -59536 163813 74723 -95951 207692 527896
5969 527896 241393 -84275 -419578 -697674 -735178 -322778 -11953 220641 580747 553900
5959 553900 569339 368163 391747 857817 1238908 1208395 1040703 858713 691461 463134
$$ packed form
6031d2047j48671M0865m40085j02395l2759R5942J52647K48125O5224R9973K97642
6020B34461N40640k5734m81418N4458K85817l74849m67557k47289J95055N14749
6010B28333j18680j46977K94437M43282O7276l62997j10065N9317M9216r698j13916
5999B79528p5423k12953l79916K7140M34227J98144J71734J33975o7194q4296
5989D24966p5036K37544K56164K55889k28571o67866q54251k30366L58763L14066
5979b08698j6556K42448N49031l55703k70058K23349q9090j70674L03643L20204
5969E27896k86503l25668l35303k78096l7504M12400L10825K32594L60106k6847
5959E53900J5439k01176K3584M66070L81091l0513j67692j81990j67252k28327
$$ plain form
5949 463134 298166 29628 -358845 -905212 -874028 -667060 -524573 -641820 -1098351 -1103782
5939 -1103782 -492749 41207 155392 376837 560660 473451 142792 -313463 -725462 -1216350
5929 -1216350 -1942211 -2057984 -1235859 -683092 -641428 -1113595 -1615840 -1303354 -592777 -617684
5919 -617684 -1038985 -1029170 -642516 -826766 -1333621 -1098051 -496751 -98559 365418 515091
5909 515091 173875 475766 993321 1083868 874183 791182 1163834 1484834 1235224 750553
5899 750553 564719 993345 974299 841595 574825 207045 601134 1145288 1465224 1680902
5889 1680902 1533268 1407360 1043260 794092 836852 406779 -227806 -812323 -1255001 -1225285
5879 -1225285 -769793 -387027 -308126 -618712 -1048610 -1256536 -1087695 -770179 -505550 -118184
$$ packed form
5949D63134j64968k68538l88473n46367L1184K06968J42487j17247m56531n431
5939a103782O11033N33956J14185K21445J83823q7209l30659m56255m11999m90888
5929a216350p25861j15773Q22125N52767M1664m72167n02245L12486P10577k4907
5919f17684m21301R815L86654j84250n06855K35570O01300L98192M63977J49673
5909E15091l41216L01891N17555R0547k09685q3001L72652L21000k49610m84671
5899G50553j85834M28626j9046j32704k66770l67780L94089N44154L19936K15678
5889A680902j47634j25908l64100k49168M2760m30073o34585n84517m42678K9716
5879a225285M55492L82766P8901l10586m29898k07926J68841L17516K64629L87366
$$ plain form
5869 -118184 323459 594908 641609 835864 1157223 1004329 311122 -245500 -407552 -599105
5859 -599105 -993978 -1502953 -1276939 -951598 -1094275 -776292 -159864 -113327 -85273 116478
5849 116478 256035 358062 374452 293391 -23628 -334965 -560374 -748345 -1229957 -1522105
5839 -1522105 -1373877 -1220579 -770388 -643314 -731480 -612571 -429148 -413374 -357511 -49491
5829 -49491 327560 218841 -27923 -235530 1390 637365 1304450 1238244 804678 392228
5819 392228 465592 513859 -73185 -684881 -287206 152190 -46831 170585 181262 -54235
5809 -54235 -128441 -370901 -717711 -1181941 -1159630 -1017768 -631843 -224699 -235637 -662629
5799 -662629 -544553 -68028 50558 111113 69634 -112292 -253385 -268426 -99862 391003
$$ packed form
5869a18184M41643K71449M6701J94255L21359j52894o93207n56622j62052j91553
5859e99105l94873n08975K26014L25341j42677L17983O16428M6537K8054K01751
5849A16478J39557J02027J6390q1061l17019l11337k25409j87971m81612k92148
5839a522105J48228J53298M50191J27074q8166J18909J83423J5774N5863L08020
5829d9491L77051j08719k46764k07607K36920O35975O67085o6206m33566m12450
5819C92228P3364M8267n87044o11696L97675M39396j99021K17416J0677k35497
5809e4235p4206k42460l46810m64230K2311J41862L85925M07144j0938m26992
5799f62629J18076M76525J18586O0555m1479j81926j41093j5041J68564M90865
$$ plain form
5789 391003 304060 -286422 -108555 -28708 -500070 -792677 -696627 -595512 -305580 197024
5779 197024 242318 -303513 -751589 -931066 -1016393 -919500 -836568 -657430 -582603 -430071 52692
5768 52692 368739 -13707 -530134 -628561 -1255283 -1451842 -1296815 -1158261 -673467 -131288
5758 -131288 203558 586833 516262 242810 273204 230725 320381 162676 78562 552682 886726
5747 886726 1187994 1066536 876936 796119 253965 187030 675600 1057729 1076043 759161
5737 759161 578286 664752 338416 -271754 -528187 -504005 -636014 -428992 76449 642301
5727 642301 509787 130534 -181042 -372537 -170022 312300 604802 205226 -107748 510420
5717 510420 876895 959326 668390 463045 163718 -215600 -619003 -540790 -522332 -297894
$$ packed form
5789C91003q6943n90482J77867P9847m71362k92607R6050J01115K89932N02604
5779A97024M5294n45831m48076j79477q5327R6893Q2932J79138P4827J52532M82763
5768E2692L16047l82446n16427r8427o26722j96559J55027J38554M84794N42179
5758a31288L34846L83275p0571k73452L0394m2479Q9656j57705q4114M74120L34044
5747H86726L01268j21458j89600q0817n42154o6935M88570L82129J8314l16882
5737G59161j80875Q6466l26336o10170k56433K4182j32009K07022N05441N65852
5727F42301j32514l79253l11576j91495K02515M82322K92502l99576l12974O18168
5717E10420L66475Q2431k90936k05345k99327l79318m03403P8213J8458K24438
$$ plain form
5707 -297894 -14460 384825 895351 877259 261923 -415001 -391664 247461 398252 266331
5697 266331 -188062 -784331 -1119038 -1174546 -663512 4221 122294 205235 426107 91725
5687 91725 -217490 -353122 -444014 -505244 -172199 219242 716978 1155869 1113344 939452
5677 939452 1002970 1318187 1666726 1445988 1450491 1702677 1635756 1205865 1061756 1007560 859248
5666 859248 707445 554985 829321 937623 863109 865720 886204 1059051 1296839 1283290 514016
5655 514016 -242714 -114741 43234 351709 306256 -177361 -542083 -779601 -1066059 -555513
5645 -555513 136652 278873 323177 293302 799132 1055142 801092 316257 -258415 -747897
5635 -747897 -1103022 -963971 -647136 -466857 -66232 446971 622647 711464 535349 288626
$$ packed form
5707b97894K83434L99285N10526j8092o15336o76924K3337O39125J50791j31921
5697B66331m54393n96269l34707n5508N11034O67733J18073Q2941K20872l34382
5687I1725l09215j35632r0892o1230L33045L91441M97736M38891m2525j73892
5677I39452O3518L15217L48539k20738M503K52186o6921m29891j44109n4196j48312
5666H59248j51803j52460K74336J08302p4514K611K0484J72847K37788j3549p69274
5655E14016p56730J27973J57975L08475m5453m83617l64722k37518k86458N10546
5645e55513O92165J42221M4304k9875N05830K56010k54050m84835n74672m89482
5635g47897l55125J39051L16835J80279M00625N13203J75676Q8817j76115k46723
$$ plain form
5625 288626 211929 325001 7615 -406082 -39525 537179 1021954 1372994 1851377 2491608
5615 2491608 2811387 2753542 2527004 2193299 2106289 2100113 1826797 1477233 1181407 669371
5605 669371 310368 233129 157942 336580 809182 1074300 990730 573719 -116064 -322294
5595 -322294 18740 337671 294353 113761 72323 -187384 -266669 -216879 -327487 -635128
5585 -635128 -594528 51484 523774 952111 1397846 1609514 1510420 983399 180855 -928395
5575 -928395 -1609973 -1331470 -852583 -590874 -594030 -698660 -599461 -354683 76634 940824
5565 940824 1873734 2558886 2948846 3035835 3498013 3878708 3979635 4384542 5034431 5630540
5555 5630540 5879643 5810731 5122471 4704566 4188873 3125471 2688144 2630980 2518601 2426693
$$ packed form
5625B88626p6697J13072l17386m13697L66557N76704M84775L51040M78383O40231
5615B491608L19779n7845k26538l33705q7010o176k73316l49564k95826n12036
5605F69371l59003p7239p5187J78638M72602K65118q3570m17011o89783k06230
5595c22294L41034L18931m3318j80592m1438k59707p9285M9790j10608l07641
5585f35128M0600O46012M72290M28337M45735K11668r9094n27021q02544j109250
5575i28395o81578K78503M78887K61709l156j04630R9199K44778M31317Q64190
5565I40824R32910O85152L89960Q6989M62178L80695J00927M04907O49889N96109
5555E630540K49103o8912o88260m17905n15693j063402m37327n7164j12379r1908
$$ plain form
5545 2426693 2545236 2119010 1908033 2160301 2366402 2159650 1175214 360063 224230 95751
5535 95751 538473 1268966 1345874 942344 643889 584229 347687 292490 241207 -22171 37114
5524 37114 559650 292001 -28077 209488 270747 41067 24868 403274 943214 524249
5514 524249 -232462 -239842 -12754 369588 928843 1080805 952812 988920 1245790 1724216
5504 1724216 2048151 2324173 2269431 2097570 2348949 2868463 3607832 4554451 5449307 5870338
5494 5870338 5906476 5283541 4734140 4516608 4422520 4407563 4162810 3691444 2888470 2284779
5484 2284779 1684495 1402443 1285207 1337716 1504749 1816915 1849143 1540332 999731 586280
5474 586280 583580 736214 919377 911408 670286 677952 489086 266294 506930 676048 476379
$$ packed form
5545B426693J18543m26226k10977K52268K06101k06752r84436q15151j35833j28479
5535I5751M42722P30493P6908m03530k98455n9660k36542n5197n1283k63378N9285
5524C7114N22536k67649l20078K37565O1259k29680j6199L78406N39940m18965
5514E24249p56711p380K27088L82342N59255J51962j27993L6108K56870M78426
5504A724216L23935K76022n4742j71861K51379N19514P39369R46619Q94856M21031
5494E870338L6138o22935n49401k17532r4088j4957k44753m71366q02974o03691
5484B284779o00284k82052j17236N2509J67033L12166L2228l08811n40601m13451
5474E86280k700J52634J83163p969k41122P666j88866k22792K40636J69118j99669
$$ plain form
5463 476379 658826 499471 34135 -177664 -150472 127031 298115 509857 676428 801206
5453 801206 887457 642942 68289 -309700 -175193 385638 772435 1275911 1400375 1428611
5443 1428611 1845036 2323918 2791962 3283393 3933203 4633949 5271991 5831441 5944070 5877965
5433 5877965 6154651 6324413 5916156 5267527 4432806 3661467 2850018 1743466 783291
5424 783291 343921 -389973 -919659 -937890 -705539 -330635 -47503 -106096 -331687 -812991
5414 -812991 -777554 -231095 -402525 -1101998 -1329149 -1293770 -1210256 -446848 390607 769559
5404 769559 617047 373667 569772 1047646 1363482 1423615 1381432 990046 383338 165734
5394 165734 594503 879558 467442 172368 331695 699967 782395 540540 460320 733523
$$ packed form
5463D76379J82447j59355m65336k11799K7192K77503J71084K11742J66571J24778
5453H01206Q6251k44515n74653l77989J34507N60831L86797N03476J24464K8236
5443A428611M16425M78882M68044M91431O49810P00746O38042N59450J12629o6105
5433E877965K76686J69762m08257o48629q34721p71339q11449j106552r60175
5424G83291m39370p33894n29686j8231K32351L74904K83132n8593k25591m81304
5414h12991L5437N46459j71430o99473k27151L5379Q3514P63408Q37455L78952
5404G69559j52512k43380J96105M77874L15836O0133m2183l91386o06708k17604
5394A65734M28769K85055m12116k95074J59327L68272Q2428k41855q0220K73203
$$ plain form
5384 733523 1232583 1251383 659358 607873 810534 1023466 1511442 1666034 2084314 2750157
5374 2750157 3204631 3432876 3011722 2080768 1399789 1087284 631289 424712 544926 459789
5364 459789 350440 587237 1173710 1340803 1185342 1285600 1023271 241374 101835 386381
5354 386381 468972 736568 746768 595262 779448 561893 19871 -329127 -503772 -75292
5344 -75292 12031 -189863 -145857 -171795 -335561 -548987 -790657 -930626 -1018279 -978004 -494894
5333 -494894 328287 624264 394971 147141 -175343 -370876 -421657 -349722 -276880 -99410
5323 -99410 183788 799341 1035931 1107990 1237372 1052562 718114 476264 667939 1229575
5313 1229575 1508881 1119529 615369 701911 1172534 892858 793135 440721 24869 -550031
$$ packed form
5384G33523M99060J8800n92025n1485K02661K12932M87976J54592M18280O65843
5374B750157M54474K28245m21154r30954o80979l12505m55995k06577J20214q5137
5364D59789j09349K36797N86473J67093j55461J00258k62329p81897j39539K84546
5354C86381Q2591K67596J0200j51506J84186k17555n42022l48998j74645M28480
5344g5292Q7323k01894M4006k5938j63766k13426k41670j39969q7653M0275M83110
5333d94894Q23181K95977k29293k47830l22484j95533n0781P1935P2842J77470
5323i9410K83198O15553K36590P2059J29382j84810l34448k41850J91675N61636
5313A229575K79306l89352n04160Q6542M70623k79676r9723l52414m15852n74900
$$ plain form
5303 -550031 -1200949 -1186217 -868727 -652841 -825092 -799917 -712373 -668704 -660066 -787993 -543747
5292 -543747 37874 653367 802159 603998 284390 -611280 -1130301 -963240 -752698 -772547
5282 -772547 -462439 81216 -4602 -450522 -613056 -502213 -250215 74383 345720 463981
5272 463981 560255 346971 350844 626154 936598 1113791 980592 675524 429299 434607 1313085
5261 1313085 2295276 1927981 1544677 1359604 811331 75326 -619067 -1222601 -1510559 -1348284
5251 -1348284 -1188798 -1059060 -1281408 -1422240 -1324495 -1305304 -983319 -564499 -223472 208323
5241 208323 57995 -455850 -465475 35796 549718 751085 608200 480658 319048 77119
5231 77119 -137316 276499 553533 -18087 -398306 -339816 -317704 -238962 -64907 453472
$$ packed form
5303e50031o50918J4732L17490K15886j72251K5175Q7544M3669Q638j27927K44246
5292e43747N81621O15493J48792j98161l19608q95670n19021J67061K10542j9849
5282g72547L10108N43655q5818m45920j62534J10843K51998L24598K71337J18261
5272D63981R6274k13284L873K75310L10444J77193j33199l05068k46225N308Q78478
5261A313085R82191l67295l83304j85073n48273p36005o94393o03534k87958J62275
5251a348284J59486J29738k22348j40832R7745J9191L21985M18820L41027M31795
5241B08323j50328n13845r625N01271N13922K01367j42885j27542j61610k41929
5231G7119k14435M13815K77034n71620l80219N8490K2112P8742J74055N18379
$$ plain form
5221 453472 742430 512442 368469 217930 374752 43164 -189888 -13684 368523 1198235
5211 1198235 1487519 1487632 1560991 1895285 2096547 2175169 2822093 3780996 4051130 3419486
5201 3419486 2521390 1952935 1778391 1381588 851449 266495 -161794 -424734 -317557 -354251
5191 -354251 -508928 -523465 -476781 -440496 -485325 -853811 -950256 -574068 -355600 -201598 -105858
5180 -105858 -406090 -527939 -489773 -230945 -159334 -291539 -146470 315204 777606 545221
5170 545221 1222 -571166 -626794 -64115 372853 460971 770876 1152612 1102918 901808
5160 901808 647421 302793 126277 573297 1380233 2052693 2258384 2266337 2292782 2584585
5150 2584585 2810905 2563668 2534696 3435013 4797558 6127150 6188608 5074846 3844698
$$ packed form
5221D53472K88958k29988j43973j50539J56822l31588k33052J76204L82207Q29712
5211A198235K89284J13P3359L34294K01262P8622O46924R58903K70134o31644
5201C419486q98096n68455j74544l96803n30139n84954m28289k62940J07177l6694
5191c54251j54677j4537M6684L6285m4829l68486r6445L76188K18468J54002R5740
5180a05858l00232j21849L8166K58828P1611j32205J45069M61674M62402k32385
5170E45221n43999n72388n5628N62679M36968Q8118L09905L81736m9694k01110
5160I01808k54387l44628j76516M47020Q06936O72460K05691P953K6445K91803
5150B584585K26320k47237k8972R00317J362545J329592O1458j113762j230148
$$ plain form
5141 3844698 2989725 1833170 1067067 1147828 1164874 1126721 1123368 904144 384209 -267447
5131 -267447 -382130 -428569 -748474 -1106279 -1145409 -870065 -739907 -1154832 -1410301 -1228077
5121 -1228077 -1051290 -1200289 -1101747 -714724 -831403 -1003255 -1109843 -826653 -331830 -84372
5111 -84372 -9575 472410 1173330 1200489 805827 794264 938034 975978 774077 -170176 -709828
5100 -709828 -682443 -536895 -272967 -39660 205987 497871 449881 399588 743806 1570000
5090 1570000 2808993 3975204 5091345 6033587 5638123 3946448 2775646 2060658 1308070
5081 1308070 1109125 1278866 972171 790928 253285 -502161 -934174 -875668 -492458 -71226
5071 -71226 288710 532720 428859 246184 28579 -173240 -157885 147204 81048 -72364
$$ packed form
5141C844698q54973j156555p66103Q0761J7046l8153l353k19224n19935o51656
5131b67447j14683m6439l19905l57805l9130K75344J30158m14925k55469J82224
5121a228077J76787j48999R8542L87023j16679j71852j06588K83190M94823K47458
5111h4372P4797M81985P00920K7159l94662j1563J43770L7944k01901r44253n39652
5100g09828K7385J45548K63928K33307K45647K91884m7990n0293L44218Q26194
5090A570000J238993J166211J116141R42242l95464j691675j170802p14988p52588
5081A308070j98945J69741l06695j81243n37643p55446m32013N8506L83210M21232
5071g1226L59936K44010j03861j82675k17605k01819J5355L05089o6156j53412
$$ plain form
5061 -72364 -37305 -244791 -345336 -542357 -537824 -104592 180189 227059 61169 27858 -51856
5050 -51856 46926 8572 -76125 -362079 -647685 -931686 -765117 -59536 229309 110757
5040 110757 -5596 -369731 -789382 -753068 -315358 96801 339974 627772 1076832 1394515
5030 1394515 1654205 2011420 2078751 1600122 862856 423797 -14960 -218808 -139967 -212814
5020 -212814 -68066 -33725 591747 903750 654629 551816 277613 -238287 -262610 -190630
5010 -190630 -96428 -211733 -534145 -770164 -817452 -481372 -241670 -349593 -633814 -925579
5000 -925579 -1273792 -1127828 -326891 588780 784476 761292 524975 200053 627610 799045
4990 799045 248978 -309505 -485976 -456197 -240466 137707 200208 -53965 383796 1150565
$$ packed form
5061g2364L5059k07486j00545j97021M533M33232K84781M6870j65890l3311p9714
5050e1856R8782l8354q4697k85954k85606k84001J66569P05581K88845j18552
5040A10757j16353l64135m19651L6314M37710M12159K43173K87798M49060L17683
5030A394515K59690L57215O7331m78629p37266m39059m38757k03848P8841p2847
5020b12814J44748L4341O25472L12003k49121j02813k74203n15900k4323P1980
5010a90630R4202j15305l22412k36019m7288L36080K39702j07923k84221k91765
5000i25579l48213J45964Q00937R15671J95696k3184k36317l24922M27557J71435
4990G99045n50067n58483j76471K9779K15731L78173O2501k54173M37761P66769
$$ plain form
4980 1150565 1154261 805936 613940 828978 587114 -57099 -395078 -362758 189320 446341
4970 446341 328249 718207 896009 631067 604517 648323 211353 -650614 -872787 -444662
4960 -444662 -244136 -93910 67405 -70201 -413888 -863611 -1207685 -1546677 -2071414 -2095680
4950 -2095680 -1630619 -1104076 -357459 455220 650470 353444 135092 200752 -99981 -513269
4940 -513269 -317241 155656 194563 -179218 -622201 -956961 -1096161 -1025268 -733965 -532946
4930 -532946 -399449 -374550 -422683 -471745 -819998 -1177141 -778916 -459294 -731023 -852395
4920 -852395 -1066588 -1293050 -1013227 -538254 -521532 -743994 -972556 -997564 -680355 -613879
4910 -613879 -1186079 -1746078 -1798506 -1368916 -1033449 -738881 -253062 -37314 1912 -219996
$$ packed form
4980A150565L696l48325j91996K15038k41864o44213l37979L2320N52078K57021
4970D46341j18092L89958J77802k64942k6550M3806m36970q61967k22173M28125
4960d44662K00526J50226J61315j37606l43687m49723l44074l38992n24737k4266
4950b095680M65061N26543P46617Q12679J95250k97026k18352O5660l00733m13288
4940e13269J96028M72897L8907l73781m42983l34760j39200P0893K91303K01019
4930e32946J33497K4899m8133m9062l48253l57143L98225L19622k71729j21372
4920h52395k14193k26462K79823M74973J6722k22462k28562k5008L17209O6476
4910f13879n72200n59999n2428M29590L35467K94568M85819K15748L9226k21908
$$ plain form
4900 -219996 -636418 -606799 -258741 -128567 70369 21961 -217324 -680007 -1087978 -1186938
4890 -1186938 -1123311 -1062792 -1119235 -983061 -810885 -679898 -321432 143296 78317 -37801
4880 -37801 79624 471261 428185 145518 -36324 -13974 -180155 -392937 -448742 -259183
4870 -259183 -280836 -229125 -12344 53337 249072 619593 636725 436961 227998 -194040
4860 -194040 -146631 225107 727347 760437 148727 -462458 -522434 -394716 -830933 -1239808
4850 -1239808 -1303699 -1172700 -1306672 -1440917 -1105507 -591664 -192777 -203524 -181479 95319
4840 95319 -179354 -642314 -830794 -743320 -715914 -766162 -1059340 -1350935 -1078970 -905794
4830 -905794 -1071135 -1219760 -1316203 -1723368 -1796331 -1253628 -737400 -663349 -619487 -453093
$$ packed form
4900b19996m16422K9619L48058J30174J98936m8408k39285m62683m07971r8960
4890a186938O3627O0519n6443J36174J72176J30987L58466M64728o4979j16118
4880c7801J17425L91637m3076k82667j81842K2350j66181k12782n5805J89559
4870b59183k1653N1711K16781O5681J95735L70521J7132j99764k08963m22038
4860a94040M7409L71738N02240L3090o11710o11185n9976J27718m36217m08875
4850a239808o3891J30999j33972j34245L35410N13843L98887j0747K2045K76798
4840I5319k74673m62960j88480Q7474K7406n0248k93178k91595K71965J73176
4830i05794j65341j48625r6443m07165p2963N42703N16228P4051M3862J66394
$$ plain form
4820 -453093 -556211 -558612 -365825 -609424 -878671 -910639 -915396 -836539 -407070 -226846 -44300
4809 -44300 74190 -523069 -837266 -506599 -77564 244183 602944 501994 -243227 -525970
4799 -525970 -644274 -750457 -1029463 -1573514 -1154152 -354646 96150 -104665 -493329 -341638
4789 -341638 63657 336949 429252 210903 -293037 -833390 -1059821 -822319 -396788 85177
4779 85177 287921 391205 568803 608878 329171 362897 716295 944229 1188239 1171710
4769 1171710 1102610 993619 844700 780225 626356 194037 -313696 -367055 -163340 -18483
4759 -18483 167730 343526 62749 -138178 -157266 -169963 -251379 266989 894805 809530 542640
4748 542640 147297 -285977 -501375 -227879 -19945 -230601 -366003 -560458 -556532 -230059
$$ packed form
4820d53093j03118k401J92787k43599k69247l1968m757P8857M29469J80224J82546
4809d4300J18490n97259l14197L30667M29035L21747L58761j00950p45221k82743
4799e25970j18304j06183k79006n44051M19362P99506M50796k00815l88664J51691
4789c41638M05295K73292R2303k18349n03940n40353k26431K37502M25531M81965
4779H5177K02744J03284J77598M0075k79707L3726L53398K27934K44010j6529
4769A171710o9100j08991j48919o4475j53869m32319n07733n3359K03715J44857
4759a8483J86213J75796k80777k00927j9088j2697q1416N18368O27816q5275k66890
4748E42640l95343m33274k15398K73496K07934k10656j35402j94455L926L26473
$$ plain form
4738 -230059 133231 239419 -129214 -566575 -773693 -834609 -1067398 -1137239 -1024658 -569576
4728 -569576 -477611 -918418 -1152500 -573845 176331 214654 -4590 152520 182343 96323
4718 96323 161209 44903 -99146 50537 101727 267220 583331 538360 190866 -228586
4708 -228586 -474486 -758897 -1181985 -1413234 -1246521 -454593 135934 236277 485828 514848
4698 514848 229487 -185445 -259164 98112 274274 235170 329453 356715 7973 -180853
4688 -180853 -450401 -642134 -460944 -546073 -348878 184706 608902 651346 605655 658604
4678 658604 691112 417504 178165 215930 255411 -160555 -1010796 -1105673 -477618 -508615 -724421
$$ packed form
4738b30059L63290J06188l68633m37361k07118o0916k32789o9841J12581M55082
4728e69576R1965m40807k34082N78655P50176L8323k19244J57110K9823q6020
4718I6323O4886j16306j44049J49683N1190J65493L16111m4971l47494m19452
4708b28586k45900k84411m23088k31249J66713P91928N90527J00343K49551K9020
4698E14848k85361m14932p3719L57276J76162l9104R4283K7262l48742j88826
4688a80853k69548j91733J81190q5129J97195N33584M24196M2444m5691N2949
4678F58604L2508k73608k39339L7765L9481m15966q50241r4877O28055l0997k15806
$$ [...]
##END NTUPLES=NMR SPECTRUM
##END=
