##TITLE=C13_SR124T6
 CDCl3, 22200 sc

 2.6.2022
##JCAMPDX= 6.0         $$ Bruker NMR JCAMP-DX V2.0
##DATA TYPE= NMR SPECTRUM
##DATA CLASS= NTUPLES
##ORIGIN= UXNMR, Bruker Analytische Messtechnik GmbH
##OWNER= root
$$ XWIN-NMR		Version 3.5
$$ Fri Jun  3 13:41:19 2022 Russian Standard Time (UT+4h)  she@DPX200
##.OBSERVE FREQUENCY= 50.327896
##.OBSERVE NUCLEUS= ^13C
##.ACQUISITION MODE= SIMULTANEOUS
##.ACQUISITION SCHEME= undefined
##.AVERAGES= 22301
##.DIGITISER RES= 17
##SPECTROMETER/DATA SYSTEM= spect
##.PULSE SEQUENCE= zgpg30
##.SOLVENT NAME= CDCl3
##.SHIFT REFERENCE= (INTERNAL, CDCl3, 0, 222.089)
##AUDIT TRAIL= $$ (NUMBER, WHEN, WHO, WHERE, WHAT)
$$ ##TITLE= Audit trail, XWIN-NMR		Version 3.5
$$ ##JCAMPDX= 5.01
$$ ##ORIGIN= Bruker BioSpin GmbH
$$ ##OWNER= she
$$ F:/spectra/data/she/nmr/c13/1/pdata/1/auditp.txt
$$ ##AUDIT TRAIL=  $$ (NUMBER, WHEN, WHO, WHERE, WHAT)
(   1,<2022-06-03 13:39:50.73 +0400>,<she>,<DPX200>,
      <created by zg, POWCHK disabled, PULCHK disabled
       terminated by command 'halt'
       configuration hash MD5:
       00 E9 B6 7A A2 85 ED C7 34 08 36 98 17 FE 4E 26
       data hash MD5: 32K
       82 CF 33 2C DC 6B 3D BD 67 22 30 C0 32 D2 C1 A5>)
(   2,<2022-06-03 13:39:54.85 +0400>,<she>,<DPX200>,
      <Start of raw data processing
       efp BC_mod = 2 LB = 1 FT_mod = 6 PKNL = 1 PHC0 = -382.7807 PHC1 = 30.16232 SI = 32K 
       data hash MD5: 32K
       80 50 BE 4B F2 D8 42 96 5B 1C 58 07 DD 71 B5 60>)
(   3,<2022-06-03 13:40:19.32 +0400>,<she>,<DPX200>,
      <pk PHC0 = 29.09028 PHC1 = -8.599998 
       data hash MD5: 32K
       AB 5A 4A 11 87 40 E2 88 68 24 2D 98 86 87 86 F3>)
(   4,<2022-06-03 13:40:23.04 +0400>,<she>,<DPX200>,
      <abs ABSG = 5 
       data hash MD5: 32K
       CF E8 7B 88 EB D6 0C B3 35 D5 3C E5 B4 A9 52 C1>)
$$ ##END=
$$ 
$$ hash MD5
$$ DD 9B E8 29 2B BB CF E6 7A DB 72 CC 7E A6 24 A2
##$RELAX= 
##$RELAX= 
##$RELAX= 
##$RELAX= 
##$RELAX= 
##$RELAX= 
##$RELAX= 
##$RELAX= 
$$ Bruker specific parameters
$$ --------------------------
##$DU= <F:/spectra>
##$EXPNO= 1
##$NAME= <c13>
##$PROCNO= 1
##$TYPE= <nmr>
##$USER= <she>
##$AMP= (0..31)
100 100 100 100 100 100 100 100 100 100 100 100 100 100 100 100 100 100 
100 100 100 100 100 100 100 100 100 100 100 100 100 100 
##$AQSEQ= 0
##$AQ_mod= 1
##$AUNM= <au_zg>
##$AUTOPOS= <>
##$BF1= 50.322709
##$BF2= 200.13
##$BF3= 50.322709
##$BF4= 500.13
##$BF5= 500.13
##$BF6= 500.13
##$BF7= 500.13
##$BF8= 500.13
##$BYTORDA= 1
##$CFDGTYP= 0
##$CFRGTYP= 5
##$CHEMSTR= <none>
##$CNST= (0..31)
1 1 145 1 1 1 1 1 1 1 1 1 1 1 1 1 1 1 1 1 1 1 1 1 1 1 1 1 1 1 1 1 
##$CPDPRG= <waltz16>
##$CPDPRG1= <>
##$CPDPRG2= <waltz16>
##$CPDPRG3= <>
##$CPDPRG4= <mlev>
##$CPDPRG5= <mlev>
##$CPDPRG6= <mlev>
##$CPDPRG7= <mlev>
##$CPDPRG8= <mlev>
##$CPDPRGB= <>
##$CPDPRGT= <>
##$D= (0..31)
0 2 0.00345 0 0 0 0 0 0 0 0 0.03 2e-05 3e-06 0 0 0 0 0 0 0 0 0 0 0 0 0 
0 0 0 0 0 
##$DATE= 1654173031
##$DBL= (0..7)
120 120 120 120 120 120 120 120 
##$DBP= (0..7)
150 150 150 150 150 150 150 150 
$$ [...]
##$SUBNAM4= <"">
##$SUBNAM5= <"">
##$SUBNAM6= <"">
##$SUBNAM7= <"">
##$SUBNAM8= <"">
##$SUBNAM9= <"">
##$SW= 239.972175391363
##$SWIBOX= (0..15)
0 1 3 0 0 0 0 0 0 0 0 0 0 0 0 0 
##$SW_h= 12077.2946859903
##$TD= 32768
##$TD0= 1
##$TE= 0
##$TE2= 300
##$TE3= 300
##$TEG= 300
##$TL= (0..7)
120 120 120 120 120 120 120 120 
##$TP= (0..7)
150 150 150 150 150 150 150 150 
##$TP07= 0
##$TPNAME0= <>
##$TPNAME1= <>
##$TPNAME2= <>
##$TPNAME3= <>
##$TPNAME4= <>
##$TPNAME5= <>
##$TPNAME6= <>
##$TPNAME7= <>
##$TPOAL= (0..7)
0.5 0.5 0.5 0.5 0.5 0.5 0.5 0.5 
##$TPOFFS= (0..7)
0 0 0 0 0 0 0 0 
##$TUNHIN= 0
##$TUNHOUT= 0
##$TUNXOUT= 0
##$USERA1= <user>
##$USERA2= <user>
##$USERA3= <user>
##$USERA4= <user>
##$USERA5= <user>
##$V9= 5
##$VALIST= <valist>
##$VCLIST= <CCCCCCCCCCCCCCC>
##$VD= 0
##$VDLIST= <DDDDDDDDDDDDDDD>
##$VPLIST= <PPPPPPPPPPPPPPP>
##$VTLIST= <TTTTTTTTTTTTTTT>
##$WBST= 1024
##$WBSW= 4
##$XGAIN= (0..3)
0 0 0 0 
##$XL= 0
##$YL= 0
##$YMAX_a= 128099353
##$YMIN_a= -41235824
##$ZGOPTNS= <>
##$ZL1= 120
##$ZL2= 120
##$ZL3= 120
##$ZL4= 120
##$ABSF1= 222.0892
##$ABSF2= -17.90747
##$ABSG= 5
##$ABSL= 3
##$ALPHA= 0
##$AQORDER= 0
##$ASSFAC= 0
##$ASSFACI= 0
##$ASSFACX= 0
##$ASSWID= 0
##$AUNMP= <proc_1d>
##$AZFE= 0.1
##$AZFW= 0.5
##$BCFW= 0
##$BC_mod= 2
##$BYTORDP= 0
##$COROFFS= 0
##$CY= -3
##$DATMOD= 1
##$DC= 0
##$DFILT= <>
##$DTYPP= 0
##$F1P= 0
##$F2P= 0
##$FCOR= 0.5
##$FTSIZE= 32768
##$FT_mod= 6
##$GAMMA= 0
##$GB= 0
##$INTBC= 1
##$INTSCL= 4.134877e-10
##$ISEN= 128
##$LB= 1
##$LEV0= 0
##$LPBIN= 0
##$MAXI= 10000
##$MC2= 0
##$MEAN= 0
##$ME_mod= 0
##$MI= 0.1934396
##$NCOEF= 0
##$NC_proc= 2
##$NLEV= 6
##$NOISF1= 120.0001
##$NOISF2= 80.00006
##$NSP= 0
##$NTH_PI= 0
##$NZP= 0
##$OFFSET= 222.0892
##$PC= 1.4
##$PHC0= -353.6904
##$PHC1= 21.56232
##$PH_mod= 1
##$PKNL= yes
##$PPARMOD= 0
##$PSCAL= 0
##$PSIGN= 0
##$REVERSE= no
##$SF= 50.3227585034004
##$SI= 32768
##$SIGF1= 140
##$SIGF2= 120
##$SINO= 11.81781
##$SIOLD= 32768
##$SREGLST= <13C.CDCl3>
##$SSB= 0
##$STSI= 32768
##$STSR= 0
##$SW_p= 12077.2946859903
##$SYMM= 0
##$S_DEV= 0
##$TDeff= 32768
##$TDoff= 0
##$TI= <>
##$TILT= no
##$TM1= 0
##$TM2= 0
##$TOPLEV= 0
##$USERP1= <user>
##$USERP2= <user>
##$USERP3= <user>
##$USERP4= <user>
##$USERP5= <user>
##$WDW= 1
##$XDIM= 32768
##$YMAX_p= 395410828
##$YMIN_p= -2703897
$$ End of Bruker specific parameters
$$ ---------------------------------
##NTUPLES= NMR SPECTRUM
##VAR_NAME=  FREQUENCY,     SPECTRUM/REAL,   SPECTRUM/IMAG
##SYMBOL=    X,             R,               I
##VAR_TYPE=  INDEPENDENT,   DEPENDENT,       DEPENDENT
##VAR_FORM=  AFFN,          ASDF,            ASDF
##VAR_DIM=   32768,         32768,           32768
##UNITS=     HZ,            ARBITRARY UNITS, ARBITRARY UNITS
##FACTOR=    0.368581032318806, 1,           1
##FIRST=     11176.1413227862, 0,            0
##LAST=      -901.153363204117, 0,           0
##MIN=       -901.153363204117, -2703897,    0
##MAX=       11176.1413227862, 395410828,    0
$$ Real data points
##PAGE= N=1
##DATA TABLE= (X++(R..R)), XYDATA
$$ [...]
15868a285464P39232N83975K54107K40319p6752o02615r2176O89596L70362j97414
$$ -1285464 -546232 37743 291850 532169 455417 -147198 -239374 450222 820584 623170
15858F23170q3658q5497j58142J1021J7178J11096m03121l21794J96552k16865
$$ 623170 539512 454015 295873 306894 324072 435168 32047 -289747 -93195 -310060
15848c10060j24777J53163k44316k17552L6446L81073L05873k2023j13648l15694
$$ -310060 -434837 -281674 -525990 -743542 -707096 -326023 -20150 -42173 -155821 -471515
15838d71515m0548M73228K22858J00468k08397l91644m0129J16134k82195l07536
$$ -471515 -512063 -38835 184023 284491 76094 -315550 -355679 -239545 -521740 -829276
15828h29276K86152M64671J2217j35596P8173O36882O03970O1637M3784l20853
$$ -829276 -543124 -78453 -66236 -201832 -123659 513223 1117193 1178830 1222614 901761
15818I01761m29685k51855j82797J18670J09372j08206k09238n03906k86589R3569
$$ 901761 472076 220221 37424 156094 265466 157260 -51978 -555884 -842473 -748904
15808g48904K76068N20729J17718l08731k0687L04596O732l315M09631K71818
$$ -748904 -472836 47893 165611 -143120 -163807 140789 147521 144206 553837 825655
15798H25655q9722k28601k24177j86464l66598q38995m97818J86540r0885Q7161
$$ 825655 735933 507332 283155 96691 -269907 -1108902 -1606720 -1420180 -1511065 -1423904
15788a423904L22914L60279N11822K38151o58249o75596j38414J59974L101j52615
$$ -1423904 -1100990 -740711 -228889 9262 -648987 -1324583 -1462997 -1303023 -1299922 -1452537
15778a452537j98530J15408L95605J30221o1394K95553M61720P87191M73445k80892
$$ -1452537 -1651067 -1535659 -1140054 -1009833 -1071227 -775674 -313954 473237 946682 665790
15768F65790k25754j91879j24950n5426K62751L00218j18999k2460K72209M37707
$$ 665790 440036 248157 123207 67781 330532 630750 511751 489291 761500 1199207
15758A199207K41364n19446m19559m87117M9077J53262O1546k29483k50559Q351
$$ 1199207 1440571 921125 501566 14449 63526 216788 278334 48851 -201708 -193357
15748a93357l08693l60736J5102R8011J2698L36554L16706K47141J08912L43365
$$ -193357 -502050 -862786 -847684 -749673 -736975 -400421 -83715 163426 272338 615703
15738F15703J45659k93512l13220k95191O0859k17432l52422j57893J81671J20970
$$ 615703 761362 467850 154630 -140561 -79702 -297134 -649556 -807449 -625778 -504808
15728e04808J01512k7880j87719J4558K35016l5910k63773q7523r5470J61819
$$ -504808 -403296 -431176 -618895 -604337 -369321 -405231 -669004 -756527 -851997 -690178
15718f90178O88785N15914N3068j16379j84876j09608m928J54720J6098o3934
$$ -690178 -1393 514521 567589 451210 266334 156726 151798 306518 322616 258682
15708B58682q8290j95996N2073n1222k40144j32273j81354J69972j17757j96798
$$ 258682 170392 -25604 26469 -24753 -264897 -397170 -578524 -408552 -526309 -723107
15698g23107k5846k5215K65631J26552O6257J86007j07699k84481K3806l86289
$$ -723107 -748953 -774168 -508537 -381985 -315728 -129721 -237420 -521901 -498095 -884384
15688h84384l50232j67011M5407K87597L73022j03455j62805L32107k8761k81106
$$ -884384 -1234616 -1401627 -1356220 -1068623 -695601 -799056 -961861 -629754 -658515 -939621
15678i39621l72758l00229L84579N23861K83592Q2218M74962P06972R4196l43213
$$ -939621 -1312379 -1612608 -1228029 -704168 -420576 -338358 136604 843576 937772 594559
15668E94559l49857k25710r9650J55834K0529q3223k78385l75407O8182N73002
$$ 594559 244702 18992 -80658 75176 95705 12482 -265903 -641310 -573128 -126
15658a26O42745O8277n22342k55994j8755m1630r2082J00131J08892Q7962P8462
$$ -126 642619 710896 188554 -67440 -86195 -127825 -219907 -119776 -10884 77078 155540
15647A55540m8423m0012M09230L29311j69647l58844m9270L76423Q07756j01789
$$ 155540 107117 67105 476335 805646 635999 277155 227885 604308 1412064 1310275
15637A310275r25440n79211m93838k52096m2947J57077Q1772k60593J35623K46324
$$ 1310275 384835 -194376 -688214 -940310 -983257 -826180 -744408 -1005001 -869378 -623054
15627f23054K60481J25281j8016p1515o0589N3108J25701k72851o67812o14066
$$ -623054 -362573 -237292 -255308 -326823 -387412 -334304 -208603 -481454 -1149266 -1763332
15617a763332k13483N52528Q32655P06234M96866k65152p97570p99005l07141
$$ -1763332 -1976815 -1424287 -591632 114602 611468 346316 -451254 -1250259 -1557400
15608a557400M2437M84686P35777L26212j87148l15572q8518l1612m02766n34831
$$ -1557400 -1514963 -1030277 -294500 31712 -155436 -471008 -559526 -591138 -993904 -1528735
15598a528735R2777M54381L18993L35718K42423K71049J67758j33138m16784l62498
$$ -1528735 -1435958 -981577 -662584 -326866 -84443 186606 354364 221226 -195558 -558056
15588e58056J48890K77980L66443K84250j80709J59364j08470o74957m27901Q9068
$$ -558056 -409166 -131186 235257 519507 338798 498162 389692 -285265 -713166 -624098
15578f24098K95923j48600j49380n111K29177K2340j33977m2783L60547L97278
$$ -624098 -328175 -476775 -626155 -631266 -402089 -379749 -513726 -556509 -195962 201316
15568B01316k20734l84248k6094L50717P48102L35950l74478m76980l28427N8773
$$ 201316 -19418 -403666 -429760 -79043 669059 1005009 630531 153551 -174876 -116103
15558a16103J19979k68614k71051J58039L17720Q4949L7925J90733q7431n9522
$$ -116103 3876 -264738 -535789 -377750 -60030 24919 62844 253577 166146 106624
15548A06624K77302J51109r3660j44308j17951n8650M4096p9817r1571k54900
$$ 106624 383926 535035 441375 297067 179116 120466 164562 84745 -6826 -261726
15538b61726k35641J20915L37735j24356l4016l05666j55242J39827p930R57j36193
$$ -261726 -497367 -376452 -38717 -163073 -197089 -502755 -657997 -518170 -526100 -525143 -661336
15527f61336k94735p127M08877K87435j07263j35790k48180L49396K77974j33804
$$ -661336 -956071 -963198 -554321 -266886 -374149 -509939 -758119 -408723 -130749 -264553
15517b64553Q3952k85143k76889R4062k3194r2891Q6909L69102j34445l60551
$$ -264553 -180601 -465744 -742633 -648571 -671765 -764656 -677747 -308645 -443090 -803641
15507h03641L48165L24406J81105j77544n59560j42712k26443j85057L43089N9389
$$ -803641 -455476 -131070 50035 -127509 -687069 -829781 -1056224 -1241281 -898192 -838803
15497h38803p1999K45618R4808l86126k95006J74867K64753M32641J53285m01701
$$ -838803 -910802 -665184 -570376 -956502 -1251508 -1076641 -811888 -379247 -225962 -627663
15487f27663m65389n4398M2354J34701K4309o2926L67595M15982J01840m19086
$$ -627663 -1093052 -1147450 -1105096 -970395 -946086 -1009012 -641417 -225435 -123595 -542681
15477e42681k30398j18690r5619K84771K59787J60763n7286M4198N77357N91803
$$ -542681 -773079 -891769 -987388 -702617 -442830 -282067 -339353 -295155 282202 874005
15467H74005K07625p43878p53804j30741L55712L34818k0616q5987k0964r4225
$$ 874005 1081630 337752 -416052 -546793 -191081 143737 123121 37134 16170 -78055
15457g8055N3663l371J16111p6322j42536l8025n439M61573K07843m86365o99
$$ -78055 -24392 -27763 88348 12026 -130510 -168535 -173974 287599 495442 9077 8378
15446H378M01827k39056n56304R6954n0188k65218q88j43206j99666p7413M03919
$$ 8378 410205 171149 -385155 -288201 -338389 -603607 -604495 -747701 -947367 -1024780 -620861
15435f20861N34647j04346m15941J37070L19389k41989P2568L52521M8606l47929
$$ -620861 -86214 -190560 -606501 -469431 -150042 -392031 -319463 33058 81664 -266265
15425b66265l74123j9446K53405j45752l65389j88978J04149J64652r8919P1900
$$ -266265 -640388 -659834 -406429 -552181 -917570 -1106548 -1002399 -837747 -936666 -864766
15415h64766J22109r0231P4743K72132k96250k16588J36295M01333L61151K77257
$$ -864766 -742657 -832888 -758145 -486013 -782263 -998851 -862556 -461223 -100072 177185
15405A77185M87143L32536j86997n02541j50932L6820k7272l135m55026k62951
$$ 177185 664328 996864 809867 307326 156394 193214 165942 162807 -292219 -555170
15395e55170K63219l09173l44388K59561O77600O2253p40618o49335n54832K54343
$$ -555170 -291951 -601124 -945512 -685951 -8351 53902 -686716 -1336051 -1890883 -1636540
15385a636540Q53155L24274p6562K56335N08054K45151L79772L66328l48367n34088
$$ -1636540 -783385 -459111 -535673 -279338 228716 473867 853639 1219967 871600 337512
15375C37512m8669R2317J694j73220l59180L8782r5584j81843L35440M10808K7197
$$ 337512 288843 381160 382854 209634 -149546 -110764 -206348 -388191 -52751 358057 385254
15364C85254k14766J62367j57950n50630r4378O3678K29975L34311J09341J57273
$$ 385254 170488 332855 174905 -375725 -470103 -406425 -176450 157861 267202 424475
15354D24475J75625N1230k39419j89812j40325R1265K46076J59368k99240o98912
$$ 424475 600100 651330 411911 222099 81774 173039 419115 578483 279243 -419669
15344d19669j06891J8525m94030j98382J12017J34599M80537O0356l80972J5372
$$ -419669 -526560 -508035 -1002065 -1200447 -1088430 -953831 -473294 -412938 -793910 -778538
15334g78538Q09223M85227k0726k46957l99781n80765m97615l4277L56631K83801
$$ -778538 30685 515912 495186 248229 -151552 -732317 -1229932 -1264209 -907578 -623777
15324f23777q4533m22728j29131L20953P19163K78610l37716O1190M82540K19399
$$ -623777 -708310 -1131038 -1260169 -939216 -220053 58557 -279159 -217969 264571 483970
15314D83970k06156p38077n45791k91495L62852M27127j09847m75779l00709K79451
$$ 483970 277814 -460263 -1006054 -1297549 -934697 -507570 -617417 -1093196 -1393905 -1114454
15304a114454N24175L32495J94879K80294J92455J32840n07926m09793M14278
$$ -1114454 -590279 -257784 -62905 217389 409844 542684 34758 -375035 39243
15295C9243k7774l14494Q7370K15384L00443J69835j10345M04969K13144m67850
$$ 39243 11469 -303025 -215655 -271 300172 470007 359662 764631 977775 509925
15285E09925m20833k6263M49298K63428k18782l39248n7397n0342l63186l18502
$$ 509925 89092 62829 512127 775555 556773 217525 160128 109786 -253400 -571902
15275e71902m04041k97997J44807J22238o4403L4440K09752M6530K52855J07952
$$ -571902 -975943 -1273940 -1129133 -1006895 -1071298 -1036858 -827106 -780576 -527721 -419769
15265d19769j71164l72546M8102K2580k67943M00542N73251L66714J76481m7120
$$ -419769 -590933 -963479 -915377 -892797 -1160740 -760198 -186947 179767 356248 309128
15255C09128j1462l48514l55318j93664K06686M23884M45606J05571K62287K9402
$$ 309128 297666 -50848 -406166 -599830 -393144 30740 476346 581917 844204 873606
15245H73606l98556m84127m01203k33664k14344J27641R1000K05836K5478j28625
$$ 873606 475050 -9077 -410280 -643944 -858288 -730647 -639647 -433811 -408333 -536958
15235e36958L62972J22806k24662j27889j72516j90177P4434J4636K99913L17268
$$ -536958 -173986 -51180 -275842 -403731 -576247 -766424 -691990 -677354 -377441 -60173
15225f0173K46536K89697Q7140M478j18404K36413J98079m24554k43222j41454
$$ -60173 186363 476060 563200 567678 449274 685687 883766 459212 215990 74536
15215G4536l03488j57869j08947m81151k72894M09556p0305K94764L05072m94053
$$ 74536 -228952 -386821 -495768 -976919 -1249813 -840257 -910562 -615798 -310726 -804779
15205h04779k04272K17337O5519k8685J7244j68329j58297R1521M06238L60510
$$ -804779 -1009051 -791714 -726195 -754880 -737636 -905965 -1064262 -972741 -566503 -205993
15195b05993M4042K27704M49253M85052l07676o36210m51875l55129K6290J32645
$$ -205993 -161951 65753 515006 1000058 692382 56172 -395703 -750832 -724542 -591897
15185e91897P2196L108K86357J69524k09710m26557o0180J94896l2036l39024
$$ -591897 -519701 -516593 -230236 -60712 -270422 -696979 -757159 -562263 -594299 -933323
15175i33323j34259O838L5115K05490L36694o2481k08957K20751L78442k69065
$$ -933323 -1067582 -1060744 -1025629 -820139 -483445 -545926 -754883 -534132 -155690 -424755
15165d24755K1108K296l02984K45185K20255J63267K71788M77020K6937k98916
$$ -424755 -403647 -401351 -704335 -459150 -238895 -75628 196160 673180 700117 401201
15155D01201l60269n3938K10676j27993k79386J89054m7493k54587k94443l52403
$$ 401201 40932 -13006 197670 69677 -209709 -20655 -68148 -322735 -617178 -969581
15145i69581m59836k23304J14138K03941P08978L20856p7741L39242L08775K64362
$$ -969581 -1429417 -1652721 -1538583 -1334642 -625664 -304808 -382549 -43307 265468 529830
15135E29830K38379j77157l32659n9975J51233L76835M82161P0466k75613r2871
$$ 529830 768209 591052 258393 198418 349651 726486 1208647 1279113 1003500 910629
15125I10629k66072l68829k50871l25710k45005l29016m74602k93767N18202J064681
$$ 910629 644557 275728 24857 -300853 -545858 -874874 -1349476 -1643243 -1125041 -60360
15115f0360M10100M2679J05018L5193k73463j22269J10021l09311p51515k80660
$$ -60360 349740 392419 497437 532630 259167 136898 246919 -62392 -813907 -1094567
15105a094567J91748L76352L43355m01700p20006n28005L02884Q56530R27600
$$ -1094567 -902819 -526467 -183112 -584812 -1304818 -1832823 -1529939 -673409 254191
15096B54191J21524j37256n800J69023l7147m20604m10568l49911K3174L46632
$$ 254191 375715 238459 232659 401682 364535 -56069 -466637 -816548 -793374 -446742
15086d46742M23622m7208j16864K25118J7253j69088k35324j50022k60490k49737
$$ -446742 -23120 -70328 -187192 37926 55179 -113909 -349233 -499255 -759745 -1009482
15076a009482K13414L10406L64237Q249k35783J4858M4831k47754J27089p9298
$$ -1009482 -796068 -485662 -121425 -113176 -348959 -334101 -289270 -537024 -409935 -489233
15066d89233j02482O041l4764K85246J59795P8100j52536j76083Q3812M5787J44776
$$ -489233 -591715 -585674 -620438 -335192 -175397 -97297 -249833 -425916 -342104 -296317 -151541
15055a51541J08299k78523k76073K26401J29588q6102M808J8723l41413k05666
$$ -151541 -43242 -321765 -597838 -371437 -241849 -327951 -323143 -304420 -645833 -851499
15045h51499J59459L04012m8455n61112o56400k1942N48733L18116K24400L81010
$$ -851499 -692040 -388028 -436483 -997595 -1653995 -1675937 -1127204 -809088 -584688 -203678
15035b03678m9300j56491J56095R7490M8733J88584j28145J17741n3871m61877
$$ -203678 -252978 -409469 -253374 -155884 -107151 81433 -46712 71029 17158 -444719
15025d44719J036l0801J55199J62088n7419m62211j04291l6394k30946L08048
$$ -444719 -443683 -474484 -319285 -157197 -214616 -676827 -781118 -817512 -1048458 -740410
15015g40410P55000O07759j01002m78277k66872q7768K62204J02630r4767n1463
$$ -740410 14590 622349 521347 43070 -223802 -311570 -49366 53264 -41503 -92966
15005i2966L92591J73022L5971j4733N3189J91942j29972j3357K05088r0007m35756
$$ -92966 299625 472647 508618 493885 547074 739016 609044 595687 800775 710768 275012
14994B75012n39407k58301J2002k46180m53753j64349l0440J53950P7555o2935
$$ 275012 -264395 -522696 -510694 -756874 -1210627 -1374976 -1405416 -1251466 -1173911 -1236846
14984a236846K6268J91500q0929k14013N8510O8603K90258K31688N48298L06104
$$ -1236846 -1210578 -1019078 -1100007 -1314020 -1255510 -1186907 -896649 -664961 -116663 189441
14974A89441p1188j57485j11593K04981m53455o39933j79345K50322J19245k9565
$$ 189441 118253 -39232 -150825 54156 -399299 -1039232 -1218577 -968255 -849010 -878575
14964h78575J68659J33356N10616K28226j10957K90671k02343n90820j96665J60945
$$ -878575 -709916 -576560 -65944 162282 51325 341996 139653 -451167 -647832 -486887
14954d86887J15685k56757l8392K92358j7262J9682J73663n0576k8566K17783
$$ -486887 -371202 -627959 -666351 -373993 -391255 -371573 -197910 -248486 -277052 -59269
14944e9269K75548R2184l62225m94660k05720J74599K40652k08072k32990J17525
$$ -59269 216279 308463 -53762 -548422 -754142 -579543 -338891 -546963 -779953 -662428
14934f62428K10001J34896p1213J54200k2199j46394L97818p1738o50489r7068
$$ -662428 -452427 -317531 -388744 -234544 -256743 -403137 -5319 -77057 -727546 -824614
14924h24614M45113K76110O483P5534Q3008j35599k92016k90377r3345p6711j27351
$$ -824614 -379501 -103391 -96908 -21374 61634 -73965 -365981 -656358 -749703 -826414 -953765
14913i53765n13470l53302J13698K96448K52979Q8842J54428M01039K21037m14816
$$ -953765 -1467235 -1820537 -1706839 -1410391 -1157412 -1068570 -914142 -513103 -292066 -706882
14903g06882m46055J2520J78559L72851J37220n28606n96146J96340M11856J88886
$$ -706882 -1152937 -1140417 -961858 -589007 -451787 -980393 -1576539 -1380199 -968343 -779457
14893g79457M65489M43970O5053l57373k37156M11463O79136J67008l38658m93576
$$ -779457 -313968 130002 195055 -162318 -399474 11989 691125 858133 519475 25899
14883B5899R498R0357k44551l96225L8250L35587K76182j84019q65531j26889
$$ 25899 35397 125754 -118797 -515022 -476772 -141185 134997 -49022 -914553 -1041442
14873a041442N67137K96444J74265k30224k92541M35314L84943J89683j42112
$$ -1041442 -474305 -177861 -3596 -233820 -526361 -91047 293896 483579 341467
14864C41467o1089l95611o41369m29344J10917N28918N28194L00212M2529K37754
$$ 341467 280378 -115233 -756602 -1185946 -1075029 -546111 -17917 282295 324824 562578
14854E62578M00463N7901k48920j56206j05041j14365m29022l48012j47937j24882
$$ 562578 963041 1020942 772022 615816 510775 396410 -32612 -380624 -528561 -653443
14844f53443L08594L65168K14159l34911l75829n8656L4545j20695M78438M76784
$$ -653443 -344849 20319 234478 -100433 -476262 -534918 -500373 -621068 -142630 334154
14834C34154K04522L16561j69924m39805M8656M7524k86862k89100j30078l4052
$$ 334154 538676 855237 685313 245508 294164 341688 54826 -234274 -364352 -398404
14824c98404K2660p8742o1392M39461J92144K95125K12669l53359K744K14754
$$ -398404 -375744 -454486 -515878 -76417 115727 410852 623521 270162 272906 487660
14814D87660J51165L58397J53497n87635l42702J84680n1108J03523O5080j82103
$$ 487660 638825 997222 1150719 563084 220382 405062 353954 457477 522557 340454
14804C40454Q0321P0083j88971l23044j87051J80123r4973n10574j36440R8368
$$ 340454 420775 490858 301887 -21157 -208208 -28085 -123058 -633632 -770072 -671704
14794f71704j48755J19282K71888L83625K22340l23036l59005K3352l52983o45629
$$ -671704 -820459 -701177 -429289 -45664 176676 -146360 -505365 -482013 -834996 -1480625
14784a480625J16436L71632K02747L34985J18946O4729j85432j40717J34830J78091
$$ -1480625 -1364189 -992557 -789810 -454825 -335879 -271150 -456582 -597299 -462469 -284378
14774b84378M73702L20818j34360n8054r5647l64689l70928j67204M43875L98448
$$ -284378 189324 510142 375782 317728 222081 -142608 -513536 -680740 -236865 161583
14764A61583N283K58111K153k76497M16j53193l89362p3793q5570j2712K16034
$$ 161583 166866 424977 427130 150633 151049 -2144 -391506 -465299 -550869 -563581 -347547
14753c47547L62417J17649n55279l92501M5300K42453P040k03175j6527n2040
$$ -347547 14870 132519 -422760 -815261 -769961 -527508 -520468 -723643 -740170 -792210
14743g92210k37509l55206J04709L4907K7305L45665l7037m51161k52615K80265
$$ -792210 -1029719 -1384925 -1280216 -1245309 -1218004 -872339 -909376 -1360537 -1613152 -1332887
14733a332887J58201j15110P2658N93609P73120L20383k24303l9073j03951m23339
$$ -1332887 -1174686 -1289796 -1217138 -623529 149591 469974 245671 206598 102647 -320692
14723c20692m05533L2412K57595L96394K36624j39597l81668k57664j78971j55664
$$ -320692 -726225 -693813 -436218 -39824 196800 57203 -324465 -582129 -761100 -916764
14713i16764J89947K25128o9923l34793J50140L85637M22691K95872l04794j86329
$$ -916764 -726817 -501689 -571612 -906405 -756265 -370628 52063 347935 43141 -143188
14703a43188j207k01589l46711j74758L97386P25587J8326o08399m2433L67479
$$ -143188 -144395 -345984 -692695 -867453 -470067 255520 273846 -334553 -376986 -9507
14693i507J3063o89988l11387L30307K75451Q8871l6232K16927J96199j98795
$$ -9507 3556 -686432 -997819 -667512 -392061 -303190 -339422 -122495 73704 -125091
14683a25091m27290M5303K56848J9609j51569l08306N3571Q9841j43602k7294
$$ -125091 -552381 -507078 -250230 -230621 -382190 -690496 -636925 -547084 -690686 -717980
14673g17980M01560J04913m2034l60584j25796L0313l11829j27734j3662J42168
$$ -717980 -316420 -211507 -253541 -614125 -739921 -709608 -1021437 -1149171 -1162833 -1020665
14663a020665N10580M43440K92262K13019M5651j33637k59462m32419m59471l8578
$$ -1020665 -510085 -66645 225617 438636 484287 350650 91188 -341231 -800702 -839280
14653h39280R0056L74861M31813K9393k90891p31705l17275L28060J22237J04447
$$ -839280 -749224 -374363 57450 86843 -204048 -935753 -1253028 -924968 -802731 -698284
14643f98284k8079J9346J1311l80502n8830N74501J57651n3268l07751n8747K86053
$$ -698284 -726363 -707017 -695706 -1076208 -1135038 -560537 -402886 -456154 -763905 -822652 -536599
14632e36599M18783K88238k93359k55692p1872j98937K50100O47177N841k31701
$$ -536599 -117816 170422 -122937 -378629 -450501 -649438 -399338 247839 253680 21979
14622B1979L77784N57201M4458l58459n07980l48000j61749L98881j95608o19740
$$ 21979 399763 956964 1001422 642963 134983 -213017 -374766 24115 -171493 -791233
14612g91233j43391J28042R6341k5069J30456L68966K70181j13222j46426J6300
$$ -791233 -934624 -806582 -710241 -735310 -604854 -235888 34293 -78929 -225355 -209055
14602b09055K17991j28602K6258N24220L83695M21745p2376m80147m37933m0544
$$ -209055 8936 -119666 -93408 430812 814507 1236252 1163876 683729 245796 205252
14592B05252j70069l17405N9719J19982j54592l92605k71482j78245m7065M6560
$$ 205252 35183 -282222 -222503 -102521 -257113 -649718 -921200 -1099445 -1146510 -1099950
14582a099950K69499K45385J94497L36940L98956J69523J56093J74450j75225
$$ -1099950 -830451 -585066 -390569 -53629 345327 514850 670943 845393 670168
14573F70168l81072l26342j29624j23429j18481j16383O0513l0419k85302j48628
$$ 670168 289096 -37246 -166870 -290299 -408780 -525163 -464650 -495069 -780371 -928999
14563i28999j40203M49771O85684K50223j51538j37928q1312L92141O03410K72065
$$ -928999 -1069202 -619431 66253 316476 164938 27010 -54302 337839 941249 1213314
14553A213314l6511k65969k06427l87473m6630m96917q53806m91688R9158J93960
$$ 1213314 1176803 910834 704407 316934 270304 -226613 -1080419 -1572107 -1472949 -1278989
14543a278989M58314P76871L17254j68813l24072k50151j93017k53835j77727
$$ -1278989 -820675 -43804 273450 104637 -219435 -469586 -662603 -916438 -1094165
14534a094165N9421K73837K10075J21841K79223O08400j33187p34148p6623K0196
$$ -1094165 -1034744 -760907 -550832 -428991 -149768 458632 325445 -408703 -485326 -465130
14524d65130J49203R7180Q7204M06587l32619m61575j48449j17786J66477K58305
$$ -465130 -315927 -218747 -131543 275044 -57575 -519150 -667599 -785385 -618908 -360603
14514c60603J00004J27292k47977j44893k84866k57993L61935L95624J64536j47988
$$ -360603 -260599 -133307 -381284 -526177 -811043 -1069036 -707101 -311477 -146941 -294929
14504b94929j60593j66669j18104L750L23049L23642O2465M822J90511Q5141k3556
$$ -294929 -455522 -622191 -740295 -736545 -413496 -89854 -27389 -22567 167944 253085 229529
14493B29529r797o1636j81893n9067P5383k35951l48524j60636L8188L22382M66111
$$ 229529 219732 158096 -23797 -82864 -7481 -243432 -591956 -752592 -714404 -392022 74089
14482G4089N56839J08268o24059o96565j92822L90546J18808n046J85618J87538
$$ 74089 630928 739196 115137 -581428 -774250 -383704 -264896 -269942 -84324 103214
14472A03214k24594m88142l27836J07684K44330L18069l2778n56389j49335K85333
$$ 103214 -121380 -609522 -937358 -829674 -585344 -267275 -300053 -856442 -1005777 -720444
14462g20444K44290K56755M95192J68822o71887o61325j99944L44329M72399L1786
$$ -720444 -476154 -219399 275793 444615 -227272 -888597 -1088541 -744212 -271813 -240027
14452b40027k74199q3860K01904k3530k82006j60656K16544N580o6402N7385J25657
$$ -240027 -514226 -598086 -396182 -419712 -701718 -862374 -645830 -640250 -706652 -649267 -523610
14441e23610J64405j86898N2381N42608n5366j58768k97051k69153p4987j68569
$$ -523610 -359205 -546103 -493722 48886 -6480 -165248 -462299 -731452 -806439 -975008
14431i75008j45872L89005L84154m9879k88269j73492M5719J82205O3660Q0260
$$ -975008 -1120880 -731875 -347721 -397600 -685869 -859361 -813642 -631437 -567777 -487517
14421d87517J09529J6530l91737m90187j04992J33521J48184J53946K64549K95013
$$ -487517 -377988 -361458 -753195 -1243382 -1348374 -1214853 -1066669 -912723 -648174 -353161
14411c53161P8296J07697J63349L8671k3609M66599N27056K12394R685k80497
$$ -353161 -274865 -167168 -3819 34852 11243 477842 1004898 1217292 1226977 946480
14401I46480n79439n41491L2044j6467k1788m1225q7407q767j50895j37150O342
$$ 946480 367041 -174450 -142406 -158873 -180661 -221886 -309293 -318060 -468955 -606105 -599763
14390e99763j52563j70170k4996O3933J16300K17204N66511J68911l14683m43600
$$ -599763 -752326 -922496 -947492 -883559 -767259 -550055 16456 185367 -129316 -572916
14380e72916l88231J44428J83816K955k67971j11335J51041M10560M94212k97710
$$ -572916 -961147 -816719 -632903 -629948 -897919 -1009254 -858213 -447653 46559 -251151
14370b51151r51236j87498k2106j9886Q4615J02348N76207J56612j22610K22777
$$ -251151 -1202387 -1389885 -1411991 -1431877 -1347262 -1244914 -668707 -512095 -634705 -411928
14360d11928J46234k26981j34048k36214k1680K07307J54000n1753K26762Q9570
$$ -411928 -265694 -492675 -626723 -862937 -884617 -677310 -523310 -575063 -348301 -258731
14350b58731L80576M20970J27944j28523k26447r5487l57470l76902j27040p0003
$$ -258731 121845 542815 670759 542236 315789 220302 -137168 -514070 -641110 -711113
14340g11113K65726K35131J8483j23446l27926j06664N9232j68369Q4956J61674
$$ -711113 -445387 -210256 -191773 -315219 -643145 -749809 -690577 -858946 -773990 -612316
14330f12316j81633n06205j31630K06491J08153J12264K17397P03796L18531N4369
$$ -612316 -793949 -1300154 -1431784 -1225293 -1117140 -1004876 -787479 -83683 234848 289217
14320B89217J04334q5479m32941m61353J76388j26257m17095k04584k55148l01378
$$ 289217 393551 308072 -124869 -586222 -409834 -536091 -953186 -1157770 -1412918 -1714296
14310a714296K1887K13959J75923k16368j28628O6875l59992J22005R37073O44806
$$ -1714296 -1692409 -1478450 -1302527 -1518895 -1647523 -1580648 -1940640 -1818635 -881562 -236756
14300b36756M88773L40375l75921n27435j80675J57690K678j61338o60K2132l61981
$$ -236756 252017 592392 216471 -310964 -491639 -333949 -331271 -492609 -493269 -471137 -833118
14289h33118m96132m0748J58905Q4756M52225M40398J03988J81178p6422m78991
$$ -833118 -1329250 -1369998 -1211093 -1126337 -674112 -233714 -129726 51452 -24970 -503961
14279e03961r6984o7686J25177K25049k87668l79225K975n0653L08407P16870
$$ -503961 -600945 -668631 -543454 -318405 -606073 -985298 -982323 -1032976 -724569 -7699
14269g699K44364o1685n43333m09763Q2723J04199o0081n0438L62298R6346k73191
$$ -7699 236665 174980 -368353 -778116 -695393 -591194 -651275 -701713 -339415 -243069 -516260
14258e16260k04597j54275k81709j39773L04662N48326J86921m2330m1127o5848
$$ -516260 -720857 -875132 -1156841 -1296614 -991952 -443626 -256705 -299035 -340162 -406010
14248d06010q2231N52357O69162j00583l70107n35718k42914j18189j86707K32977
$$ -406010 -488241 64116 733278 632695 262588 -273130 -516044 -634233 -820940 -587963
14238e87963P0436J07873M37247p6870k79408N6342K44823L31477P1547j87737
$$ -587963 -517527 -409654 27593 -49277 -328685 -272343 -27520 303957 375504 187767
14228A87767o0068K45124K97222p4302j32601j64448m26719l51384n2681L58086
$$ 187767 127699 372823 670045 595743 463142 298694 -128025 -479409 -532090 -174004
14218a74004n2878m24578J1041L87040J86912L17008K21929J49422j97005l00906
$$ -174004 -226882 -651460 -640419 -253379 -66467 250541 472470 621892 424887 123981
14208A23981J44456p627Q0793k59487o9239J57353j17184m54512j46714K04370
$$ 123981 268437 260810 341603 82116 12877 170230 53046 -401466 -548180 -343810
14198c43810K60112M76199M5292L10527K36186K7352l99408l62221K15363J929
$$ -343810 -83698 392501 437793 748320 984506 1011858 612450 250229 465592 467521
14188D67521k03318l74088l81172M0349P8688o1485R5209J23790O8895L44833
$$ 467521 264203 -109885 -491057 -450708 -372020 -433505 -338296 -214506 -145611 199222
14178A99222J11146o42457n85261M2405K49687K07094k27743j75141K73896L55173
$$ 199222 310368 -332089 -917350 -874945 -625258 -418164 -645907 -821048 -547152 -191979
14168a91979J34681j12826J11777j42366k24894N99002P00087M21552l73956q18644
$$ -191979 -57298 -170124 -58347 -200713 -425607 173395 873482 1295034 921078 102434
14158A02434j08571J98097K13947R4771j37764N8863J85729J77137R382Q7591
$$ 102434 -6137 191960 405907 500678 362914 421777 607506 784643 794025 881616
14148H81616m43540o37659l02458l50615o53474k70429J08889L01456J4205o5289
$$ 881616 438076 -199583 -502041 -852656 -1506130 -1776559 -1667670 -1366214 -1352009 -1417298
14138a417298J89852K51811R2226j44324m2240M14406M15447O649m09441M5044
$$ -1417298 -1227446 -975635 -883409 -1027733 -1069973 -655567 -240120 -233471 -642912 -597868
14128e97868L09539p9911n6170K27989L96453j4255j15511K58510j00238m24664
$$ -597868 -288329 -368240 -424410 -196421 200032 185777 70266 328776 228538 -196126
14118a96126k29152p8145O2310J55602J44781J53830J17617j83992k12828K45983
$$ -196126 -425278 -503423 -441113 -285511 -140730 13100 130717 -53275 -266103 -20120
14108b0120R9129r3916l1124l91104j92609L65650M24901L0316j72463m5513l09384
$$ -20120 79009 -14907 -46031 -437135 -629744 -264094 160807 191123 18660 -26853 -336237
14097c36237n48327m3226K96843K24594j40406p0882K55266R1685k42248m3533
$$ -336237 -884564 -927790 -630947 -406353 -546759 -617641 -362375 -270690 -512938 -556471
14087e56471n6732K70012J90415N6463K2918j77167K33428M82924n25615p64500
$$ -556471 -613203 -343191 -152776 -96313 -73395 -250562 -17134 465790 -59825 -824325
14077h24325k01055L95445R1227j00689K21843M8731k10101J20105J15955K2218
$$ -824325 -1025380 -629935 -538708 -639397 -417554 -368823 -578924 -458819 -342864 -320646
14067c20646L0610N4619K6352m51281o27124j74360J7172J10686L63368N56283
$$ -320646 -290036 -235417 -209065 -660346 -1287470 -1461830 -1444658 -1333972 -970604 -414321
14057d14321M61779o0343l17697q4914L14407K01167O5619p9396o05108l88395
$$ -414321 47458 -12885 -330582 -415496 -101089 100078 165697 86301 -518807 -907202
14047i07202K52928N21023L23435K7803O8842n7580k44848l96344l20373K63209
$$ -907202 -654274 -133251 190184 217987 286829 229249 -15599 -411943 -732316 -469107
14037d69107N01073L99753M20458J5813j54828l16439l09014J61924J15718o03881
$$ -469107 31966 431719 852177 867990 713162 396723 87709 249633 365351 -238530
14027b38530k86675R3031L118j91265J36056J22572p3941m68504o79791J05558
$$ -238530 -525205 -432174 -429056 -620321 -484265 -361693 -435634 -904138 -1583929 -1478371
14017a478371O35138M45932m985J7834j63593l4838j44226j98153K95942L82119
$$ -1478371 -843233 -397301 -402286 -384452 -548045 -582883 -727109 -925262 -629320 -247201
14007b47201M9713K45303J87505J76665k56392m85348J32197L40337l94257m09796
$$ -247201 -197488 47815 235320 411985 155593 -329755 -197558 142779 -251478 -661274
13997f61274k27431n11773k39114L44642K14810l90358j36336M65664N16050J74906
$$ -661274 -888705 -1400478 -1639592 -1294950 -1080140 -1470498 -1606834 -1141170 -625120 -450214
13987d50214l12938l35074l23596M7520J90054K60396L11712p1529R8936O1154
$$ -450214 -763152 -1098226 -1421822 -1374302 -1184248 -923852 -612140 -683669 -584733 -523579
13977e23579J54492M74821L62228Q8582J13735L553j0313j40872j32354j9295
$$ -523579 -369087 105734 467962 556544 670279 673832 663519 522647 390293 370998
13967C70998m09333l45535J09886P4234J53919J95858k68008k88813p2279K7524
$$ 370998 -38335 -383870 -273984 -199750 -45831 150027 -117981 -406794 -479073 -451549
13957d51549L5948K06020L98474j35460k35630l92716n72751M7504K75515L01972
$$ -451549 -415601 -209581 188893 53433 -182197 -574913 -1147664 -1100160 -824645 -522673
13947e22673N71739L88106k05544j51505L09797J27473m53059n00675k62466K8566
$$ -522673 49066 437172 231628 80123 389920 517393 64334 -436341 -698807 -670241
13937f70241L72125M37859N0673j8427O4103M0851q6790R8308j10582m64680m92485
$$ -670241 -298116 139743 190416 171989 236092 276943 190153 288461 177879 -286801 -779286
13926g79286m40157J00096J96057J79410M0909k14648k21557M6405L79698N02169
$$ -779286 -1219443 -1119347 -923290 -743880 -702971 -917619 -1139176 -1092771 -713073 -210904
13916b10904K64070m2145k25364k00878Q0775r162l97130k23120N62351L76816
$$ -210904 53166 11021 -214343 -415221 -334446 -343608 -740738 -963858 -401507 -24691
13906b4691R3370j31310l7930K28181j14148l11955l76137j87982l03585J21797
$$ -24691 68679 -62631 -100561 127620 13472 -298483 -674620 -862602 -1166187 -1044390
13896a044390J87404j43017M30521N44255J64084J89911J72771K1554o3006j41071
$$ -1044390 -856986 -1000003 -569482 -25227 138857 328768 501539 523093 460087 319016
13886C19016k06143k15226k52165O7220L47937L90407j90129l63064k50884J13381
$$ 319016 112873 -102353 -354518 -287298 60639 451046 260917 -102147 -353031 -239650
13876b39650J83528k74160k88312L50297L07193K54686L5649j21259m58834j41738
$$ -239650 -56122 -330282 -618594 -268297 38896 293582 329231 207972 -250862 -392600
13866c92600L06243L8082J8358L76252K20577j02444J31368j14882r1544J24091
$$ -392600 -86357 -48275 -29917 346335 566912 464468 595836 480954 389410 513501
13856E13501l10221m20774j39270K33707O16411L13858K4709o8065J78586m5112
$$ 513501 203280 -217494 -356764 -123057 493354 807212 831921 763856 942442 897330
13846H97330l96750o07361k52123K30161K47974k23734p67734k08779J26826K03513
$$ 897330 500580 -106781 -358904 -128743 119231 -104503 -872237 -1081016 -954190 -750677
13836g50677L81136m3646l97366j94177J08153J90298L32465R4970k2056o30950
$$ -750677 -369541 -413187 -810553 -1004730 -896577 -706279 -373814 -278844 -300900 -931850
13826i31850n97814K05092M75855L00114L00794M975Q2347J9583m35294l98670
$$ -931850 -1529664 -1324572 -848717 -548603 -247809 -242834 -160487 -140904 -576198 -974868
13816i74868O0902k70707p7813J10934K91414L76774K63919j83146l76280M189
$$ -974868 -913966 -1184673 -1262486 -1151552 -860138 -483364 -219445 -402591 -778871 -774682
13806g74682L7474L64614R6662l90353l18827k9107J47054L10975L81779n2041
$$ -774682 -737208 -372594 -275932 -666285 -985112 -1014219 -867165 -556190 -174411 -226452
13796b26452J06844Q3612J07442K38462J48932J25669L2027j28719n673j60284
$$ -226452 -119608 -35996 71446 309908 458840 584509 616536 487817 482144 321860
13786C21860l8642N92402K3989q11369m79500j94135j68904q3076K9196N6571
$$ 321860 283218 875620 899609 88240 -391260 -585395 -754299 -837375 -808179 -751608
13776g51608J88148K88698J09133K71689N23350K95925k75205j30905J3987L4579
$$ -751608 -563460 -274762 -165629 106060 629410 925335 650130 519225 533212 567791
13766E67791k19652l69079j17753j776L6741R6060l55471n3286K33937J08718
$$ 567791 348139 -20940 -138693 -140469 -103728 -7668 -363139 -416425 -182488 -73770
13756g3770N42033Q2612k05722n7488L8356L48240O6114m07273l35024L93167
$$ -73770 468263 550875 345153 287665 326021 674261 740375 333102 -1922 391245
13746C91245K50643j74195L9442p4216j01187p4204l45772l09798k43415k1189
$$ 391245 641888 467693 507135 432919 331732 257528 -88244 -398042 -641457 -662646
13736f62646J1231Q3044j8693k51466j84615J73911K35808Q411q0259L90171L52175
$$ -662646 -651415 -568371 -587064 -838530 -1023145 -849234 -613426 -605015 -685274 -295103 57072
13725E7072j94501j00141Q5387J42363R2917j87867P6202K73090J04463J09664
$$ 57072 -137429 -237570 -152183 -9820 83097 -104770 -28568 244522 348985 458649
13715D58649o8871m17077J2176M10436j37422j40638l91558k20084L17373J79222
$$ 458649 389778 -27299 -15123 395313 257891 117253 -274305 -494389 -177016 2206
13705B206Q2619p4359r1424M4804q0258o8760k10623k26982p7611J11767k54889
$$ 2206 84825 10466 -80958 -36154 -116412 -185172 -395795 -622777 -700388 -588621 -843510
13694h43510q62326m73135N5266P03408P26800o8408m9986M7638k38936k50834
$$ -843510 -1705836 -2178971 -2123705 -1420297 -693497 -761905 -811891 -764253 -1003189 -1254023
13684a254023K1484P46914O11387k39534l76935l14958J51528N12666O4049M7237
$$ -1254023 -1232539 -485625 125762 -113772 -490707 -805665 -654137 -141471 -77422 -30185
13674c0185K13944K5646m04300o34764n2369M03642p8206j46857M3852J32048
$$ -30185 183759 209405 -194895 -829659 -882028 -478386 -556592 -703449 -659597 -527549
13664e27549j44449k21034O7929K64880J88635L55893N75413N5492m43411j81803
$$ -527549 -671998 -893032 -825103 -560223 -371588 -15695 559718 615210 171799 -10004
13654a0004p3658k25962l99466l12434J38341O13855M53670O8516m42963o20881
$$ -10004 -83662 -309624 -709090 -1021524 -883183 -269328 184342 252858 -190105 -810986
13644h10986k53236J45222m2454k00918R7291L77005p8152j44721J1592Q7109
$$ -810986 -1064222 -919000 -961454 -1162372 -1065081 -688076 -766228 -910949 -899357 -812248
13634h12248r7552j9937O0925J19141K78891n7602L4035J44757L16267P7936l33333
$$ -812248 -909800 -929737 -868812 -749671 -470780 -528382 -494347 -349590 -33323 44613 -288720
13623b88720J74645R1913o11024m11487Q9625N49007R14353M30021l72524l99749
$$ -288720 -114075 -22162 -633186 -1044673 -955048 -406041 508312 938333 565809 166060
13613A66060l5672M1012J8409k86373K6236K59631L2123l1668j1367l04506j91894
$$ 166060 130388 171400 189809 -96564 -70328 189303 221426 189758 178391 -126115 -318009
13602c18009o906N0741k00205k70884l5209l554q8100q4297J26068N49420K70530
$$ -318009 -324915 -274174 -474379 -745263 -780472 -784026 -872126 -956423 -830355 -280935 -10405
13591a0405K7722j73481j77477J23207O0046O9898J83174P8261k02582n07415
$$ -10405 17317 -156164 -333641 -210434 -150388 -80490 102684 180945 -21637 -529052
13581e29052j12131K41459K20966J56470J34097l11115o55655m98917j41853J57588
$$ -529052 -641183 -399724 -178758 -22288 111809 -199306 -854961 -1353878 -1495731 -1338143
13571a338143j37578O1946N29773M72841k6316J30084R0679R5034Q5405m15276
$$ -1338143 -1475721 -1413775 -884002 -411161 -437477 -307393 -216714 -121680 -36275 -451551
13561d51551m57095q7103J94395p0658M20926K12240m71346k00955J75388M33177
$$ -451551 -908646 -995749 -801354 -872012 -451086 -238846 -710192 -911147 -735759 -302582
13551c02582M48038M89182q038P5797L4610m28651l98591O7170N4227j5388m0721
$$ -302582 145456 634638 626600 702397 737007 308356 -90235 -23065 31162 15774 -24947
13540b4947k23314o9206J04565l25641l03493L33274J65401k6336p5823q3950
$$ -24947 -248261 -317467 -212902 -538543 -842036 -508762 -343361 -369697 -445520 -529470
13530e29470J58881J58333L52027q8785j01662R5647J91384J63083L73721O9483
$$ -529470 -370589 -212256 139771 50986 -50676 44971 236355 399438 773159 842642
13520H42642m55727n50264o895J26736r5120m28196k11943l34872k35443R9354
$$ 842642 386915 -163349 -170244 -43508 -138628 -566824 -778767 -1113639 -1349082 -1249728
13510a249728l9925M60025N78787j07959m54220J66188N92120R0559K86463R9111
$$ -1249728 -1289653 -829628 -250841 -358800 -813020 -646832 -54712 35847 322310 421421
13500D21421m47183m85172j29123L76851K18655j52848j70464L2837J13445k61573
$$ 421421 -25762 -510934 -640057 -263206 -44551 -197399 -367863 -335026 -221581 -483154
13490d83154j12498n3533j14494p3252L1704O9167M56546L29445o5963k51916
$$ -483154 -595652 -649185 -763679 -836931 -805227 -736060 -279514 49931 -16032 -267948
13480b67948m01333m06736m33826l38455o8981K71387O22213J73877k28881n45248
$$ -267948 -669281 -1076017 -1509843 -1848298 -1917279 -1645892 -1023679 -849802 -1078683 -1623931
13470a623931l13559J25090J01613K40054M12222K98721M61910L33771K88211
$$ -1623931 -1937490 -1812400 -1710787 -1470733 -1058511 -759790 -297880 35891 324102
13461C24102k47936k55010J90161k02088l57737J79677M49294J28518k03364M0845
$$ 324102 76166 -178844 11317 -190771 -548508 -368831 80463 208981 5617 46462
13451D6462l5958j64774K84375O2698m2185k10418J78723L81437k90899m34414
$$ 46462 10504 -154270 130105 192803 150618 -59800 118923 500360 209461 -224953
13441b24953j4487r2687m63301l09847O1336q0939j5480M85791M90760J12173
$$ -224953 -239440 -332127 -795428 -1105275 -1043939 -1124878 -1140358 -654567 -163807 -51634
13431e1634M0521L1858j66411o00J51875k17834m54113l09354O715N8483k04701
$$ -51634 -11113 20745 -145666 -146266 5609 -212225 -666338 -975692 -968977 -910494 -1115195
13420a115195l60420J25932K19892j95498j35777Q9602N18873Q24882j5395k29945
$$ -1115195 -1475615 -1349683 -1129791 -1325289 -1461066 -1371464 -852591 -27709 -43104 -273049
13410b73049J46505J81653J41884p5780n65689n90815l88046n4338J9818k52243
$$ -273049 -126544 55109 196993 121213 -444476 -1035291 -1423337 -1477675 -1457857 -1710100
13400a710100k38789K81874O46138O95721J51975j05325K8352K14156m03966k86421
$$ -1710100 -1948889 -1667015 -1020877 -325156 -173181 -278506 -250154 -35998 -439964 -726385
13390g26385K37154K19364M3833R4886j2120k57468l11597r6584M05668J958j49398
$$ -726385 -489231 -269867 -226034 -131148 -143268 -400736 -712333 -808917 -403249 -401291 -550689
13379e50689p3548N9011K28452J79337k09548P4322N96988O0076n33725k75237
$$ -550689 -624237 -565226 -336774 -157437 -366985 -292663 304325 364401 -169324 -444561
13369d44561l93088l48490J49425O91153O14771J00886P8604J88375Q5939o08492
$$ -444561 -837649 -1186139 -1036714 -345561 269210 370096 448700 637075 723014 114522
13359A14522k70327O2945O4445j926j36667j7997J37944K66113J09067r08j69362
$$ 114522 -155805 -92860 -28415 -30341 -167008 -185005 -47061 219052 328119 327211 157849
13348A57849k36674R8903m5508l330J95201j17788n05878k84963k90161k61080
$$ 157849 -78825 20078 -25430 -28760 166441 48653 -457225 -742188 -1032349 -1293429
13338a293429K70479K30413q9464K92887L76762J9957K27722K49010J12422r012
$$ -1293429 -1022950 -792537 -882001 -589114 -212352 -192395 35327 284337 396759 387747
13328C87747r1842r2599k60238m78551j99170k13373k30721k89633K50925Q19173
$$ 387747 295905 203306 -56932 -535483 -734653 -948026 -1178747 -1468380 -1217455 -398282
13318c98282Q05857P06984J88230k98026p33640r11313o08142K65924M01982P11239
$$ -398282 407575 1114559 1302789 1004763 271123 -640190 -1248332 -982408 -580426 130813
13308A30813N61495N1987J0025K17190n76904o44775k28572p1438J25003K59094
$$ 130813 692308 744295 754320 971510 394606 -250169 -478741 -550179 -425176 -166082
13298a66082K5990n55836j92319L03528O11087P60065J82278o92414o73670l45671
$$ -166082 -140092 -695928 -888247 -584719 26368 786433 968711 276297 -397373 -743044
13288g43044o6852L26573N48950J53851l41888m18186l88282p48321l53575M90863
$$ -743044 -809896 -483323 65627 219478 -122410 -540596 -928878 -1677199 -2030774 -1539911
13278a539911L73905K33047M26924M09705N16979N68391j19892o62776p40499
$$ -1539911 -1166006 -932959 -506035 -96330 420649 989040 869148 206372 -534127
13269e34127l15421N07772O03955L4770R745M29104M42526j37470l42352j32863
$$ -534127 -849548 -341776 262179 296949 306694 735798 1178324 1040854 698502 565639
13259E65639m55907l79385l4447Q5629N1180l03493l24222P8581J17984K52362
$$ 565639 109732 -269653 -304100 -218471 -167291 -470784 -795006 -716425 -598441 -346079
13249c46079R6665j9892L20560J89245M61134M96555K76912l65210o12541l769
$$ -346079 -249414 -269306 51254 240499 701633 1198188 1475100 1109890 497349 493580
13239D93580K37086j76166k85122l28995m44180O8868K52620m6173L13108O46625
$$ 493580 730666 554500 269378 -59617 -503797 -434929 -182309 -228482 84626 731251
13229G31251L1748q6626r79P3912k63759j33476O1683j94296L3164O6218Q8406
$$ 731251 762999 676373 675394 749306 485547 352071 413754 219458 252622 318840 407246
13218D07246p8677J95555J27770k41663m1073K37112L46317L00621Q9845m02322
$$ 407246 328569 524124 651894 410231 369158 606270 952587 1253208 1343053 940731
13208I40731j8886J65579k24082l39486K53560J31652n6956J82142J29431j37585
$$ 940731 921845 1087424 863342 523856 777416 909068 852112 1034254 1163685 1026100
13198A026100l64032m93988r7415l04628l73030M06319O78831M54966j1577R1719
$$ 1026100 662068 168080 70665 -233963 -606993 -200674 478157 933123 921546 1013265
13188A013265J98288L3606R509j91197j45470l99861m54197j36581L02646k04970
$$ 1013265 1211553 1245159 1254668 1063471 918001 518140 63943 -72638 230008 25038
13178B5038q36242m74872j50131K25018L53291N8759J35070N39147R7773J33766
$$ 25038 -811204 -1286076 -1436207 -1211189 -857898 -799139 -664069 -124922 -27149 106617
13168A06617L34167L85738L29747j33131p46308k60162J26374J93729Q1931L09907
$$ 106617 440784 826522 1156269 1023138 276830 16668 143042 336771 418702 728609
13158G28609R1959o7959l80064k69540K97482K84275k02891n0352K38946M9802
$$ 728609 820568 752609 372545 103005 400487 684762 481871 431519 670465 720267
13148G20267K48444K05786j95175n24926m74909l90372O6777J74973l2428k19241
$$ 720267 968711 1174497 979322 454396 -20513 -410885 -344108 -169135 -201563 -420804
13138d20804k09012j76630J02021J49503J12681L3890J80636M26855J79855j99649
$$ -420804 -629816 -806446 -704425 -554922 -442241 -408351 -227715 199140 378995 179346
13128A79346l87959l4530N09389J90040J16691L81484K96784l67316m55819p8330
$$ 179346 -208613 -243143 266246 456286 572977 954461 1251245 883929 428110 349780
13118C49780J68757K28104m18641p90984j58513K60023k5957l55294j07191N75339
$$ 349780 518537 746641 328000 -462984 -621497 -361474 -387431 -742725 -849916 -274577
13108b74577P24066R5277p46719n44768j00875L10593K71714l17377k71332K12693
$$ -274577 449489 544766 -201953 -746721 -847596 -537003 -265289 -582666 -853998 -641305
13098f41305J77370K02041M69342O44075N36129m17086q88597k92506j12379L5216
$$ -641305 -463935 -261894 207448 851523 1387652 970566 81969 -210537 -322916 -287700
13088b87700O5016k33150O5067J66989J27869K06851J99549N20244N79681K77229
$$ -287700 -222684 -455834 -390767 -223778 -95909 110942 310491 830735 1410416 1687645
13078A687645l21270k46363L53422k03262n92191j09808J5702m32200R1456K58938
$$ 1687645 1366375 1120012 1473434 1270172 677981 568173 583875 151675 243131 502069
13068E02069K91370J49214l5271l62808l21719M02015N77485L23772J21871j48141
$$ 502069 793439 942653 907382 544574 222855 624870 1202355 1526127 1647998 1499857
13058A499857j40130J957J10411K7729P8604J53817J28227m6874j26016k38212
$$ 1499857 1359727 1361684 1472095 1499824 1578428 1732245 1860472 1813598 1687582 1449370
13048A449370o071k45238l53383m6076J32805J77318R1479O0356J25109j88129
$$ 1449370 1443299 1198061 844678 798602 931407 1108725 1200204 1260560 1385669 1197540
13038A197540j7737k5037l66187j20637O6927J89369K36090L42762J1743l21374
$$ 1197540 1179803 1154766 788579 667942 734869 924238 1160328 1503090 1514833 1193459
13028A193459k93935j44125m4599k780J30326M01352l07607n58953k81873o4275
$$ 1193459 899524 755399 710800 708020 838346 1239698 932091 373138 91265 26990
13018B6990L05665N01438M50472R4896k49783j59933m6991K31857L7974K57912
$$ 26990 332655 834093 1284565 1379461 1129678 969745 922754 1154611 1192585 1450497
13008A450497K03016p3755m5682J45173k41961k49024k47764j01809K35039N6248
$$ 1450497 1653513 1579758 1534076 1679249 1437288 1188264 940500 838691 1073730 1129978
12998A129978K73595k13835k88288K51832N06921N31738N26710L33350p6218l24344
$$ 1129978 1403573 1189738 901450 1153282 1660203 2191941 2718651 3052001 2975783 2651439
12988B651439k57234m3584M20612Q79455M73023l8141m6751n3654O5837K86868
$$ 2651439 2394205 2350621 2771233 3650688 4123711 4085570 4038819 3985165 4051002 4337870
12978D337870J20706J6797j43883L2765J31469l15768j47129K74106J53921K39649
$$ 4337870 4458576 4475373 4331490 4364255 4495724 4179956 4032827 4306933 4460854 4700503
12968D700503O75455R21577P50296K81551K01281J85947k02213n1001O19718M88387
$$ 4700503 5375958 6297535 7047831 7329382 7530663 7716610 7514397 7463396 8083114 8571501
12958H571501L80060P27354P05067P19695Q38564R70180J072808J129605J357485
$$ 8571501 8951561 9678915 10383982 11103677 11942241 12912421 13985229 15114834 16472319
12949A6472319J440289J404804J825146J973088J981404K333202L307802M340815
$$ 16472319 17912608 19317412 21142558 23115646 25097050 27430252 30738054 35078869
12941C5078869N139039N837732O748967Q324859J0138150J2232461J5443802K0496763
$$ 35078869 40217908 46055640 52804607 61129466 71267616 83500077 98943879 119440642
12933A19440642K7376302L5765970M4490750N0491029M4256196J7028592k0955908
$$ 119440642 146816944 182582914 227073664 277564693 321820889 338849481 317893573
12926C17893573m5924982n0849737m4352982l4374202k5570818j9677990j5801149
$$ 317893573 271968591 221118854 176765872 142391670 116820852 97142862 81341713
12919H1341713j2490509r425318p147516n859795n178500m631488l515447k513659
$$ 81341713 68851204 59425886 52278370 46418575 41240075 36608587 33093140 30579481
12911C0579481k190127k244570k375830k197546j742598j149477p43406r77737
$$ 30579481 28389354 26144784 23768954 21571408 19828810 18679333 17935927 16958190
12903A6958190j338595p70123o11993q84154j030155o21043l54093k34789J91393
$$ 16958190 15619595 14849472 14237479 13353325 12323170 11702127 11348034 11113245 11304638
12894A1304638k3419l53550l73349j64276O2367L78408K06119p0391j12599p6265
$$ 11304638 11281219 10927669 10554320 10390044 10452411 10830819 11036938 10966547 10853948 10777683
12884A0777683l75891o7444J18330j62367k31136J98362K72096J55017P81711
$$ 10777683 10401792 10334348 10452678 10290311 10059175 10257537 10529633 10684650 11466361
12875A1466361J017678J057550J030784J278693J672105J977081J623969J12762
$$ 11466361 12484039 13541589 14572373 15851066 17523171 19500252 21124221 21236983
12867B1236983o78703j78324J02705K27296L32560O49557J376504J665441J609149
$$ 21236983 20558280 20379956 20482661 20709957 21042517 21692074 23068578 24734019 26343168
12858B6343168J707599K268045L169675L956666M697511N878323P152601Q756049
$$ 26343168 28050767 30318812 33488487 37445153 42142664 48020987 55173588 63929637
12850F3929637J0685150J3406517J7098752K2523587K9370378L7814306M7281442
$$ 63929637 74614787 88021304 105120056 127643643 157014021 194828327 242109769
12843B42109769N1667875M0598913Q103588l0382369n1255383n1369023m2106642
$$ 242109769 293777644 334376557 342480145 312097776 260842393 209473370 167366728
12836A67366728l2231128k4013430j7906479j4203376j1623582r428921p727779
$$ 167366728 135135600 111122170 93215691 79012315 67388733 57959812 50232033
12829E0232033o245400m989115l826373l306182l201630l066493k733550j992443
$$ 50232033 43986633 38997518 35171145 31864963 28663333 25596840 22863290 20870847
12821B0870847j300935j209211j005462n01977q81532q15146o46315n89698n92347
$$ 20870847 19569912 18360701 17355239 16853262 15971730 15156584 14510269 13920571 13328224
12812A3328224m63305l53457l37900n46425o14164l37351l86980k37195k01527
$$ 13328224 12864919 12511462 12173562 11627137 11012973 10675622 10288642 10051447 9849920
12803I849920k74121J10163J32764k7874o9520R5044l08573l12865Q6205q5979
$$ 9849920 9575799 9685962 9818726 9790852 9721332 9816376 9507803 9194938 9281143 9195164
12793I195164j85728J07949L97662L99606O35446O2363k3182J73179L8233K10844
$$ 9195164 9009436 9117385 9515047 9914653 10550099 10612462 10589280 10762459 10800692 11011536
12783A1011536N18010P73773R72778J038576Q73365O72126M70444J030944J574215
$$ 11011536 11529546 12303319 13276097 14314673 15188038 15860164 16330608 17361552 18935767
12774A8935767J849417K353220K704154K482900K482592L416534M550035M906962
$$ 18935767 20785184 23138404 25842558 28325458 30808050 34224584 38774619 43681581
12766D3681581N844941P355151Q954523J1313497J4336050J8290259K3829442
$$ 43681581 49526522 56881673 65836196 77149693 91485743 109776002 133605444
12759A33605444L1489349M0181323M7553433M8724058L2232003l211446l6811229
$$ 133605444 165094793 205276116 252829549 301553607 333785610 330574164 293762935
12752B93762935n0408438m7556934l8882598l0151679k2916309j7122624j3171218
$$ 293762935 243354497 195797563 156914965 126763286 103846977 86724353 73553135
12745G3553135j0631384q581008o885145n564454m988312m742548l692399l184376
$$ 73553135 62921751 54340743 47455598 41891144 36902832 32160284 28467885 25283509
12737B5283509k648362j728928j235373j566896j691175j503167r65245n71664
$$ 25283509 22635147 20906219 19670846 18103950 16412775 14909608 13944363 13372699
12729A3372699n11931l99925o78480j072333p46277l49023o64561o49410n28866
$$ 13372699 12860768 12460843 11782363 10710030 9963753 9614730 8950169 8300759 7771893
12720G771893n15288n55847k98191k78080l73316q0374m98000n09757k97354l16899
$$ 7771893 7256605 6700758 6402567 6124487 5751171 5670797 5172797 4663040 4365686 4048787
12710D048787k16659k85008j73605l8688r926L94941L62688n353p0597j25175
$$ 4048787 3832128 3547120 3373515 3334827 3324901 3719842 4082530 4077177 4006580 3881405
12700C881405k09382m07614r6924K92087j00383l43379j22038J18595K93306J01886
$$ 3881405 3672023 3264409 3167485 3459572 3359189 3015810 2893772 3012367 3305673 3407559
12690C407559k54353j77991J1735l39212l35147k86579k2655M65904J22559p8451
$$ 3407559 3153206 2975215 2986950 2647738 2312591 2026012 2003357 2469261 2591820 2513369
12680B513369N5965J14425l10950m83497m40483j81272M05695p0701o73610k10154
$$ 2513369 2569334 2683759 2372809 1889312 1448829 1267557 1673252 1602551 928941 718787
12670G18787O9346j61488K80784M59600L90142K99452K17100O916l40209m51759
$$ 718787 788133 626645 907429 1367029 1757171 2056623 2273723 2280639 1940430 1488671
12660A488671l9701J25264J66642K03876k10298m32533K9367L96285m7428l96966
$$ 1488671 1448970 1574234 1740876 1944752 1734454 1301921 1331288 1727573 1680145 1283179
12650A283179K11542K84580m88308l55086O8382M40482O42737J91970k69385n23684
$$ 1283179 1494721 1779301 1290993 935907 1004289 1444771 2087508 2279478 2010093 1486409
12640A486409l42764k1716L8270j20543k92912k82123k38562n31k6141j56914
$$ 1486409 1143645 1121929 1160199 1039656 746744 464621 226059 225528 199387 42473
12630D2473J07922J20773J68995j6028P9320J62476j5231K8114j63776l07790
$$ 42473 150395 271168 440163 424135 503455 665931 650700 678814 515038 207248
12620B07248l94545M8469J96372M02347L44927j97927k58836o7947J32888N3461
$$ 207248 -187297 -138828 57544 459891 804818 606891 348055 280108 412996 466457
12610D66457j21296l01192K5813K22631q6747j7530J34587K76552M19557j37856
$$ 466457 345161 43969 69782 292413 205666 188136 322723 599275 1018832 880976
12600H80976j98272j14424k58801Q3856j03968K91252L01199k20k53508J48007
$$ 880976 682704 568280 309479 393335 289367 580619 881818 881598 628090 776097
12590G76097K51448q6474l74398m29177K92123L43964J9693n05058m89810O4239
$$ 776097 1027545 941071 566673 137496 429619 773583 793276 288218 -201592 -137353
12580a37353K4226j20314m0320k6178J09846J62336J92955m08J23124M9667J54393
$$ -137353 -113127 -233441 -273761 -299939 -190093 -27757 165198 164790 287914 337581 491974
12569D91974M24979j29407k30360K48346Q0744l97736m12918m3723J1294l6498
$$ 491974 916953 787546 557186 805532 886276 488540 75622 31899 43193 6695
12559F695P3927M05841J30979J75982K83238l25226k83598l950J46296L04488
$$ 6695 80622 486463 617442 793424 1076662 751436 467838 463888 610184 914672
12549I14672J35915L49471M97691o68101r34893o72595j76381K60048L29586M34606
$$ 914672 1050587 1400058 1897749 1229648 294755 -377840 -554221 -294173 35413 470019
12539D70019k110j87157K47910K18413R2186K85290K26811j34416m90486k44616
$$ 470019 467909 280752 528662 747075 839261 1124551 1351362 1216946 726460 481844
12529D81844m39250m04109L07664N13399K8485m93398j0125R3656k79163M1243
$$ 481844 42594 -361515 -53851 459548 488033 -5365 -15490 78166 -200997 -159754
12519a59754Q7417N6355r90l89342m61083n6766o029P8016L75523O11013K32200
$$ -159754 -72337 -15982 -16972 -406314 -867397 -924163 -930192 -852176 -476653 134360 366560
12508C66560j0203k76591m84581k86289l02957R9022n7017K03583L93984N0630
$$ 366560 356357 79766 -404815 -691104 -994061 -895039 -952056 -748473 -354489 -303859
12498c03859j15605o7911M5100K13110l700R1026J54287j8003k3677J67641K37602
$$ -303859 -419464 -487375 -442275 -229165 -232865 -141839 12448 -5555 -29232 138409 376011
12487C76011J69473Q8384M9586o8817J17372J64715j32767r4231m4463k46277
$$ 376011 545484 633868 683454 614637 732009 896724 763957 669726 625263 378986
12477C78986j8047P1409K78952q7253l99528j01848O8292j39197O2872J50159
$$ 378986 360939 432348 711300 624047 224519 122671 190963 51766 114638 264797
12467B64797N0133K3170q5444k19736L3873J46527l46097r7214L507K92110J49238
$$ 264797 314930 338100 252656 32920 66793 213320 -132777 -229991 -226484 65626 214864
12456B14864j58961k75473j94484L1078K39379K05712j32776l21993L6000R5744
$$ 214864 55903 -219570 -414054 -382976 -143597 62115 -70661 -392654 -356654 -260910
12446b60910O80352O75359l85964m76660k84632J12660N81691L86976j69827k58417
$$ -260910 419442 1094801 708837 232177 -52455 60205 641896 1028872 859045 600628
12436F00628l8662r012l6141J48081k3857k35361J54497M27517J88003Q9038L4414
$$ 600628 561966 552954 516813 664894 641037 405676 560173 987690 1175693 1264731 1299145
12425A299145o9238J74603l30478p77430m2457K83758J69601k24798m41065m34237
$$ 1299145 1229907 1404510 1074032 296602 254145 537903 707504 482706 41641 -392596
12415c92596l76521K42908L85254L0405J94469K66875k11834n777J98394j30719
$$ -392596 -769117 -526209 -140955 -110550 83919 350794 138960 133183 331577 200858
12405B00858J34103J4659j22962o662j29556j69161l19839m76679k21171K32208
$$ 200858 334961 349620 226658 219996 90440 -78721 -398560 -875239 -1096410 -864202
12395h64202K1180l3380J61405L28279M63581N26059r5586o32716r3262J72350
$$ -864202 -843022 -876402 -714997 -386718 76863 602922 507336 -125380 -218642 -46292
12385d6292n6896M21405M38431j37310j72095J36137l8603j41202J957R2114l51614
$$ -46292 -103188 318217 756648 619338 447243 583380 544777 403575 405532 497646 146032
12374A46032p20479n58859L3642N20163L34672J03072p009J0466L17020J61933
$$ 146032 -574447 -1133306 -1099664 -579501 -244829 -141757 -148766 -138300 178720 340653
12364C40653P7613p5400m85003m28716j3815j68486k96064n5604k30451m5270
$$ 340653 418266 342866 -142137 -570853 -584668 -753154 -1049218 -1104822 -1335273 -1380543
12354a380543L02848m1276J96659L01327M07177J3317k55426l23728j83396k34003
$$ -1380543 -1077695 -1118971 -922312 -620985 -213808 -200491 -455917 -779645 -963041 -1197044
12344a197044j72067O35905O73585q2942k17598J64189o5482m03185J50714K53863
$$ -1197044 -1369111 -733206 -59621 -142563 -360161 -195972 -261454 -664639 -513925 -260062
12334b60062j51580N6714k1352j46637R4713J60339L1023r7959J92772p8610n9934
$$ -260062 -411642 -354928 -376280 -522917 -428204 -267865 -236842 -334801 -142029 -220639 -280573
12323b80573K19380K0400k57195p4885n9452J4675K32360M32207N20696R9218
$$ -280573 -61193 -40793 -297988 -372873 -432325 -417650 -185290 246917 767613 866831
12313H66831k35906k30286l39532k78521k69667j36496L84182N72944J2784k58269
$$ 866831 630925 400639 61107 -217414 -487081 -623577 -239395 333549 346333 88064
12303H8064p482K03417J44893K93071L58186K65324K52438l27513m08249l11339
$$ 88064 80582 283999 428892 721963 1080149 1345473 1597911 1270398 862149 550810
12293E50810j55313k17564l45960m05357K03909N97378L72330k79490l78897j87430
$$ 550810 395497 177933 -168027 -573384 -369475 227903 600233 320743 -58154 -245584
12283b45584K71937K49441K7065J50028k45874Q509L87005J6938l16765m17183
$$ -245584 26353 275794 302859 452887 207013 215522 602527 619465 302700 -114483
12273a14483j76706K41589O2912l36460J20293K95973k0576l05387j9569M01216
$$ -114483 -291189 -49600 13312 -323148 -202855 93118 72542 -232845 -252414 148802
12263A48802L14057L05289K36549k12726j96421J54864k15184m45105j74929R3264
$$ 148802 462859 768148 1004697 791971 595550 750414 535230 90125 -84804 8460
12253H460P5926k62541K34762M23603K62557J26534K23491j15158J04297L43768
$$ 8460 84386 -178155 56607 480210 742767 869301 1092792 977634 1081931 1425699
12243A425699K23806L5585o1933J15383J56913J89787N27208R29090R68753J146563
$$ 1425699 1649505 1685090 1623157 1738540 1895453 2085240 2612448 3541538 4510291 5656854
12233E656854J381933J337244M08693j009476k278375j908879j062393p55791
$$ 5656854 7038787 8376031 8784724 7775248 5496873 3587994 2525601 1769810
12225A769810l82140j866q2160K15814n0780k99247m096l51327o55677j80207
$$ 1769810 1387670 1385804 1303644 1519458 1468678 1169431 1165335 814008 158331 -21876
12215b1876L32000K24391L66223N61961J08263l96916o15374n66034n7286j11181
$$ -21876 310124 534515 900738 1462699 1570962 1174046 558672 -7362 -64648 -175829
12205a75829j35977j59078l16290J23486N37290L59662J69184J06749j49601J91608
$$ -175829 -311806 -470884 -787174 -663688 -126398 233264 402448 509197 359596 551204
12195E51204L55221k35376k93110J16753m9907o2225J8959K61473L18233L84873
$$ 551204 906425 671049 377939 494692 444785 382560 401519 662992 981225 1366098
12185A366098K47211k71803m30348m32844m61034k36026K77395j27101l91474
$$ 1366098 1613309 1341506 911158 478314 17280 -218746 58649 -68452 -459926
12176d59926j34370O0151l88001M69830Q33596R6034O6260l65894n9972K31364
$$ -459926 -594296 -534145 -922146 -452316 381280 477314 543574 177680 117708 349072
12166C49072P7374L8437M41261M96982J44649k04238l11439k14399k71901r1557
$$ 349072 426446 464883 906144 1403126 1547775 1343537 1032098 817699 545798 454241
12156D54241J48354J24j62853j80299k72951K26161K23370r4801q561n347j23251
$$ 454241 602595 602719 439866 259567 -13384 212777 436147 341346 332785 327438 204187
12145B04187j0038L09557K55649l59374k44079j84432k74329J52145N68362M66737
$$ 204187 194149 503706 759355 399981 155902 -28530 -302859 -150714 417648 884385
12135H84385L13029M02880R2002k69359k05551j71704K29161L12635J9628l38710
$$ 884385 1197414 1600294 1692296 1422937 1217386 1045682 1274843 1587478 1607106 1268396
12125A268396n33009n36122J18215K54273J63036M9191L2942k16599k05865J19031
$$ 1268396 735387 199265 317480 571753 734789 783980 816922 600323 394458 513489
12115E13489K59887k44117l14431j93899k43364N3004k31065k15614O1270J16667
$$ 513489 773376 529259 214828 20929 -222435 -169431 -400496 -616110 -554840 -438173
12105d38173J44451K94804K8740r2305R5364J42405J41776Q5592J21980K6641
$$ -438173 -293722 1082 29822 -62483 32881 175286 317062 402654 524634 551275
12095E51275q8016l58603j67258N8629K45211K08763l74014l60365Q6047J78520
$$ 551275 463259 104656 -62602 -3973 241238 450001 75987 -284378 -198331 -19811
12085a9811L18364k8211j46630j58591r0473q5255j32740L5257L05621M18544
$$ -19811 298553 270342 123712 -34879 -125352 -210607 -343347 -308090 -2469 416075
12075D16075L98589m36397q05566k35388M15866J67924j15044O04489M50278j05776
$$ 416075 814664 378267 -427299 -662687 -246821 -78897 -193941 410548 860826 755050
12065G55050j91355q3722l84804l48496j01256n755J01905K09771r2882Q2208
$$ 755050 563695 479973 95169 -253327 -354583 -360338 -258433 -48662 -141544 -59336
12055e9336K33113Q9666R9840M00444j48606k41823N3038J70318N05022K53077
$$ -59336 173777 263443 363283 763727 615121 373298 426336 596654 1101676 1354753
12045A354753p523k10674n36521n69837M0972l09423m60107K90951M69927L77468
$$ 1354753 1347230 1136556 600035 30198 71170 -238253 -698360 -407409 62518 439986
12035D39986J55617k37948l23700M299j39559J89344J70253J42704J85236p6000
$$ 439986 595603 357655 33955 38254 -101305 88039 258292 400996 586232 510232
12025E10232l84743l85443N666K18487l0060j72668J86249L59482r37l04078l37919
$$ 510232 125489 -259954 -254288 -35801 -65861 -238529 -52280 307202 306265 2187 -335732
12014c35732l40689J34097M20463J70033j17251j78931o5440p1603m99688J3404
$$ -335732 -676421 -542324 -121861 48172 -69079 -248010 -313450 -385053 -884741 -871337
12004h71337Q51235M70560q0095m66662l30048L0178M67940l14680p28104n05288
$$ -871337 -20102 450458 370363 -96299 -426347 -396169 71771 -242909 -971013 -1476301
11994a476301k5682O02286N43409O1071K30157R9404j65834j75533k84748l21684
$$ -1476301 -1501983 -899697 -356288 -295217 -65060 34344 -131490 -307023 -591771 -913455
11984i13455l02001L91060K70656J10301J73373p4976l2269K02674J69688j28061
$$ -913455 -1215456 -824396 -553740 -443439 -270066 -345042 -377311 -174637 -4949 -133010
11974a33010L2784k86019N2343N45624N62295J46600m6944m45569m64003J17911
$$ -133010 -100226 -386245 -333902 211722 774017 920617 873673 428104 -35899 82012
11964H2012J66268j90893J11476L07574M10500L98613n8838p45447m49539J18716
$$ 82012 248280 57387 168863 476437 886937 1285550 1226712 481265 31726 150442
11954A50442L68550L8050J39507K33426l4415R4971O19764L17068k8148j87057
$$ 150442 518992 557042 696549 929975 895560 990531 1610295 1927363 1899215 1712158
11944A712158r0418K85459J26748J27421M95646L75251M295J90348N69704J022119
$$ 1712158 1621740 1907199 2033947 2161368 2657014 3032265 3036560 3226908 3796612 4818731
11934D818731J736535K145308N63692r75721j552087j315416o25982o79456p05634
$$ 4818731 6555266 8700574 9264266 8288545 6736458 5421042 4795060 4115604 3409970
11925C409970l94138m20457m89224o3701J10515p3382q0441J69997M29286K58117
$$ 3409970 3015832 2595375 2106151 2042450 2152965 2079583 1999142 2169139 2598425 2856542
11915B856542J33164L01366M26278O52525K81718k73489m01218k70594J6805j10193
$$ 2856542 2989706 3291072 3717350 4369875 4651593 4378104 3976886 3706292 3723097 3612904
11905C612904K21009P10683N14610j7464P1521R2584K10897M89298R36306J449581
$$ 3612904 3833913 4544596 5059206 5041742 5113263 5205847 5416744 5906042 6842348 8291929
11895H291929J843953J709146K552425M457071O454524P709842O261295J006040
$$ 8291929 10135882 11845028 14397453 18854524 25309048 33018890 39280185 40286225
11887D0286225m827793p197543o639760n435952l130330j425338j540453j652866
$$ 40286225 35458432 28260889 21621129 16185177 13054847 11629509 10089056 8436190
11879H436190j368496q97737o67031r99573q92125p787k3394M6103J06313l30177
$$ 8436190 7067694 6169957 5502926 4503353 3611228 3603441 3580047 3626150 3732463 3402286
11869C402286j46005K46406k18638o23216o75447o24804j05925K59618J06309
$$ 3402286 3256281 3502687 3284049 2660833 1985386 1360582 1254657 1514275 1620584
11860A620584K03183L72557L08431j82768n08132p009J14546l27976r56218o96192
$$ 1620584 1823767 2196324 2504755 2321987 1813855 1806846 1921392 1593416 637198 -58994
11850e8994J62750L97190N3821J39877M25934L22108L47522N1461l07269k4721
$$ -58994 103756 500946 554767 694644 1120578 1442686 1790208 1841669 1534400 1509679
11840A509679P0901J6174L9751k30669m91448l98585J62457N93636K89134j06229
$$ 1509679 1580580 1596754 1636505 1405836 914388 515803 678260 1271896 1561030 1454801
11830A454801k64057n1718J76685k39320k82689M35591P4465j98692k21896j2093
$$ 1454801 1190744 1139026 1315711 1076391 793702 1229293 1303758 1105066 883170 871077
11820H71077J26951L28253O31395J61723l64686k68328J29149N05705P23872L96623
$$ 871077 998028 1326281 1957676 2119399 1754713 1486385 1615534 2121239 2845111 3241734
11810C241734j41171j13488K97712O3459L7223O18385Q17111R78203J28299M05792
$$ 3241734 3100563 2987075 3284787 3348246 3385469 4003854 4820965 5799168 5927467 6333259
11800F333259J325085J385664P45920J50914j03120k57757m62772q25135p29925
$$ 6333259 7658344 9044008 9789928 9940842 9837722 9579965 9117193 8292058 7562133
11791G562133l04360m62850p14856o34178l20404K5023k61961l76305l13598o15836
$$ 7562133 7257773 6794923 6080067 5445889 5125485 5150508 4888547 4512242 4198644 3582808
11781C582808o42135n29628q6445M45891M45847K95313P196k5997j10045K35289
$$ 3582808 2940673 2411045 2324600 2770491 3216338 3511651 3518847 3492850 3382805 3618094
11771C618094K06706k00436j23782m84715k01175j23344k19437J57578K53784
$$ 3618094 3824800 3624364 3500582 3015867 2814692 2691348 2471911 2629489 2883273
11762B883273k26012n18764j32729l02091m22557l8980j65156m03772j36428K55338
$$ 2883273 2657261 2138497 2005768 1703677 1281120 1242140 1076984 673212 536784 792122
11752G92122M80463L46614M76195K7916l30964Q622M22445j9585o68043j80457
$$ 792122 1272585 1619199 2095394 2123310 1792346 1800968 2223413 2203828 1535785 1355328
11742A355328k65994l97931M3253Q5292k24166j64019K26129J12767k18473l23629
$$ 1355328 1089334 691403 734656 819948 595782 431763 657892 770659 552186 228557
11732B28557l79204j07670N4133K98696L34880K7224l20377p6177q7370l04713
$$ 228557 -150647 -258317 -204184 94512 429392 456616 136239 60062 -27308 -332021
11722c32021J2991r7405K0407P13794R40542L39795M9742l8403J71237k69655
$$ -332021 -319030 -416435 -396028 317766 1258308 1598103 1647845 1609442 1780679 1511024
11712A511024m84951K37045J16753J31237R6430n8741K89257K47679q300m45610
$$ 1511024 1026073 1263118 1379871 1511108 1607538 1548797 1838054 2085733 2077433 1631823
11702A631823m34939j52162j22782q2534J12239j39826j91201j59641l91273n62653
$$ 1631823 1196884 1044722 921940 839406 951645 811819 620618 460977 69704 -492949
11692d92949j47356O44278P76689L34427L2345J4865j61814J82568r4889n24706
$$ -492949 -640305 3973 780662 1115089 1147434 1162299 1000485 1183053 1088164 563458
11682E63458o1768L56011K70476q6486l06339l64429n70872M128J43152m42330
$$ 563458 501690 857701 1128177 1041691 735352 370923 -199949 -195821 -52669 -494999
11672d94999j30799K25416L41252L81571K41352k818k10109R0765J83541L60678
$$ -494999 -625798 -400382 -59130 322441 563793 560975 350866 441631 625172 985850
11662I85850N64091J37423k70411k51991R3146n711j42254L8175l89148l82690
$$ 985850 1549941 1687364 1416953 1164962 1258108 1252397 1110143 1148318 759170 376480
11652C76480J50686j59612k54670l11337j4520L34206N17316O67452M80431l54923
$$ 376480 527166 367554 112884 -198453 -212973 121233 638549 1306001 1786432 1431509
11642A431509o53111j98284L89935L24001j35632o95040m00433j00337j75051
$$ 1431509 778398 580114 970049 1294050 1158418 463378 62945 -37392 -212443
11633b12443J76979J23070j24664k21961m4230k17522j10854J55083M08318N08630
$$ -212443 -35464 87606 -37058 -259019 -303249 -520771 -631625 -476542 -68224 440406
11623D40406M29236K87322k2433m02588m57066n0684M32576j61913o21712m55990
$$ 440406 869642 1156964 1134531 731943 274877 224193 656769 494856 -126856 -582846
11613e82846M9040L00369M1763k20413n13270k52990k55993Q8056L29103j33206
$$ -582846 -533806 -233437 -191674 -412087 -925357 -1178347 -1434340 -1346284 -1017181 -1150387
11603a150387j2489K43432Q9446j04732L60188J73480P0902J09256q9579K45714
$$ -1150387 -1162876 -919444 -829998 -934730 -574542 -401062 -330160 -220904 -310483 -64769
11593f4769L33886K49670M6720K34822J99467o39928p28347n630K33318J74052
$$ -64769 269117 518787 565507 800329 999796 359868 -368479 -374109 -140791 33261
11583C3261N5728k40814l87735N5656K04330J39191k25896L4895j78915j68922
$$ 33261 88989 -151825 -539560 -483904 -279574 -140383 -366279 -331384 -510299 -679221
11573f79221K00108M16845K14727k67244l02296k10851M0289O8738J6797N1841
$$ -679221 -479113 -62268 152459 -114785 -417081 -627932 -587643 -518905 -502108 -450267
11563d50267P595q3519j92859j04912K6041K58822M24659K18478k2521l43294
$$ -450267 -442672 -526191 -719050 -823962 -797921 -539099 -114440 104038 81517 -261777
11553b61777k63606k43022k08824q1280L33038M78970J71709M1984L82266L41537
$$ -261777 -525383 -768405 -977229 -1058509 -725471 -246501 -74792 -32808 349458 690995
11543F90995j18603n47920l85214m16810m15619K29409N27616J19302k34419k25006
$$ 690995 572392 24472 -360742 -777552 -1193171 -963762 -436146 -316844 -551263 -776269
11533g76269k29954k41947P6803L80563M59901M63300l9763l74085m41750N6730
$$ -776269 -1006223 -1248170 -1171367 -790804 -330903 132397 92634 -281451 -723201 -666471
11523f66471M31165K76776K17520K45840J72822l8653l02867q6513K2842j06631
$$ -666471 -235306 41470 258990 504830 677652 638999 336132 249619 272461 165830
11513A65830k22794R6398L48288J80819L50787L30999k7299j06746k15977j95982
$$ 165830 -56964 39434 387722 568541 919328 1250327 1223028 1116282 900305 704323
11503G04323k63994m31386m06175j67495P0232M43129K07928O3106o8322m70997
$$ 704323 440329 8943 -397232 -564727 -494495 -51366 156562 219668 151346 -319651
11493c19651o02780l11269o3324J53348K38852j7632P5750O0455R5817L3801J49937
$$ -319651 -922431 -1233700 -1297024 -1143676 -904824 -922456 -846706 -786251 -690434 -656633 -506696
11482e06696L74210o0386j74112J04189K01863l6954j07694m19920k16147L83682
$$ -506696 -132486 -192872 -366984 -262795 -60932 -97886 -205580 -625500 -841647 -457965
11472d57965L8638l58284R494J66264P936k1846J81673N0864o13368k74519K65846
$$ -457965 -419327 -777611 -768117 -601853 -593917 -615763 -434090 -383226 -996594 -1271113 -1005267
11461a005267P7532J22685j79356j80407L30453N95284N42434N3599L11794J24595
$$ -1005267 -927735 -805050 -984406 -1164813 -834360 -239076 303358 356957 668751 793346
11451G93346m60379k09297K27689K1104j76406j48241P0959M43310J86406N2088
$$ 793346 332967 123670 351359 372463 196057 47816 118775 562085 748491 800579
11441H00579j72352m16573k54163k75486k77917o3119m8475Q5942N5318j74546
$$ 800579 628227 211654 -42509 -317995 -595912 -659031 -707506 -621564 -566246 -740792
11431g40792K08160L10160Q5638L24447L54392o6053l38899k48570k6405m5058
$$ -740792 -532632 -222472 -136834 187613 542005 475952 137053 -111517 -137922 -182980
11421a82980J454L45015N48480L7403l43358m40734n18297j33708M61407M69456
$$ -182980 -181526 163489 711969 749372 406014 -34720 -553017 -686725 -225318 244138
11411B44138J44989L4429n26684p74543j85208L98222N32224N94588N12474n3217
$$ 244138 389127 423556 -103128 -877671 -1062879 -664657 -132433 462155 974629 921412
11401I21412l24227n0277N1387m41027k99403n42026m84189k01380M40212P40468
$$ 921412 597185 546908 598295 157268 -142135 -684161 -1168350 -1369730 -929518 -189050
11391a89050N3398r2944P4260j07834q6125j18273P4558K44876Q7047P1574K34146
$$ -189050 -135652 -228596 -154336 -262170 -348295 -466568 -392010 -147134 -60087 11487 245633
11380B45633l131l20921l39226k24505r973L12603K07745k61800l26814k11083
$$ 245633 242502 -78419 -417645 -642150 -652123 -339520 -131775 -393575 -720389 -931472
11370i31472k19071k00149r0564K77709M53764J08874M7653L76673M94826j1455
$$ -931472 -1150543 -1350692 -1441256 -1163547 -709783 -600909 -553256 -176583 318243 306788
11360C06788j59784l46385l89765K57356K66267J64920K85245r3334K8564L11658
$$ 306788 147004 -199381 -589146 -331790 -65523 99397 384642 291308 319872 631530
11350F31530o724j94720k01730j09655q9211l73552j88031q1417j65290P717j3049
$$ 631530 624806 430086 228356 118701 29490 -344062 -532093 -613510 -778800 -771083 -784132
11339g84132J45695j82706k47193L22353M23827K3004r9095n40701q7517N80617
$$ -784132 -638437 -821143 -1068336 -745983 -322156 -299152 -398247 -938948 -1026465 -445848
11329d45848M22484L20983J97729J24627m7913n86171m99104m52489j05525n1008
$$ -445848 -23364 297619 495348 619975 572062 -14109 -513213 -965702 -1071227 -1122235
11319a122235j27865K43572K39305L85786M10722P6721k22036j29509l25335m89456
$$ -1122235 -1250100 -1006528 -767223 -381437 29285 106006 -116030 -245539 -570874 -1060330
11309a060330l3858M51348L25503l57304o43828n0292L00874J35930O16766N35468
$$ -1060330 -1094188 -642840 -317337 -674641 -1318469 -1368761 -1067887 -931957 -315191 220277
11299B20277K78561N04604J1673q2338K9949K4918l08337l63844j13129r3475
$$ 220277 498838 1003442 1015115 932777 962726 987644 679307 315463 202334 108859
11289A08859J97644L51088J92850J27992o0591m04486o61968k78262K37602N77138
$$ 108859 306503 657591 850441 978433 917842 513356 -148612 -426874 -189272 387866
11279C87866M44823J00094j38536J9333j42830l63295l09367l18303k2139K2011
$$ 387866 832689 932783 794247 813580 670750 307455 -1912 -320215 -342354 -320343
11269c20343j22850l6663o9072l0195K17328J60416L2112l24383l49860P9183
$$ -320343 -443193 -479856 -548928 -579123 -361795 -201379 -169267 -493650 -843510 -764327
11259g64327J70485L29901L19640M30187N32925J26554k24983m09945n81023p83969
$$ -764327 -593842 -263941 55699 485886 1018811 1145365 920382 510437 -70586 -854555
11249h54555l31448k2135N8532J64421L10937M47096L26882J72210j58822l73693
$$ -854555 -1186003 -1208138 -1149606 -985185 -674248 -227152 99730 271940 113118 -260575
11239b60575k03325O069J59599J98091k28958o02432l35823J72788L34428P6431
$$ -260575 -463900 -457831 -298232 -100141 -329099 -931531 -1267354 -1094566 -760138 -683707
11229f83707l74018j33488K45670J10702j05782k66987l28628O4327L20575K89706
$$ -683707 -1057725 -1191213 -945543 -834841 -940623 -1207610 -1536238 -1471911 -1151336 -861630
11219h61630N92234K64044l17133K13330L23009J42205j88182m83933j75397O0728
$$ -861630 -269396 -5352 -322485 -109155 213854 356059 167877 -316056 -491453 -430725
11209d30725q4711j1452J95918o3297L895O5242k73010k82341J19668J90430O1680
$$ -430725 -515436 -526888 -330970 -394267 -390372 -325130 -598140 -880481 -760813 -570383 -508703
11198e08703p6480j82676K72259K41671r6507J51190R1374k49640J38268O01964
$$ -508703 -585183 -767859 -495600 -253929 -350436 -199246 -107872 -357512 -219244 382720
11188C82720L15776j92073k02836j55141m83268j8005J84416K12018K27773K85669
$$ 382720 698496 506423 303587 148446 -334822 -352827 -168411 43607 271380 557049
11178E57049K23202k32727l09183j54214J99052K1481P7806M95157J88120l45724
$$ 557049 780251 547524 238341 84127 283179 304660 382466 877623 1065743 720019
11168G20019n03565n75833m24850j14577L41387R6417J82593M59781K95443n31545
$$ 720019 216454 -359379 -784229 -898806 -557419 -461002 -278409 181372 476815 -54730
11158e4730j24741N78876K68985K50992K13296k66315p20900o96357j02732j18048
$$ -54730 -179471 399405 668390 919382 1132678 866363 145463 -550894 -653626 -771674
11148g71674n9300M52469N27795J14K1240k63798l96820o0107L56858M63210N26113
$$ -771674 -830974 -378505 149290 149404 170644 -93154 -489974 -550081 -193223 269987 796100
11137G96100K41204n67445p43195k21850O93010N16504j90017m55718m54117p2073
$$ 796100 1037304 469859 -273336 -495186 197824 714328 524311 68593 -385524 -457597
11127d57597Q6972K2308j38649p6836j15945m23878n0924L01582L44917K97587
$$ -457597 -370625 -348317 -486966 -563802 -679747 -1103625 -1154549 -852967 -508050 -210463
11117b10463N7654J38669J78652N8179o9867N8824j30620j75929L7597J92296
$$ -210463 -152809 -14140 164512 222691 152824 211648 81028 -94901 -57304 134992
11107A34992L64149L05729k07101n59001n93904l31403m9592K11749J67052j14403
$$ 134992 499141 804870 597769 38768 -555136 -886539 -936131 -724382 -557330 -671733
11097f71733j08381K83419O36540O35675L45898m02500p9487q109j27451K39227
$$ -671733 -780114 -496695 139845 775520 1121418 718918 639431 631322 503871 743098
11087G43098M26798K55371j46989k21486J79498l25080l76082R8052K91895n44845
$$ 743098 1169896 1425267 1278278 1056792 1236290 911210 535128 633180 925075 380230
11077C80230n48900J23313J26726k23376k88379l70336o8769L83284K60279j97150
$$ 380230 -168670 -45357 81369 -142007 -430386 -800722 -869491 -486207 -225928 -423078
11067d23078r7033j37096j06553j3378K8297N65294K35557j63087m1864j33033
$$ -423078 -520111 -657207 -763760 -777138 -748841 -183547 52010 -111077 -152941 -285974
11057b85974J39436J62669L02543N4531l0835j12726j40163J94148L08852j01149
$$ -285974 -146538 16131 318674 373205 342370 229644 89481 283629 592481 491332
11047D91332j51333K16015J70121j6588k15361j49867R4175k16139n34180p91373
$$ 491332 339999 556014 726135 709547 494186 344319 438494 222355 -311825 -1103198
11037a103198j21170M73287L01994J34911k38411m13557R5450K85001K05807M05187
$$ -1103198 -1224368 -751081 -449087 -314176 -552587 -966144 -870694 -585693 -379886 25301
11027B5301M18813M50437K98697K5400j20412l07329o58116n25100J19131L10286
$$ 25301 444114 894551 1193248 1218648 1098236 790907 132791 -392309 -273178 37108
11017C7108l45413n3107L63134j21552k61937K50646O31167K56108l29438M396
$$ 37108 -308305 -361412 1722 -119830 -381767 -131121 500046 756154 426716 431112
11007D31112L39733Q03399M90359k17503j24371n31689p27891k56061r9693p0609
$$ 431112 770845 1574244 2064603 1847100 1722729 1191040 463149 207088 107395 36786
10997C6786j48938k91542P0189J12737J44146l52360j65853J96017k9017K29993
$$ 36786 -112152 -403694 -333505 -220768 -76622 -428982 -594835 -398818 -427835 -197842
10987a97842N4813k21890k79964j01291M48141P10316J34024n31444n86462O891
$$ -197842 -143029 -364919 -644883 -746174 -298033 412283 546307 14863 -571599 -564708
10977e64708K94069L44004l58700j63994M65096L9286n52694O9900M44444j58116
$$ -564708 -270639 73365 -285335 -449329 15767 55053 -497641 -427741 16703 -141413
10967a41413k15995m90753l65473K48519j21927q035O783m06706J16872N78994
$$ -141413 -357408 -848161 -1213634 -965115 -1087042 -1095077 -1088294 -1495000 -1378128 -799134
10957g99134L01898L18167N28530L51122J89183Q919l45952k63099j48565r5049
$$ -799134 -497236 -179069 349461 700583 889766 898685 552733 289634 141069 46020
10947D6020L47399N04758M15549m38748q94291k41440L97426L60968k16205l87447
$$ 46020 393419 898177 1313726 874978 -19313 -260753 136673 497641 281436 -106011
10937a06011l58483j78285l3603k81880m54356j50816M78818P39751K71759k27076
$$ -106011 -464494 -642779 -676382 -958262 -1412618 -1563434 -1084616 -344865 -73106 -300182
10927c00182k20562m3652K1401N7171J51036J22816J13495K95093l1967o39997
$$ -300182 -520744 -564396 -542995 -485824 -334788 -211972 -98477 196616 164649 -475348
10917d75348o59766R3862O39172J80806j16825k09946m64663K41523O19412M01490
$$ -475348 -1135114 -1041252 -402080 -221274 -338099 -548045 -1012708 -771185 -151773 249717
10907B49717l7008n3429L05572L2927k19956n67668l102Q6344J23679L28418q3961
$$ 249717 212709 159280 464852 497779 277823 -289845 -292947 -206603 -82924 245494 161533
10896A61533J60788J61188n70124p87954k05675M91514N59750L03911M19376r8522
$$ 161533 322321 483509 -86615 -874569 -1080244 -588730 -28980 274931 694307 595785
10886E95785j74473j1242o6841k51498k75837K59538P52204N20547L44275q3770
$$ 595785 421312 410070 343229 91731 -184106 75432 827636 1348183 1692458 1608688
10876A608688q19974l70083K3110P0514r3855j00146j54633K09828r6918o31127
$$ 1608688 788714 418631 441741 512255 418400 318254 163621 373449 276531 -354596
10866c54596n05059J04823L66683L89866J18530j10726k87204j43724j69261K0405
$$ -354596 -859655 -754832 -388149 1717 120247 9521 -277683 -421407 -590668 -570263
10856e70263L2235l45536K47640J09162m27896J0620K67830M6362n39740j00480
$$ -570263 -538028 -883564 -635924 -526762 -954658 -944038 -676208 -629846 -1169586 -1270066
10846a270066Q17473P09100L78661J09048k88120n23146k16067o3336k0219K4530
$$ -1270066 -452593 256507 635168 744216 456096 -67050 -283117 -346453 -366672 -342142
10836c42142j2043P4228J32260m72585k36841M40069N70489J97466Q3918R3891
$$ -342142 -354185 -279957 -147697 -620282 -857123 -417054 153435 350901 434819 528710
10826E28710j33978P098j13416m63890k17863j23964j04933J9883J73864K25465
$$ 528710 394732 401830 288414 -175476 -393339 -517303 -622236 -602353 -428489 -203024
10816b03024n9508k17982l08164n304N27200J54596n4684J72963L44103K42480
$$ -203024 -262532 -480514 -788678 -793982 -266782 -112186 -166870 6093 350196 592676
10806E92676l8866k44346j87451m06965j85192L87690M02414J30638k37647l60915
$$ 592676 553810 309464 122013 -284952 -470144 -82454 319960 450598 212951 -147964
10796a47964o6836m1376m8343J88800l42833n91549m43408m49775n7480N28091
$$ -147964 -214800 -256176 -304519 -115719 -458552 -1050101 -1493509 -1943284 -2000764 -1472673
10786a472673N40802K70876K58785j78721m86482J38918K93372J63321J65178
$$ -1472673 -931871 -660995 -402210 -580931 -1067413 -928495 -635123 -471802 -306624
10777c06624r1780k66409n80020m31205K06801L01647J92101L56659N77892M10150
$$ -306624 -398404 -664813 -1244833 -1676038 -1469237 -1167590 -975489 -618830 -40938 369212
10767C69212m8237j45625k51590J84884M83769J23069j70858j94912k87487K790
$$ 369212 320975 175350 -76240 108644 592413 715482 544624 349712 62225 65015
10757F5015k24057m9523O5900P1044j32646n89290p64843m83104K36457M26566
$$ 65015 -159042 -208565 -142665 -71621 -204267 -793557 -1558400 -2041504 -1805047 -1378481
10747a378481j87973k5557K49812N98604L71269L7889K84155M78249N92405K33929
$$ -1378481 -1566454 -1592011 -1342199 -743595 -372326 -334437 -50282 427967 1020372 1254301
10737A254301K88489J43972M03505K38156k89556p00890q10270o68813k72519
$$ 1254301 1542790 1686762 2090267 2328423 2038867 1337977 527707 -141106 -413625
10728d13625K18061L9871j72143j44711r012j13460k60770q0355M68544K38046
$$ -413625 -195564 -155693 -327836 -472547 -481559 -595019 -855789 -936144 -467600 -229554
10718b29554k07472o7382K10687O2393j64741l84279r5615K12957K43003L64474
$$ -229554 -437026 -504408 -293721 -231328 -396069 -780348 -875963 -663006 -420003 -55529
10708e5529M33754N77650L04517n8868k48037k6863o06396l68646K73853L87196
$$ -55529 378225 955875 1260392 1201524 953487 926624 320228 -48418 225435 612631
10698F12631M5613l1542l3137l7996L02625J00093j30842k89604p5873j20454
$$ 612631 658244 626702 593565 555569 858194 958287 827445 537841 461968 341514
10688C41514n085K82357l2420k1026L93836j45850n88665k66951O8615l21366
$$ 341514 336429 618786 586366 565340 959176 813326 224661 -42290 26325 -295041
10678b95041q88043n83115K80568P10423N33249n518p9200J08531K56844K91975
$$ -295041 -1183084 -1766199 -1485631 -775208 -241959 -247477 -326677 -218146 38698 330673
10668C30673R8330J12963j72506l53337j23489L37185O7685n46902m78713j46347
$$ 330673 429003 541966 369460 16123 -107366 229819 297504 -249398 -728111 -874458
10658h74458k10386l390k98049k53783j5682K2344J80199j11223K24202L47161
$$ -874458 -1084844 -1088234 -1386283 -1640066 -1655748 -1633404 -1453205 -1564428 -1340226 -993065
10648i93065M10736M71999J59463M81077l1326n05465k90639L09015o1053k55703
$$ -993065 -582329 -110330 49133 530210 498884 -6581 -297220 11795 -49258 -304961
10638c04961P927M77384K89483j32442q69553p61555k33583k69431p0140P5025
$$ -304961 -297034 180350 469833 337391 -532162 -1293717 -1527300 -1796731 -1866871 -1791846
10628a791846L14274J79951p9837j85276p6951M63099P42662L58327k39827j35909
$$ -1791846 -1477572 -1297621 -1377458 -1562734 -1639685 -1176586 -433924 -75597 -315424 -451333
10618d51333j80324l34025j03457K23977R9359Q4839J00565L85341J61016J73797
$$ -451333 -631657 -965682 -1069139 -845162 -745803 -660964 -560399 -175058 -14042 159755
10608A59755j21263o55962j70681K00054N58412M24862k26385k51371J05916r8261
$$ 159755 38492 -617470 -788151 -588097 -29685 395177 168792 -82579 23337 -74924
10598g4924J77037J17462k1489j51970L05510L48452J73452r9500m88035m30722
$$ -74924 102113 219575 198086 46116 351626 700078 873530 774030 285995 -144727
10588a44727l51889k34935J70184J96458J60916L222J31822J27531l2220o48178
$$ -144727 -496616 -731551 -561367 -364909 -203993 -200771 -68949 58582 26362 -621816
10578f21816o25162k18836R7975J75623L51065J40293K3967K49836L65979K29166
$$ -621816 -1246978 -1465814 -1367839 -1192216 -841151 -700858 -676891 -427055 -61076 168090
10568A68090k42897k87988l44445l29090q805L82029R6915J17748J39080P4536
$$ 168090 -74807 -362795 -707240 -1036330 -1045135 -663106 -566191 -448443 -309363 -234827
10558b34827p7275J2604J69120j10491n9770r6846l393j43373p3916l09161j82727
$$ -234827 -312102 -299498 -130378 -240869 -300639 -397485 -400878 -544251 -618167 -927328 -1110055
10547a110055J50412L02357k03755l99815o9731K10781M53131m1472j80431N6935
$$ -1110055 -959643 -657286 -861041 -1260856 -1330587 -1119806 -666675 -708147 -888578 -831643
10537h31643L36329K54067j61834j168j46775l52861k66207n836K74368L70185
$$ -831643 -495314 -241247 -403081 -404249 -551024 -903885 -1170092 -1175928 -901560 -531375
10527e31375K91096K12028P9494J09460J97385K04391J68927j90463j58869m7727
$$ -531375 -240279 -28251 51243 160703 358088 562479 731406 540943 382074 334347
10517C34347j17173r5769J41425j59156r7009L88838L69274l40166m39358n67229
$$ 334347 217174 121405 262830 103674 6665 395503 764777 424611 -14747 -581976
10507e81976k13440K50610J68775K85857K84516m38737q63889l48953L19763K39019
$$ -581976 -795416 -544806 -376031 -90174 194342 -244395 -1108284 -1457237 -1137474 -898455
10497h98455n6922J95088M56176j39066k52479l4044K75878M63656Q9358m6815
$$ -898455 -955377 -760289 -304113 -443179 -695658 -729702 -453824 9832 99190 52375
10487E2375j46120l0251O8575L0469J66485K612r3460l61241l96902J46991M66360
$$ 52375 -93745 -123996 -55421 -24952 141533 144145 50685 -310556 -707458 -560467 -94107
10476i4107R6995n8268l687R2071J04702k72751m28979l17093k96635K75924L76952
$$ -94107 2888 -55380 -59067 33004 137706 -135045 -564024 -881117 -1177752 -901828 -524876
10465e24876J66972l43892K85792L24771k34154K990K79490L97256P9637o2472
$$ -524876 -357904 -701796 -416004 -91233 -325387 -322397 -42907 354349 433986 371514
10455C71514l65997m90171l98798K9714L12615L82365K93752p2168o11008n47964
$$ 371514 5517 -484654 -883452 -853738 -541123 -158758 134994 62826 -548182 -1096146
10445a096146n7698m3600R5516P2373L30420L13799k15165k23246K80259K32046
$$ -1096146 -1153844 -1197444 -1101928 -1029555 -699135 -385336 -600501 -823747 -543488 -311442
10435c11442k48040k67571m37295k20376O75725Q33104K37097k65818j05689j5700
$$ -311442 -559482 -827053 -1264348 -1484724 -808999 24105 261202 -4616 -110305 -126005
10425a26005r6642J26562K34530R1079l93056l09175K23833J66422k95771k09253
$$ -126005 -222647 -96085 138445 229524 -163532 -472707 -248874 -82452 -378223 -587476
10415e87476P3964M79693L55643N6794j43955N809L19279J88590j28500j79332
$$ -587476 -513512 -33819 321824 378618 234663 240472 559751 748341 619841 440509
10405D40509j42280M02785N25629m4684j106173o17672P388J05730R3271j35595
$$ 440509 298229 701014 1226643 1181959 75786 -541886 -534498 -428768 -335497 -471092
10395d71092j97760K48561K30916J75160J91018n81587J81874N93167L59536M39802
$$ -471092 -668852 -420291 -189375 -14215 176803 -404784 -222910 370257 729793 1169595
10385A169595K32833J28620l73520j36966q0141j18306k15987l10571k5821j62989
$$ 1169595 1402428 1531048 1157528 1020562 940421 822115 606128 295557 269736 106747
10375A06747j92817R4909m9554j10592j48512m3377K48253O9824k21748J9957
$$ 106747 -86070 8839 -40715 -151307 -299819 -343196 -94943 -25119 -246867 -226910
10365b26910P5233L4283J1342j00507Q3140P5434j78909m93705k34223j67482
$$ -226910 -151677 -117394 -106052 -206559 -123419 -47985 -226894 -720599 -954822 -1122304
10355a122304j38058j8662M87910Q34295O15660l7101k33475l04572j44851M5641
$$ -1122304 -1260362 -1279024 -791114 43181 658841 621740 388265 83693 -61158 -15517
10345a5517R2199k28782m19438j18887L73191J59388l50253n6094L97409l5407
$$ -15517 76682 -152100 -571538 -690425 -317234 -157846 -508099 -564193 -166784 -202191
10335b02191n68850n11987k68260k01806K0849N26135P30768J49015j12501J61961
$$ -202191 -771041 -1283028 -1551288 -1753094 -1732245 -1206110 -475342 -326327 -438828 -276867
10325b76867j02840k42115J68427L45060o39J72813K08302j5702j32143k7304
$$ -276867 -379707 -621822 -453395 -108335 -108974 63839 272141 256439 124296 96992
10315I6992o8910p4133K02251K77962j90709l51469j9961m585N4547J92546J2890
$$ 96992 28082 -46051 156200 434162 243453 -108016 -127977 -132562 -78015 114531 127421
10304A27421N246k71863m69923l94489k9104K87926N97195O28676J08236m83677
$$ 127421 132667 -139196 -609119 -1003608 -1032712 -744786 -147591 481085 589321 105644
10294A05644m97724n799q8430k76924J08478J23171L34682Q3305l16852k41582
$$ 105644 -392080 -397879 -486309 -763233 -654755 -531584 -196902 -113597 -430449 -672031
10284f72031P2502L53434J95525j22384j70073j64617K34476J23845m1491j78484
$$ -672031 -599529 -246095 -50570 -172954 -343027 -507644 -273168 -149323 -190814 -369298
10274c69298m24810j28319R6025Q2923j41408j41310J34311K54305J08056m8581
$$ -369298 -794108 -922427 -826402 -743479 -884887 -1026197 -891886 -637581 -529525 -578106
10264e78106K75838L99326J73197K84205L68068M31250j88596r15350n15877j2729
$$ -578106 -302268 97058 270255 554460 922528 1353778 1165182 249832 -266045 -278774
10254b78774L09654J53336l22909k92624k14043j45825O0025K38263L22433q2216
$$ -278774 30880 184216 -138693 -431317 -645360 -791185 -731160 -492897 -170464 -252680
10244b52680o32333l69236p8727J6698K48908J14600J32630J88137K45950J24850
$$ -252680 -885013 -1254249 -1332976 -1316278 -1067370 -952770 -820140 -632003 -386053 -261203
10234b61203K27513K64199k73619j82000j03287k16713m9215j88051Q6492K54297
$$ -261203 -33690 230509 -43110 -225110 -328397 -545110 -594325 -782376 -695884 -441587
10224d41587j55086j9404K15096j39693m03750j49763j19275L09833L70930o5281
$$ -441587 -596673 -616077 -400981 -540674 -944424 -1094187 -1213462 -903629 -532699 -597980
10214e97980r0322J4740J25882K76365l05800m73156p46153l09257K40608L80834
$$ -597980 -688302 -673562 -547680 -271315 -577115 -1050271 -1796424 -2105681 -1865073 -1484239
10204a484239K36507M56604O34819K31494L41819J94160p1310R330J08244k67463
$$ -1484239 -1247732 -791128 -156309 75185 417004 611164 539854 549184 657428 389965
10194C89965m33972l11029j50145p3706m1698P8770K35428J71160r3498o9486
$$ 389965 -44007 -355036 -505181 -578887 -620585 -541815 -306387 -135227 -228725 -298211
10184b98211l17870j03976M22283L70422K42168K4888J84507j08242k33793q8127
$$ -298211 -616081 -720057 -297774 72648 314816 339704 524211 415969 182176 94049
10174I4049L19067N57973K84584l70192j96051k99247o10195l55795j95138J03675
$$ 94049 413116 971089 1255673 885481 689430 390183 -220012 -575807 -770945 -667270
10164f67270j5445K30636O15436K79269L19413K46325k48096j85891l74064k24889
$$ -667270 -682715 -452079 163357 442626 762039 1008364 760268 574377 200313 -24576
10154b4576m3701J50820J01466r5391k80650m36280L50861O47458L142l63000
$$ -24576 -68277 82543 184009 88618 -192032 -628312 -277451 370007 373149 10149
10144A0149J82444O2334l45927K30648K58147O4075j4216k06984j90195J5529
$$ 10149 192593 254927 -91000 139648 397795 461870 447654 240670 50475 66004
10134F6004P7306j7379K27585K21799k90300k08425p2382R8460k03033N8662K28810
$$ 66004 143310 125931 353516 575315 285015 76590 4208 102668 -100365 -41703 187107
10123A87107l7258K84895J42494j10742Q1947J51108J05073J44344j97979o99510
$$ 187107 149849 434744 577238 466496 548443 699551 804624 948968 750989 51479
10113E1479k76244j36791k4002M94775K62518k66000n9869p6473l45759o31104
$$ 51479 -224765 -361556 -385558 109217 371735 105735 45866 -30607 -376366 -1007470
10103a007470n10183j55925J9659J53151J68717L32184P55573L97058j95831j19284
$$ -1007470 -1517653 -1673578 -1653919 -1500768 -1332051 -999867 -244294 152764 -43067 -162351
10093a62351m7025Q5914l35554m73721m30023k30996L90236P53665M66045L06061
$$ -162351 -209376 -123462 -459016 -932737 -1362760 -1593756 -1203520 -449855 16190 322251
10083C22251L03463J00094j32787J36645O8948r2482l16379p05883n38862l38675
$$ 322251 625714 725808 593021 729666 798614 706132 389753 -316130 -854992 -1193667
10073a193667K1123n2719j79308j2451O5608K9819M0404R0901l8264J32398J09834
$$ -1193667 -1172544 -1225263 -1404571 -1417022 -1351414 -1321595 -1281191 -1190290 -1228554 -1096156 -986322
10062i86322J8385L84830M40235Q1129J67650k23883l93480L81437N38985K2185
$$ -986322 -967937 -583107 -142872 -61743 105907 -117976 -511456 -130019 408966 431151
10052D31151q16982n69010K76590J42760j63099Q3312L93022J85911J06197K69467
$$ 431151 -385831 -954841 -678251 -535491 -698590 -615278 -222256 -36345 69852 339319
10042C39319J98470j35399j92545k94746n47307j30844J82911J23024M65210M33467
$$ 339319 537789 402390 209845 -84901 -632208 -763052 -580141 -457117 8093 441560
10032D41560r3366n17648m05974K64108N39607M36609J14452m15243m31664m85324
$$ 441560 348194 -169454 -575428 -311320 228287 664896 779348 364105 -67559 -552883
10022e52883k71032M7697K17496M4030k6327M14735K59042r5429l40063j34251
$$ -552883 -823915 -776218 -558722 -514692 -541019 -126284 132758 37329 -302734 -436985
$$ [...]
##END NTUPLES=NMR SPECTRUM
##END=
