##TITLE=C13_SR121
 CDCl3, 19100 sc

 14.4.2022
##JCAMPDX= 6.0         $$ Bruker NMR JCAMP-DX V2.0
##DATA TYPE= NMR SPECTRUM
##DATA CLASS= NTUPLES
##ORIGIN= UXNMR, Bruker Analytische Messtechnik GmbH
##OWNER= root
$$ XWIN-NMR		Version 3.5
$$ Fri Apr 15 10:30:29 2022 Russian Standard Time (UT+4h)  she@DPX200
##.OBSERVE FREQUENCY= 50.327896
##.OBSERVE NUCLEUS= ^13C
##.ACQUISITION MODE= SIMULTANEOUS
##.ACQUISITION SCHEME= undefined
##.AVERAGES= 19101
##.DIGITISER RES= 17
##SPECTROMETER/DATA SYSTEM= spect
##.PULSE SEQUENCE= zgpg30
##.SOLVENT NAME= CDCl3
##.SHIFT REFERENCE= (INTERNAL, CDCl3, 0, 222.961)
##AUDIT TRAIL= $$ (NUMBER, WHEN, WHO, WHERE, WHAT)
$$ ##TITLE= Audit trail, XWIN-NMR		Version 3.5
$$ ##JCAMPDX= 5.01
$$ ##ORIGIN= Bruker BioSpin GmbH
$$ ##OWNER= she
$$ F:/spectra/data/she/nmr/c13/1/pdata/1/auditp.txt
$$ ##AUDIT TRAIL=  $$ (NUMBER, WHEN, WHO, WHERE, WHAT)
(   1,<2022-04-15 10:29:22.48 +0400>,<she>,<DPX200>,
      <created by zg, POWCHK disabled, PULCHK disabled
       terminated by command 'halt'
       configuration hash MD5:
       00 E9 B6 7A A2 85 ED C7 34 08 36 98 17 FE 4E 26
       data hash MD5: 32K
       98 6B 32 29 30 09 25 6E 4B DD B1 CA AD FD AF E9>)
(   2,<2022-04-15 10:29:25.51 +0400>,<she>,<DPX200>,
      <Start of raw data processing
       efp BC_mod = 2 LB = 1 FT_mod = 6 PKNL = 1 PHC0 = -331.5542 PHC1 = 39.56232 SI = 32K 
       data hash MD5: 32K
       3A C3 87 DF 92 70 6E 01 F6 90 D0 69 4A FB BD CA>)
(   3,<2022-04-15 10:29:28.29 +0400>,<she>,<DPX200>,
      <abs ABSG = 5 
       data hash MD5: 32K
       DE C7 07 E0 2E A5 8E FD 25 70 AA 31 74 1D 4C A9>)
(   4,<2022-04-15 10:30:00.50 +0400>,<she>,<DPX200>,
      <pk PHC0 = 2.489241 PHC1 = -5.2 
       data hash MD5: 32K
       F6 25 02 55 80 16 37 30 29 AC 68 2A 1A F0 50 6A>)
(   5,<2022-04-15 10:30:03.87 +0400>,<she>,<DPX200>,
      <abs ABSG = 5 
       data hash MD5: 32K
       32 3C 5A 7F 7F FE CC 78 C9 21 BC 34 63 39 E5 E4>)
$$ ##END=
$$ 
$$ hash MD5
$$ 53 8C F3 A5 2A 88 57 38 14 61 EB A2 B8 D6 58 58
##$RELAX= 
##$RELAX= 
##$RELAX= 
##$RELAX= 
##$RELAX= 
##$RELAX= 
##$RELAX= 
##$RELAX= 
$$ Bruker specific parameters
$$ --------------------------
##$DU= <F:/spectra>
##$EXPNO= 1
##$NAME= <c13>
##$PROCNO= 1
##$TYPE= <nmr>
##$USER= <she>
##$AMP= (0..31)
100 100 100 100 100 100 100 100 100 100 100 100 100 100 100 100 100 100 
100 100 100 100 100 100 100 100 100 100 100 100 100 100 
##$AQSEQ= 0
##$AQ_mod= 1
##$AUNM= <au_zg>
##$AUTOPOS= <>
##$BF1= 50.322709
##$BF2= 200.13
##$BF3= 50.322709
##$BF4= 500.13
##$BF5= 500.13
##$BF6= 500.13
##$BF7= 500.13
##$BF8= 500.13
##$BYTORDA= 1
##$CFDGTYP= 0
##$CFRGTYP= 5
##$CHEMSTR= <none>
##$CNST= (0..31)
1 1 145 1 1 1 1 1 1 1 1 1 1 1 1 1 1 1 1 1 1 1 1 1 1 1 1 1 1 1 1 1 
##$CPDPRG= <waltz16>
##$CPDPRG1= <>
##$CPDPRG2= <waltz16>
##$CPDPRG3= <>
##$CPDPRG4= <mlev>
##$CPDPRG5= <mlev>
##$CPDPRG6= <mlev>
##$CPDPRG7= <mlev>
##$CPDPRG8= <mlev>
##$CPDPRGB= <>
##$CPDPRGT= <>
##$D= (0..31)
$$ [...]
##$SUBNAM4= <"">
##$SUBNAM5= <"">
##$SUBNAM6= <"">
##$SUBNAM7= <"">
##$SUBNAM8= <"">
##$SUBNAM9= <"">
##$SW= 239.972175391363
##$SWIBOX= (0..15)
0 1 3 0 0 0 0 0 0 0 0 0 0 0 0 0 
##$SW_h= 12077.2946859903
##$TD= 32768
##$TD0= 1
##$TE= 0
##$TE2= 300
##$TE3= 300
##$TEG= 300
##$TL= (0..7)
120 120 120 120 120 120 120 120 
##$TP= (0..7)
150 150 150 150 150 150 150 150 
##$TP07= 0
##$TPNAME0= <>
##$TPNAME1= <>
##$TPNAME2= <>
##$TPNAME3= <>
##$TPNAME4= <>
##$TPNAME5= <>
##$TPNAME6= <>
##$TPNAME7= <>
##$TPOAL= (0..7)
0.5 0.5 0.5 0.5 0.5 0.5 0.5 0.5 
##$TPOFFS= (0..7)
0 0 0 0 0 0 0 0 
##$TUNHIN= 0
##$TUNHOUT= 0
##$TUNXOUT= 0
##$USERA1= <user>
##$USERA2= <user>
##$USERA3= <user>
##$USERA4= <user>
##$USERA5= <user>
##$V9= 5
##$VALIST= <valist>
##$VCLIST= <CCCCCCCCCCCCCCC>
##$VD= 0
##$VDLIST= <DDDDDDDDDDDDDDD>
##$VPLIST= <PPPPPPPPPPPPPPP>
##$VTLIST= <TTTTTTTTTTTTTTT>
##$WBST= 1024
##$WBSW= 4
##$XGAIN= (0..3)
0 0 0 0 
##$XL= 0
##$YL= 0
##$YMAX_a= 121925351
##$YMIN_a= -28861481
##$ZGOPTNS= <>
##$ZL1= 120
##$ZL2= 120
##$ZL3= 120
##$ZL4= 120
##$ABSF1= 222.961
##$ABSF2= -17.03589
##$ABSG= 5
##$ABSL= 3
##$ALPHA= 0
##$AQORDER= 0
##$ASSFAC= 0
##$ASSFACI= 0
##$ASSFACX= 0
##$ASSWID= 0
##$AUNMP= <proc_1d>
##$AZFE= 0.1
##$AZFW= 0.5
##$BCFW= 0
##$BC_mod= 2
##$BYTORDP= 0
##$COROFFS= 0
##$CY= -3
##$DATMOD= 1
##$DC= 0
##$DFILT= <>
##$DTYPP= 0
##$F1P= 0
##$F2P= 0
##$FCOR= 0.5
##$FTSIZE= 32768
##$FT_mod= 6
##$GAMMA= 0
##$GB= 0
##$INTBC= 1
##$INTSCL= 4.134877e-10
##$ISEN= 128
##$LB= 1
##$LEV0= 0
##$LPBIN= 0
##$MAXI= 10000
##$MC2= 0
##$MEAN= 0
##$ME_mod= 0
##$MI= 0.1934396
##$NCOEF= 0
##$NC_proc= 2
##$NLEV= 6
##$NOISF1= 120.0001
##$NOISF2= 80.00006
##$NSP= 0
##$NTH_PI= 0
##$NZP= 0
##$OFFSET= 222.961
##$PC= 1.4
##$PHC0= -329.065
##$PHC1= 34.36232
##$PH_mod= 1
##$PKNL= yes
##$PPARMOD= 0
##$PSCAL= 0
##$PSIGN= 0
##$REVERSE= no
##$SF= 50.3227146458226
##$SI= 32768
##$SIGF1= 140
##$SIGF2= 120
##$SINO= 11.81781
##$SIOLD= 32768
##$SREGLST= <13C.CDCl3>
##$SSB= 0
##$STSI= 32768
##$STSR= 0
##$SW_p= 12077.2946859903
##$SYMM= 0
##$S_DEV= 0
##$TDeff= 32768
##$TDoff= 0
##$TI= <>
##$TILT= no
##$TM1= 0
##$TM2= 0
##$TOPLEV= 0
##$USERP1= <user>
##$USERP2= <user>
##$USERP3= <user>
##$USERP4= <user>
##$USERP5= <user>
##$WDW= 1
##$XDIM= 32768
##$YMAX_p= 382307439
##$YMIN_p= -2390066
$$ End of Bruker specific parameters
$$ ---------------------------------
##NTUPLES= NMR SPECTRUM
##VAR_NAME=  FREQUENCY,     SPECTRUM/REAL,   SPECTRUM/IMAG
##SYMBOL=    X,             R,               I
##VAR_TYPE=  INDEPENDENT,   DEPENDENT,       DEPENDENT
##VAR_FORM=  AFFN,          ASDF,            ASDF
##VAR_DIM=   32768,         32768,           32768
##UNITS=     HZ,            ARBITRARY UNITS, ARBITRARY UNITS
##FACTOR=    0.368581032318806, 1,           1
##FIRST=     11220.0027064323, 0,            0
##LAST=      -857.291979557962, 0,           0
##MIN=       -857.291979557962, -2390066,    0
##MAX=       11220.0027064323, 382307439,    0
$$ Real data points
##PAGE= N=1
##DATA TABLE= (X++(R..R)), XYDATA
$$ [...]
15843A30877j48195M5496R0291j12527L48677N32418j97289m80565k60172P8114
15833B7125K35145J77284j17217l8234K48275M60422K88858J2116j09361l28567
15823H55846m66626m88519k54228m813j46436k866n1387J3213K16802J57368O1074
15812a10572J04269N6836k27531J24513j01814j32314o1177q3521k03895m7810
15802f83016L76692J13739k0251k47263m05145m40099q2237L13600L41026J37100
15792e95854J08735J28977J03636M6075l51715K62194J17080k52607l12347l6408
15782g82234q457J6792O02814N68646M43669l41900p87583k18351m6068K23445
15772c29227N19583K98382P3391j90890k32419k52881j58922K4173j05099R6758
$$ plain form
15843 130877 -17318 28178 118469 5942 354619 887037 689748 209183 -50989 27125
15833 27125 262270 439554 322337 284103 532378 992800 1281658 1293774 1184413 855846
15823 855846 389220 -99299 -353527 -358340 -504776 -507642 -559029 -545816 -329014 -171646 -110572
15812 -110572 -6303 50533 -176998 -52485 -154299 -286613 -347790 -431311 -635206 -683016
15802 -683016 -306324 -192585 -212836 -460099 -865244 -1305343 -1387580 -1073980 -732954 -595854
15792 -595854 -487119 -358142 -254506 -208431 -560146 -297952 -180872 -433479 -745826 -782234
15782 -782234 -790691 -773899 -171085 397561 841230 499330 -288253 -506604 -552672 -329227
15772 -329227 190356 488738 562129 371239 138820 -114061 -272983 -248810 -353909 -257151
15762b57151M17809M25366J4627M8671Q6695J1697k79265l36107l9058k9357l67607
15751c03680j32350K17409m4973l03106q5945j5241j53157l80234n59464Q4798
15741a675943P22737R55616M84603K55737m36772n04791j98237m5330J89597k87408
15731e40191j94629O4842L8424N1610J50464J27683j43220l1353M47867L42152
15721C13649L27627L7649q2415j00072l54774p02054j85090O32905K84099j20580
15711E0944p2274R8615r0584k60735k80120J5716j3538m7571k23602l59822j55100
15700a338071L03920M81773J00399K37922L29355j53963L8165J11879J90089j13072
15690A88396m46935k76690N462K18045K24565L5840Q0005K4482j39407j99796
$$ plain form
15762 -257151 160658 586024 600651 649322 736017 747714 468449 132342 93284 63927 -303680
15751 -303680 -436030 -218621 -263594 -566700 -652645 -667886 -821043 -1201277 -1760741 -1675943
15741 -1675943 -953206 2410 487013 742750 305978 -198813 -397050 -442380 -252783 -540191
15731 -540191 -734820 -669978 -631554 -579944 -429480 -301797 -445017 -476370 -28503 313649
15721 313649 641276 678925 596510 496438 141664 -560390 -745480 -112575 171524 50944
15711 50944 -21330 77285 -13299 -274034 -554154 -538438 -551976 -599547 -823149 -1182971 -1338071
15700 -1338071 -1034151 -552378 -451979 -214057 115298 -38665 -500 111379 301468 188396
15690 188396 -258539 -535229 -529767 -311722 -87157 -51317 28688 53170 -86237 -286033
15680b86033J37191M87273M10575K5793l24858l86142n5451N633j4735q3098n85812
15669f69664l33235j69755o891L21963J05525P2267j0919p6926r8811n0741P9580
15658h37607O09502N95278L38028K84582k59825j72675k3026k85806n06485J66579
15648i1455K45899Q6884l54771m54285K00259L38305m19935n07598l13269J41722
15638a128244K92216J47787o5690o580K94630J34930j38572k07884J99796N34273
15628E6662K91737o4410O8214k0272j41066j62781j95367k2748N8550k61152k96989
15617f89622r7971k20977m32516m45606k8491K32911L69125P80951O90335l21409
15607a63270r81421n31404n1839p1629L94228M31257L34871J59784K22778K55864
$$ plain form
15680 -286033 -148842 338431 749006 774799 449941 63799 8348 13981 -754 -83852 -669664
15669 -669664 -1002899 -1172654 -1179545 -857582 -752057 -679790 -690709 -767635 -866446 -917187 -837607
15658 -837607 -228105 367173 705201 989783 729958 557283 534257 248451 -258034 -91455
15648 -91455 154444 241328 -113443 -567728 -367469 -29164 -449099 -956697 -1269966 -1128244
15638 -1128244 -836028 -688241 -753931 -760511 -465881 -330951 -469523 -677407 -477611 56662
15628 56662 348399 283989 352203 331931 190865 28084 -167283 -190031 -131481 -392633 -689622
15617 -689622 -787593 -1008570 -1441086 -1886692 -1915183 -1682272 -1313147 -532196 158139 -163270
15607 -163270 -1144691 -1676095 -1727934 -1799563 -1405335 -974078 -639207 -479423 -256645 -781
15597g81R6231r7772l42365j83146J1729R0669J71552J59538J7276n551j94806
15586b77426k56937j4464M00743L72880L28355K27381k2517j55639J55058K05400
15576I62834R573j60188j90436k18047k04194l80738j64688L04406J25495j93931
15566a09914j46951J12808m9622J0940L81557L77963O3979q9308j25098l79366
15556D6988m08046R4934M02393M1135j01658p7311k68143k55782j13922m9799
15546f89211M82017K95830j41126J37024J41511p0764p0029j64155k31352O7372
15536b42883q123m2413n3369K72636M93623P0924R5007j37376o19028j14111M22939
15525A37826L648m19808j26802J83037K69928J97396j29007j59054O8663J37241
$$ plain form
15597 -781 95450 -2322 -344687 -527833 -516104 -425435 -253883 -94345 -77069 -82620 -277426
15586 -277426 -534363 -548827 -148084 224796 553151 780532 758015 602376 757434 962834
15576 962834 972407 812219 621783 403736 199542 -181196 -345884 -41478 84017 -109914
15566 -109914 -256865 -144057 -193679 -182739 198818 576781 640760 551452 426354 46988
15556 46988 -361058 -266124 136269 177404 75746 -1565 -269708 -525490 -639412 -689211
15546 -689211 -207194 88636 -52490 84534 226045 155281 85252 -78903 -310255 -242883
15536 -242883 -251006 -293419 -346788 -74152 419471 490395 585402 448026 -171002 -285113 137826
15525 137826 141474 -278334 -405136 -222099 47829 245225 116218 -42836 25827 163068
15515A63068J49015P1948r2754j68568k8856k16964p253L29080J14476j36592
15505A76600n41732n38634J57185K11825J55278K20943K32302k9447j20288J91014
15495A15046N49176K13403k89604l21490M6740K58623k462k88741j49433m4281
15485H6977Q1565J50301J53280O46920l62891q15033o2006J82656j22216k10129
15475b70576j10982L56411L27018J76666O0975J48253n7714l87763k92236j48658
15465a98606k64844j07328J12149Q9047k59558k80374Q2503O2052m31861k75201
15455a472021M4686M1709J5524J59847J98099m6821R3657P0626O8628K82114K96591
15444b47361N4285J28076L01884K48842m2685m6713K0997J0892m2098j38404O135
$$ plain form
15515 163068 312083 384031 291277 122709 93853 -123111 -130364 198716 313192 176600
15505 176600 -365132 -903766 -746581 -534756 -379478 -158535 73767 44320 -75968 115046
15495 115046 664222 877625 588021 266531 313271 571894 569432 280691 131258 86977
15485 86977 168542 318843 472123 1119043 756152 -58881 -120887 61769 -60447 -270576
15475 -270576 -381558 -25147 301871 478537 539512 687765 630051 242288 -49948 -198606
15465 -198606 -463450 -570778 -458629 -369582 -629140 -909514 -827011 -764959 -1196820 -1472021
15455 -1472021 -1427335 -1385626 -1370102 -1210255 -1012156 -1058977 -965320 -894694 -826066 -543952 -247361
15444 -247361 -193076 -65000 236884 485726 443041 396328 417325 428217 386119 247715 253850
15433B53850m32761m81213Q9562q0063j8374K98379l4877j26932L29675M88519
15423B85765J74022l3421K01542o4133m94060k22340j68413j36322M9087J00676
15413c07597L0463m4404K16535L46212l8130n81696j94600K23178O4686l15509
15403f00862m07559k59534j20922K59904K69526j02882J37368L20082J75091L55932
15393B6144l2895l75355j39599J44041J93555J98484q4599l31620k8733M65071
15383C4494j9756l49162n5886p834l07999Q3901M90385O24474J88836m55551k27587
15372a685j47202P4460J19289J5102K98505R6099k51446l67694r8573M66312P47854
15361I51021M44348k39035j93816k29849l19575k62903k23543n5656L26254j43475
$$ plain form
15433 253850 -178911 -660124 -570562 -650625 -668999 -370620 -405497 -532429 -202754 285765
15423 285765 459787 426366 627908 563775 69715 -152625 -321038 -457360 -408273 -307597
15413 -307597 -277134 -321538 -105003 241209 203079 -378617 -573217 -350039 -285353 -600862
15403 -600862 -1008421 -1267955 -1388877 -1128973 -859447 -962329 -824961 -504879 -329788 26144
15393 26144 -6751 -382106 -521705 -377664 -184109 14375 -70224 -401844 -430577 34494
15383 34494 14738 -334424 -390310 -398144 -706143 -622242 -131857 492617 681453 225902 -1685
15372 -1685 -148887 -74427 44862 59964 358469 454568 203122 -164572 -263145 203167 951021
15361 951021 1395369 1156334 962518 732669 413094 150191 -73352 -129008 197246 53771
15351E3771j09162M7849Q4283J65829J57229K18594j29843k72302Q9518p7107
15341B28659n21532k76178N0422J19256J82740K14188J73214m19226k82134P8304
15331d52287p1424r7356o0804J81634L25031N19254K75246j77903j69252j34196
15321A37943k83031j90915J88258L2487m3098J08944K04277m510j56771j67275
15311a73691j68794L9535r7760J40612j2112l17685j79442O3251K29140L82921
15301i4025K14473L0642Q0961O9655K07467q988j91654l19177q4248K17213J65477
15290B87796L1378l99021k02196o7275m17990k04037K32108O19956K37003j49719
15280c1997P9442K12249K33009M9193k07648q9892p11727n31444j77758j0040
$$ plain form
15351 53771 -55391 -7542 76741 242570 399799 618393 488550 216248 305766 228659
15341 228659 -292873 -569051 -518629 -399373 -216633 -2445 170769 -248457 -530591 -452287
15331 -452287 -523711 -621067 -681871 -500237 -175206 344048 619294 441391 272139 137943
15321 137943 -145088 -336003 -147745 -115258 -158356 -49412 154865 150355 -6416 -173691
15311 -173691 -342485 -302950 -400710 -260098 -272210 -589895 -769337 -706086 -476946 -94025
15301 -94025 120448 151090 232051 301706 509173 500185 308531 -10646 -94894 122319 287796
15290 287796 319174 -79847 -282043 -349318 -767308 -971345 -739237 -119281 117722 -31997
15280 -31997 47445 259694 492703 541896 334248 244356 -467371 -998815 -1176573 -1186613
15270a186613O29898N44246L49637N0553k42115r8115j47056J5007J07144k31553
15260b08967k27750k76187l2571J78680K12938p6923k29403J85876K46586l56563
15250e84284l16403R4676K77773J24473J64341K54944K96747L60939k03176l96102
15240G3928j49332N9780P0661L84555M25005j38751j87182M1358j3737K49441
15230H15726L29305q8195p2518k56970q03820o27706j13779L07908K28130r0101
15220c72020N4023p8479p4354m313J40962L01865K86507k23480p2684Q7983j25422
15209g9412J57079K4591j6836j77383l1446L5021L4512q6423l12111j35036J93514
15198c93930J14627J3964j8456p7965J26952n5592j32105L7924j60640j03857
$$ plain form
15270 -1186613 -556715 -12469 337168 387721 145606 47491 -99565 -84558 22586 -208967
15260 -208967 -436717 -712904 -745475 -566795 -353857 -430780 -660183 -474307 -227721 -584284
15250 -584284 -900687 -806011 -528238 -403765 -239424 15520 312267 673206 470030 73928
15240 73928 -75404 -15624 55037 439592 864597 725846 538664 580022 566285 815726
15230 815726 1145031 1056836 984318 727348 -76472 -704178 -817957 -510049 -281919 -372020
15220 -372020 -317997 -396476 -470830 -475143 -334181 -32316 254191 30711 -41973 46010 -79412
15209 -79412 77667 102258 85422 -91961 -123407 -88386 -53874 -140297 -452408 -587444 -393930
15198 -393930 -279303 -265339 -283795 -361760 -234808 -290400 -422505 -384581 -545221 -649078
15188f49078J45394K45968K13387O2427j63445j12884K55071K95919J53125j26595
15178C19289m10622j37791K32823L42957K59262K7255q7293k09000o51353o2290
15168c76763M38244L22093J18819k40587n2318k8001j3081r4838j92368J5168
15158a03632K04424J2401K17990L66936n9796n30636n78435j51647K27807K01810
15148a92778K32844K41994P9121K6801k04679l84100k86703R4235J75736K06324
15138a1205K24028k86515L46924N86651p1792m26264j59517n4714J8649J49230
15128C15475J44256P4676k52059O436J51511Q8188K31703r434j25206k14665k83284
15117A27597m5440K21060K72140L25949P5391j51009l14537j95041l40000k48794
$$ plain form
15188 -649078 -503684 -257716 -44329 18098 -145347 -258231 -3160 292759 445884 319289
15178 319289 -91333 -229124 3699 346656 605918 633173 545880 336880 -314473 -376763
15168 -376763 61481 383574 502393 261806 209488 181487 168406 73568 -118800 -103632
15158 -103632 100792 113193 331183 698119 638323 107687 -470748 -622395 -394588 -192778
15148 -192778 40066 282060 361181 387982 183303 -200797 -487500 -393265 -217529 -11205
15138 -11205 212823 -73692 273232 859883 788091 361827 202310 147596 166245 315475
15128 315475 459731 534407 282348 288784 440295 528483 760186 750752 625546 410881 127597
15117 127597 82157 303217 575357 901306 976697 825688 511151 316110 -23890 -272684
15107b72684J01110J99402K65856J21218R4514Q1944m3781K33402q349m33246
15097C39386k02018J52967m2685j29104K75258N51590L83905M1898J51877j19857
15087A403217k69055k43092R3016j51243l15505l30582M3061M26754J08300k59881
15077E04990l24238k22522j0790J18443J42352L67349j00231p13628l07584J35476
15067d10383N6485j61057j30220L2781M9822K13414l7581l52071l09625j69974
15057a218409j5915L59075O46889M99802P4924j25839m4651J25490k11831m51828
15047c62293m4148K13093j00664l09128j48856K97570M14079L96702R9281l22293
15037A33343J41520J58216j56011k76947J16109K10319M3611p3536k26781l38038
$$ plain form
15107 -272684 -171574 27828 293684 414902 509416 591360 547579 780981 772632 339386
15097 339386 137368 290335 247650 118546 393804 945394 1329299 1371197 1523074 1403217
15087 1403217 1134162 891070 984086 832843 517338 186756 229817 656571 764871 504990
15077 504990 180752 -41770 -52560 65883 208235 575584 475353 -238275 -545859 -410383
15067 -410383 -353898 -514955 -645175 -612394 -562572 -349158 -386739 -738810 -1048435 -1218409
15057 -1218409 -1234324 -875249 -228360 271442 346366 220527 175876 301366 89535 -362293
15047 -362293 -406441 -193348 -294012 -603140 -751996 -454426 -40347 356355 455636 133343
15037 133343 274863 433079 277068 121 116230 326549 370160 296624 69843 -268195
15027b68195r5211O6535K49819j27858k42769J95429L6376o7805K36880R7296
15017H0497Q2753K20179K88980r6721l55555k53574J72142M08319m1137j93085
15007C12798J08294K6929l8854k0903l92118p0329L08045R6201m5344J31618K67885
14996F84222J01378k9200K80050K33m13806l97242o0705R9266J14566M7304K36212
14985F62278K45696K01027l43253n02589k57011j42442k62945J17652M7287j63046
14975c97346q347k02301J39014J95676j34948O2890m8985j46775K37771M7628
14965b55723j19068j36003j88781j49993J42037P40657N69260J74945O5320j02007
14955G40644l92131k78308J0798j13657j27577N0014J22659P7891L8345J91006
$$ plain form
15027 -268195 -363406 -296871 -47052 -174910 -417679 -222250 -185874 -253679 -16799 80497
15017 80497 163250 383429 672409 575688 220133 -33441 138701 547020 505883 312798
15007 312798 421092 448021 409167 388264 -3854 -74183 233862 330063 284719 416337 684222
14996 684222 785600 756400 1036450 1036683 622877 225635 164930 264196 378762 426066 662278
14985 662278 907974 1109001 765748 263159 6148 -136294 -399239 -281587 -234300 -397346
14975 -397346 -405693 -607994 -468980 -273304 -408252 -345362 -394347 -541122 -303351 -255723
14965 -255723 -374791 -510794 -699575 -849568 -707531 33126 602386 777331 842651 740644
14955 740644 348513 70205 81003 -32654 -160231 -110217 12442 90333 128678 319684
14945C19684J90223j87980n77163n76398r6158L88115Q4077j89138K92391K09303
14935a43044k2789m1715p7299K71213N29410k08037o18756j50216J45568J22987
14925a92678K26599J09721k63641j1374L20039N57172J30347o41821k64680l91123
14915d21439m90441J79592L55965J99906o3744n18090m12611J07640J86094P2268
14905h04860J36616r7040p8046K61939L40324J83453K6161J62318l7305j24278
14895c0718p7297k44974r1597L78455K2768k37476Q0803J83417J56166k75739
14885a36192j67120K53625J34001Q543p3281j46990j73115l47332k17357R1394
14875g73824J45968J45631Q8769K88712K73253o0708l00769k40574k34011k37595
$$ plain form
14945 319684 509907 321927 -255236 -831634 -927792 -539677 -455600 -644738 -352347 -143044
14935 -143044 -165833 -207548 -284847 -13634 515776 307739 -311017 -461233 -315665 -192678
14925 -192678 33921 143642 -119999 -131373 188666 745838 876185 234364 -30316 -421439
14915 -421439 -911880 -732288 -376323 -176417 -240161 -758251 -1170862 -1063222 -877128 -804860
14905 -804860 -668244 -765284 -843330 -581391 -241067 -57614 -31453 130865 93560 -30718
14895 -30718 -108015 -352989 -444586 -66131 -43363 -280839 -200036 -16619 139547 -136192
14885 -136192 -303312 -49687 84314 92857 19576 -127414 -300529 -647861 -865218 -773824
14875 -773824 -627856 -482225 -393456 -104744 168509 107801 -192968 -433542 -667553 -905148
14865i05148j39023q1519j76113j21803j62689J28365N91303M14128M16422J89233
14855A53156k86891o6496k9027n80846n17253l9459M75156M62302n8361m10513
14845h98232l26807o7500K13374M22503L61329K62574J67012k93812j43603K88417
14835a4745K46358J18860K32375J62408L5663j19833m25005k26376R5029k8358
14825G6376k17711k08711j90480p2687l7380r9795J02190J12011R1135K76293
14815a68759M67036J44946J49887p7672m10677j89954j88890j65594M2002j23033
14805e20708l57882j51348M3239k31139j63689L02271O66260N93148J35485l40966
14795b5329j65676j46403n77855n84675N9183M53147P36842O06127J19261R3366
$$ plain form
14865 -905148 -1044171 -1125690 -1301803 -1423606 -1586295 -1457930 -866627 -452499 -36077 153156
14855 153156 -133735 -200231 -229258 -810104 -1327357 -1366816 -891660 -429358 -487719 -898232
14845 -898232 -1225039 -1292539 -1079165 -656662 -295333 -32759 134253 -159559 -303162 -14745
14835 -14745 231613 350473 582848 745256 780919 661086 236081 9705 104734 76376
14825 76376 -141335 -350046 -540526 -613213 -650593 -750388 -648198 -536187 -445052 -168759
14815 -168759 298277 443223 593110 515438 104761 -85193 -274083 -439677 -397675 -520708
14805 -520708 -878590 -1029938 -986699 -1217838 -1381527 -1079256 -412996 180152 315637 -25329
14795 -25329 -191005 -337408 -915263 -1499938 -1440755 -987608 -250766 355361 474622 567988
14785E67988P2883J51544J98197m08847k47226o2322j6713j83259r39300o25065
14775a492120J91085M36793L98602J33668K28022P4763J9348m9072J41597N87030
14765F69716J13242k01181O1977j06098l26042k62349o5179J12332j90757k12662
14755d07001j98777j80881k35180j2159L70849Q8137J40487k6145k03265J99342
14745d64593N56988J73759k97398l31362k72638R1992K65240L32846K02032J54810
14735D11676k54512k66840n3564R5956M0058J09445J94854K0356k56179l65412
14725c24162j49855p7601J11872J23126o1763L75384L03093l02932k69562L0677
14715b41723J63535q0798P4086J7604p71K939R270J75168K35196q152n07696k86460
$$ plain form
14785 567988 640871 792415 990612 581765 334539 272217 255504 72245 -867055 -1492120
14775 -1492120 -1301035 -864242 -465640 -331972 -103950 -29187 -9839 -58911 82686 669716
14765 669716 782958 581777 643754 537656 211614 -50735 -115914 -3582 -194339 -407001
14755 -407001 -605778 -786659 -1021839 -1033998 -663149 -575012 -434525 -460670 -663935 -464593
14745 -464593 92395 266154 -31244 -362606 -635244 -543252 -278012 54834 256866 411676
14735 411676 157164 -109676 -163240 -67284 -27226 82219 277073 297429 41250 -324162
14725 -324162 -474017 -551618 -439746 -316620 -378383 -2999 300094 -2838 -272400 -241723
14715 -241723 -78188 -158986 -84900 -67296 -68067 -65128 -55858 119310 354506 346354 -161342 -447802
14703d47802r2961M9738R6313m4194k10554k69789K27274K15444J31389O01514
14693B56372N49386R9220k70971k35656k83316j22197L42409J67586o0357j35774
14683C06702k10317L9002J33254K29120j08296j57580n7239m7346N7021J96678
14673C80999n9203J80299O0356k52140k34449j05249l37285k77581O5314L8887
14663e40052l03156p6253l1190Q0816J28844J94083J94162K53943Q7698L0644
14653A9539J70680k06083k42504k64620r8388J23537L5285j98393j43821n2189
14643h56957O3750K974L3171K27136J91224Q607j5693N6753l84630j48178Q2755
14632g39088j65145K31967K14764j24m1615L6418K07414J68662O8737J62124K15746
$$ plain form
14703 -447802 -540763 -491025 -394712 -438906 -649460 -919249 -691975 -476531 -345142 256372
14693 256372 805758 904978 634007 398351 115035 -7162 335247 502833 442476 306702
14683 306702 96385 135387 268641 497761 389465 231885 174646 127300 184321 380999
14673 380999 321796 502095 562451 310311 75862 -29387 -366672 -644253 -578939 -540052
14663 -540052 -843208 -919461 -950651 -869835 -740991 -546908 -352746 -98803 -11105 19539
14653 19539 190219 -15864 -258368 -522988 -621376 -497839 -462554 -660947 -804768 -856957
14643 -856957 -793207 -790233 -757062 -529926 -338702 -330095 -345788 -289035 -673665 -821843 -739088
14632 -739088 -904233 -672266 -457502 -457626 -499241 -462823 -255409 -86747 -18010 144114 359860
14621C59860Q3114j94071k51724k8648L7636o2417k87184o0595K56842M98252
14611C51065L55698m9378j86402J47740M46873J34721l00975n58928m56827j71648
14601b88061l57404j69219P4167K51185L03170q6715k17777j08092l68010l15715
14591a282471J70885L53477J50222j06592L5849O2944j03777P7954J95759N54566
14581A08816K88788j64547o4812J95352L3418m65468l58061o1573J88694J96501
14571a02892Q3666J0269o8499k59350J08278q2316o2433P0289j5654J04714J46041
14560f7887l17630n20680j31222K88185K40468K90320j34177j54309K44866j01849
14550c63915k93489J00612K23903O8880J14811o5218j3233o0022j59072r6417
$$ plain form
14621 359860 442974 248903 -2821 -31469 6167 -56250 -343434 -404029 -147187 351065
14611 351065 706763 657385 470983 618723 1065596 1200317 899342 340414 -116413 -288061
14601 -288061 -645465 -814684 -740517 -489332 -186162 -272877 -490654 -598746 -966756 -1282471
14591 -1282471 -1111586 -758109 -607887 -714479 -678630 -615686 -719463 -641509 -445750 108816
14581 108816 397604 233057 168245 363597 397015 -68453 -426514 -488087 -299393 -102892
14571 -102892 -19226 -8957 -77456 -336806 -228528 -310844 -373277 -302988 -318642 -213928 -67887
14560 -67887 -385517 -906197 -1037419 -749234 -508766 -218446 -352623 -506932 -262066 -363915
14550 -363915 -657404 -556792 -332889 -264009 -149198 -214416 -227649 -287671 -446743 -543160
14540e43160R993k6876J18165L90880J27256j385j88318N319J68138K24650n053
14529B79609N372j78655p7525K40392K61235J598k61781k93651N3409K60753J09637
14518D00393j36342l90320l53272j96951k2922j36195k3497J46619M23408P0155
14508b18924k60218k44709k49849O7654K22492L6622O2835J00707j96316j08615
14498g88321k71657j24893K93601M81093K69878k99496l56974J22355j5751J63722
14488e26443J87394K3089J28611r3335l21838m34808j16089M24454M30010l44725
14478f43680k90270N5072J75378J64184J25919L65023J62555r7971m0838m4758
14468f9386O9986j8675J04376K45221N0642k98141M7450Q2266k58538j90520l50516
$$ plain form
14540 -543160 -533167 -560043 -441878 -50998 76258 74873 -113445 -108126 60012 284662 279609
14529 279609 284981 106326 28801 269193 530428 532026 270245 -23406 30003 290756 400393
14518 400393 264051 -126269 -479541 -676492 -699414 -835609 -859106 -712487 -289079 -218924
14508 -218924 -479142 -723851 -973700 -906046 -683554 -646932 -584097 -483390 -679706 -788321
14498 -788321 -1059978 -1184871 -891270 -410177 -140299 -439795 -796769 -674414 -690165 -526443
14488 -526443 -339049 -315960 -187349 -280684 -602522 -1037330 -1153419 -728965 -298955 -643680
14478 -643680 -933950 -878878 -703500 -539316 -413397 -48374 114181 16210 -24628 -69386
14468 -69386 600 -18075 86301 331522 382164 84023 131473 213739 -44799 -235319 -585835
14457e85835l06746l4970M01920R33145Q2235o15109o35420p4391O62873O13317
14447D41019J20554m9097L6610j87197k09996o8857P8782K21519K58956o1725
14437E80568J8995k59119l93347L29767Q13858n8639l71529j70238k70269l00118
14427h0071o9130j78676l54618n72752r8055J43100p8941l5965L3970J63882L23787
14416h03469L48699j23487k22467R5960M05722K30820J8990J54758M00187J24081
14406F29794j20096k70402j90124K51825M83665j49246n06799N191N52399P00651
14396A386858K02448m70204j62181o25446p26861k25323j48044Q7456K83438K1038
14386c76821j21892J6759k08889Q1401K38095J5699j72899J00953K28481R8272
$$ plain form
14457 -585835 -892581 -927551 -525631 407514 489749 -125360 -760780 -835171 -172298 441019
14447 441019 561573 512476 549086 361889 151893 83036 161818 383337 642293 580568
14437 580568 599563 340444 -52903 276864 1090722 1032083 660554 490316 220047 -80071
14427 -80071 -149201 -327877 -682495 -1255247 -1353302 -1210202 -1289143 -1325108 -1291138 -1127256 -803469
14416 -803469 -454770 -578257 -800724 -704764 -299042 -68222 -49232 105526 505713 629794
14406 629794 509698 239296 49172 300997 784662 635416 128617 133808 686207 1386858
14396 1386858 1589306 1119102 956921 331475 -395386 -620709 -768753 -681297 -397859 -376821
14386 -376821 -498713 -481954 -690843 -609442 -371347 -355648 -528547 -427594 -199113 -100841
14376a00841K21898l4330k69700k17467m80l1156J60947J81087k7458j54698J75729
14365i6469L25894L68352J83812L10112N2493m15974k11539M4815l07868l80373
14355a26745J49581K34928R3872K13657K74640J47152J39235m21328l86824m67402
14345a49234j56320m7647k16061J97931J65104O9286M4263j66869l57791l41778
14335i59116R7192J82771R9215k26157j21600L94868O39780L30112j66789k5515
14325B44761r394j95386j43748k15071J1949L07743M52658L88994J19782k81669
14315F80619k82980k15596m12133l87654j02280J22977K70199K33430L71417M83243
14305G61242k93673o62252k509J07274J08975L69630N31335K73482K4962k52637
$$ plain form
14376 -100841 121057 86727 -182973 -400440 -400920 -432076 -271129 -90042 -117500 -272198 -96469
14365 -96469 229425 597777 781589 1091701 1144194 728220 516681 561496 253628 -126745
14355 -126745 22836 257764 351636 565293 839933 987085 1126320 704992 318168 -149234
14345 -149234 -305554 -353201 -569262 -371331 -206227 -136941 -92678 -259547 -617338 -959116
14335 -959116 -861924 -679153 -579938 -806095 -927695 -532827 106953 437065 270276 244761
14325 244761 235367 39981 -103767 -318838 -306889 854 453512 842506 962288 680619
14315 680619 397639 182043 -230090 -617744 -720024 -597047 -326848 -93418 277999 761242
14305 761242 467569 -194683 -197192 -89918 19057 388687 920022 1193504 1218466 965829
14295I65829m16848k84718j96990l2219o6425j25963j93145k14797k04592K2808
14285g47060J74549N64669N01492k07823k19778J07948l55156j59721K00468k7009
14275a67421k02556k42428J69456K06288L5742l88876k20018L37157J23940n59138
14265i07854q19664k15216O58340L90940J63541n1332k1012j85340j66966j87831
14255a342394J20417K65061R3558q1123n3817J2362J61550L82382J21437K04290
14245a16277J2996l49444l02862R6534J50613J0461k76369k89916m42565K55924
14235a250905O72398P11401K10578j68686J405k10051j92757q2076K33942k1467
14225i6218k5490M5211m30353k64275J30522N4911j90789J09395L33987K12750
$$ plain form
14295 965829 548981 264263 67273 35054 -31371 -157334 -350479 -565276 -769868 -747060
14285 -747060 -572511 -7842 493650 285827 66049 173997 -181159 -340880 -140412 -167421
14275 -167421 -369977 -612405 -442949 -236661 -200919 -589795 -809813 -472656 -348716 -907854
14265 -907854 -1727518 -1942734 -1284394 -893454 -729913 -781245 -802257 -987597 -1154563 -1342394
14255 -1342394 -1221977 -956916 -863358 -944481 -998298 -985936 -824386 -442004 -320567 -116277
14245 -116277 -103281 -452725 -755587 -659053 -508440 -497979 -774348 -1064264 -1506829 -1250905
14235 -1250905 -578507 132894 343472 174786 176191 -33860 -226617 -308693 -74751 -96218
14225 -96218 -121708 -76497 -506850 -771125 -640603 -585692 -776481 -667086 -333099 -120349
14215a20349j03631l94401k26406J04859L47562N33930L39261N165j63690o0997
14205B61303R4616J11347j68892m22921l16219m53000n21612l40387r6054M16458
14195a435361M92381L69987P3177j43136l73808k59793q8723M1125L82758K23899
14185g17494j75095l0950K33185O27735M55112k22494l71485J78723K50927j7896
14175B10268n07055k01319J71221q6488q5486j00269q0021J51800M61882J49998
14165H4531l26194k73728l5873O25408L62715k89867m53530j30771J43136l151
14155b97324P9062K21359p6952n3492r889J6343K48728J21288j38526n0948k75662
14144b16013k43316M6700K4957j85451j80702J37318J22601k56590j25494K56699
$$ plain form
14215 -120349 -223980 -618381 -844787 -739928 -392366 141564 480825 485990 322300 261303
14205 261303 355919 467266 298374 -124547 -440766 -893766 -1415378 -1755765 -1851819 -1435361
14195 -1435361 -942980 -572993 -499816 -642952 -1016760 -1276553 -1365276 -1324151 -941393 -717494
14185 -717494 -892589 -923539 -690354 -62619 392493 169999 -201486 -22763 228164 210268
14175 210268 -296787 -498106 -326885 -413373 -498859 -599128 -679149 -527349 -65467 84531
14165 84531 -241663 -515391 -551264 74144 436859 146992 -306538 -437309 -294173 -297324
14155 -297324 -218262 3097 -73855 -127347 -137236 -120893 127835 249123 110597 59649 -216013
14144 -216013 -459329 -412629 -387672 -573123 -753825 -616507 -493906 -750496 -875990 -619291
14134f19291L71952o8024l59193M0202K1331j97822j31072J74045r620M4644K42529
14123d90319M30353N04483j82641p22393k79365J78451J0403q4137J7044K55004
14113c63117K87493j24569j10959k9545r4666m0920m6549k9105j0037j71977k3554
14102g57505J17815k5725o4148K17847J04120J93176p3593m71964l27581k06903
14092a294461L08839N52755M05782N9384J49956R2823j64310l26874j84058j16698
14082e16862k9778K23690L40359K91580j08402j30839j31509k18091k40299P2722
14072d47429J56571L64862N1184O8147K83504j70073o4921K59837J01492j57431
14062D45743l37642l04801j72475j55850P4528J47648J85867J0672K34559P6168
$$ plain form
14134 -619291 -247339 -315363 -674556 -634354 -613023 -810845 -941917 -767872 -777492 -732848 -490319
14123 -490319 -59966 444517 261876 -460517 -739882 -561431 -551028 -635165 -618121 -363117
14113 -363117 -75624 -200193 -311152 -340697 -435363 -476283 -522832 -551937 -561974 -733951 -757505
14102 -757505 -639690 -665415 -729563 -511716 -407596 -214420 -288013 -759977 -1087558 -1294461
14092 -1294461 -985622 -432867 -27085 32299 182255 275078 110768 -216106 -400164 -516862
14082 -516862 -546640 -322950 17409 308989 200587 69748 -61761 -279852 -520151 -447429
14072 -447429 -290858 74004 125188 193335 476839 306766 241845 501682 603174 445743
14062 445743 108101 -196700 -369175 -525025 -450497 -302849 -116982 -106310 128249 204417
14052B04417k43563K37544J91151k08851l58771O8731L84293J62246j55760j69814
14042A11623q3718j32204R0409j2969j4263m2121k15277n0671j0275j1519k7828
14031c98813j54365n71236m76999K72483N82218J97543K13079K75548J12750K11456
14021B63664l6999j91313m50661j32833O44221J23117j66064m50602n04516j20363
14011a022349q6355j43345J15000J65832J32708J62392K31914J98589J6953K26972
14001a689J50999k09299j69308l13635o63547o69814K9740K81121L33715O02797
13991f28920O06158N56380J6895j73666j39168k88777j92199L8459K34356N040
13981C4558k15263j59029l3191j75082J19606K81407M20577P6668K8138o2240
$$ plain form
14052 204417 -39146 198398 389549 180698 -178073 -109342 274951 437197 281437 111623
14042 111623 27905 -104299 -13890 -26859 -41122 -83243 -298520 -349191 -359466 -370985 -398813
14031 -398813 -553178 -1124414 -1601413 -1328930 -746712 -549169 -336090 -60542 52208 263664
14021 263664 226665 35352 -415309 -548142 96079 219196 53132 -397470 -901986 -1022349
14011 -1022349 -1108704 -1252049 -1137049 -971217 -838509 -676117 -444203 -245614 -228661 -1689
14001 -1689 149310 -59989 -229297 -542932 -1206479 -1876293 -1846553 -1565432 -1231717 -628920
13991 -628920 -22762 533618 550513 376847 237679 -51098 -243297 -204838 29518 34558
13981 34558 -180705 -339734 -372925 -548007 -428401 -146994 273583 350251 378389 316149
13971C16149j34024l26405l92302L7720K44579j43399K7704M78558J06664j34583
13961H0661R554Q6369m19819m08613K59157N60109R3096M0611n2623J32909j6947
13950C64464M671K20947J50100J29983j97552l82365Q3346L50065k7998P4997
13940G70658J79438k27858n78348m23954l54538P9153J97448J10219O9121J61920
13930a6741l3378J67589J97441j91047k34589M31405O80985K89381m2698o73504
13920E74844l10033N6015J4893L0184J41431j40890m27944m03122R1768K01735
13910a71119L40344K25507J18675J43535J01289k64380l01797q626J37278K53074
13900E73780J64903J86505o534k91357P9497L19491J33199K76746O885j46121
$$ plain form
13971 316149 182125 -144280 -536582 -498862 -254283 -397682 -369978 108580 215244 80661
13961 80661 90215 176584 -243235 -651848 -392691 167418 260514 301125 248502 381411 364464
13950 364464 369135 590082 740182 870165 672613 290248 373594 723659 695661 770658
13940 770658 950096 722238 143890 -280064 -634602 -555449 -358001 -247782 -178661 -16741
13930 -16741 -50119 117470 314911 123864 -110725 320680 1001665 1291046 1248348 574844
13920 574844 264811 320826 335719 365903 507334 366444 -61500 -464622 -372854 -171119
13910 -171119 169225 394732 513407 656942 758231 493851 192054 183428 320706 573780
13900 573780 738683 925188 918654 627297 706794 1026285 1159484 1436230 1443115 1296994
13890A296994J02179K38293J72897J37766N7780L857K76208L14392l720k05399
13880B391247J26808K44557J09815J27326J64157k0990q4310k57358k39094l3191
13870B528967k47073o3616K9712l01514o01536m88642J19331N13305L52746J78981
13860B020661K53857M75973J66549K2473M77098M55183j12882n04436o34436l91305
13850B228735j19406J65434L5150k01151j49231k08882l81809Q7730O38089M45518
13840B540177P8519L37239L31777l8964k06493j05757k99589k38961L83953N23231
13830C305132L38865J06362j68491n37324j63628O7194o3673Q0056N2860l68612
13820B648741m52845j55013K06777K48079L88776J81136L9480J09280l53969n99106
$$ plain form
13890 1296994 1399173 1637466 1810363 1948129 2005909 2009766 2285974 2600366 2596646 2391247
13880 2391247 2518055 2762612 2872427 2999753 3163910 3142920 3058610 2801252 2562158 2528967
13870 2528967 2281894 2218278 2247990 1946476 1344940 856298 975629 1488934 1841680 2020661
13860 2020661 2274518 2750491 2917040 2939513 3416611 3871794 3758912 3254476 2620040 2228735
13850 2228735 2109329 2274763 2309913 2108762 1959531 1750649 1368840 1456570 2094659 2540177
13840 2540177 2618696 2955935 3287712 3248748 3042255 2936498 2636909 2397948 2781901 3305132
13830 3305132 3643997 3750359 3581868 3044544 2880916 2948110 2884437 2964493 3017353 2648741
13820 2648741 2195896 2040883 2247660 2495739 2884515 3065651 3105131 3214411 2860442 2261336
13810B261336k94144j65940l13591N7578J81467k1765M5498L02148K53656J72449
13800B478692R4095n39678m16157k15043p63K61642Q0265k94956k41956o1741
13790A144400q3149J60532K54328J38218K4806n9209n1514k54022J01393k18592
13780A157191l62252m1525K35326J18519j09772k34054j3648J90823M9730j47846
13770H42492k14674P4233K74506l4996o34444k43626M77996L34080j77848p52974
13760e5255l14446M0612k16061j64477k87256J6337N86880N10520r7032o562O5592
13749G8852k3388l1683J34582J31653j48197l52795j81395K31507K65603Q2679
13739A87418p2764l60486l70197o43642j35047L22019R1410q2851k36498J07507
$$ plain form
13810 2261336 1967192 1801252 1487661 1545239 1726706 1704941 1750439 2052587 2306243 2478692
13800 2478692 2572787 2033109 1616952 1401909 1401146 1662788 1743053 1448097 1206141 1144400
13790 1144400 1061251 1221783 1476111 1614329 1639135 1579926 1528412 1274390 1375783 1157191
13780 1157191 794939 753414 988740 1107259 997487 763433 749785 940608 990338 842492
13770 842492 627818 702051 976557 941561 307117 63491 541487 875567 697719 -55255
13760 -55255 -369701 -329089 -545150 -709627 -996883 -980546 -393666 116854 19822 13260 78852
13749 78852 55464 23781 158363 290016 141819 -210976 -392371 -160864 104739 187418
13739 187418 114654 -245832 -616029 -1259671 -1394718 -1072699 -981289 -1064140 -1300638 -1193131
13729a193131J85303K89596J71001j1118l2897k92535l54007K09887M66530q4732
13719f46103j79665q9738j00807M65679M20719L6131j44123k60030K1460K55506
13709b20971J14013N3188L0322l0017j20058q6101j12320k20547J82515J63634
13699b46342R7067J65713O6981k00898l1739J77924J56451L1054k90912r7946
13689a72647Q9951L17646j35690n82644j45665K04912J50741k36446j33043N3904
13679e88981J34683M07066M97846L42927m5440O3823j33755j31629j94822r8967
13669B52751J93885l64851l64053Q3685K48984J11845J28519j19318J61866j76993
13659A56320l24778J84712J72940K42824L72729J47389m14794l65958M782r4321
$$ plain form
13729 -1193131 -1007828 -718232 -547231 -558349 -591246 -883781 -1237788 -1027901 -561371 -646103
13719 -646103 -825768 -915506 -1016313 -550634 -129915 -93784 -237907 -497937 -476477 -220971
13709 -220971 -106958 -53770 -23448 -53465 -173523 -259624 -371944 -592491 -409976 -246342
13699 -246342 -149275 16438 83419 -117479 -149218 28706 185157 216211 -74701 -172647
13689 -172647 -82696 234950 99260 -483384 -629049 -424137 -273396 -509842 -642885 -588981
13679 -588981 -454298 -47232 450614 793541 748101 811924 678169 546540 351718 252751
13669 252751 446636 81785 -282268 -198583 50401 162246 290765 171447 333313 156320
13659 156320 -168458 16254 189194 432018 804747 952136 537342 171384 176166 81845
13649H1845k89896l78818j7358K16474K77803K54998J28240o566j88204J13912
13639A92430J18252K76441K70926m78967l21991Q0541K82840K81820K82836J99672
13629A184800n5836n19610o91871k45945L19337L54645k46152j05507L94486M63350
13619H51697M7885j24499m56652l25705j00659j54963m37308p03251j63803L96946
13609a170312N68558M20705K04771R7076M5630p1599l56466j54316O9696k14609
13599e60866m162N95796J25336k10754k70392l58658l39651j93599L4413K03009
13589i79528K66131J86868J13047l5805K55559K52706J5124J84678J64595l13643
13579A09732l23841k49966k23045j01728J05072L269j9354J55920M11737J17442
$$ plain form
13649 81845 -208051 -586869 -604227 -387753 -109950 145048 273288 266722 78518 192430
13639 192430 310682 587123 858049 379082 57091 137632 420472 702292 985128 1184800
13629 1184800 1128964 609354 -82517 -328462 -9125 345520 99368 -6139 388347 851697
13619 851697 899582 775083 318431 -7274 -107933 -262896 -700204 -1403455 -1567258 -1170312
13609 -1170312 -601754 -181049 23722 120798 166428 94829 -261637 -415953 -346257 -560866
13599 -560866 -565028 30768 156104 -54650 -325042 -683700 -1023351 -1216950 -1182537 -979528
13589 -979528 -713397 -526529 -413482 -449287 -193728 58978 74102 258780 423375 109732
13579 109732 -214109 -464075 -687120 -788848 -683776 -680507 -699861 -543941 -132204 -14762
13569a4762j96327K4853M24711K65732k01938m69152k9261J57119K34772k03699
13559g952l60889m18795L2338K40448q3632o5060K26313J46336j19906J63812
13549b46987M41746j4447l82143p09140k18411K98536K64974P7022k09552K71485
13539d26917K15814j64019l17965Q2444J65427J8616Q4141K18240K5001l2061
13529a31279j37560l76732K37765N61335j49257l24820m23580j33744j88272N0883
13519a015261K07494M9158k50451l28252J17117K60791j8284j49435O7941O09848
13509d49334L38004K06659K61498Q8809j46775k34198j72941J74184M98401K61040
13499H25347k62180p1295m7664o3060Q7484k7805k9884l65750n03361P0797P7049
$$ plain form
13569 -14762 -211089 -186236 238475 504207 302269 -166883 -196144 -39025 195747 -7952
13559 -7952 -368841 -787636 -755298 -514850 -598482 -663542 -437229 -290893 -410799 -246987
13549 -246987 194759 180312 -201831 -910971 -1129382 -830846 -565872 -488850 -698402 -426917
13539 -426917 -211103 -375122 -693087 -610643 -445216 -426600 -342459 -124219 -99218 -131279
13529 -131279 -268839 -645571 -407806 153529 4272 -320548 -744128 -877872 -1066144 -1015261
13519 -1015261 -807767 -758609 -1009060 -1337312 -1220195 -959404 -977688 -1127123 -1059182 -449334
13509 -449334 -111330 95329 356827 445636 298861 64663 -108278 65906 564307 825347
13499 825347 563167 491872 444208 381148 468632 440827 410943 45193 -458168 -387371 -310322
13488c10322k47549J47628K36671l1051O8092R6633K2174k47162k73852J68383
13478c70355L16667R199J04227L88851q7649n32017k92379Q4654R6166J62862
13468a19774N9962m85260m10394m10293m47705J1848J29623m7750j10195J13503
13458a716435L82861M55391k2126k00736K55833K4169l24412j05165J98847P1592
13448i80181L88018P8287n2974M7225l45779m24751O4167M12161L70845K22763
13438b20219l9826J18984M5698l30983k61611J756L78045L57009j54999j29780
13428b35926j63509j96660n9152K09429L66091J75152J36745K13034R9508N54
13418E45266o6807j08404l26566k58537j30402o3080L5519L11003L98524L67105
$$ plain form
13488 -310322 -557871 -410243 -173572 -204623 -136531 -39898 -17724 -264886 -538738 -370355
13478 -370355 -53688 -44489 59738 448589 360940 -171077 -463456 -378802 -282636 -119774
13468 -119774 -59812 -545072 -955466 -1365759 -1813464 -1801616 -1671993 -1719743 -1829938 -1716435
13458 -1716435 -1333574 -878183 -900309 -1101045 -845212 -821043 -1145455 -1250620 -1051773 -980181
13448 -980181 -592163 -513876 -566850 -519625 -865404 -1290155 -1225988 -813827 -442982 -220219
13438 -220219 -260045 -141061 -95363 -426346 -687957 -686201 -308156 48853 -106146 -235926
13428 -235926 -399435 -596095 -655247 -445818 -79727 95425 232170 445204 544712 545266
13418 545266 478459 370055 43489 -215048 -345450 -408530 -373011 -62008 336516 703621
13408G03621N2276j59783l46940l81770k44030l6936K33324K16287P0785J83388
13398B90222L09731R7473k43437l25049n53984n71691n9801N75923L04836l69876
13388e45653o0291J21331K10912j46623l23782q2874Q289m7855k76900j27370
13378a270816P2285R11584J126371O14149k27192p38765m29124j32653N3087J58133
13368A37059N2305J29368J07936j79304l3820Q7221k19078M8652K05307L04941
13358F40587J08301l64405l05887J32183k73398l54318j35196r3149K25891K20792
13348a98599j92021Q8839K23881K64510l98695m70473M55201L64762k24582p9222
13338a66399j15837l99247l4853K7176K07236P76611N84343j23623k38408l78078
$$ plain form
13408 703621 755897 596114 249174 -132596 -376626 -413562 -180238 36049 106834 290222
13398 290222 599953 697426 453989 128940 -425044 -996735 -1056536 -480613 -175777 -545653
13388 -545653 -605944 -484613 -273701 -420324 -744106 -826980 -818691 -866546 -1143446 -1270816
13378 -1270816 -1198531 -286947 839424 1453573 1226381 487616 58492 -74161 -21074 137059
13368 137059 189364 318732 426668 247364 213544 300765 81687 130339 335646 640587
13358 640587 748888 384483 78596 210779 -62619 -416937 -552133 -645282 -419391 -198599
13348 -198599 -390620 -301781 -77900 186610 -212085 -682558 -227357 137405 -87177 -166399
13338 -166399 -282236 -681483 -716336 -689160 -481924 294687 879030 755407 516999 138921
13328A38921l14278j35669L24431L73770l33843l87632J37611L20524j38927k97831
13318c12923j11589j09936j48426m1511j09104P9770J09610K04230Q9813n3480
13308d03546k40077k20340J19349L01741L16433J96517Q6848m8001k7649J13409
13298A94684K93437R6187N1712r7348j91458J86879K13204O1355k8149k95526
13288D84977k20090n6111l26211K36116O94968M11487j47998n57914n65069k5485
13278g1330M30032M97220O4744k70450r5759Q5341K43287j14911k63661j55005
13268C49508M1135J72602N41497L31657l38002m44217m12852j71875O9572j38132
13258H93j17925p8787j86992l17905P1964N30050N42135O8207l27687q6593J62395
$$ plain form
13328 138921 -175357 -311026 13405 387175 53332 -334300 -196689 123835 -15092 -312923
13318 -312923 -424512 -534448 -682874 -724385 -833489 -753719 -644109 -439879 -350066 -403546
13308 -403546 -643623 -863963 -744614 -442873 -126440 70077 156925 108924 81275 194684
13298 194684 488121 584308 636020 538672 347214 534093 747297 808652 780503 484977
13288 484977 264887 208776 -117435 118681 813649 1225136 1077138 519224 -45845 -71330
13278 -71330 358702 855922 920666 650216 554457 639798 883085 768174 504513 349508
13268 349508 390643 563245 1104742 1436399 1098397 654180 241328 69453 139025 893
13258 893 -117032 -195819 -382811 -700716 -628752 -98702 443433 511640 183953 97360 259755
13247B59755K903J7011J0082j28120j33443N69533N24034M30097k89252p81108
13237D81492n4087r2946n35451l11585k76887k25276l5568J76845K88307N95988
13227A0832N24161L27457J03875l60590l55327N8143K48326l8292m26392m595
13217H7598M69568N06627k523l53214k15626j62283l78674k22803J24019J69136
13207B1825R8498j62540K20392L22668j17807k41367j59901k15937k1526J3662
13197b42033K663j32364j84470K53874J94875k91757l02987L18288R01448L13678
13187H31215l38005l53789l4439L1721K91223K91447k8271l31138m43050q9793
13177a72879J60331K89507j28772O5360N66534M16350k19098n05758k36689K40167
$$ plain form
13247 259755 262658 279669 289751 161631 28188 597721 1121755 1551852 1262600 481492
13237 481492 427405 334459 -200992 -512577 -789464 -1014740 -1050308 -873463 -585156 10832
13227 10832 534993 862450 966325 605735 250408 308551 556877 518585 92193 87598
13217 87598 557166 1063793 1061270 708056 492430 330147 -48527 -271330 -147311 21825
13207 21825 120323 -42217 178175 500843 383036 141669 -18232 -234169 -255695 -242033
13197 -242033 -239370 -371734 -556204 -302330 -107455 -399212 -702199 -383911 517537 831215
13187 831215 493210 139421 104982 136703 427926 719373 691102 359964 -83086 -172879
13177 -172879 -12548 276959 148187 213547 780081 1196431 977333 471575 234886 475053
13167D75053K3401J08689L30105j62668k82141l66152o8736N87274M97774M9268
13157A191867j04987K30480L07399j20566n86894l15363L37189L42586M02297
13148A684008K97523j12663j35021J678l93768k10610M08807j68881m28908k16691
13138G25474k3301p4518j40539p8595q6077K83524M63572L69868j55253j84820
13128A099335J94313J52513N2405q6190k72829O7265M41774M35235K63288m95626
13118A851483o59571k77516K07315K42590l57656o96861j93777J28451K46410
13109D90868J03531Q7901K39528M95947K20736m36386m00659j07038K17702K49674
13099A161804P5163k82738l28269P4193K98744N4347j72191J53169K30031R070
$$ plain form
13167 475053 498454 607143 937248 774580 492439 126287 57551 644825 1142599 1191867
13157 1191867 1086880 1317360 1624759 1504193 917299 601936 939125 1281711 1684008
13148 1684008 1981531 1868868 1733847 1735525 1341757 1131147 1539954 1371073 942165 725474
13138 725474 702173 627655 487116 408521 322444 605968 1069540 1439408 1284155 1099335
13128 1099335 1293648 1446161 1498566 1412376 1139547 1206812 1648586 2083821 2347109 1851483
13118 1851483 1191912 914396 1121711 1364301 1006645 309784 116007 244458 490868
13109 490868 594399 682300 921828 1417775 1638511 1202125 801466 694428 912130 1161804
13099 1161804 1236967 954229 625960 700153 998897 1053244 881053 1034222 1264253 1273323
13089A273323p3749k30321r5573K84698M19200k382k61199k56080L0797j19164
13079I69550l96791r8481K83476M28518J8879r5693M9508J41409K36083r8320
13069A438138j10824J55959q5961j39332J780o5368k15075o9672N55644P20499
13059B185788M48971r0507k23059P2297J63196K17462n6723k84796J30774L92489
13049B955892j3231k46235j78755M202n7730K54344M94580k9235j26537p2895
13039B984400p5414l09981k63988K77715K59613L69907O35488N14175J23021p585
13029D507351j24522q0676k76285n90363j70066J99565N42994L97029J2153j3768
13019D403412M43487L79847K76669O18708N36581N70072K91931p1894J81126J88514
$$ plain form
13089 1273323 1199574 969253 873680 1158378 1577578 1575196 1313997 1057917 1088714 969550
13079 969550 572759 474278 757754 1186272 1205151 1109458 1158966 1300375 1536458 1438138
13069 1438138 1327314 1483273 1397312 1257980 1259760 1194392 979317 909645 1465289 2185788
13059 2185788 2634759 2544252 2321193 2393490 2556686 2774148 2717425 2432629 2563403 2955892
13049 2955892 2942661 2696426 2517671 2521873 2464143 2718487 3213067 3183832 3057295 2984400
13039 2984400 2908986 2599005 2335017 2612732 2872345 3242252 3877740 4391915 4514936 4507351
13029 4507351 4382829 4302153 4025868 3435505 3265439 3465004 4007998 4405027 4417180 4403412
13019 4403412 4846899 5226746 5503415 6122123 6658704 7228776 7520707 7448813 7629939 7818453
13009G818453J22800K18271L04412N71236N13838O12622Q76008Q71200J217895
13000A3126735J391880J010385R57719J593997K044155K069811K480203K816944
12992B7491829K927609L610911M327751N355312O821081P889754R275960J1169738
12984G8869945J3355249J6533292K0311751K4954601L0434288L7500770M5044531
12977B67004427M9902501M3414081J5255825k4975544n1696025n6401012m8396554
12970A94107699l7795577k9157680k2095132j7062186j3397058j0536037q094995
12963E5969034o190181n301691m958757m180379l277027k748110k599649k392632
12955B4320608j451388j475052j837331j491774j159253j163831r58473m30015
$$ plain form
13009 7818453 7941253 8159524 8463936 9035172 9549010 10161632 11037640 11908840 13126735
13000 13126735 14518615 15529000 16486719 18080716 20124871 22194682 24674885 27491829
12992 27491829 30419438 34030349 38358100 43713412 50534493 58424247 67700207 78869945
12984 78869945 92225194 108758486 129070237 154024838 184459126 221959896 267004427
12977 267004427 316906928 360321009 375576834 350601290 298905265 242504253 194107699
12970 194107699 156312122 127154442 105059310 87997124 74600066 64064029 55969034
12963 55969034 49778853 44477162 39518405 35338026 32060999 29312889 26713240 24320608
12955 24320608 22869220 21394168 19556837 18065063 16905810 15741979 14783506 14353491
12947A4353491l65727r87619r50129k16550P826J56005r1430k14780K7817k07131
12937A1511773m64324l80843m25783l58451K09286j6069J5128L34552L68865K64103
12927A1058237N916K08206L77874L72623L94217Q45730J605835J579776J099347
12918A7547761J129489J080151J061085Q84442j82012j080711l62286J025644
12910B1103563J846490K028385K022474K068991K062294K754322L863696M579842
12902D2330057N286397O726750Q306173R965950J1794850J4061606J7122070K1085867
12894A36679720K5926785L2433699M0010951M7757031N2021730M1329378O148145
12887C82307439l6342615n8440278n7326761m6767570l6050756k7506866k0826123
$$ plain form
12947 14353491 13987764 13000145 12050016 11833466 11841292 11997297 11905867 11691087 11718904 11511773
12937 11511773 11047449 10666606 10240823 9882372 10091658 10075589 10090717 10425269 10794134 11058237
12927 11058237 11064153 11272359 11650233 12022856 12417073 13262803 14868638 16448414 17547761
12918 17547761 18677250 19757401 20818486 21702928 21520916 20440205 20077919 21103563
12910 21103563 22950053 24978438 27000912 29069903 31132197 33886519 37750215 42330057
12902 42330057 47616454 54343204 62649377 72615327 84410177 98471783 115593853 136679720
12894 136679720 162606505 195040204 235051155 282808186 334829916 376159294 382307439
12887 382307439 345964824 287524546 230197785 183430215 147379459 119872593 99046470
12880I9046470j5862791j2528864r644958p639412o406470n120457m031947l375424
12872C4436147l212639k830484k344005j923328j838732j828690j511132j010032
12864A7937105j011411j297490j053640k90350k20417l82917m21280j000722j203140
12855A1055738n80603N861Q2712N2602j09691j45161k69768k31889r4777J78571
12845I943595L99305M6207N3752l16899p36347m66299L9554J62331O93730Q12591
12835A0631520M22118L28199P51222R06161N36240N11532N16142L06900J025437
12826A5935471J227291J375676J616852J526185J629812J575067K335323L046261
12818C0267938L796432M694200N056910N915607P546426Q289867R664343J2174964
$$ plain form
12880 99046470 83183679 70654815 61009857 53370445 46963975 41843518 37811571 34436147
12872 34436147 31223508 28393024 26049019 24125691 22286959 20458269 18947137 17937105
12864 17937105 16925694 15628204 14574564 14284214 14063797 13680880 13259600 12258878 11055738
12855 11055738 10475135 10480996 10563708 10616310 10506619 10361458 10091690 9859801 9765024 9943595
12845 9943595 10342900 10389107 10442859 10125960 9389613 8923314 8962868 9125199 9818929 10631520
12835 10631520 11053638 11381837 12133059 13039220 13575460 14086992 14603134 14910034 15935471
12826 15935471 17162762 18538438 20155290 21681475 23311287 24886354 27221677 30267938
12818 30267938 34064370 38758570 43815480 49731087 57277513 65567380 75231723 87406687
12810H7406687J5111038J8294378K2326523K7532174L3329915M0377377M7888079
12803B92266171M8858954L2417779n072736m2171848n7158977n3369995m3012367
12796A72756981l2959917k5275852j9722343j5104615j1920353r640320p759072
12789E0374509o490826n302240m044922l220232k891723k714940k518557k288110
12781B0902959k091957j834833j195434j052702j045706j031716q26951l49288
12773A1474372o69528r61045p27931m98333l54872m17034m31162l21635l69361
12764F723471o8735k42808o09642o17169j19751J34489J76615J93040J1466P5290
12754E656266J30605n07482p45137k49598J51746O4237l08861n56178m44188j07594
$$ plain form
12810 87406687 102517725 120812103 143138626 170670800 204000715 244378092 292266171
12803 292266171 341125125 373542904 368470168 326298320 269139343 215769348 172756981
12796 172756981 139797064 114521212 94798869 79694254 67773901 58133581 50374509
12789 50374509 43883683 38581443 34536521 31316289 28424566 25709626 23191069 20902959
12781 20902959 18811002 16976169 15780735 14728033 13682327 12650611 11823660 11474372
12773 11474372 10804844 9843799 9115868 8617535 8262663 7845629 7414467 7092832 6723471
12764 6723471 6654736 6411928 5802286 5185117 5065366 5199855 5376470 5569510 5580976 5656266
12754 5656266 5786871 5279389 4534252 4284654 4436400 4500637 4191776 3635598 3191410 3083816
12744C083816K60200j6701k46927J8354j01095k18716J50627J48485K86796L26479
12734C691318K85447j71377j33377k2319k91845o1959j07568k999j7749Q5882
12724C253454P3241m24819p73337m37854M14501M83836o2475m09866k29285q0262
12714A807134J01444l9802j37163k1174J09086J05418j82758m69550m633L82201
12704A650203K10429j71468m26100m8873J75937O2596L37061M7798k39874k86932
12694A310777j82709j62226l47779k49048J28330k24639j9172O8152Q7703J46527
12684E55916j17392k61391Q3254M81780P4414K5153J64649q7459J51504k19533
12674H50895j70334L25060J54423k76370l8948L59102P4640k43613l97036l32335
$$ plain form
12744 3083816 3344016 3327315 3080388 3098742 2997647 2778931 2929558 3078043 3364839 3691318
12734 3691318 3976765 3805388 3672011 3649692 3357847 3295888 3188320 3185321 3167572 3253454
12724 3253454 3326695 2901876 2128539 1690685 2105186 2589022 2526547 2116681 1887396 1807134
12714 1807134 1908578 1868776 1731613 1710439 1819525 1924943 1742185 1272635 1268002 1650203
12704 1650203 1860632 1689164 1263064 1214191 1390128 1452724 1789785 1837583 1597709 1310777
12694 1310777 1128068 965842 618063 369015 497345 272706 253534 321686 409389 555916
12684 555916 438524 177133 260387 742167 816581 841734 1006383 918924 1070428 850895
12674 850895 680561 1005621 1160044 883674 844726 1203828 1278468 1034855 637819 305484
12664C05484k56006Q8540p9858j38155J90717K66609N81823J48809n26416m06251
12654A75296J52364L18291q4613j79969r3553J06078L2108K0211o2764j71790
12644B11659O4278L44590J12376P1087J11284K7607j86326r8203L62184L13389
12634A333925m2290R348K79876J03416Q183J8482l62788p01465j72936K34566
12624G08317j18414N6488o3472q5255k36732j15945k11689J70181P29401K22244
12614A055124K21752L16897j04069j93234j55480k60325m0740q0997j84393l8631
12604E35904k82191m70888L3356O52247M71930q4695k08759L23592M31720J59907
12594A562123P0291l81841p49466j66735j4182l8787N5209K74106L62607L26736
$$ plain form
12664 305484 49478 138018 58160 -79995 110722 377331 959154 1107963 581547 175296
12654 175296 327660 645951 561338 381369 287816 393894 426002 446213 383449 211659
12644 211659 275937 620527 732903 803990 915274 942881 756555 658352 1020536 1333925
12634 1333925 1291635 1300983 1580859 1684275 1692458 1710940 1348152 646687 473751 708317
12624 708317 589903 646391 582919 497664 260932 144987 -66702 103479 832880 1055124
12614 1055124 1276876 1593773 1489704 1296470 1140990 880665 839925 758928 574535 535904
12604 535904 253713 -217175 -183819 468428 940358 855663 646904 970496 1402216 1562123
12594 1562123 1632414 1250573 501107 334372 320190 281403 336612 610718 973325 1300061
12584A300061L83108N4808L5566k58168o26861n59581j46432j68693j58025n2167
12574a96384Q1875K73663m4424l42386j09640J05710j6267r788J84152N6718k55854
12563b72625j06179K65875O80230J33195k68884r1409l1078j86726j79077K4448
12553c2230k29075l55162j50505m938J19907K86839N74593J79084o8857J27851
12543D47507K00665j25446r7146L34432K55946l72239j27413J4671k75298m05597
12533a49918Q8356M28818L33933L57048J83179k17563j50582k48033m91007m95727
12523c61496j22587O57531P44559P98261M00854n94988q14787k44389n7018k52607
12513A53333K07651M4986m03646m28023j2874N58983L37019P3418l04986j11263
$$ plain form
12584 1300061 1683169 1737977 1773543 1515375 888514 328933 182501 13808 -144217 -196384
12574 -196384 -114509 159154 114730 -227656 -337296 -231586 -247853 -257641 -73489 -16771 -272625
12563 -272625 -378804 -112929 567301 700496 431612 340203 309125 122399 -56678 -32230
12553 -32230 -261305 -616467 -766972 -771910 -652003 -365164 209429 388513 319656 447507
12543 447507 648172 522726 425580 760012 1015958 643719 516306 530977 255679 -149918
12533 -149918 -61562 367256 701189 1058237 1241416 1023853 873271 625238 134231 -361496
12523 -361496 -484083 173448 918007 1716268 2117122 1522134 707347 462958 405940 153333
12513 153333 360984 405970 2324 -425699 -438573 120410 457429 530847 225861 114598
12503A14598L6723k71687j5815L76010q6757k91962O8070m2075m132n9962J86046
12492I057K63937n3962l25178p3985K05126K85360N19292J28823j04181p8295
12482G75994k84060m29988J53839L63346J63436J24833j79351M5944L09507L66916
12472A410416L49130N6361j33968p47143p18263j94182K52718N82754K72526J39265
12462A269614j84112l28732K34919J31186j50727L03543J6680m34215l01609k14958
12452C41589n3191l81045j81876J46490R5161M6923M708K42267J33498M5525P0403
12441E10452L22182j31811l12375m01384k39383j87985k04581M07518M41915J47794
12431C52342L13473M49158L72734r2293m39350m10914l11226l71092m54024k21514
$$ plain form
12503 114598 151321 -120366 -136181 239829 153072 -138890 -70820 -112895 -117027 -176989 9057
12492 9057 272994 219032 -106146 -180131 24995 310355 829647 958470 854289 775994
12482 775994 491934 61946 215785 579131 742567 867400 688049 733993 1043500 1410416
12472 1410416 1759546 1815907 1681939 934796 216533 22351 275069 857823 1130349 1269614
12462 1269614 1085502 756770 991689 1122875 972148 1275691 1292371 858156 556547 341589
12452 341589 288398 -92647 -274523 -128033 -32872 14051 18759 261026 394524 440049 510452
12441 510452 832634 700823 388448 -12936 -252319 -440304 -644885 -237367 204548 352342
12431 352342 665815 1114973 1487707 1395414 956064 545150 233924 -137168 -591192 -812706
12421h12706J80062K12815j76981m07728m7871M38116K39427o1589j88372O2380
12411e62447L19508J00362J19409o365l33923l37480O8925O04590K47676k87609
12401f7354J06559J90653R9711p8211l59544M6348K19285R2998K72671L79261
12391I02377j30149n05074l7002J05930m14248l61449P7970L23671q8494m74265
12381f00733j85626j07929K88947L98810J96205K66739K37235M717o98260k00904
12371d00799K92354J45445k02636k17085o8613L1244O6472j35794j94112R2538
12361e90986M65134J32799l17266k91431m0321L28887L96526j28945k21850k75
12351b67728K13036K1866J84731M46146j02131m19449l66500k71233r8492M5554
$$ plain form
12421 -812706 -632644 -419829 -596810 -1004538 -1052409 -614293 -374866 -436455 -624827 -562447
12411 -562447 -242939 -142577 -23168 -29533 -363456 -700936 -632011 -27421 220255 -67354
12401 -67354 39205 229858 329569 251358 -108186 -61838 157447 250445 523116 902377
12391 902377 772228 267154 230152 336082 -78166 -439615 -361645 -37974 -126468 -600733
12381 -600733 -786359 -894288 -605341 -206531 -10326 256413 493648 498365 -199895 -400799
12371 -400799 -108445 37000 -165636 -382721 -451334 -420090 -353618 -489412 -683524 -590986
12361 -590986 -125852 6947 -310319 -601750 -642071 -313184 83342 -45603 -267453 -267728
12351 -267728 -54692 -32826 151905 598051 495920 76471 -290029 -561262 -659754 -614200
12341f14200J15519L97509K61093L06771J43037K3009j17832k40956k81026O8686
12331F1610L9859j80403k95290k45868J4169P9057M1268K4018o0661j2219J00632
12320d33828M2215j69517k82158r899K39523m467O75949O59140M1559j47539k34945
12309C76033j01120N3325k21673Q4300L88517j40154k77962J7969R5391J3835
12299B88461o8412j14823J91427L42463k02759m12840J55874J35020J96011M6004
12289E56426p5855J43575K94993o0538j26807j39631k92195l33414m63055k10460
12279g06961p5833J46843M01875J91587P2722j39274m5889J86662k65652l03414
12269e37334K39188M30380o5909j78187J30861j34230r8618J34625Q1773L4305
$$ plain form
12341 -614200 -498681 -101172 159921 466692 609729 632738 514906 273950 -7076 61610
12331 61610 101469 -78934 -374224 -620092 -605923 -526866 -485598 -461580 -522241 -534460 -433828
12320 -433828 -391613 -561130 -843288 -853187 -613664 -618131 57818 716958 758517 610978 376033
12309 376033 274913 328238 106565 190865 579382 439228 161266 179235 274626 288461
12299 288461 220049 105226 296653 639116 436357 23517 179391 314411 510422 556426
12289 556426 480571 624146 919139 858601 731794 592163 299968 -33446 -496501 -706961
12279 -706961 -782794 -635951 -234076 -42489 30233 -109041 -154930 31732 -233920 -537334
12269 -537334 -298146 132234 66325 -111862 18999 -115231 -213849 -79224 2549 36854
12259C6854J2120k845k0728j6398n47547l37332K16325k4630m40734j53586k8465
12248a306966J86336N46224R6160q6382K46961R8059N1371q4988m36578n48916
12238a238719j75347K20848J47227K38485K40448k05573k19293K87142L99836
12229c04946N34873j06979o39380o93681L1097L43453N19998M73075k2804l38465
12219b03759j97441L35509L10803J19729K2679l63201l18813m2062k95988n43603
12209a176147j42216K85431R0725Q7423K03310L8256j78442o7438K13448m41001
12199a086651m74463J22161K83429Q7004j6116K7791J81060K23564J58092N05036
12189A0907L95835M22952J29342n2651p7938O1968k17021j51739J92655j23799
$$ plain form
12259 36854 48974 46129 25401 9003 -538544 -875876 -659551 -684181 -1124915 -1278501 -1306966
12248 -1306966 -1120630 -574406 -478246 -564628 -317667 -219608 -168237 -253225 -689803 -1238719
12238 -1238719 -1414066 -1193218 -1045991 -807506 -567058 -772631 -991924 -704782 -304946
12229 -304946 229927 122948 -516432 -1210113 -1179016 -835563 -315565 157510 134706 -203759
12219 -203759 -401200 -65691 245112 364841 387520 24319 -294494 -336556 -632544 -1176147
12209 -1176147 -1318363 -1032932 -942207 -854784 -651474 -613218 -791660 -859098 -645650 -1086651
12199 -1086651 -1561114 -1438953 -1155524 -1068520 -1084636 -1056845 -875785 -652221 -494129 10907
12189 10907 406742 829694 959036 906385 828447 890415 673394 521655 714310 590511
12179E90511q5009k64435n85171m25392J05859L78800J37259K4536J5081M7544
12169f0417r3996r2168K41042K16004j5643j03248k06792m13383k79098Q5708
12159g21991K41187K06110k18095j84351n1387R8613L27829M74167J79433J03812
12149D55327k06553k12711P1162K39466N70628J14140n2337l48997k61506j22565
12139B46054j81447M9166j63060k14176M47473O29221K85214N3719n52059n90683
12129I422m57467m05426j28830L80176K98134J41430M47950N5802l42629k01643
12119b03081J14025L4012j7097j56492J33153O66773O21652K51511J08217j69130
12109A383543o86842k99444m24949k87034M5850l96270l03800J9544N5437L46333
$$ plain form
12179 590511 505502 241067 -344104 -769496 -663637 -284837 -147578 -123042 -107961 -60417
12169 -60417 -154413 -246581 -5539 210465 194822 91574 -115218 -528601 -807699 -721991
12159 -721991 -480804 -274694 -492789 -677140 -728527 -629914 -302085 172082 351515 455327
12149 455327 248774 36063 107225 346691 917319 1031459 979122 630125 368619 246054
12139 246054 64607 113773 -49287 -263463 184010 813231 1098445 1152164 600105 9422
12129 9422 -448045 -853471 -982301 -602125 -303991 -162561 285389 341191 -1438 -203081
12119 -203081 -89056 -55044 -72141 -228633 -95480 571293 1192945 1444456 1552673 1383543
12109 1383543 696701 397257 -27692 -314726 -268876 -665146 -968946 -949402 -893965 -547632
12099e47632K60852L92343j20276n0360R2296l58311k3738q0340q9964Q1236K67505
12088a76389k7201r3323J17563M93732n322m39203K182j01922l18658k59457k5457
12077h33455J03664q0814k3012K76643N28359K67510j33676m35399l14611J36076
12067e08715M24083J5044l96568l80633J62842M76362M79463Q3384J69348J77084
12057G01694k79739j04192L52558J2457m01685l53782j56318L90015M90822R0440
12047G42270j05110k03227n68790r1620L63625N4408k64624k41839j27244K09430
12037b32721K12031k85166k08574J86829L13003O6353k5539J60054K25716k09017
12027B02969J71488L63282l83320n64724J81668P11525M77088O4810l41015j39199
$$ plain form
12099 -547632 -286780 105563 -14713 -65073 27223 -331088 -354826 -435166 -525130 -443894 -176389
12088 -176389 -203590 -296913 -179350 314382 309060 -130143 -127961 -229883 -548541 -807998 -833455
12077 -833455 -729791 -810605 -833617 -556974 -28615 238895 105219 -330180 -644791 -508715
12067 -508715 -84632 -69588 -466156 -846789 -683947 -207585 271878 355262 524610 701694
12057 701694 421955 317763 670321 682778 281093 -72689 -229007 161008 651830 742270
12047 742270 637160 433933 -134857 -226477 137148 191556 -73068 -314907 -442151 -232721
12037 -232721 -20690 -305856 -514430 -327601 -14598 51755 26216 186270 411986 202969
12027 202969 374457 737739 354419 -210305 -28637 682888 1159976 1224786 883771 744572
12017G44572m2284m75021m05099K2990L14971j29896k69216j16592J77052M79045
12007C00522J56638m01403m36803j16560M5771J62203J01218k07577l12838k14912
11997i23741Q129l62522O2198O59899P03423M82212J64212m7043j63585p5089
11987E08093r2174M0023k06814l64861l89898k16581O2851L34892K84717k70235
11977c09987l30880J6029j75691j32746Q8819K88455j34852j82129K66291j89370
11967g96061J25279K87234J907j8675P0224R4231k21798l41469j59176Q2063K6771
11956h49470K43813M11082Q8588m12113M2793N86598K70640k0548j88566k49864
11946g7047k56800J94866J60072j75463j21409o0834j08146o8102k06353J32547
$$ plain form
12017 744572 702288 227267 -177832 -154842 160129 30233 -238983 -355575 -178523 300522
12007 300522 457160 55757 -381046 -497606 -451835 -289632 -188414 -395991 -708829 -923741
11997 -923741 -915612 -1278134 -1215936 -556037 147386 629598 793810 746767 583182 508093
11987 508093 415919 455942 249128 -115733 -505631 -722212 -659361 -324469 -39752 -309987
11977 -309987 -640867 -624838 -800529 -933275 -844456 -556001 -690853 -872982 -606691 -796061
11967 -796061 -670782 -383548 -381641 -400316 -330092 -235861 -457659 -799128 -958304 -876241 -849470
11956 -849470 -605657 -194575 -105987 -518100 -475307 111291 381931 361383 172817 -77047
11946 -77047 -333847 -138981 21091 -154372 -275781 -336615 -444761 -512863 -719216 -586669
11936e86669K15339K2623j32910Q6773p7893l63850L14501L50228J71307m596
11926e147j97028k1735K90852K68257N2808n8219K05292R6812N0044j71003l93275
11915A17658n4013J259l89524j95818J76365J57241L22391N2859k24833k34005
11905b70420J60637L1860j38804J60316K20875m0706J1825q6040j24322J49832
11895G5053P5376R2287K64387M27366Q9633j22227j54985j19555l00598J39911
11885D66648L14818j24548l85455k93694m01132l69857m9377L25801J4148p9759
11875e82407P1368o7342k60599m4617M01743L45546p149J00027M72738K60768
11865F90076n61996m13385J47919N1300m69331l54888L03211L12274J36034j88979
$$ plain form
11936 -586669 -371330 -348707 -481617 -394844 -472737 -836587 -522086 -171858 -551 -5147
11926 -5147 -202175 -223910 66942 335199 388007 329788 535080 631892 681936 510933 117658
11915 117658 63645 64904 -324620 -520438 -344073 -186832 135559 188418 -36415 -270420
11905 -270420 -109783 -77923 -216727 -56411 164464 123758 135583 49543 -74779 75053
11895 75053 150429 242716 507103 934469 1024102 901875 746890 627335 326737 466648
11885 466648 781466 656918 271463 -22231 -423363 -793220 -842597 -516796 -502648 -582407
11875 -582407 -511039 -578381 -838980 -883597 -481854 -136308 -143457 -43430 429308 690076
11865 690076 128080 -285305 -137386 -86086 -555417 -910305 -607094 -294820 -158786 -347765
11855c47765l42332j74237R2595P492J73857K69804k52571j00256M9354j19790
11845g43849j28328N7217j21832M426L78277J03517l08908J93615M80436N38958
11835D53529L10720K66447L7956k55526l49589l23990m70370N3676L36881l14425
11825b54691k22151n175o4495j63338l1583K38110K84435J58765R5253K95339
11815C30469M08032J37303k17515m03187m89454k48632m2066N1814O8695j10604
11805e15145L2521L4869j43691k77058Q2658K44784L36288O0832k74094k46356
11795f64392K30606l677J1411l7420J09086K17493j35303k3112m8084o4153k28340
11784f35885k2472M18879M01547K70567j71816l00694j22088k896O4747J11998
$$ plain form
11855 -347765 -690097 -864334 -771739 -764247 -590390 -320586 -573157 -673413 -624059 -743849
11845 -743849 -872177 -814960 -936792 -932366 -554089 -450572 -759480 -565865 -85429 453529
11835 453529 764249 1030696 1068652 813126 463537 139547 -330823 -277147 59734 -254691
11825 -254691 -476842 -482017 -546512 -709850 -741433 -503323 -218888 -60123 35130 330469
11815 330469 738501 875804 658289 255102 -234352 -482984 -525050 -473236 -404541 -515145
11805 -515145 -482624 -447755 -591446 -868504 -785846 -541062 -204774 -143942 -418036 -664392
11795 -664392 -433786 -437463 -426052 -463472 -354386 -136893 -272196 -295308 -343392 -407545 -635885
11784 -635885 -658357 -239478 162069 432636 260820 -39874 -161962 -164858 -100111 11887
11774A1887J21322j87216k36118N4633o56k11053r6892l8191j13998p845M02656
11763c01471M53416J83641j77122m85678l39196N7601J95737N2908o197L74511
11753H150K07957j18040o0616n0460j24148o8137L15575K10803k02804k72279
11743a53999j75997M6721p5592j0837L7720j01543k08122p0230q1031m97812j58858
11732a449580J87787j4467q0809j35032k96492k99589M15601N34653J65666j82884
11722a155146N31474M91395P20388R73859L3912l0164J31715M42629j93527l75334
11712A571201n00227k80802n7107K06891R9783o9925m23276o32007q2958J47969
11702b0458m2233N6346k18524l88387j68711k70146m64842J61497N64241N88925
$$ plain form
11774 11887 133209 -54007 -290125 -235492 -236148 -447201 -544093 -582284 -696282 -704127 -301471
11763 -301471 151945 335586 158464 -327214 -666410 -608809 -413072 -360164 -366361 8150
11753 8150 216107 98067 37451 -13009 -137157 -205294 110281 321084 118280 -153999
11743 -153999 -329996 -283275 -358867 -369704 -331984 -433527 -641649 -711879 -792910 -1290722 -1449580
11732 -1449580 -1261793 -1276260 -1357069 -1492101 -1788593 -2088182 -1672581 -1137928 -972262 -1155146
11722 -1155146 -623672 -132277 588111 1561970 1595882 1565718 1697433 2140062 1946535 1571201
11712 1571201 1070974 790172 733065 939956 1039739 969814 546538 -85469 -168427 -20458
11702 -20458 -62691 -6345 -224869 -613256 -781967 -1052113 -1516955 -1355458 -791217 -202292
11692b02292P51131N66639N5806J75304N93792O00285M34248L47529n49906r44109
11682A828427p16183m51950j50935l36996J6K72449j17251m84539l51230J10175
11672c98017M49232K82035j32842l21884K2302J33944J44230k72489j45427J0440
11662b28476L64768N21789K78145j02173q4260K58930m12428o52641l66544N51016
11652A28126L57641j56423j26446k7753k66283K5388N34859L73010j12291l54359
11642C75469K17794P4220n9068L2256k41926j13373l66791j62350J09980l2169
11632a65958J93477k30093n08840j09892O7327N97464N30430L13775k0355m29317
11622B38018k63796O7056J96118Q4682L7777p7625m52198l46919J30680K06269
$$ plain form
11692 -202292 548839 1115478 1171284 1346588 1940380 2540665 2974913 3322442 2772536 1828427
11682 1828427 1112244 660294 509359 172363 172379 444828 327577 -156962 -508192 -398017
11672 -398017 51215 333250 200408 -121476 -99174 34770 179000 -93489 -238916 -228476
11662 -228476 136292 658081 936226 834053 749793 1008723 596295 -56346 -422890 128126
11652 128126 485767 329344 202898 175145 -91138 -65750 469109 842119 729828 375469
11642 375469 593263 667483 608415 640671 398745 285372 -81419 -243769 -133789 -165958
11632 -165958 27519 -202574 -711414 -821306 -753979 -156515 373915 687690 667335 238018
11622 238018 -25778 41278 237396 322078 359855 282230 -169968 -516887 -386207 -179938
11612a79938K28860J72489j47348j48510l37638k33435L05729K58314Q7014K97058
11602C02595J52071M1883j97114j49741J93216j79264k17897q4761J40738K10725
11592B12451j81998l38950q7746L866J75497J8762k64829l70775J77610K68382
11582c87730J26256K75257o2811m00452J0647N7325o6142L08100N43034n8389
11572C45095m18369m57343l50762o6006k39586K96743J93173P0578J57855M5843
11562d22779j2009j19442J59826K70187J67187r4050n3018L92903L40276m30993
11552A98088q61754n25758Q1697K38993L84849L22475K95367J24083K42482L82619
11542H83141N4028l31745l41596j41719L30784J40851k91256m31617Q0025P3855
$$ plain form
11612 -179938 48922 221411 74063 -74447 -412085 -645520 -339791 -81477 5537 302595
11602 302595 454666 496549 299435 149694 342910 163646 -54251 -139012 1726 212451
11592 212451 30453 -308497 -396243 -392377 -216880 -198118 -462947 -833722 -656112 -387730
11582 -387730 -261474 13783 -49028 -449480 -438833 -381508 -447650 -139550 403484 345095
11572 345095 -73274 -530617 -881379 -947385 -1186971 -890228 -697055 -626477 -468622 -422779
11562 -422779 -434788 -554230 -394404 -124217 42970 -51080 -104098 288805 629081 198088
11552 198088 -663666 -1189424 -1107727 -868734 -483885 -161410 133957 258040 500522 883141
11542 883141 937169 605424 263828 122109 452893 593744 302488 -129129 -49104 24751
11532B4751p316p220J23598j58644k21146P7278K01784j33391n23485m48504j88069
11521a260364L30275N14405K78323N3277K71148L30567M56339K0060l63316j00773
11511E29941p6817j35091k35294J08617M07206k8363k66032k89517k44175R0299
11501a39226k5948j83131k04772K9779K75427J14056l53967J41802P4307l61807
11491f33480j25361Q0591J30063j49460m53596k59933K68399N44066N50819M61599
11481D13707K77833j67308l60266l62538l06736r5339J70472K46185M76316L36411
11471F28737k29905j37252j6853n1617j0899k95100m43375J59951L24096L31970
11461B59753L54252M0260r5580m4706j40067J7008K77460P1340k85756l74454
$$ plain form
11532 24751 17435 10215 133813 -24831 -245977 -168699 33085 -100306 -623791 -1072295 -1260364
11521 -1260364 -930089 -415684 -137361 -84084 187064 517631 973970 994030 630714 529941
11511 529941 453124 318033 82739 191356 598562 570199 304167 14650 -229525 -139226
11501 -139226 -165174 -348305 -553077 -523298 -247871 -133815 -487782 -345980 -271673 -633480
11491 -633480 -758841 -678250 -548187 -697647 -1151243 -1411176 -1142777 -598711 -47892 413707
11481 413707 691540 524232 163966 -198572 -505308 -600647 -430175 -183990 292326 628737
11471 628737 398832 261580 244727 193110 182211 -112889 -556264 -396313 -72217 259753
11461 259753 614005 654265 558685 513979 373912 390920 668380 739720 453964 79510
11451G9510k69677J21941m8172L10812M41857k65975l28910J22017M19983K85427
11441H68813N5984P0324N6098k91690R383M05242K60733J80512l32623l23588
11431I59188K94627P2533m05860k44600K33206R7204j53461k78008l36202L5851
11421B74478L01346P2914J02943J2411p12890j218539m45740M25846O90612L39512
11411a57107L99095N5321p15468m43695P7308K84084K74589K40113l0495k14351
11401b30606j39736l67178l14062K98159O15987J83787J56987J10545M3371j11178
11391B46076m79866m05212J85670J0575k84629l03866r5242J56168K8505K14655
11381g27166J58273L12621L51999N628k30661n02323j12540J95925J84489m4165
$$ plain form
11451 79510 -190167 -68226 -116398 194414 636271 370296 41386 163403 583386 868813
11441 868813 924797 995121 1051219 759529 768912 1174154 1434887 1615399 1282776 959188
11431 959188 1253815 1326348 920488 675888 909094 1006298 852837 574829 238627 274478
11421 274478 575824 648738 751681 764092 51202 -1167337 -1613077 -1187231 -496619 -157107
11411 -157107 241988 297309 -418159 -861854 -784546 -500462 -225873 14240 -16255 -230606
11401 -230606 -370342 -737520 -1051582 -753423 -137436 46351 203338 313883 357254 246076
11391 246076 -233790 -639002 -453332 -442757 -727386 -1031252 -1126494 -970326 -941821 -727166
11381 -727166 -568893 -256272 95727 101355 -129306 -631629 -744169 -548244 -363755 -407920
11371d07920j39757J18669N31956K07614K14481K5716l16448k41945J04225p5401
11361B1190o0155j75535j15515l2940J80411J65844n9042o7278k54961J16244
11351b81737J25602M8558q9254l34538J70077K06334l13829k66444K04221J76758
11341c54252J49063M50397M42316K28344j93971l94440j23416O8823K25811M18805
11331I17480j11386o21437j77021j45701k32436p239M88060M91187k71904m57036
11321a27433k00276M0179K06263L63129J78805j91527j18425k05532j17620R2757
11311g9680J63581k30348m94819k58122O308k61966m7641K07469k5935j74713
11301a195866K34641O31340K43231J95814J45674n57144m33636j18528P1760J16081
$$ plain form
11371 -407920 -547677 -429008 102948 310562 525043 550759 234311 -7634 96591 21190
11361 21190 -38965 -214500 -330015 -362955 -182544 -16700 -75742 -143020 -397981 -281737
11351 -281737 -156135 -107577 -196831 -531369 -361292 -154958 -468787 -735231 -531010 -354252
11341 -354252 -205189 245208 687524 915868 721897 327457 204041 272864 498675 917480
11331 917480 806094 184657 7636 -138065 -370501 -377740 110320 601507 329603 -127433
11321 -127433 -327709 -287530 -81267 281862 460667 269140 150715 -54817 -172437 -79680
11311 -79680 83901 -146447 -641266 -899388 -893080 -1155046 -1202687 -995218 -1021153 -1195866
11301 -1195866 -961225 -329885 -86654 109160 254834 -302310 -735946 -854474 -782714 -666633
11291f66633m478K27230J34483J41878L41787O1588k85197l88388k17542J19278
11281e35994J87216k50956j10372K61712K18071J10339J36083j41196q6436K20131
11271H598j3218p5670k15078k35133L49246K16360p4747m1412p9083J31330K43746
11260B14939k75070m23486J09338K61761K98245K98073P0863j719j28303l80292
11250D4349k06097k51813j71149l44023j38655L30980K71152L1225K07829J92426
11240c3776k39678l42510K12793K34972K48071N6818j30057j34903R6095p6414
11230a08589o3062K30678L41681K62924M9018l50893l41148r6013j66584l06481
11220e48469J84032N31415J8708J8804J6223M5187O4269k22632j38335M1313J41409
$$ plain form
11291 -666633 -671111 -443881 -309398 -167520 174267 235855 -49342 -437730 -655272 -535994
11281 -535994 -348778 -599734 -710106 -448394 -230323 -119984 16099 -125097 -211533 8598
11271 8598 -4620 -80290 -295368 -530501 -181255 35105 -39642 -81054 -160137 -28807 214939
11260 214939 -60131 -483617 -374279 -112518 185727 483800 554663 552944 424641 44349
11250 44349 -161748 -413561 -584710 -928733 -1067388 -736408 -465256 -434031 -226202 -33776
11240 -33776 -273454 -615964 -403171 -168199 79872 136690 6633 -128270 -32175 -108589
11230 -108589 -171651 59027 400708 663632 712650 361757 20609 -75404 -241988 -548469
11220 -548469 -364437 166978 185686 204490 220713 265900 330169 107537 -30798 10515 151924
11209A51924K54674J64230n6425m73766o19849m09652J13546P10618L39296J18892
11199B93488K96008m3509k20179N7857m7711N0835K6679l96342j88471L28225
11189A56880R5189j17833m7647K02060j49250l49486P4785O2899l33394K42362
11179a63435J48911o09608l02368K27942K16897J34192M09255K78209m74116m17417
11169e51538j73016M5536K47725L95325J70498L8426L69099J30549j69606J60702
11159F63700K07532j98874p98268n74440j5927P4583j74052j01383K59244J64054
11149d93831L6974j7691L2729P4559n3143K55066O31261M47128p5999k74614m47818
11138A14621m06386k16351l12001l23010J10069M09864N65654L88520k4643n00644
$$ plain form
11209 151924 406598 570828 514403 40637 -579212 -988864 -875318 -164700 174596 293488
11199 293488 589496 545987 325808 383665 335954 386789 413468 17126 -171345 156880
11189 156880 252069 134236 86589 288649 139399 -210087 -135302 -72403 -405797 -163435
11179 -163435 -14524 -624132 -926500 -698558 -481661 -347469 61786 339995 -134121 -551538
11169 -551538 -724554 -679018 -431293 -35968 134530 172956 542055 672604 502998 663700
11159 663700 871232 672358 -125910 -700350 -716277 -641694 -815746 -917129 -657885 -493831
11149 -493831 -456857 -474548 -441819 -367260 -420403 -165337 465924 913052 837053 562439 114621
11138 114621 -291765 -508116 -820117 -1143127 -1033058 -623194 -57540 330980 306337 -194307
11128a94307l33381j0767J48353M07201L02573J89006K1481r3151j9244j14595
11118C03169k22012q5556j4213j26303j13162O4324L67820M05211N4796j88467
11108D45607r7520j70387M0352j6869l82857m81099n9000N10891L33974K7645
11098A50737j08367J87675K19964M0933j27390k32320m29392K49528M87495L56589
11088G95452K44933n4805l6123L5656l0679l07211l00142j84603k07425o4841
11078a09788k14849J40051J96857o455p3716p7610Q5410p3772l71183m02740m089
11067i11884L16628J70028J34199J74282l1911l92179J12708K38289K3096J90063
11057B3319L40110K266l13016K1714o7637l33050j88053j57526j87310J33676
$$ plain form
11128 -194307 -527688 -538455 -390102 17099 319672 508678 530159 437008 417764 303169
11118 303169 81157 -4399 -18612 -144915 -258077 -193753 174067 579278 634074 445607
11108 445607 348087 177700 218052 201183 -181674 -662773 -721773 -210882 123092 150737
11098 150737 42370 230045 450009 490942 363552 131232 -298160 -48632 438863 795452
11088 795452 1040385 985580 949457 985113 954434 647223 347081 162478 -44947 -109788
11078 -109788 -324637 -184586 12271 5816 -67900 -145510 -60100 -133872 -505055 -907795 -911884
11067 -911884 -595256 -425228 -291029 -116747 -148658 -540837 -428129 -189840 -166744 23319
11057 23319 363429 365695 52679 74393 6756 -326294 -514347 -671873 -859183 -725507
11047g25507k0792r2892K7563K69833L41143J7805l8277K19423J01334l49302
11037b49669k28809j12690j27481M88927O52846k63984n50330k40591N8406N327
11027e68048J4180l6536Q7811K4816Q8993N454N9145k1809k30535J53366J22148
11016c01015R0910r7972q6399J13752o1573J38610J08771L1186L35659J68571
11006D40500k30578m43125k95029K02124M06838p615n0372L10136J39517m30155
10996D2241k72767M08889Q8392k18207j84056j05939N743J72156J2815l68379
10986d19112l94318j31213k89547q4684J29125m774m6761K51351L89302K04981
10976c95650J3544k40087M8570L60485M77963L57689J33384J00356k37178n67252
$$ plain form
11047 -725507 -746299 -839191 -811628 -541795 -200652 -182847 -221124 -1701 99633 -249669
11037 -249669 -478478 -591168 -718649 -229722 423124 159140 -391190 -631781 -573375 -568048
11027 -568048 -553868 -590404 -502593 -477777 -388784 -383330 -324185 -345994 -576529 -423163 -301015
11016 -301015 -210105 -308077 -394476 -280724 -342297 -203687 -94916 -63730 271929 440500
11006 440500 209922 -233203 -528232 -326108 80730 73115 22743 332879 472396 42241
10996 42241 -230526 178363 266755 48548 -135508 -241447 -235704 -63548 -50733 -419112
10986 -419112 -813430 -944643 -1234190 -1318874 -1189749 -1194523 -1241284 -989933 -600631 -395650
10976 -395650 -382106 -622193 -573623 -213138 264825 622514 755898 856254 619076 51824
10966E1824k03216k27031n99384J47539P76922L60203K41772J89322J84329k84833
10956F37447l21371j27250n40335m03425K76152N33152K11686P2030j46002m94171
10946c02087m46241J19026K84249j93409M5050N17502L59492l00846j96350K90021
10936A76407K32112l9930j27297L3534M59214M48574J35605k53390j8203K01011
10926A247637j92695k34272j38725l92836j78787k18364k02789K4062L7126O1129
10916a88514q9003l5128P3032M16754N63813l3728L7775P2308k03131m20148k71949
10905g7919j12558j55069J03745J550m5238J73613L85006J06059j79290q7276
10895A12623L47057N4548l22242l93377j15462k68803l58588Q7891L70170M13468
$$ plain form
10966 51824 -151392 -378423 -977807 -830268 -53346 306857 548629 737951 922280 637447
10956 637447 316076 188826 -351509 -754934 -478782 54370 266056 338086 192084 -302087
10946 -302087 -748328 -629302 -345053 -538462 -493412 24090 383582 82736 -113614 176407
10936 176407 408519 368589 241292 274826 734040 1182614 1318219 1064829 1046626 1247637
10926 1247637 1054942 820670 681945 289109 110322 -108042 -310831 -286769 -249643 -188514
10916 -188514 -277517 -312645 -239613 177141 740954 707226 745001 817309 614178 194030 -77919
10905 -77919 -190477 -345546 -241801 -240251 -285489 -111876 273130 379189 199899 112623
10895 112623 459680 514228 191986 -201391 -316853 -585656 -944244 -856353 -486183 -72715
10885g2715J73470K26289M55297R998l47662m70332j59536j2720k01739K97172
10875a02478L20747j38j61462k12178K18755K6620l89410L8843N32526M27160
10865F98985m0929m33563n10301k6320j95662l88972P3627K55680K28635j51236
10855d90056j09001J29533J92590J37702n3209k96687j74337k07011L21606O62934
10845A14064P2776j04534J76804o2757j08143j06031j87413k69390k91963M72605
10835b93982L59078l8696r9197j65977L3017k07503m12593p8539m5j57480J74860
10824h87057O03340N13616K00633J47337L28389J04205k3618l59380j56621K89744
10814G60588J54903j48451P9436L42390K38645Q1359l43315j59885L17636K21925
$$ plain form
10885 -72715 100755 327044 782341 792339 444677 -25655 -185191 -197911 -399650 -102478
10875 -102478 218269 218131 56669 -155509 63246 89866 -299544 -260701 271825 698985
10865 698985 658056 224493 -285808 -312128 -507790 -896762 -823135 -567455 -338820 -490056
10855 -490056 -599057 -469524 -276934 -139232 -192441 -489128 -663465 -870476 -548870 114064
10845 114064 186840 82306 259110 196353 88210 -17821 -205234 -474624 -766587 -293982
10835 -293982 65096 26400 -72797 -238774 -205757 -413260 -825853 -904392 -904437 -1061917 -887057
10824 -887057 -283717 229899 430532 577869 906258 1010463 986845 627465 470844 760588
10814 760588 915491 767040 846476 1188866 1427511 1508870 1165555 1005670 1323306 1545231
10804A545231R2349j54970K71188J61435j4720J04049j59007j15691K25403L61366
10794B316633K92789J28397k99080j78291L07962K44193j06238j05311Q8156J88267
10784B877477M53442K06532l27513K2960N78961O78587N16713K3463k23591K69052
10774E076083K32453O1315L34002L6514m64719N7043N28016O55583M43394L91360
10764G351044k6083N63798O24684j63308m31655l48980l10556M8936k03286o84083
10754F420511q31180n43097l4180J0100J28975M43007K92875l63843m60395k12829
10744D849944j01798k02152J92154L22764J21226K07574K13089K15264l78732
10735E439333p51828q08322j57462j52546l44865j46650K6472K22624k01173k36014
$$ plain form
10804 1545231 1637580 1482610 1753798 1915233 1900513 2004562 1845555 1729864 1955267 2316633
10794 2316633 2609422 2737819 2438739 2260448 2568410 2812603 2706365 2601054 2689210 2877477
10784 2877477 3330919 3537451 3209938 3232898 3811859 4490446 5007159 5030622 4807031 5076083
10774 5076083 5308536 5369851 5703853 5740367 5275648 5332691 5860707 6516290 6959684 7351044
10764 7351044 7324961 7888759 8513443 8350135 7918480 7569500 7258944 7307880 7104594 6420511
10754 6420511 5589331 5046234 5012054 5022154 5151129 5594136 5887011 5523168 5062773 4849944
10744 4849944 4748146 4545994 4738148 5060912 5182138 5389712 5602801 5818065 5439333
10735 5439333 4687505 3879183 3721721 3569175 3224310 3077660 3104132 3326756 3125583 2889569
10725B889569j58320m22401l18959K88224J89699j05804k96791P5341m04136n38501
10715A197921r8509N3874j24366l08369p8388K06479M09636L66676o4097j43880
10705A416977p6577j04572k8469o0703P4497J99889j70304J96266M42818p8894
10695A810928m53459m23026p7575R9909K0443j89239k82027j48218O4335L84112
10685H06183J02394k02875k68826k14361J55785K53023Q8011M3961o9661Q0829
10675G74463l57672l23127N4505P9310k14985m1528N4425Q6673K60345M8180j02829
10664C17760l54434l26050j97177K46863N95602O25639J84953m77367m23066k79890
10654h7167q9890J86209j12504l72928k28223L54162L51707J61631k7273m46756
$$ plain form
10725 2889569 2731249 2308848 1989889 2278113 2467812 2362008 2065217 2140558 1736422 1197921
10715 1197921 1099412 1153286 1028920 720551 642163 848642 1258278 1624954 1560857 1416977
10705 1416977 1340400 1235828 1207359 1146656 1221153 1421042 1250738 1447004 1889822 1810928
10695 1810928 1357469 934443 856868 956777 977220 787981 505954 357736 422071 806183
10685 806183 908577 705702 436876 222515 378300 631323 719334 763295 693634 774463
10675 774463 416791 93664 148169 227479 12494 -29034 25391 112064 372409 420589 317760
10664 317760 -36674 -362724 -559901 -313038 282564 908203 1093156 615789 192723 -87167
10654 -87167 -177057 9152 -103352 -476280 -704503 -350341 1366 162997 135724 -311032
10644c11032j39592L65378N09304N24918l5879p10152m64394M6730N0232j1266
10634a75753J2496J88959j74744l54076L62129N87435l75293l74877O3321r6810
10624c37213N1820J84039J18843L03302R6276j65699Q3230J91757K93263J66548
10614I86166P0797p1874k94531o85453j87060O35549O12255j36923m62330m49507
10604A7089n34925j23236K70955L99860K34491j33681j78177q100K84064L59779
10594E88119j9497m17585k55210J93579J80082M07470k4328m83325j43751r8403
10584g2849n9555r9675n1464o8996K24689K35845L51512j01409j55745L07354
10574E09707K20604m10032o79517l97474Q0353O2262J6571L939K41897K60635
$$ plain form
10644 -311032 -450624 -85246 424058 948976 913097 202945 -261449 -214719 -164487 -175753
10634 -175753 -163257 25702 -149042 -503118 -140989 446446 71153 -303724 -240403 -337213
10624 -337213 -285393 -101354 17489 320791 417067 251368 334598 526355 819618 986166
10614 986166 1056963 985089 690558 5105 -181955 453594 1065849 928926 466596 17089
10604 17089 -517836 -641072 -370117 29743 264234 130553 -47624 -55724 228340 588119
10594 588119 568622 151037 -104173 89406 269488 676958 652630 169305 25554 -72849
10584 -72849 -132404 -232079 -283543 -352539 -127850 107995 459507 358098 202353 509707
10574 509707 730311 320279 -359238 -756712 -676359 -614097 -597526 -593587 -351690 -91055
10564i1055J9105j77119k83698o6312L07624L60506N5863j49088q3999K43839
10554A35666J81702n6284k94299l11751k10201K093K64020K4341k51357Q9761
10544d26309O5962J46178Q9696L1216N8350J39876J71747R9409m4053j13391j49141
10533F9540k59259j97385J88855M16770J92607M3262l26707j82387K69875K07098
10523D22269k02560n82717r8301n0698p6043J03816M01692P16880L52884k10818
10513G76404o77841o64673M2714K52037L47586K92049k31821j38248k9267j4473
10503d5533K20662L4796o0441J49754r7455m7711P8415K937j23276k68831k34036
10492c90719k26987k80269K9252M16339P5186J9104l7111q8650j48029j33480
$$ plain form
10564 -91055 -71950 -249069 -532767 -599079 -291455 69051 124914 -24174 -108173 135666
10554 135666 317368 261084 -33215 -344966 -555167 -553074 -289054 -264713 -516070 -426309
10544 -426309 -360347 -214169 -124473 -93257 -34907 104969 276716 376125 332072 218681 69540
10533 69540 -189719 -387104 -198249 218521 411128 454390 127683 -54704 215171 422269
10523 422269 219709 -363008 -461309 -512007 -588050 -484234 -82542 634338 987222 776404
10513 776404 98563 -566110 -523396 -271359 76227 368276 136455 -1793 -31060 -45533
10503 -45533 175129 209925 149484 299238 201783 154072 232487 235424 112148 -156683 -390719
10492 -390719 -617706 -897975 -868723 -452384 -377198 -358094 -395205 -483855 -631884 -765364
10482g65364j38875j73202r9479k31337j53753K4264J07818K52366M55790M38619
10472b83153M0957J85894L30276K02417j67276n60116q68102l70158J37827k87033
10462a638467q1058M09769K49976O55332L42313j1315M65882N6301m22796j06217
10452h0280J65442L66377O4899o7272l61478n18478n45998l87824K24208N54235
10442e86169N50334L98092L5553l68361m95894j27941k4290L8016M12468L04577
10432A36385O6543l3816m96533p42561m7266N16076L77710N44491L97873R2760
10422H11662J03567j7632j44212l36476k10571M054k28759j86596Q8326J41247
10412B4610J29300R4112j11558m9223R4905R0275j40934k71489j66752j65125
$$ plain form
10482 -765364 -904239 -1077441 -1176920 -1408257 -1562010 -1537746 -1429928 -1177562 -721772 -283153
10472 -283153 -242196 -56302 273974 476391 309115 -251001 -1119103 -1489261 -1351434 -1638467
10462 -1638467 -1719525 -1309756 -1059780 -404448 -62135 -73450 392432 448733 25937 -80280
10452 -80280 85162 451539 516438 449166 87688 -430790 -976788 -1364612 -1140404 -586169
10442 -586169 -35835 362257 397810 29449 -466445 -594386 -618676 -580660 -168192 136385
10432 136385 202928 169112 -327421 -1069982 -1117248 -601172 -223462 321029 718902 811662
10422 811662 915229 897597 753385 416909 206338 210392 -18367 -204963 -116637 24610
10412 24610 153910 248022 136464 87241 182146 272421 131487 -140002 -306754 -471879
10402d71879k26238J0562M35958J88145k40062j27403L46688M63261p4707k03607
10392A00718Q2843J24482j65211l60805M4005L02660M80856J60551m6714l38332
10382C85053n01079n24918l1576j1954J3620L98979K36427l0437j60826k17759
10372d44470j31545j8006j6381j49747K7737L54977J85091K7678k48141j93966
10362f06773J29738L55736k7965k8492l6080m72182k85150j69688L20424N97406
10352b23026L51726J51691j46032j02014l07743n47981j11824K54068J66070K38713
10342b76352K83015n5774j16657J14281L24855j68316o55409k17079J31403m0094
10332f76127Q3322K93354N8258n7135R5946O9831K2129j06789j18795o742K64734
$$ plain form
10402 -471879 -698117 -687555 -251597 -63452 -303514 -430917 -84229 379032 304325 100718
10392 100718 183561 308043 142832 -217973 -173968 128692 609548 770099 723385 385053
10382 385053 -116026 -640944 -672520 -684474 -670854 -271875 -35448 -65885 -226711 -444470
10372 -444470 -576015 -594021 -610402 -760149 -732412 -377435 -192344 -164666 -412807 -606773
10362 -606773 -477035 -121299 -149264 -177756 -213836 -686018 -971168 -1140856 -820432 -223026
10352 -223026 128700 280391 134359 32345 -275398 -823379 -935203 -681135 -515065 -276352
10342 -276352 6663 -49111 -165768 -51487 273368 105052 -550357 -767436 -636033 -676127
10332 -676127 -592805 -299451 -241193 -298328 -202382 -132551 -110422 -217211 -336006 -342748 -78014
10321g8014K70149j0092J05635K42223J91371J31234n7836k25016N4530J58641
10311G82825l73169l24193R6707j27925n34205m05552m9947r707N3253N25582
10301c66331L72793J46103o7500p8937l0767j83254k43251J78615O7853k05309
10291d09985P1040K95623o1825j51966L37261r9977l1199j57795k27701n6283
10281d92807L03567J75901J65591J02948k31231k24386j47464n7328R1210J87093
10271a26906J648j86985o19285k61574K59083K34200p6810l1603R7898J60376
10261e49958M13763L27311k56889l99022k0437L6746j6288K01149k6564P0991
10251b19198J82795L16303M88056J81295j52214R095n6495q8365k1797l26478
$$ plain form
10321 -78014 192135 182043 287678 529901 721272 852506 794670 569654 624184 782825
10311 782825 409656 85463 182170 54245 -479960 -885512 -935459 -945166 -891913 -366331
10301 -366331 6462 152565 85065 6128 -24639 -207893 -451144 -272529 -204676 -409985
10291 -409985 -338945 -43322 -105147 -257113 80148 -19829 -51028 -208823 -436524 -492807
10281 -492807 -189240 -13339 152252 255200 23969 -200417 -347881 -405209 -313999 -126906
10271 -126906 -125258 -312243 -931528 -1193102 -934019 -699819 -776629 -808232 -710334 -549958
10261 -549958 -136195 191116 -65773 -464795 -485232 -448486 -464774 -263625 -290189 -219198
10251 -219198 -36403 279900 767956 949251 797037 806132 749637 661272 639475 312997
10241C12997l97191k72772K65517K87936k12692k40723J71492l3235m29876j93493
10231g42040m0293K22895L54202P6080k14195m850L6410K8288l24350k46887M59996
10220c94744K62138k37014k40677p201J3195J00558K6724J51797L72443J13544
10210A60763J27342l26668n29578j01023m0842j83610j60656J27791J43282M6133
10200g37066N18021O71271N4632n35470l28994l21352o20311p7019O80k09898
10190a585506O0509K77318L91734K15934l22258n7966M32667L67794m2565n6706
10180c19045K86172L31967j04497o97276o36581L69400P40888L78608J69599K86462
10170H05697K57576j89530n45683l60743k32183l4827k30027n88760m11449l2751
$$ plain form
10241 312997 -84194 -356966 -91449 196487 -16205 -256928 -85436 -118671 -548547 -742040
10231 -742040 -782333 -559438 -205236 -129156 -343351 -348201 -311791 -283503 -607853 -854740 -394744
10220 -394744 -132606 -369620 -610297 -617498 -604303 -503745 -477021 -325224 47219 160763
10210 160763 288105 -38563 -568141 -669164 -710006 -893616 -1054272 -926481 -783199 -737066
10200 -737066 -219045 452226 506858 -28612 -357606 -678958 -1299269 -1376288 -1375608 -1585506
10190 -1585506 -1524997 -1247679 -855945 -640011 -962269 -1020235 -587568 -219774 -262339 -319045
10180 -319045 -32873 299094 194597 -502679 -1139260 -769860 -28972 349636 519235 805697
10170 805697 1063273 873743 328060 -32683 -264866 -299693 -529720 -1118480 -1529929 -1562680
10160a562680L39510Q17674P13202J87160J00293J59946J0654k37550k16568j37258
10150A74383l66892l19165M9207k5338j40129l10256j96011k82762k27820J6209
10140a628574M7869P11803P14567Q4317m98620k44789J58390j34942O4314L35547
10130c90118k20112k01635J12179L9923q1166o2247L71755J43652j11342l60439
10120g59550m61393N1269J31817j9531K24013M18494L87617P8314l11927Q6118
10110a74759k1268k25169j49886K02111J66259r698N1057N38795K94281k53223
10100D18500m28472k47565J55722L23714j66374j82452J67469q6940j07665J14374
10090c9689J79609k95282m75886m74586j48665l4325P5601M41643M29012k2691
$$ plain form
10160 -1562680 -1223170 -405496 307706 494866 595159 755105 765759 528209 311641 174383
10150 174383 -192509 -511674 -462467 -487805 -627934 -938190 -1134201 -1416963 -1644783 -1628574
10140 -1628574 -1580705 -868902 -154335 -70018 -568638 -813427 -655037 -789979 -725665 -390118
10130 -390118 -610230 -811865 -699686 -659763 -740929 -803176 -431421 -287769 -399111 -759550
10120 -759550 -1220943 -1169674 -1037857 -1057388 -833375 -414881 -27264 51050 -260877 -174759
10110 -174759 -196027 -421196 -571082 -368971 -202712 -212410 -161353 377442 671723 418500
10100 418500 -9972 -257537 -101815 221899 55525 -126927 40542 -46398 -154063 -39689
10090 -39689 139920 -155362 -631248 -1105834 -1254499 -1288824 -1213223 -771580 -342568 -365259
10080c65259L4350R2278M4418N2346K00025m4115j65504l31522j68147j10739
10070g61869J2893M23479L29078k5789l57917j81917L70030O54906M51111j85036
10060G28969m63283k11410Q3019k11041k12447k28185l85606p0337J54664Q7355
10050g28302J79298Q7922n3491j63591k2660K46173J26535k18745M267J89904
10040c52690L83150p8395l35665K62265K67235q6343m27845m6543J18330j07018
10030d03519j16621K3620K60237O29985N47684J67563j75827p03096n70256j90604
10020e30834q3814J27557p7679K30781N54178J2208j62786n52860o61708j8324
10010a163281L31848K74815K32888K47703o9779m89242l09100L2458p6476k14235
$$ plain form
10080 -365259 -330909 -238631 -194213 -141867 58158 14043 -151461 -482983 -651130 -761869
10070 -761869 -748976 -325497 3581 -22208 -380125 -562042 -192012 462894 914005 728969
10060 728969 265686 54276 137295 -73746 -286193 -514378 -899984 -970321 -815657 -728302
10050 -728302 -549004 -461082 -514573 -678164 -700824 -454651 -328116 -546861 -542594 -352690
10040 -352690 30460 -47935 -383600 -121335 145900 59557 -368288 -414831 -296501 -403519
10030 -403519 -520140 -496520 -236283 393702 941386 1108949 933122 230026 -340230 -530834
10020 -530834 -614648 -487091 -564770 -333989 220189 232397 69611 -483249 -1144957 -1163281
10010 -1163281 -831433 -556618 -323730 -76027 -145806 -635048 -944148 -911690 -988166 -1202401
10000a202401q5986K83343O05390O18343M56142J06859l33759n00229m53516j53719
9990f59533L0579J53271J71024L22054O8444k31543m60859k1238K48982j74910
9980e53729k89297k05709L53941L43795J93277K35929k7465m1139M0909L46955
9970C97467k4040o69162k67119R0449j38132n7317J60889L1598j14738j76382
9960g66487L3193K33822K81685J23255j4929J90917R8903n26229o36657P7559
9950i04968K64107M8885j00158L296M10125Q5415j83897k02453p6754o71L7532
9939f19541M31154L09911L49613K22248j30257j57532L5807j36448j89569j33271
$$ plain form
10000 -1202401 -1288387 -1005044 -399654 218689 674831 781690 447931 -52298 -505814 -659533
9990 -659533 -628954 -475683 -304659 17395 85839 -145704 -606563 -627801 -378819 -553729
9980 -553729 -843026 -1048735 -694794 -350999 -157722 78207 50742 9603 50512 397467
9970 397467 373427 -295735 -562854 -472405 -610537 -667854 -506965 -475367 -590105 -766487
9960 -766487 -733294 -499472 -217787 -94532 -109461 81456 180359 -345870 -982527 -904968
9950 -904968 -640861 -591976 -692134 -688838 -278713 -193298 -377195 -579648 -656402 -657073 -619541
9939 -619541 -188387 121524 471137 693385 563128 405596 441403 304955 115386 -17885
$$ [...]
##END NTUPLES=NMR SPECTRUM
##END=
