##TITLE=C13_SR115_k
 CDCl3, 22300 sc

 24.10.2022
##JCAMPDX= 6.0         $$ Bruker NMR JCAMP-DX V2.0
##DATA TYPE= NMR SPECTRUM
##DATA CLASS= NTUPLES
##ORIGIN= UXNMR, Bruker Analytische Messtechnik GmbH
##OWNER= root
$$ XWIN-NMR		Version 3.5
$$ Tue Oct 25 13:42:25 2022 Russian Standard Time (UT+4h)  she@DPX200
##.OBSERVE FREQUENCY= 50.327896
##.OBSERVE NUCLEUS= ^13C
##.ACQUISITION MODE= SIMULTANEOUS
##.ACQUISITION SCHEME= undefined
##.AVERAGES= 22301
##.DIGITISER RES= 17
##SPECTROMETER/DATA SYSTEM= spect
##.PULSE SEQUENCE= zgpg30
##.SOLVENT NAME= CDCl3
##.SHIFT REFERENCE= (INTERNAL, CDCl3, 0, 222.653)
##AUDIT TRAIL= $$ (NUMBER, WHEN, WHO, WHERE, WHAT)
$$ ##TITLE= Audit trail, XWIN-NMR		Version 3.5
$$ ##JCAMPDX= 5.01
$$ ##ORIGIN= Bruker BioSpin GmbH
$$ ##OWNER= she
$$ F:/spectra/data/she/nmr/c13/1/pdata/1/auditp.txt
$$ ##AUDIT TRAIL=  $$ (NUMBER, WHEN, WHO, WHERE, WHAT)
(   1,<2022-10-25 13:39:51.20 +0400>,<she>,<DPX200>,
      <created by zg, POWCHK disabled, PULCHK disabled
       terminated by command 'halt'
       configuration hash MD5:
       00 E9 B6 7A A2 85 ED C7 34 08 36 98 17 FE 4E 26
       data hash MD5: 32K
       51 48 2A 47 04 E3 D4 32 D2 34 68 CC 96 92 EC D7>)
(   2,<2022-10-25 13:40:29.79 +0400>,<she>,<DPX200>,
      <Start of raw data processing
       efp BC_mod = 2 LB = 1 FT_mod = 6 PKNL = 1 PHC0 = -320.3523 PHC1 = 37.56394 SI = 32K 
       data hash MD5: 32K
       3B 9C E5 15 AE 1D CA 67 D7 A7 CB A3 A0 98 77 71>)
(   3,<2022-10-25 13:40:52.42 +0400>,<she>,<DPX200>,
      <pk PHC0 = 14.45735 PHC1 = 5.599999 
       data hash MD5: 32K
       5C 4D DB 5B E4 BC 97 70 FC 5B E9 FD 46 45 FA 87>)
(   4,<2022-10-25 13:40:55.73 +0400>,<she>,<DPX200>,
      <abs ABSG = 5 
       data hash MD5: 32K
       B8 49 9E CD 83 81 FF C6 5B F2 82 50 9D 50 8D 88>)
(   5,<2022-10-25 13:41:49.76 +0400>,<she>,<DPX200>,
      <pk PHC0 = 5.457863 PHC1 = -8.599999 
       data hash MD5: 32K
       27 B7 55 D4 6B F0 3C 30 79 BF F5 2E EB D4 8C 17>)
(   6,<2022-10-25 13:41:53.51 +0400>,<she>,<DPX200>,
      <abs ABSG = 5 
       data hash MD5: 32K
       E7 A4 58 81 26 2E 57 CA B2 7F 4F 57 3A 46 C9 4E>)
$$ ##END=
$$ 
$$ hash MD5
$$ 89 9F A1 5E BA 44 CC 18 F1 8A 78 C1 96 79 8C F9
##$RELAX= 
##$RELAX= 
##$RELAX= 
##$RELAX= 
##$RELAX= 
##$RELAX= 
##$RELAX= 
##$RELAX= 
$$ Bruker specific parameters
$$ --------------------------
##$DU= <F:/spectra>
##$EXPNO= 1
##$NAME= <c13>
##$PROCNO= 1
##$TYPE= <nmr>
##$USER= <she>
##$AMP= (0..31)
100 100 100 100 100 100 100 100 100 100 100 100 100 100 100 100 100 100 
100 100 100 100 100 100 100 100 100 100 100 100 100 100 
##$AQSEQ= 0
##$AQ_mod= 1
##$AUNM= <au_zg>
##$AUTOPOS= <>
##$BF1= 50.322709
##$BF2= 200.13
##$BF3= 50.322709
##$BF4= 500.13
##$BF5= 500.13
##$BF6= 500.13
##$BF7= 500.13
##$BF8= 500.13
##$BYTORDA= 1
##$CFDGTYP= 0
##$CFRGTYP= 5
##$CHEMSTR= <none>
##$CNST= (0..31)
1 1 145 1 1 1 1 1 1 1 1 1 1 1 1 1 1 1 1 1 1 1 1 1 1 1 1 1 1 1 1 1 
##$CPDPRG= <waltz16>
##$CPDPRG1= <>
##$CPDPRG2= <waltz16>
##$CPDPRG3= <>
$$ [...]
##$SUBNAM4= <"">
##$SUBNAM5= <"">
##$SUBNAM6= <"">
##$SUBNAM7= <"">
##$SUBNAM8= <"">
##$SUBNAM9= <"">
##$SW= 239.972175391363
##$SWIBOX= (0..15)
0 1 3 0 0 0 0 0 0 0 0 0 0 0 0 0 
##$SW_h= 12077.2946859903
##$TD= 32768
##$TD0= 1
##$TE= 0
##$TE2= 300
##$TE3= 300
##$TEG= 300
##$TL= (0..7)
120 120 120 120 120 120 120 120 
##$TP= (0..7)
150 150 150 150 150 150 150 150 
##$TP07= 0
##$TPNAME0= <>
##$TPNAME1= <>
##$TPNAME2= <>
##$TPNAME3= <>
##$TPNAME4= <>
##$TPNAME5= <>
##$TPNAME6= <>
##$TPNAME7= <>
##$TPOAL= (0..7)
0.5 0.5 0.5 0.5 0.5 0.5 0.5 0.5 
##$TPOFFS= (0..7)
0 0 0 0 0 0 0 0 
##$TUNHIN= 0
##$TUNHOUT= 0
##$TUNXOUT= 0
##$USERA1= <user>
##$USERA2= <user>
##$USERA3= <user>
##$USERA4= <user>
##$USERA5= <user>
##$V9= 5
##$VALIST= <valist>
##$VCLIST= <CCCCCCCCCCCCCCC>
##$VD= 0
##$VDLIST= <DDDDDDDDDDDDDDD>
##$VPLIST= <PPPPPPPPPPPPPPP>
##$VTLIST= <TTTTTTTTTTTTTTT>
##$WBST= 1024
##$WBSW= 4
##$XGAIN= (0..3)
0 0 0 0 
##$XL= 0
##$YL= 0
##$YMAX_a= 132260064
##$YMIN_a= -31554028
##$ZGOPTNS= <>
##$ZL1= 120
##$ZL2= 120
##$ZL3= 120
##$ZL4= 120
##$ABSF1= 222.6533
##$ABSF2= -17.34351
##$ABSG= 5
##$ABSL= 3
##$ALPHA= 0
##$AQORDER= 0
##$ASSFAC= 0
##$ASSFACI= 0
##$ASSFACX= 0
##$ASSWID= 0
##$AUNMP= <proc_1d>
##$AZFE= 0.1
##$AZFW= 0.5
##$BCFW= 0
##$BC_mod= 2
##$BYTORDP= 0
##$COROFFS= 0
##$CY= -3
##$DATMOD= 1
##$DC= 0
##$DFILT= <>
##$DTYPP= 0
##$F1P= 0
##$F2P= 0
##$FCOR= 0.5
##$FTSIZE= 32768
##$FT_mod= 6
##$GAMMA= 0
##$GB= 0
##$INTBC= 1
##$INTSCL= 4.134877e-10
##$ISEN= 128
##$LB= 1
##$LEV0= 0
##$LPBIN= 0
##$MAXI= 10000
##$MC2= 0
##$MEAN= 0
##$ME_mod= 0
##$MI= 0.1934396
##$NCOEF= 0
##$NC_proc= 2
##$NLEV= 6
##$NOISF1= 120.0001
##$NOISF2= 80.00006
##$NSP= 0
##$NTH_PI= 0
##$NZP= 0
##$OFFSET= 222.6533
##$PC= 1.4
##$PHC0= -300.4371
##$PHC1= 34.56394
##$PH_mod= 1
##$PKNL= yes
##$PPARMOD= 0
##$PSCAL= 0
##$PSIGN= 0
##$REVERSE= no
##$SF= 50.322730123286
##$SI= 32768
##$SIGF1= 140
##$SIGF2= 120
##$SINO= 11.81781
##$SIOLD= 32768
##$SREGLST= <13C.CDCl3>
##$SSB= 0
##$STSI= 32768
##$STSR= 0
##$SW_p= 12077.2946859903
##$SYMM= 0
##$S_DEV= 0
##$TDeff= 32768
##$TDoff= 0
##$TI= <>
##$TILT= no
##$TM1= 0
##$TM2= 0
##$TOPLEV= 0
##$USERP1= <user>
##$USERP2= <user>
##$USERP3= <user>
##$USERP4= <user>
##$USERP5= <user>
##$WDW= 1
##$XDIM= 32768
##$YMAX_p= 480669501
##$YMIN_p= -2441766
$$ End of Bruker specific parameters
$$ ---------------------------------
##NTUPLES= NMR SPECTRUM
##VAR_NAME=  FREQUENCY,     SPECTRUM/REAL,   SPECTRUM/IMAG
##SYMBOL=    X,             R,               I
##VAR_TYPE=  INDEPENDENT,   DEPENDENT,       DEPENDENT
##VAR_FORM=  AFFN,          ASDF,            ASDF
##VAR_DIM=   32768,         32768,           32768
##UNITS=     HZ,            ARBITRARY UNITS, ARBITRARY UNITS
##FACTOR=    0.368581032318806, 1,           1
##FIRST=     11204.5221812756, 0,            0
##LAST=      -872.772504714734, 0,           0
##MIN=       -872.772504714734, -2441766,    0
##MAX=       11204.5221812756, 480669501,    0
$$ Real data points
##PAGE= N=1
##DATA TABLE= (X++(R..R)), XYDATA
$$ [...]
15826B76894J12285j14052m18795j13477J23556J15541k08145o05806m78049K4128
15816a285920J92656M20864L47090l8595k65800m1778M509M8433l4813k15229
15806h68583J98407L72781j39955k88570J68166L77930J18790L33985L75097J84009
15796H32057k59968n03962m17424m94649R6439L75213J98940K9723j98676j26482
15786d68789o3398J11878J97128M22894M51773L8058l03117l57782M3371j38078
15776f6062j22938l6284m6113J33028J12253q8616P2648J94798j68207m80683
15766d96176j39963O9627M90598J53770l90065j28991M2985n3240l13437n63117
15756a328009j23129L36669O67773M68590J91371J69766J58808k8744l67516m09971
$$ plain form
15826 276894 389179 275127 -143668 -257145 -133589 -18048 -226193 -831999 -1310048 -1285920
15816 -1285920 -1093264 -672400 -325310 -363905 -629705 -671483 -666974 -618541 -653354 -868583
15806 -868583 -670176 -297395 -437350 -725920 -557754 -179824 -61034 272951 648048 832057
15796 832057 572089 68127 -349297 -843946 -747507 -372294 -173354 -143631 -342307 -468789
15786 -468789 -532187 -420309 -223181 199713 651486 689544 386427 28645 72016 -66062
15776 -66062 -189000 -225284 -271397 -138369 -26116 -114732 -42084 152714 -15493 -496176
15766 -496176 -636139 -566512 -75914 77856 -312209 -441200 -398215 -451455 -764892 -1328009
15756 -1328009 -1451138 -1114469 -446696 21894 213265 383031 541839 513095 145579 -264392
15746b64392K76530J98242n4105M1276J76127q527m0405r4539M5662l0252o0081
15735A85536L03685j70613k80404J48608J35427j95671m72832l57651P2241N59202
15725g2472K81804l9388L05738L46183K14289o40985q61396m41528Q7773P52809
15715f7173M82192j3294m84087J50356M61315K5844j39277m6286o0042j2590m1234
15704B55724J72q9096k82297k76351J16305J96288K09639K56763O9673j36268
15694C20552k28095j37836m73076m44606k26183J11416N11312M38976K3843k70324
15684c74021k58804L07010J32375m65687o63279j11543J74080J63062K73006Q0337
15674g43464J20332M67362J08717j41543j07381j86821p5613J50930J45385o4620
$$ plain form
15746 -264392 12138 210380 156275 197551 373678 365151 324746 230207 275869 245617 185536
15735 185536 489221 318608 38204 186812 322239 126568 -346264 -703915 -631674 -72472
15725 -72472 209332 169944 475682 821865 1036154 395169 -466227 -907755 -819982 -67173
15715 -67173 415019 401725 -82362 67994 529309 555153 415876 369590 309548 296958 255724
15704 255724 255896 166800 -115497 -391848 -275543 -79255 130384 387147 456820 320552
15694 320552 92457 -45379 -518455 -963061 -1189244 -1077828 -566516 -127540 -103697 -374021
15684 -374021 -632825 -325815 -193440 -659127 -1322406 -1433949 -1259869 -1096807 -823801 -743464
15674 -743464 -623132 -155770 -47053 -188596 -295977 -482798 -558411 -407481 -262096 -326716
15664c26716J9168K28701Q5963k05533K2298J09530K1716J13978k05821k60243
15654c96959K18206J57102l48323l36122q9734L22222L32048J86538M51152p458
15644D88672m91907q6165o2980K30404k73735m59882L43355J67438p8201j20818
15634c43819l56066l19069p8594k48081j58234K60176L59494O5054l3460j80293
15624a032892J8082M15397L37833J65619l41385l67034M4481L66337J17529J2449
15614b63584m21081j88100J45634K73098J71808L44878M39361q7561n65684m55645
15604f06876l91748k1593J06859j86569j02199L54253R18154O74535J73772j30869
15594G87719K6888j1052j61579l56851j17455K9281k48290J23234J85672J09126
$$ plain form
15664 -326716 -307548 -78847 7116 -198417 -176119 -66589 -44873 69105 -136716 -396959
15654 -396959 -178753 -21651 -369974 -706096 -795830 -473608 -141560 44978 496130 488672
15644 488672 -3235 -89400 -152380 78024 -195711 -655593 -312238 -144800 -223001 -343819
15634 -343819 -699885 -1018954 -1097548 -1345629 -1503863 -1243687 -884193 -819139 -852599 -1032892
15624 -1032892 -1014810 -599413 -261580 -95961 -437346 -804380 -759899 -393562 -276033 -263584
15614 -263584 -684665 -872765 -727131 -454033 -282225 62653 502014 414453 -151231 -606876
15604 -606876 -998624 -1020217 -913358 -1099927 -1202126 -847873 70281 744816 918588 787719
15594 787719 814607 803555 641976 285125 167670 196951 -51339 71895 257567 366693
15584C66693p503m46177k95299O0856J47125p8261j06623J34461O58627J80177
15574F14076k65583m40804m80909K82192L15971J92798M70852L48726j07649j72821
15564G56849l38222o0798o93443n14168q4527j52087K17594J54758J57027J30371
15554d26646K31629N22582L2227k54476j45777K82983J56793J72338N50634K94275
15544A416562l71828q13791n59238n066K14371K12578l23015n26009j79474J28674
15534h06236M97536N49387L27243l44843n37438l01113q086m5429K30637K45856
15524a92486k96173j21506P15898M49584M8626r8480p96491j064853m11319J52799
15514a614401j5792J27518M68869L45712q2972J91961O35983J11934l09292l17916
$$ plain form
15584 366693 359190 -86987 -382286 -321430 -174305 -252566 -359189 -224728 433899 614076
15574 614076 348493 -92311 -573220 -291028 24943 217741 688593 1037319 929670 756849
15564 756849 418627 357829 -335614 -849782 -934309 -1086396 -868802 -714044 -557017 -426646
15554 -426646 -195017 327565 359792 105316 -40461 242522 399315 571653 1122287 1416562
15544 1416562 1044734 230943 -328295 -333361 -118990 93588 -229427 -755436 -934910 -806236
15534 -806236 -308700 240687 567930 223087 -314351 -615464 -623550 -668979 -438342 -192486
15524 -192486 -488659 -610165 105733 555317 603943 505463 -291028 -1355881 -1767200 -1614401
15514 -1614401 -1630193 -1502675 -1033806 -688094 -771066 -579105 56878 168812 -140480 -458396
15504d58396n5137j956j08550l54751J16701L04374L07937J07410j40226k13543
15494d96137l16737k35404k86188q4877Q055M58979M29362J42832K28748K95961
15484A44594j3808l3155P6390l15031k46140j46164l42597j26271L31462J11494
15474e59226J00095J62697j38939m27956m9L04941J05897J99682L64388j47340
15464c5810n75436l65362L67789N75752M34891J42997Q5044M97190m5332j033714
15454D8009p98394k24818k36891M7765N66458O28069K10577k24599j70720k56797
15444d11341j42912j14575k42858L93026P14593q9109k39018k48594n18705m05769
15434a305262J22849J09928j60540j0484L13424K45404N3822r2468L4523j29372
$$ plain form
15504 -458396 -513533 -515489 -624039 -978790 -862089 -557715 -249778 -142368 -282594 -496137
15494 -496137 -812874 -1048278 -1334466 -1419343 -1411288 -952309 -522947 -380115 -151367 144594
15484 144594 130786 97631 174021 -141010 -387150 -533314 -875911 -1002182 -670720 -559226
15474 -559226 -459131 -296434 -435373 -863329 -863378 -558437 -452540 -252858 111530 -35810
15464 -35810 -611246 -976608 -608819 -33067 401824 544821 629865 1127055 1081723 48009
15454 48009 -750385 -975203 -1212094 -1164329 -597871 30198 240775 16176 -154544 -411341
15444 -411341 -554253 -668828 -911686 -518660 195933 106824 -132194 -380788 -899493 -1305262
15434 -1305262 -1182413 -1072485 -1233025 -1243509 -930085 -684681 -630859 -723327 -688804 -818176
15424h18176k96853l05144K21049L0229J18603K21674M46658J89430k76782j33555
15414f02867J34052K57015O6762M5465K64328j02233l27841J96315M77861J47071
15404E55928j25757O2733N09502K94396k04009l42772m64355j57008J46570J42682
15394D17910j56991n35412k72168K23343L5392j79293j94979K6009M11858L18868
15384I4537K34302Q2601n1494m36093m37054l0250o9552P577N1843M2023P4685
15373d36875l8572k63849k11362J84786N60526J52858L6743J15639J85447R9539
15363C84880k20226n63814m88869j2926K81788O36039M76493J35818m0804m11235
15353A77144n10679k99426r8756j63155J60352J84827j51124k68268M7235O9389
$$ plain form
15424 -818176 -1115029 -1420173 -1199124 -1168895 -1050292 -828618 -381960 -192530 -469312 -602867
15414 -602867 -468815 -211800 -145038 -99573 164755 62522 -265319 -69004 408857 555928
15404 555928 430171 492904 1002406 1296802 1092793 750021 285666 128658 275228 417910
15394 417910 260919 -274493 -546661 -323318 -287926 -467219 -662198 -636189 -224331 94537
15384 94537 328839 411440 359946 -76147 -513201 -543451 -613003 -605426 -553583 -511560 -436875
15373 -436875 -475447 -739296 -950658 -765872 -205346 -52488 -15745 99894 285341 384880
15363 384880 164654 -399160 -888029 -900955 -619167 16872 493365 629183 588379 177144
15353 177144 -333535 -632961 -731717 -894872 -734520 -549693 -700817 -969085 -921850 -852461
15343h52461J6832J82930K64753k95445K8748J78951N2270l4937k28158J70018
15333e16499K89285J67803J03420J53128L23767M69610M4892m86400j95153l8127
15323C15726j59473l14744k91605j72298M40117P10223O9594O3763M63744N0252
15313A175299m28640n77074o3753M9335J77454K8657q5702k22935j91754j37256
15303b76369m8119K26078J59971K49878j25059l45538n2977j36508q4536K23942
15293b09237N24903L41035P7560J86127L60494o2287j56612j65601k07442j61788
15283E27152q9271k08262k60396O7892M13982j988j86602K21314O30257K02197
15273A316275m83747m42237j03854l96094l09978J7498L2955K96131J03671k71281
$$ plain form
15343 -852461 -835629 -652699 -387946 -683391 -654643 -475692 -423422 -458359 -686517 -516499
15333 -516499 -227214 -59411 44009 197137 520904 990514 1035406 549006 353853 315726
15323 315726 156253 -158491 -450096 -622394 -182277 527946 597540 661303 1125047 1175299
15313 1175299 746659 169585 105832 155167 332621 361278 275576 52641 -139113 -276369
15303 -276369 -324488 -98410 61561 311439 186380 -159158 -212135 -348643 -433179 -209237
15293 -209237 315666 656701 734261 920388 1280882 1218595 1061983 896382 688940 527152
15283 527152 437881 229619 -30777 37115 451097 449109 262507 483821 1114078 1316275
15273 1316275 832528 390291 286437 -109657 -419635 -402137 -369182 -73051 30620 -240661
15263b40661q7992R8860J00899L62420j00363o1862l2095K92759K92613J97843
15253H22421K65952q4914m89826m95810o13802m58618J04738N7720L91497K56654
15243b43988l34703L15424P73591L53273P2407K00313j971J5552k097n03457o53537
15232i193j84974r4061m9840L01445K17768k54118j50717l84754k88167k2784
15222i19395j55993q59p2899o80117o12503N7929O58997P55395J92311J24609
15212f52525k24859k97465J48103M13785N52101M83754O6818k17507M0589p2835
15202B39959l82376k8237m4892o5473J60506M85467o6153j88154J4439j26087
15192a001k76446j10515L25900M42640K23644j86172k1M0434l60804j32670M35369
$$ plain form
15263 -240661 -328653 -229793 -128894 233526 133163 71301 39206 331965 624578 822421
15253 822421 1088373 1003459 513633 17823 -595979 -1054597 -949859 -892139 -500642 -243988
15243 -243988 -578691 -263267 510324 863597 936004 1136317 1134346 1149898 1147801 644344 -9193
15232 -9193 -194167 -288228 -338068 -36623 181145 -72973 -223690 -608444 -896611 -919395
15222 -919395 -1075388 -1076247 -1149146 -1829263 -2441766 -2383837 -1724840 -969445 -777134 -652525
15212 -652525 -877384 -1174849 -1026746 -612961 -60860 422894 489712 272205 312794 239959
15202 239959 -142417 -170654 -215546 -281019 -120513 364954 298801 110647 125086 -1001
15192 -1001 -277447 -387962 -62062 380578 604222 418050 418029 458463 97659 -35011 400358
15181D00358N86879M34358l68147p13645l74989N08671N58948n5312n08272m90116
15171b1267K08894L07466k37271k62415o8713K4838l4051o7276L65702J81175
15161C97082j55666k16852l36697j44997L10283J50371q0966N8180J94699o7626
15151A07811Q5192L8810P7607l01248n09072j42758j28519k62550J96752O56659
15141a81316J24143j09666O5559K85377j2438p2469K7716m2445p7786M2908J13063
15130A62646n1508j27287l45062m53278k78765J81714O8943j27278J66089J94196
15120f09590n46K3666m2242J01959J07850L1047n5758j02386L5793J11756J17694
15109b80757J20320P11544K61445k11145j18477k24619J4791P5572k62545j47283
$$ plain form
15181 400358 987237 1421595 1053448 339803 -35186 473485 1032433 977121 468849 -21267
15171 -21267 187627 495093 257822 -4593 -73306 -48468 -82519 -149795 215907 397082
15161 397082 241416 24564 -312133 -457130 -146847 3524 -77442 -19262 175437 107811
15151 107811 193003 231813 309420 8172 -500900 -643658 -772177 -1034727 -837975 -181316
15141 -181316 -57173 -166839 -101280 184097 171659 99190 126906 84461 6675 49583 162646
15130 162646 111138 -16149 -361211 -814489 -1093254 -911540 -842597 -969875 -803786 -609590
15120 -609590 -610136 -586470 -628712 -526753 -418903 -387856 -443614 -546000 -510207 -398451 -280757
15109 -280757 -160437 551107 812552 601407 482930 258311 273102 348674 86129 -61154
15099f1154l09407j29049Q2797l07196l73121r6655L57070L21314m8967j9538
15089e83906K04136J97250m93537l62360K30279j04J81724M59220M16207n7781
15079A91128m13170l298M90925K78967R1276J80297q0072j09303k62084o36525
15069b71859m04323O8546R0517k60160n09516k65528O3027M39236o656k50918
15059a307634j59874M48630M75807j4255R3967K42994N7850j20787j16783k51264
15049f51349M9536J14803j22838n47354o0696N52212N06661N44108L29055n2273
15039F61865m66257n42040r8396K05809L89584J68763K18899J56051k56466k92774
15029A45038j66747j5331J35660K91224m4350m6804k01375k84596j94355q2745
$$ plain form
15099 -61154 -370561 -499610 -416813 -724009 -1097130 -1193785 -836715 -515401 -564368 -583906
15089 -583906 -379770 -182520 -676057 -1038417 -808138 -808242 -626518 -167298 248909 191128
15079 191128 -222042 -225340 265585 544552 635828 816125 736053 626750 364666 -271859
15069 -271859 -676182 -607636 -517119 -777279 -1286795 -1552323 -1489296 -1050060 -1056716 -1307634
15059 -1307634 -1467508 -1018878 -543071 -557326 -463359 -220365 -162515 -283302 -400085 -651349
15049 -651349 -601813 -487010 -609848 -1157202 -1217898 -665686 -159025 385083 714138 661865
15039 661865 195608 -346432 -444828 -239019 150565 319328 538227 694278 437812 145038
15029 145038 -21709 -37040 98620 389844 345494 298690 97315 -187281 -381636 -464381
15019d64381P07694M82133j01624k65042l12321j33957L9539M51185L50477J4295
15009G67998l19020j97903k50558R4410K51088n8254J07840j0232k65433j85115
14999f5179J2523j97984q5953K22088J89457k6718J75374k05417m14498R7315
14989b98992J87247K53776n5404p1567o5370k68993l31611j0173J95909L33980
14979a31198q979k17500l20065j46948K60076M33778K38104j42619j61906J33121
14969f4136L42289J09445q0370L7692J32534k93589m55930j97853k72456p2448
14959h14822j2092O3578N25696L88239r7403j10350k02775j84124J5243p2743
14949e01553P3842J15251j26688K17611J42621j51582K63120K55217K0887K48732
$$ plain form
15019 -464381 243313 725446 623822 358780 46459 -87498 -47959 403226 753703 767998
15009 767998 448978 251075 517 94927 346015 287761 395601 385369 119936 -65179
14999 -65179 -52656 -250640 -336593 -114505 74952 48234 223608 18191 -396307 -298992
14989 -298992 -111745 142031 86627 15060 -50310 -319303 -650914 -661087 -465178 -131198
14979 -131198 -140177 -357677 -677742 -824690 -564614 -130836 107268 -35351 -197257 -64136
14969 -64136 278153 387598 307228 344920 477454 183865 -272065 -469918 -742374 -814822
14959 -814822 -826914 -763336 -237640 150599 53196 -57154 -259929 -444053 -428810 -501553
14949 -501553 -427711 -312460 -439148 -221537 -78916 -230498 32622 287839 308726 557458
14939E57458J58807k23238j63103j51027Q3481K10914k59415l95527k90567O8550
14929d03667P99171O00665M55131J36865k53134l44264n10553n60533k98121l7499
14919d15939K60045r3129o6755K64137K8596l88061k32082o0393J7253K82354
14909d03974L30073j09164k52943j56583L64842L40152o9318R3045k00250l51152
14899d15272k76493k61783k95049K0244L78918J74300K7567M10808L53751P2305
14889A89296J17988J09122q128M13134J18443k14551k83956J332q6041q098m36750
14878h8209m32473k14917m7264N64118J35646k37228J06627K87050K66145j65929
14868A73566k50588K42318K32789J28585K27631O0744k33105J01601J39631L5422
$$ plain form
14939 557458 716265 493027 329924 178897 262378 473292 213877 -181650 -472217 -403667
14929 -403667 395504 996169 1451300 1588165 1335031 990767 480214 -80319 -378440 -415939
14919 -415939 -155894 -249023 -315778 -51641 -23045 -411106 -643188 -703581 -686328 -403974
14909 -403974 -73901 -183065 -436008 -592591 -227749 112403 43085 136130 -64120 -415272
14899 -415272 -691765 -953548 -1248597 -1228353 -849435 -675135 -647568 -236760 116991 189296
14889 189296 307284 416406 408278 821412 939855 725304 441348 442680 356639 348541 -88209
14878 -88209 -520682 -735599 -782863 -218745 -83099 -320327 -213700 73350 339495 173566
14868 173566 -77022 165296 398085 526670 754301 815045 581940 683541 823172 858594
14858H58594j36255o2235k07101n60978n93359p5825m5979P8122j29034M0719
14848h33331J25541k18033l01418N4497O27654P07402J93259K79991K6820m10516
14838B51866q378o2299m76125r0352L61449N70954J00057l60198p2518K16315
14828D30771M09630r492l86147K31719N91667l64688o60660l12008k53267p0976
14818c93451J6258J85849k7736m52491m09335J17701L25123k82781m23409J76957
14808a167315L68390R9645j06915q2081m25958k54561L61445J33320N0069Q5568
14798i38393K41539M07895O90484M30599L4389l79398l73024l4373k13116j0302
14788a43700K7822j75724k06024M4014J8519j56893m1904k16344J3057K6967k62874
$$ plain form
14858 858594 722339 660104 453003 -107975 -701334 -777159 -823138 -745016 -874050 -833331
14848 -833331 -707790 -925823 -1227241 -1172744 -545090 162312 355571 635562 662382 251866
14838 251866 243488 181189 -294936 -385288 -23839 547115 647172 286974 214456 430771
14828 430771 840401 830909 444762 676481 1268148 903460 242800 -69208 -322475 -393451
14818 -393451 -377193 -191344 -219080 -671571 -1080906 -963205 -638082 -920863 -1344272 -1167315
14808 -1167315 -798925 -699280 -806195 -888276 -1314234 -1568795 -1207350 -1074030 -1023961 -938393
14798 -938393 -696854 -288959 401525 832124 866513 487115 114091 79718 -133398 -143700
14788 -143700 -115878 -291602 -497626 -453612 -435093 -591986 -633890 -850234 -837177 -810210 -1073084
14777a073084j83952j21349J00666L29405M59846K66547j73784k3126R8941K46848
14767g3042M31389o0608r1982K6077j55381L25039M18336m0616n37603n27684
14757b86075k14853r2926j83543p5J65675N57001M33434j0515k06978m60904J45647
14746a54112M15911J19247K0137k58552n73318l91486K42212M42938L98157K5303
14736B86437j82710j20456J07271J57140Q2129m5246L12804N12332J50160j03175
14726A156686k59211m68340o32783j86099l14945k00690Q133K40736L70870J10344
14716a75299N648L5738k45894J95842O13574R8860l71617l14374o9450J23574
14706a03398J74697k29812j59155N0970j20309n02305l72374K36932N06821O14276
$$ plain form
14777 -1073084 -1257036 -1378385 -1277719 -948314 -488468 -221921 -395705 -418831 -319890 -73042
14767 -73042 358347 297739 205757 231834 76453 401492 819828 779212 241609 -286075
14757 -286075 -500928 -593854 -777397 -777472 -611797 -54796 378638 368123 161145 -299759 -154112
14746 -154112 261799 381046 401183 142631 -430687 -822173 -579961 -137023 261134 286437
14736 286437 103727 -16729 90542 247682 329811 284565 597369 1109701 1259861 1156686
14726 1156686 897475 429135 -203648 -389747 -704692 -905382 -897249 -656513 -285643 -175299
14716 -175299 -169651 -133913 -379807 -183965 429609 528469 156852 -157522 -226972 -103398
14706 -103398 71299 -158513 -317668 -266698 -387007 -889312 -1261686 -1024754 -517933 96343
14696I6343L94254k90590n56579m41199q7649J38857K53991K94700J7680l03397
14686d83589l25437o977J69112o7449m63307j63034K84857K04056N43854M71429
14676A63515J24960J68537K55015O3484k44591j44118l3049j23710p5305K04292
14666C59030J20725L60530L73205k57779k18227J90433l49626m43295k46004k46782
14656c57790l50981j78545m8372j66605o1573L44515M52078J2052m05435o13083
14646a373739O8675P02868N34255K3436m16487N7280J6074p6382J33488K67335
14636f3197Q5335k5362R2193n7869n24790n57725M69225R13520R7239m11945n23527
14625e06903k96733l59683n6542K20794J52371K47119K35571J10377J45099L03480
$$ plain form
14696 96343 490597 200007 -356572 -797771 -885420 -746563 -492572 -197872 -180192 -483589
14686 -483589 -809026 -816003 -646891 -714340 -1177647 -1340681 -1055824 -851768 -307914 163515
14676 163515 288475 457012 712027 775511 530920 386802 353753 230043 154738 359030
14666 359030 479755 840285 1213490 955711 737484 927917 578291 134996 -111008 -357790
14656 -357790 -708771 -887316 -935688 -1102293 -1163866 -819351 -367273 -355221 -760656 -1373739
14646 -1373739 -1305064 -602196 -67941 -44505 -460992 -403712 -387638 -464020 -330532 -63197
14636 -63197 22138 -3224 88969 31100 -493690 -1051415 -582190 331330 428569 16624 -506903
14625 -506903 -803636 -1163319 -1219861 -999067 -846696 -599577 -364006 -253629 -108530 194950
14615A94950K13266L4061k80340p06937o04909R4756K80947K49685J48347k2989
14605c99163J95467Q7182L01573K32571k23168k0412j10994o84062n19419j94072
14595a334497N30017P39873J23112q9060j00992O7199K50413M01359K2077j643
14585F07858L44838J74392k22584n34198l48916j28942K78279J43695O2224K4427
14575D01073l9603l8665j55490p6246q9434j42142l80796j80649L311J75171j26952
14564f50422J24543j78171j02967m4551j81891k5683M4554J54240o1527J86837
14554g35038K84401L69547N31201k15666k19921j71285M8089M4281k94692j52391
14544e11474N8404l11362l7328M04336j6453J006N37026L49306l04003k41199
$$ plain form
14615 194950 408216 442277 161937 -545000 -1149909 -1055153 -774206 -524521 -376174 -399163
14605 -399163 -203696 -116514 185059 417630 194462 174050 63056 -621006 -1140425 -1334497
14595 -1334497 -804480 -64607 58505 -30555 -131547 -64348 186065 587424 609501 607858
14585 607858 952696 1127088 904504 370306 21390 -107552 170727 314422 376646 401073
14575 401073 361470 322805 167315 91069 1635 -140507 -521303 -701952 -698641 -523470 -650422
14564 -650422 -525879 -704050 -807017 -851568 -1033459 -1059142 -1014588 -860348 -921875 -735038
14554 -735038 -450637 -81090 450111 234445 14524 -156761 -108672 -64391 -359083 -511474
14544 -511474 -453070 -764432 -801760 -397424 -413877 -412871 124155 473461 169458 -71741
14534g1741J92315L36750j62564r10315p08257k1582J91576P20353N43200l24000
14524b14265m31843k18071Q4027q1995J26830L47783O43348L93502l6192L4522
14514F47646J14995l44166m27172j39513N3058Q2516q9302j69895J49854M7642
14504g4337J29221J42537j94956o1887J34852Q9085l15347l87280j67272J33105
14494e72279J5153j09737N2399L21015K39643K29211L47315j87053j84110L56833
14484E08390M22356j71413m33174O0259L8334J30885j51223n92121o82372k70521
14474a140600N99301P54355J13987m63293m41631j79512j57181P780J70449K74482
14464d61863M26269J96741k24601l44790m98208l32421j74946K6872K79648M02837
$$ plain form
14534 -71741 120574 457324 294760 -615555 -1323812 -1345394 -1153818 -433465 109735 -214265
14524 -214265 -646108 -864179 -780152 -862147 -735317 -387534 255814 649316 613124 647646
14514 647646 762641 418475 -8697 -148210 -95152 -12636 -101938 -271833 -121979 -74337
14504 -74337 54884 197421 2465 -59422 75430 164515 -150832 -538112 -705384 -572279
14494 -572279 -557126 -666863 -614464 -293449 -53806 175405 522720 335667 151557 508390
14484 508390 930746 759333 326159 386418 424752 555637 404414 -187707 -870079 -1140600
14474 -1140600 -541299 213056 327043 -136250 -577881 -757393 -914574 -906794 -736345 -461863
14464 -461863 -35594 161147 -63454 -408244 -906452 -1238873 -1413819 -1386947 -1107299 -704462
14454g04462M73007J84771q1937j19034o8284P5680L71198L79428L17766j10408
14444G17725l50192m36352j53996m77191j39315L68086L50421O01263q223m63843
14434H383l86568J37853L024P8280J67773M4560j17655j78204q2441r1552j48515
14423e65062L702J58357J55493K53207J76404J64686K89017J89222l10194p98015
14413b83183p32405l70967o7522J88427M9614o2940N9323K61226P98107L06401
14403A46081j72275K99649j1588m42993o2529M2913O1050l9772j08028J87092
14393a00400j14145N884J97601N49887J23233j99575K40662J70291n87652j024859
14383g39073j12693M46266L8591N2723O2102l89277k88558Q1314M6038L2203J46349
$$ plain form
14454 -704462 -231455 -46684 -128621 -247655 -315939 -240259 130939 510367 828133 717725
14444 717725 367533 -68819 -222815 -700006 -839321 -471235 -120814 480449 472226 8383
14434 8383 -378185 -240332 -237308 -159028 8745 53305 -64350 -242554 -324995 -416547 -565062
14423 -565062 -561360 -403003 -247510 5697 182101 346787 635804 825026 514832 -283183
14413 -283183 -1015588 -1386555 -1454077 -1265650 -1216036 -1278976 -1219653 -958427 -160320 146081
14403 146081 -26194 273455 261867 -181126 -243655 -200742 -139692 -179464 -287492 -100400
14393 -100400 -214545 -208661 -11060 538827 662060 462485 703147 873438 285786 -739073
14383 -739073 -851766 -405500 -366909 -314186 -252084 -641361 -929919 -848605 -802567 -770364 -624015
14372f24015L1817L938p4253l43542j98256K16348M74830N03093K02444m8351
14362A44053p3156l01023l41012K63938L22873K93770L5814l86502m6715L3501
14352e4459l1429j6512j88971K7963o0218n7664M9099r0460P4849M61073L51345
14341D64616r0621p2878L48014J55612k18483l41895k13028J10313K93241N14987
14331I49878K57642K296l27636l16606k80183L8798j05261j00365j34o1436o0991
14320c998j39550N30374K64112j57547j92561j38555L80319N84128L27456R7208
14310A551386j59976k48990k4745L03541j67379o47498j28466J07841j702j96828
14300C87184k53918l24085p97296l25830K55304L80632L27280K44408P1370j64840
$$ plain form
14372 -624015 -592198 -588260 -662513 -1006055 -1204311 -987963 -513133 -10040 192404 144053
14362 144053 70897 -230126 -571138 -307200 15673 309443 345257 -41245 -87960 -54459
14352 -54459 -85888 -102400 -291371 -263408 -323626 -381290 -332191 -422651 -347802 113271 464616
14341 464616 373995 301117 649131 804743 586260 244365 31337 141650 434891 949878
14331 949878 1207520 1209816 882180 565574 285391 324189 218928 118563 118429 56993 -3998
14320 -3998 -143548 386826 650938 493391 300830 162275 542594 1126722 1454178 1551386
14310 1551386 1391410 1142420 1117675 1421216 1253837 606339 477873 585714 584012 387184
14300 387184 133266 -190819 -988115 -1313945 -1058641 -678009 -350729 -106321 -34951 -199791
14290a99791o44922j08699K74494k40537j45668N30621M29738K46917j81118n07694
14280e46659r5970J6718j95662l9410L06474M07939P6636j08820l27555l23955
14270h30264N086K74122N28280R3379l52202J55474M39134L15509m59866j85886
14260a7234J88349q2253O3783j32529j27261M42415N37424j12785j04186m05108
14250B50615n58600m23669j03000K3332k71453J54462L62776j11603q8171n86
14240g65897n8440M9718N7806p604J0538J00853M44948M73755L27831n0650n45353
14229C7505l73784k09996m6743R9955J71341R946K25869L14081L98551R850j26529
14218E10046j67797l15145k28182k44342P4429O03670M90696k68435p16175l61924
$$ plain form
14290 -199791 -844713 -953412 -678918 -919455 -1065123 -534502 -104764 142153 -38965 -546659
14280 -546659 -642629 -625911 -821573 -860983 -554509 -146570 -69934 -178754 -506309 -830264
14270 -830264 -825178 -551056 -22776 70603 -281599 -126125 313009 628518 168652 -17234
14260 -17234 171115 88862 152645 20116 -107145 335270 872694 759909 655723 250615
14250 250615 -307985 -731654 -834654 -811322 -1082775 -928313 -565537 -677140 -765311 -765897
14240 -765897 -824337 -774619 -716813 -724417 -713879 -613026 -168078 305677 633508 582858 37505
14229 37505 -336279 -546275 -593018 -493063 -321722 -311776 -85907 228174 626725 636575 510046
14218 510046 342249 27104 -201078 -445420 -370991 232679 723375 454940 -261235 -623159
14208f23159O8359J14394M69427N86426R0899J46431J21071p9450k84591n51011
14198E8796m96020l29741q2266k14806q699R8860J39088N54391Q39222M69300
14188A028125p7409k03645K34333J81336J8965o02371q58019j24170J96727M17202
14178B11074J7263m70093J2483L60719j17516m16385l91717k75847K11529M30364
14168d28126J34799j80j31584J45266M28871J46195j01698r8128M4084j53256
14158a3757J33009J91436m19045m04052J8531k32962L3123K22500L83786J44051
14148E6620l41443l66265J98515N39030M52920J54753n1087j15079j21423k73839
14138A32702p3512J00072j713Q4862j06330j58870M0909L86332J88551j66985
$$ plain form
14208 -623159 -554800 -440406 29021 615447 706346 852777 973848 894398 609807 58796
14198 58796 -437224 -766965 -849231 -1064037 -1072736 -973876 -834788 -280397 558825 1028125
14188 1028125 950716 747071 981404 1162740 1181705 579334 -278685 -402855 -206128 211074
14178 211074 228337 -241756 -229273 131446 13930 -402455 -794172 -1070019 -858490 -428126
14168 -428126 -293327 -293507 -425091 -279825 149046 295241 193543 95415 139499 -13757
14158 -13757 119252 310688 -108357 -512409 -493878 -726840 -693717 -471217 -87431 56620
14148 56620 -284823 -651088 -452573 86457 539377 694130 643043 527964 406541 132702
14138 132702 59190 159262 157549 242411 136081 -22789 18120 404452 593003 426018
14128D26018l27752l9407J79182K45333O8044j10511o8113q0885P371m6906p5051
14117A77323j68030j80286N8066k0653L8246L31672J00791j52076p3425j05776
14107E852l31540j72754K42890J27667k1033k58988l22600r8922m64769j19751
14097a413948N42542M03543L48021J47196j2956N1433M40694K85924j99940k02818
14087C89691k05688j99596l37659k56093P1978L59353K63653j60002l77984j13933
14077e66280K21225K81620j43943r3399M32151L11156m3918k28784k02866k8745
14067f1783N2614L43401N55830r1797j71830q2382l39649P688L25330Q2848r5780
14056E24490j52221j34301j10998j02179r9609k04582k1024J44870Q3299k35588
$$ plain form
14128 426018 98266 58859 238041 483374 551418 440907 372794 291909 299280 252374 177323
14117 177323 9293 -170993 -112927 -133580 -95334 236338 337129 185053 111628 5852
14107 5852 -325688 -498442 -255552 -127885 -148918 -407906 -730506 -829428 -1294197 -1413948
14097 -1413948 -871406 -467863 -119842 27354 14398 65831 506525 792449 592509 389691
14087 389691 184003 -15593 -353252 -609345 -537367 -178014 85639 -74363 -452347 -566280
14077 -566280 -345055 -63435 -207378 -300777 131374 442530 398612 169828 -33038 -61783
14067 -61783 -9169 334232 890062 798265 626435 544053 204404 212092 537422 620270 524490
14056 524490 372269 237968 126970 24791 -74818 -279400 -300424 -155554 -72255 -307843
14046c07843L6635M02701J0002l0569K55890M9679k29702o52636k06425L0065
14036f42203J43363r8399j8167N4602J28090N28979M42560j06028L9342j75488
14026B96651m19696J23014R6155J50470J92292J96508K6161m03352o05909o05522
14016i53228k50324L9648n6166J19520J63288L5049K02304K08390k03637j28249
14006h23405R1863K71253R0388l89318J13326K98339m27489l12981M3716L35496
13996g08812M53036O0900j28401k11703J62429J79256K69410K68513l20609l73674
13986c49655j16943J78795q2237k32258J89122L62906L18126k88653o42658J38919
13976e24536N20638J51536k78646m5171K20186k34391M6584J92673o0980k6926
$$ plain form
14046 -307843 -271208 131493 141495 110926 366816 416495 186793 -465843 -672268 -642203
14036 -642203 -498840 -597239 -615406 -560804 -432714 96265 538825 432797 472139 296651
14026 296651 -123045 -31 96124 246594 438886 635394 661555 258203 -347706 -953228
14016 -953228 -1203552 -1163904 -1220070 -1100550 -937262 -902213 -699909 -491519 -695156 -823405
14006 -823405 -731542 -460289 -369901 -759219 -645893 -347554 -775043 -1088024 -1044308 -708812
13996 -708812 -255776 -194876 -323277 -534980 -372551 -193295 76115 344628 24019 -349655
13986 -349655 -466598 -287803 -370040 -602298 -413176 -50270 267856 -20797 -663455 -524536
13976 -524536 -3898 147638 -131008 -176179 44007 -190384 -143800 48873 -12107 -39033
13966c9033k90999k20078k52916J69155M94399J99514K415k37990k81818q9112
13956e46463J32949M36118p9619p4112K06405k04010n7919K60543m07764m87624
13946h21496M45660O27205L44426j98903l75148l59754k84675K9481K22767K15988
13936a54449K81849L3846k55251j30888L29411M07562L03636j86888m35795l8858
13926A54175o1628j26581k16870N344M08243J46833m34874j82655J68457n9389
13916a98945k41434j75991k36959j31721j1497K91826N34873M4040n43491k26990
13906h96289R8094M06394L21771L46923o2168j02575J09470l1224K9876j63566
13896E6706J59725n062m87577o26850k46592n65075K72939R09926L40702K8419
$$ plain form
13966 -39033 -330032 -550110 -803026 -633871 -139472 60042 62457 -175533 -457351 -546463
13956 -546463 -413514 22604 -57015 -131127 75278 -128732 -186651 73892 -333872 -821496
13946 -821496 -375836 251369 595795 396892 21744 -338010 -622685 -593204 -370437 -154449
13936 -154449 127400 161246 -94005 -224893 104518 512080 815716 628828 193033 154175
13926 154175 92547 -34034 -250904 -245560 162683 309516 -125358 -308013 -139556 -198945
13916 -198945 -440379 -616370 -853329 -985050 -996547 -704721 -169848 -125808 -669299 -896289
13906 -896289 -798195 -391801 -70030 276893 214725 112150 221620 190396 220272 56706
13896 56706 216431 211369 -276208 -903058 -1149650 -1714725 -1441786 -531860 -191158 -162739
13886a62739J38342M69936j4238m22411l88019M6936K17336L00592L8986k24619
13876A02n55193m73943j89692K29094K28402O913N945L05920L03137J64615K28464
13865B53764j54308j71611O6299j14661J27693j20455k48070o3704K3028P6402
13855c25623m70375n08729j14484m72355m60595l2627J45670N41243P63194M38785
13845d95896K23030q23j51995J29936J39929k09467k32257k50439k37086K84995
13835h00073N04701Q8813j674j34001l92235l3852R1925j43126m2957K63039J83967
13824d15473N4507o5539k09919M1031K92523K15448K8536J0344K79331J43288
13814C74077k91075k34508L72416J19500m79724j53004L10523L12721J46296p5221
$$ plain form
13886 -162739 -24397 445539 431301 8890 -379129 -332193 -114857 185735 224721 102
13876 102 -555091 -1029034 -1218726 -989632 -761230 -754317 -748372 -442452 -139315 25300 253764
13865 253764 99456 -72155 -5856 -120517 7176 -113279 -361349 -425053 -402025 -325623
13855 -325623 -795998 -1304727 -1419211 -1891566 -2352161 -2384788 -2239118 -1697875 -934681 -495896
13845 -495896 -272866 -273689 -425684 -295748 -155819 -365286 -597543 -847982 -1085068 -800073
13835 -800073 -295372 -206559 -208233 -342234 -734469 -768321 -676396 -819522 -862479 -599440 -415473
13824 -415473 -360966 -426505 -636424 -595393 -302870 -87422 -58886 -48542 230789 374077
13814 374077 83002 -151506 220910 340410 -139314 -292318 18205 330926 477222 402001
13804D02001J71125m82920m99480Q7895K48005O26798M56800M6146m467l36481
13794G15422j87538J10704j12353l89592n57511k54889L74481L25214q812k02608
13784a87482L9783L93866J73224j72390j33183j5458J02968j85337m05991j6977
13774d06977J12886J22554j47191k9769k3862p5273L25868L40779L57719j25175
13764D51559l44550O6386k8870J44319L2299j69839J74547L04264L78187J59744
13754A168046l07317m72284k45260J30400J25953j10517j25997r4110M17983N02921
13744I89818n7906m13650m67571k66752j45570L31860R4699q0374j0192P9524
13734E3886Q26j28212l8337J94075K42978N9807J0006l12099p75939n74622k45530
$$ plain form
13804 402001 573126 90206 -409274 -321379 -73374 553424 1010224 1056370 1051903 715422
13794 715422 527884 638588 526235 136643 -420868 -675757 -301276 23938 15126 -187482
13784 -187482 -147699 246167 419391 247001 113818 98360 201328 15991 -390000 -406977
13774 -406977 -294091 -171537 -318728 -348497 -372359 -447632 -121764 219015 576734 451559
13764 451559 107009 173395 144525 288844 321143 151304 325851 630115 1008302 1168046
13754 1168046 860729 388445 143185 273585 399538 289021 163024 68914 486897 989818
13744 989818 931912 518262 50691 -216061 -361631 -29771 64928 -15446 -25638 53886
13734 53886 54712 -73500 -111837 82238 325216 385023 395029 82930 -693009 -1267631 -1513161
13723a513161K98640L61920J90482N1931l58616j62418K33623k8726J9453P80372
13713a26500P74524P392o59225m63648l6660K81898K16010L12087q6889k54715
13703c5726J01824j0330k33906l23474j77942O38878M48901k81262R9551k28032
13693a518l03434j86207k03023J65098L91209L08513J24376N840P950m5562m65887
13682b02645l83521j05340Q844n2042k98719n21354k22066Q5864J62341J28963
13672a399675K15883O65484N55766J41072L9415J60421J13180m17692n02608j97368
13662f26122J37857K25255K00020j49892j83779K47049L88153K55236j38487l44777
13652A0513Q8355K58465p7284k26426k10346j29593J32239N42018L55011k63171
$$ plain form
13723 -1513161 -1214521 -852601 -662119 -610188 -968804 -1131222 -897599 -926325 -906872 -126500
13713 -126500 648024 655416 -3809 -467457 -504117 -222219 -6209 305878 218989 -35726
13703 -35726 66098 55768 -178138 -501612 -679554 -40676 408225 126963 226514 -1518
13693 -1518 -304952 -491159 -694182 -529084 -137875 170638 295014 300854 308804 263242 -202645
13682 -202645 -586166 -691506 -682662 -734704 -1033423 -1554777 -1776843 -1690979 -1528638 -1399675
13672 -1399675 -1183792 -518308 37458 178530 217945 378366 491546 73854 -428754 -626122
13662 -626122 -488265 -263010 -62990 -212882 -396661 -149612 238541 493777 355290 10513
13652 10513 98868 357333 280049 53623 -156723 -286316 -154077 387941 742952 479781
13642D79781l18164n9599R1503P9295j39814m10116n74130l04354O4410K10807
13632h80381J06118J09251j60874m21029j28682L06563M6792J74890J12715M17
13622g34220q6492k8695J6392K06358O38552M21581j71665o3320J02643l77677
13612g6543m76228l84212j47169J36137J03274K5575M8352J32447K34086K51983
13602a52298n7787j1099r5221P9613J43569k61865k7789J06718r0590J36676K42364
13591A2291K87157L42718J3504j08487l85687m5341N12373L67382l10647p02881
13581a7618k37487K65355m1346j61834j22492j35211J64275j1543n30718k45935
13571a074554M44390N46833K03990j80751j50999k85801l98585l36748P016K62321
$$ plain form
13642 479781 161617 102018 193521 272816 133002 -277114 -851244 -1155598 -1091188 -880381
13632 -880381 -774263 -665012 -825886 -1246915 -1375597 -1069034 -1022242 -847352 -734637 -734220
13622 -734220 -820712 -849407 -833015 -626657 11895 433476 261811 198491 301134 -76543
13612 -76543 -552771 -936983 -1084152 -948015 -844741 -819166 -770814 -638367 -404281 -152298
13602 -152298 -210085 -221184 -316405 -236792 -93223 -355088 -382877 -276159 -366749 -230073 12291
13591 12291 299448 642166 655670 547183 161496 116155 628528 995910 685263 -17618
13581 -17618 -255105 10250 -31096 -192930 -315422 -450633 -286358 -297901 -828619 -1074554
13571 -1074554 -630164 -83331 120659 -60092 -211091 -496892 -895477 -1232225 -1225209 -962888
13561i62888j86279p146L93814J76963m7977m4800J38831j75653p0838J42420
13551f43553j50849m69914Q4980L05520J98843O7774k51316J25765M51503k8646
13541c09893j05775j10411j23663k3979j17211R1890N41586K70995m67023j72208
13531e25692R4403K20866R4223L4237J40556K59590l12889k82237K6028J81550
13521f9365R4320N5909j00712k91180j90938K2991K64897L43192K47124n9731
13511C16507n68381n25410K37340M58833N56703K95719j56001k15962J07697k5739
13501D81306n56338k82829J61269K71848M0327l01263m27020j18260J8458Q3691
13491f28811L47068N56143J80363n6561j50087K908K03744O0265J36820J53291
$$ plain form
13561 -962888 -1149167 -1156313 -762499 -585536 -633513 -678313 -539482 -715135 -785973 -643553
13551 -643553 -794402 -1264316 -1179336 -873816 -674973 -607199 -858515 -732750 -281247 -309893
13541 -309893 -415668 -526079 -649742 -673721 -790932 -699042 -157456 113539 -353484 -525692
13531 -525692 -431289 -210423 -116200 -81963 58593 318183 5294 -276943 -250915 -69365
13521 -69365 24955 80864 -19848 -311028 -501966 -478975 -214078 129114 376238 316507
13511 316507 -251874 -777284 -539944 -81111 475592 771311 615310 399348 507045 481306
13501 481306 -75032 -357861 -196592 75256 115583 -185680 -612700 -730960 -712502 -628811
13491 -628811 -281743 274400 454763 398202 248115 251023 454767 515032 651852 805143
13481H05143J41711J80736N47556L35957l28127l41558k94447n7493o11528m39128
13471f1178R4188N8726j5590K38699M81619K23511j97562o13572l08149l55414
13461d54722k96080K88723J13211J46185K32231n2008o31342o97847J73055M14503
13451g64091K86086N0986m00347k77198K23206m9523l5074j01848o0142K82650
13441h45295N05037J16928j955L8464m8318j3104K26305L47404j46838m37834
13431b59206l33836r0329j22834R5667j8734j47184O4755M92703L78327J37617
13421A96946k30083m00059q7750P0303J67260Q5754J6787r3076o2800J13994p0160
13410b92884l17878J3678K86864o10234l57603M97797P24230O54224K34137j95631
$$ plain form
13481 805143 946854 1127590 1675146 2011103 1682976 1341418 1046971 989478 377950 -61178
13471 -61178 33010 91736 76146 314845 796464 1019975 822413 208841 -99308 -454722
13461 -454722 -750802 -462079 -348868 -202683 29548 -22460 -653802 -1351649 -1178594 -764091
13451 -764091 -478005 -427019 -827366 -1104564 -881358 -930881 -965955 -1067803 -1127945 -845295
13441 -845295 -340258 -223330 -225285 -186821 -235139 -248243 -21938 325466 178628 -259206
13431 -259206 -593042 -683371 -806205 -710538 -729272 -876456 -811701 -318998 59329 196946
13421 196946 -33137 -433196 -520946 -450643 -283383 -197629 -180842 -273918 -336718 -222724 -292884
13410 -292884 -610762 -597084 -310220 -920454 -1278057 -780260 -56030 598194 832331 636700
13400F36700J5162N24103O15537O6921n05419n97610m84382K9611j96626l1611
13390G2386P6846n36950k67818K65808J15147K04347J21062p9975k26750r4667
13380c50564K18066K80552k26750m57995j76130L44460m0002j79953L0541M26848
13370a30927J86959J3890Q1819j87165p8860n5628k0322J43143K38622M97125
13360F88656K03622O7802J7778l15570Q206R5444j08831m4292j3181l55645k17735
13349B6254O40705M27535k64056n78281k45404m84093q30457N5593N28124L04341
13339d19739J9358K97086K79165J38337j56727k31440K7571K93785J82580m22928
13329G048p61151M5705P35633L21327j1018p3430p8765N62218L34498k44253L7146
$$ plain form
13400 636700 651862 1175965 1791502 1858423 1353004 755394 271012 300623 103997 72386
13390 72386 149232 -387718 -655536 -389728 -274581 -70234 50828 -29147 -255897 -350564
13380 -350564 -132498 148054 -78696 -536691 -712821 -368361 -408363 -588316 -557775 -130927
13370 -130927 56032 69922 151741 -35424 -114284 -169912 -190234 -47091 191531 688656
13360 688656 892278 960080 977858 662288 670494 765938 657107 612815 599634 243989 26254
13349 26254 666959 1094494 830438 252157 6753 -477340 -1307797 -1252204 -724080 -419739
13339 -419739 -400381 -103295 175870 314207 157480 -73960 -46389 247396 429976 7048
13329 7048 -754103 -708398 27235 348562 337544 264114 185349 747567 1082065 837812 874958
13318H74958L6398j69292k80802j7119j67525p60508r04253K1329O92057P18245
13308D3488L26009n45625n642N86459P63665N02553k94577o87155n42134j55664
13298h623K73121r5316l17593R2893L64775L25108j811K28412j30601j40729k13792
13287C75844k72225k13020N5998M99969k9515J54157K02519J7046o2690p5061
13277F53022j708k78779j98676R7897M12099L98149m46516m79735J37985J65478
13267D59216l86649j88498K05499o4656l53059j31507J0828L4109R7181o0790
13257c78326N62321O97375J74514L34199J25783l21303k12195l14431m22914J20464
13247C65487L00596J66735O6580J12696N147J45465R4548j07075k02673p38072
$$ plain form
13318 874958 911356 742064 461262 444143 276618 -483890 -1388143 -1366814 -674757 43488
13308 43488 369497 -176128 -181770 404689 1168354 1670907 1376330 689175 147041 -8623
13298 -8623 264498 169182 -148411 -55518 309257 634365 632554 860966 730365 589636 375844
13287 375844 103619 -109401 -53403 446566 417051 571208 773727 790773 728083 653022
13277 653022 651314 372535 173859 271756 683855 1082004 635488 155753 293738 459216
13267 459216 72567 -115931 89568 24912 -328147 -459654 -448826 -414717 -317536 -378326
13257 -378326 183995 881370 1055884 1390083 1515866 1194563 982368 667937 245023 365487
13247 365487 666083 832818 899398 1012094 1017241 1162706 1257254 1150179 947506 209434
13237B09434m96892J67690J97405O3088k9946K31844J91075j17007m73333n26503
13227e83145j83233J77762P12825M50781o3508J652J58992l06204J49575K64286
13217G79783m63l15553l29664K9484K11029Q564r3432j30666j73454J26577L64917
13206D77122L05074L21618J27160p9262j59537o3183Q7857n37648o38412j96916
13196c56127l6640j98590R4248l6495l07830J30411J27726K26960P0999J18376
13186a66962O24548L66548k68261k75210K121O6815J51215O46710J68325j59918
13176A155931j3544m83040k38469l14199O3630M89618N00802j32471m35956j31987
13166D60315k00779j7712K71437J42364K15528K64714J17165k70095k37939l8093
$$ plain form
13237 209434 -287458 -119768 77637 140725 110779 342623 533698 416691 -56642 -583145
13227 -583145 -766378 -588616 124209 574990 511482 513134 672126 365922 515497 779783
13217 779783 779320 463767 134103 163587 374616 383180 289748 159082 -14372 112205 477122
13206 477122 782196 1103814 1230974 1151712 992175 928992 1016849 479201 -159211 -356127
13196 -356127 -392767 -591357 -497109 -533604 -841434 -711023 -583297 -356337 -285338 -166962
13186 -166962 457586 824134 555873 280663 282784 349599 500814 1147524 1315849 1155931
13176 1155931 1142387 659347 420878 106679 170309 659927 1160729 1028258 592302 460315
13166 460315 259536 241824 513261 655625 871153 1135867 1253032 982937 744998 706905
13156G06905j03165j56404k737J73719N8695K9396k81845n67570l06447K40126
13146b09327N79426M70287K78468J44838J48183K2761O4972Q6723j10534k14033
13136A261764l27454l16929k18358J50142N61645M65778N3133k70660n53463J82758
13126I88356Q21744M11145j15410O2321R8630j39217n710k21313n53163l40174
13116A007209M74766K92181k82934J5667L42087L14722K25574j05510l92255j49994
13106A741513K38690k57151l72749M27211M69232J53096m40080o05011o94308
13097F60443j27876J77662L30042K54533k77266m32047Q2705N09289L86070J2971
13087A576526l15473m0823Q26610O00550q5570j46853q3793j27011j1878n1491
$$ plain form
13156 706905 603740 447336 444599 618318 677013 706409 424564 -143006 -449453 -209327
13146 -209327 370099 840386 1118854 1263692 1411875 1434636 1499608 1586331 1475797 1261764
13136 1261764 934310 617381 399023 549165 1110810 1576588 1629721 1359061 805598 988356
13126 988356 1810100 2221245 2105835 2168156 2266786 2127569 2121859 1900546 1347383 1007209
13116 1007209 1481975 1774156 1491222 1506889 1848976 2163698 2389272 2283762 1891507 1741513
13106 1741513 1980203 1723052 1350303 1777514 2246746 2399842 1959762 1354751 660443
13097 660443 532567 710229 1040271 1294804 1017538 585491 668196 1177485 1563555 1576526
13087 1576526 1261053 1220230 2046840 2647390 2561820 2414967 2331174 2204163 2192285 2140794
13077B140794R69R6715q8333J51050K69852k31494k05376r724m99225k00710J17655
13066A542173J31364L54747N54526K11057m13810k06383K48470M16759J96373
13057C035276k98195l77788J28704L33226J93861L73684M22833P5358o7791K84874
13047D104042N92085K38680n55285k77370K4799j61868l1538K07165M06502k49699
13037D297513k37856L4833k29295n9149N8328M09035O50150N8837p02537p92569
13027C487290o812M66760N24072K80777L31819O40557K44580p7339K99046K0140
13017F210890l3442J95712M8263k12969j56353L3207J04968L10759M42256N74733
13007G518024M12840l4248K51933N45146m891K07340J98536L35612O10863K28705
$$ plain form
13077 2140794 2141763 2238478 2150145 2301195 2571047 2339553 2134177 2124453 1625228 1424518 1542173
13066 1542173 1673537 2028284 2582810 2793867 2380057 2173674 2422144 2838903 3035276
13057 3035276 2737081 2359293 2487997 2821223 3015084 3388768 3811601 3886959 3819168 4104042
13047 4104042 4696127 4934807 4379522 4102152 4126951 3965083 3933545 4140710 4547212 4297513
13037 4297513 4059657 4094490 3865195 3806046 3864374 4273409 4923559 4982396 4279859 3487290
13027 3487290 3480478 3947238 4471310 4752087 5083906 5724463 5969043 5891704 6190750 6210890
13017 6210890 6177448 6373160 6421423 6208454 6052101 6085308 6190276 6501035 6943291 7518024
13007 7518024 7930864 7896616 8148549 8693695 8688804 8896144 9094680 9430292 10041155 10269860
12997A0269860K19311N83726Q89200Q88612O17872R82860J615982J763604J535945
12988A9366972J269641J284033J212346J557579J670601J997988K727534L548913
12980C4635607M318813N027833N789752O611796P870897R751198J1990697J4732448
12972A00729041J8302838K3051412K9043147L7077009M7534144N9302339O8008917
12965C83048847O2244246K8535379k4161677o1968202p0743949o2041706m9083112
12958B05829826l7543052k8864064k2115905j7223743j3726850j1534207r416313
12951F5405692p093010n777517n608036n292012m114301k952861k673270k956474
12943B8938211k099327j409098j470031j016758p80035j211288j305630n63458
$$ plain form
12997 10269860 10489171 11072897 11962097 12850709 13468581 14451441 16067423 17831027 19366972
12988 19366972 20636613 21920646 23132992 24690571 26361172 28359160 31086694 34635607
12980 34635607 38954420 43982253 49772005 56383801 64254698 74005896 85996593 100729041
12972 100729041 119031879 142083291 171126438 208203447 255737591 315039930 383048847
12965 383048847 445293093 473828472 449666795 387698593 316954644 254912938 205829826
12958 205829826 168286774 139422710 117306805 100083062 86356212 74822005 65405692
12951 65405692 58312682 52535165 46927129 41635117 37520816 34567955 31894685 28938211
12943 28938211 26838884 25429786 23959755 22942997 22162962 20951674 19646044 19082586
12935A9082586m80531n19603r28287r21243k19823K77081L7549k55267m55222
12926A5617240m35837o47967l22265o949j54891p2773K24329O79374N35758M4595
12916A5460614j07284q3848J97629L87118N02526P24389Q22263O68742J065120
12907A9637269J766799J765557J435417R59367J20820k87508K54824J058798J204706
12898B7916049J199569J810096K247708K648584L075594L703984M818521N556523
12890E2976628O535789Q459089J0354778J2961425J5847570J9329572K4564213
12883A51029064L1102157L9804761N1229663O3503855P0752882N8423402J4823717
12876D80669501l9671604p0011748p1398553n9634715m6048976l5280294k7250941
$$ plain form
12935 19082586 18602055 18082452 17154165 16232922 16013099 16290180 16327729 16072462 15617240
12926 15617240 15181403 14533436 14211171 14204222 14049331 13976558 14200887 14880261 15416019 15460614
12916 15460614 15353330 15269482 15467111 15854229 16356755 17081144 17903407 18572149 19637269
12907 19637269 21404068 23169625 24605042 25564409 25685229 25397721 25652545 26711343 27916049
12898 27916049 29115618 30925714 33173422 35822006 38897600 42601584 47420105 52976628
12890 52976628 59512417 67971506 78326284 91287709 107135279 126464851 151029064
12883 151029064 182131221 221935982 273165645 336669500 407422382 465845784 480669501
12876 480669501 440997897 370986149 299587596 239952881 193903905 158623611 131372670
12869A31372670k0829178j6160033j2964661j0504054q414237o774468n321748
12862E0404291m421747m257836l771308l622193l250097k468701j705707j677401
12854B5229301j578034j473743j281325j057706n53776m48325r22963q74458k95704
12845A6743267q3291k39450l71214p75697q52128o15803l76275O13J93808p8092
12835A3545738k39085j43646J36368M49482N42163K76598K9102j76917k24282
12826A4195521J41895N68042M65993J64554L31299L90847O07228J311707R02439
12817A9079525R84414Q16387P54828P87771J167004J515393J358211J614680K654299
12808C0732512L552318M220802M154512M999772O570211P709703R253001J1142938
$$ plain form
12869 131372670 110543492 94383459 81418798 70914744 62500507 55726039 50404291
12862 50404291 45982544 41724708 37953400 34331207 31081110 28612409 26906702 25229301
12854 25229301 23651267 22177524 20896199 19838493 19284717 18836392 17913429 17038971 16743267
12845 16743267 16659976 16420526 16049312 15273615 14421487 13805684 13429409 13430022 13623830 13545738
12835 13545738 13306653 13163007 13299375 13748857 14291020 14567618 14596720 14419803 14195521
12826 14195521 14337416 14905458 15371451 15536005 15867304 16258151 16865379 18177086 19079525
12817 19079525 20063939 20880326 21635154 22422925 23589929 25105322 26463533 28078213 30732512
12808 30732512 34284830 38505632 42660144 47659916 54230127 61939830 71192831 82335769
12800H2335769J3075747J6207413K0920296K6104345L3024920M2098288N3295384
12793B87062162O4745652O7696104M7194260k89439m8960027p0572956o7043919
12786B79831837n5213863m2566359l2492207k5490857j9639725j5232626j2284013
12779G6912187r974169q279234o887010n683940m884124l954358l216316l262011
12771C0771025l315929k523597j560587j324396j350950j228683j384937r28167
12763A7153779k03766k90034p62477q26030j313868j432866j016930o92859j028987
12754I585962o32015k15482n4051L1395k07035k92866m12691o37133m38754K1580
12744F748910m81342n62709l42551j0249K92604j51925m80044J40403M33716k29580
$$ plain form
12800 82335769 95411516 111618929 132539225 158643570 191668490 233766778 287062162
12793 287062162 351807814 419503918 466698178 466408739 417448712 346875756 279831837
12786 279831837 224617974 182051615 149559408 124068551 104428826 89196200 76912187
12779 76912187 66938018 58658784 51771774 46087834 41203710 37249352 34033036 30771025
12771 30771025 27455096 24931499 23370912 22046516 20695566 19466883 18081946 17153779
12763 17153779 16950013 16659979 15897502 15071472 13757604 12324738 11307808 10614949 9585962
12754 9585962 8953947 8738465 8684414 8715809 8508774 8215908 7803217 7166084 6727330 6748910
12744 6748910 6267568 5704859 5362308 5352059 5644663 5492738 5012694 5153097 5586813 5357233
12734E357233o24821l12324l53203J07201L02409K49053k54267o94742l10427
12725C466112Q890j20926k0004N85353K55974j16560Q4151N2753K80284j31359
12715D344668o68031l35068l21072j23962M82869M62148k89006o72386q5392j03488
12705B691280k18675M12621M50074m0975m317k19516l28678J77198J40001k91087
12695B767926J2842Q5372q878j35409j25704m3947L25316Q4533l19815j60342
12685B481894J06166l55147j16954M01164K2713m98299k52394M0121n76732o47841
12675F04691k37163K57113L97976M26630K44737n8048l92764M9750J61404J19741
12665A574067p714j61861J10219J55078K01270k46415l52568J27975L76405J24213
$$ plain form
12734 5357233 4732412 4420088 4066885 4174086 4476495 4725548 4471281 3776539 3466112
12725 3466112 3475002 3354076 3334072 3919425 4175399 4058839 4142990 4195743 4476027 4344668
12715 4344668 3676637 3341569 3020497 2896535 3379404 3841552 3552546 2880160 2794768 2691280
12705 2691280 2472605 2885226 3335300 3294325 3290008 3070492 2741814 2919012 3059013 2767926
12695 2767926 2780768 2866140 2857262 2721853 2596149 2552202 2877518 2962051 2642236 2481894
12685 2481894 2588060 2232913 2115959 2517123 2539836 2041537 1789143 1829264 1252532 604691
12675 604691 367528 624641 1022617 1449247 1693984 1635936 1243172 1292922 1454326 1574067
12665 1574067 1566353 1404492 1514711 1669789 1871059 1624644 1272076 1400051 1776456 1900669
12655A900669r549k55564k55692K05796M07677K00873r1371l57208k72823K2426
12645A495234j1774J7255M6880k3647k02719l60955n07036j18844L13344K16702
12635H64440j97646l24340R1984N95375L9382k31150j73763k27350J58581K37340
12625H32853k63209o47683j19864J51193K85345K93430k24442J90602M08918p3535
12615H33608J66816J44789K65128j06744m46134m42526m8024M60426M83085m27738
12605H82686n19617j64942q2474K74856M06849K61700l10076j06153j8001j00642
12595E24186R2708J35786l88924k69883K16153O1100K02210J56366j71644J03341
12585F61399J48155r42P9484J74027j26997l06769j99282K08516J07788l11396
$$ plain form
12655 1900669 1891120 1635556 1379864 1585660 1993337 2194210 2102839 1745631 1472808 1495234
12645 1495234 1483460 1500715 1547595 1523948 1321229 960274 453238 334394 647738 864440
12635 864440 666794 342454 434438 1029813 1069195 838045 664282 436932 595513 832853
12625 832853 569644 -78039 -197903 -46710 238635 532065 307623 498225 907143 833608
12615 833608 1000424 1145213 1410341 1303597 857463 414937 366913 827339 1310424 882686
12605 882686 363069 198127 115653 390509 797358 1059058 748982 642829 624828 524186
12595 524186 616894 752680 363756 93873 310026 371126 573336 729702 558058 661399
12585 661399 809554 808612 888096 1062123 935126 628357 429075 637591 745379 433983
12575D33983Q676l8902j01828L79586j5958K1691K26718J67928N4757K18239K04346
12564A559236k0935n33202k85485M84998M43485n7360k50928o08572m2423J76529
12554H65343K57741K68339k67536n17345L24870O01046J66179M5913j39044l12579
12544A292927p8107P5304n4367k10379M40121K33210k34564k12763m67424j44243
12534F39715K34550k16761n97648j46968M14324M59356l03030q4853M36641L01598
12524A136924K90641J08166m0805j48152j0K80305l34282j62657K27565l66362
12514I91333n45150J1654j28960k58241m7452K2021j61764j54492J62856k8119
12504a36314J96472P10293O44469K93007j6322q673j0589l54730k86334J17980
$$ plain form
12575 433983 442659 403757 301929 681515 665557 687248 913966 1081894 1136651 1354890 1559236
12564 1559236 1538301 1005099 719614 1204612 1648097 1590737 1339809 731237 688814 865343
12554 865343 1123084 1391423 1123887 606542 931412 1532458 1698637 1744550 1605506 1292927
12544 1292927 1214820 1290124 1235757 1025378 1465499 1698709 1464145 1251382 783958 639715
12534 639715 874265 657504 59856 -87112 327212 786568 483538 398685 835326 1136924
12524 1136924 1427565 1535731 1494926 1346774 1346764 1627069 1292787 1130130 1357695 991333
12514 991333 446183 457837 328877 70636 23184 45205 -116559 -271051 -108195 -136314
12504 -136314 60158 770451 1414920 1707927 1691605 1682932 1672343 1317613 1031279 1149259
12494A149259Q8571k22891l1722J88009j57541j38520k22793q1274K02626J9223
12484G92947n8864J41874K68493j6901r8326q7425j34839J08381L0218j63836
12474G81722k01842k06138j74071n0805J88101Q6952j94533k08479k20635J53342
12464d6386K03845p9044j47132L34621M09226j38689N7129K01312p4017j06937
12454F13928N94015M17647n0182k31638n86474k55680l61181j81216L81903J47856
12444D88978k21272k77950j83083J73623o1334k25917l2538L03268K98340L40529
12434F02644L57138k19189n18961k71334m30960m52235K27709J65093J82502L86599
12424B9006N2453K22599K94409K60895q163m88051m28966M9258O6078l4888M01864
$$ plain form
12494 1149259 1237830 1014939 983217 1171226 1013685 875165 652372 571098 773724 792947
12484 792947 734083 875957 1144450 1127549 1029223 941798 806959 915340 945558 781722
12474 781722 579880 373742 199671 148866 336967 423919 229386 20907 -199728 -46386
12464 -46386 157459 78415 -68717 265904 675130 536441 593570 794882 720865 613928
12454 613928 1207943 1625590 1575408 1343770 757296 501616 140435 -40781 341122 488978
12444 488978 267706 -10244 -193327 -19704 -81038 -306955 -339493 -36225 262115 602644
12434 602644 959782 740593 221632 -49702 -480662 -932897 -705188 -540095 -357593 29006
12424 29006 81459 304058 598467 859362 851199 363148 -65818 -16560 49518 14630 416494
12413D16494P70184L46100J2917l11182m55931l22462k85152k2187j62137l8600
12403e1956k96635k58469l70574J09974P98014l5778k76694k24015M20304L23203
12393A37374k64035j43901L67484J87197j37652M6720L67247L50103R9069O3921
12383A073527k17106n90173o08156k38193J85346J67521J23443l9306j14959J84081
12373g3975J92728K89551N96221O13702l56822o00649K6654o5245K01941L2849
12363H56955n64417n59381k72633q8158J91211K83473n9173r7729k70279j77338
12353g57469j08630N4226J08651j58089l96511j4322N29300Q69339L26375l17729
12343A35141l3183J68423o3245k92920p33453o24613O2513O26414N15242M76223
$$ plain form
12413 416494 1186678 1532778 1545695 1234513 778582 456120 170968 148781 -13356 -51956
12403 -51956 -348591 -607060 -977634 -867660 -69646 -105424 -382118 -606133 -185829 137374
12393 137374 -126661 -270562 96922 284119 146467 193187 560434 910537 1009606 1073527
12383 1073527 856421 266248 -341908 -580101 -394755 -227234 -103791 -143097 -258056 -73975
12373 -73975 118753 408304 1004525 1618227 1261405 660756 687410 622165 824106 856955
12363 856955 292538 -266843 -539476 -627634 -436423 -152950 -212123 -309852 -580131 -757469
12353 -757469 -866099 -811873 -703222 -861311 -1257822 -1272144 -742844 126495 452870 135141
12343 135141 101958 270381 207136 -85784 -819237 -1443850 -1381337 -754923 -239681 236542
12333B36542M85613L26580k53599j64786q6042m48381k24091p317o3270J65986
12323c2765K42649K30813P0039n77005m83665j86291K90777L98577j03171p6542
12313b26584K09042J04118J67643J02399p912K99890M43036J64915K52354M64164
12303A973065K6731n65595o00822P9932M19614k02640q01133p01078k82777l6581
12293f91284L97322K68665L58246L41959P8498j2330q5820j33851k19726J68059
12283D69738L96542K10914m11314l86209n00972n04110K2657K19999K25773L81792
12273A24810K52582K50249J20849m9333L12971l92070p89311O8604L66510J66892
12263D32753J47257k95353k93804j45387K44800K69286O26532K16717J8105j01237
$$ plain form
12333 236542 722155 1048735 795136 630350 544308 95927 -128164 -135481 -198751 -32765
12323 -32765 209884 440697 510736 -66269 -549934 -736225 -445448 -46871 -150042 -226584
12313 -226584 -17542 86576 254219 356618 348706 648596 1091632 1256547 1508901 1973065
12303 1973065 1999796 1434201 833379 913311 1332925 1130285 329152 -371926 -654703 -691284
12293 -691284 -293962 -25297 332949 674908 753406 741076 655256 521405 301679 469738
12283 469738 866280 1077194 665880 279671 -221301 -725411 -702754 -482755 -256982 124810
12273 124810 377392 627641 748490 699157 1012128 620058 -169253 -100649 265861 432753
12263 432753 580010 284657 -9147 -154534 90266 359552 986084 1202801 1220906 1119669
12253A119669k76128j79515k26190j37719j67883M1619k7206O3904L93054L71815
12243I75420L3808m6388j49181l7670j15192p53675m64444j184k36822O6072L46171
12232c83085J71126L61182M8721k28999j80788O7346M63915N10928J25313k62518
12222F93141j54748k45163j32162J89867M31212N48914J61057m42970m59120l08451
12212B81577k20310J81574M08183N2936j97720M2881j29626k91506l69129l77041
12202f18181n2828N776k1425K39647M81049K89116j91883n03751m22382j27467
12192i22329k2026J72788p1246O304O96135K08024Q6646J01549j00251R3963N8834
12181C08391o32216l22795O5077K48388M06280R1984p3624L70486L98891L49908
$$ plain form
12253 1119669 843541 664026 437836 300117 132234 173853 146647 210551 603605 975420
12243 975420 1009228 962840 813659 775989 660797 -92878 -557322 -558506 -795328 -729256 -383085
12232 -383085 -211959 149223 197944 -31055 -211843 -144497 319418 830346 955659 693141
12222 693141 538393 293230 161068 350935 782147 1331061 1492118 1049148 590028 281577
12212 281577 61267 242841 651024 703960 506240 549121 419495 127989 -241140 -618181
12202 -618181 -671009 -665233 -686658 -447011 34038 323154 131271 -372480 -794862 -922329
12192 -922329 -944355 -771567 -842813 -836509 -140374 67650 154296 255845 155594 249557 308391
12181 308391 -323825 -646620 -581543 -333155 73125 165109 91485 461971 860862 1210770
12171A210770K66339J2639j2308J73269P4249j86141M8232l65953n16399k1584
12161F83113O08741N81778m49492n17592k48450l5584K09189K69236L24701N4575
12151A480215n03085n75607m41001j81526j67814N9855M36251R6066J73111o4638
12141C11827l09654k76735R136l19702l63059Q2569J92343K39710J59698J2310
12131b61557K31690L61695l1959p6527K32698p7822l18667j52851Q3586j50183
12121a59897j11255k26823l27536K99010M67833r1458k0325j10829r3387k75793
12111f50460o55058j07936k73235R8993L79656O87167P46791L01120Q0073j97842
12101D09269k53582l44107l80315O9156M39615N87257K91227n8052l4623j20548
$$ plain form
12171 1210770 1477109 1489748 1477440 1650709 1724958 1538817 1587049 1221096 704697 683113
12161 683113 1291854 1873632 1424140 906548 658098 622514 831703 1100939 1425640 1480215
12151 1480215 977130 401523 -39478 -221004 -388818 -328963 107288 203354 376465 311827
12141 311827 2173 -274562 -265426 -585128 -948187 -865618 -673275 -433565 -273867 -261557
12131 -261557 -29867 331828 299869 223342 456040 378218 59551 -93300 -9714 -159897
12121 -159897 -271152 -497975 -825511 -526501 -58668 -150126 -170451 -281280 -374667 -650460
12111 -650460 -1305518 -1413454 -1686689 -1587696 -1208040 -520873 225918 527038 607111 409269
12101 409269 155687 -188420 -568735 -499579 -59964 527293 818520 760468 725845 605297
12091F05297j25440j42464L26298K13050J06843J49430r1628K77808K5892m35966
12081I09120k55987J90241J62058n06899o38445J9522K76079N1667m53211m69766
12071g15621j32637M0236K47776K17954M4487K55898K92147q085k25789M05028
12061D21394L91308m63154l47664J41121k03648Q2739K21776j50805J38900J64600
12051C96567J4025M5349K65955L65569l6692j43173J2626J01487j69281j77699
12041F74733k20677J98747O03892M37944l27541n22854k33600l25603k20319L15950
12031C80672K11275K4761J41372K98613j54236p44415j59986P5245j63671r1094
12021a81464L34882N54621K90976j39439o20392m35063p3204N4230L13340K10648
$$ plain form
12091 605297 479857 337393 663691 876741 983584 1133014 1041386 1319194 1345086 909120
12081 909120 653133 843374 1005432 498533 -139912 -120390 155689 207356 -245855 -715621
12071 -715621 -848258 -808022 -560246 -342292 -297805 -41907 250240 242155 16366 421394
12061 421394 812702 349548 1884 143005 -60643 22096 243872 93067 231967 396567
12051 396567 410592 455941 721896 1087465 1050773 907600 920226 1021713 852432 674733
12041 674733 454056 652803 1256695 1694639 1367098 844244 610644 285041 64722 380672
12031 380672 591947 616708 758080 1056693 902457 158042 -1944 73301 -90370 -181464
12021 -181464 153418 708039 999015 859576 239184 -195879 -269083 -214853 98487 309135
12011C09135j60833m13469O1958Q0548K48629L39329K5599J79240j43740l50640
12001A75756j38830l0298j1894n29569L2093M06834J77160K68982L54649K64527
11991I69410K03352q6753j21784j33115L0136j0994j06604j83968N0499j98043
11981D12136n98431l90692K99016J27419k44851K10141J00430j54647L21313M60713
11971E42547M7081k47446k7718J23251j5616j20606q4464k15318o9942q6531m97958
11960f52720K1655K50407J0174J77429j66247k01735M8420k2928L50M0846J21517
11949c72832K03672M52844M86468P21289N16680j06448l56549n36676m99057J35413
11939F44804P85204J58516K7417J83516m01434j71094K35469l62180m85886l35138
$$ plain form
12011 309135 148302 -265167 -203209 -122661 125968 465297 490896 670136 526396 175756
12001 175756 36926 6628 -5266 -534835 -502742 -95908 81252 350234 704883 969410
11991 969410 1172762 1086009 964225 831110 861246 850252 743648 559680 610179 412136
11981 412136 -186295 -576987 -277971 -150552 -395403 -185262 -84832 -239479 81834 542547
11971 542547 589628 342182 314464 437715 422099 301493 217029 1711 -68231 -154762 -652720
11960 -652720 -631065 -380658 -370484 -193055 -359302 -561037 -512617 -535545 -535195 -494349 -372832
11949 -372832 -169160 283684 770152 1491441 2008121 1901673 1545124 1008448 509391 644804
11939 644804 1430008 1588524 1615941 1799457 1398023 1226929 1462398 1100218 614332 279194
11929B79194m61861l43675k08720k1739K20095L74905K57930J82824J60629j50898
11919B88684j81954J98811L67336L40196K46559k83280m18025q5633j20405k66736
11909H5553K85494N82227L60440l51342p64122m39612l15567k91682n174L10230
11899e43555K19188J30103K28743L4401m13199k51180K23905L41749J15845J29231
11889B15231o4382o8793j79353L5734l7118j31895N9164M10645K54220m139J4844
11878E04158j05232j39371M7232k49241p09679k86938M94363N47692M5219m61975
11868c13772l82479l5661J76790j22019o75625k09387J87176n542L2476N35316
11858h12727O01587J87604J5319J8061J70393k64168m10813j94469O59779M17508
$$ plain form
11929 279194 -182667 -526342 -735062 -756801 -536706 -161801 96129 278953 439582 288684
11919 288684 106730 305541 672877 1013073 1259632 976352 558327 472694 352289 85553
11909 85553 371047 953274 1313714 962372 198250 -241362 -556929 -848611 -853785 -543555
11899 -543555 -324367 -194264 34479 68880 -344319 -595499 -371594 -29845 86000 215231
11889 215231 150849 82056 -97297 -61563 -98681 -230576 -171412 239233 493453 489314 504158
11878 504158 398926 259555 306787 57546 -652133 -939071 -444708 102984 148203 -313772
11868 -313772 -696251 -731912 -555122 -677141 -1352766 -1562153 -1374977 -1380519 -1348043 -812727
11858 -812727 -211140 -23536 -8217 9844 180237 -83931 -494744 -689213 -29434 388074
11848C88074k69312M7478L34583M9457n06444o16843l42508k2244K60248K12988
11838d64523k6388J12292L74096L81798l23930n65376n5000q1186p5523K66521
11828d57219j45435j49446L11065J55304O6508K62851M23520K04135o86683q55338
11818h70738l42954K47467O73984J50553k5888k1402R703p3998l52813k28587
11808h34673K67825L90516j7117N2760K50160j6340l51222k49816J62978K16352
11798a28577j61739j12270Q8318N4985k23850q8697p5629K61481N92950K50808
11788D57780J69660K29398K09268P55o7153k09229k26043k0727O3899k39777k22317
11777A45514p1623J5989J86662J4203p1049K39294J09231l99675o0025K93844
$$ plain form
11848 388074 118762 166240 500823 550280 43836 -573007 -915515 -937759 -677511 -464523
11838 -464523 -490911 -378619 -4523 377275 53345 -512031 -567031 -648217 -723740 -457219
11828 -457219 -602654 -752100 -441035 -285731 -219223 43628 467148 671283 -15400 -870738
11818 -870738 -1213692 -966225 -292241 -141688 -167576 -188978 -179275 -253273 -606086 -834673
11808 -834673 -566848 -176332 -193449 -140689 109471 93131 -258091 -507907 -344929 -128577
11798 -128577 -290316 -402586 -314268 -259283 -483133 -571830 -647459 -385978 206972 457780
11788 457780 627440 856838 1066106 1066861 999708 790479 564436 543709 607608 367831 145514
11777 145514 73891 89880 276542 290745 219696 458990 568221 168546 108521 402365
11767D02365J94171r4337M5007J52491l39426k29805o0450o7503k82438k41158
11757e21083p6211j21864L58955J70292q1916J25643Q3174k69469n29190l33471
11747a195140j82051M07815J026991M79552j25454k60520L55716M69784K23945
11738A200638K37634o31912n97141j50407m21008k46405P3471K02740J71093j17543
11728b78840l76098Q876L20110K48791K69304L58269R5855j81756M2321J79211
11718F86043k52016p35881m01076P8983K59617K85621K9123j14770m3463m8705
11708b56524J22249L19636M91514K99710l76392m83530k26536n13583k4423K42637
11698d05242J50578K71214K38708L88976J73096m7966l52846n80886K49367O52837
$$ plain form
11767 402365 596536 502199 547206 699697 360271 130466 70016 2513 -279925 -521083
11757 -521083 -597294 -719158 -360203 -189911 -271827 -146184 -63010 -332479 -861669 -1195140
11747 -1195140 -1377191 -969376 57615 537167 411713 151193 506909 976693 1200638
11738 1200638 1438272 806360 209219 58812 -362196 -608601 -535130 -332390 -161297 -278840
11728 -278840 -654938 -646062 -325952 -77161 192143 550412 646267 464511 506832 686043
11718 686043 434027 -301854 -702930 -623947 -364330 -78709 -49586 -164356 -207819 -256524
11708 -256524 -134275 185361 676875 976585 600193 116663 -109873 -623456 -647879 -405242
11698 -405242 -254664 16550 255258 644234 817330 769364 416518 -164368 84999 737836
11688G37836K74222j27310k24400k22240Q4821O64711J86787o75737r24489j25036
11678c50835L35795L79412j341j35211j79780j86045k34030k09336j4525L72981
11668b22915K2081m75197l85044k88551l98958J13772O61884K76076K95572K44561
11658a56719J78964K20329J38957k61326l14700m53908r3955N90815M61830k55177
11648E5110l53867j45456K07380K41857L94799M64248R4804l1821j49104l8424
11638G39526k07306r3059r6032r4760l40755k72889j0408K64561N26865J82125
11628E97868l42851m48849n43776j33357J86765M31030N69090k00817l76650k36130
11618d97677K01537K23323K31892p4165m13112j95512l95443l23199O0126M65159
$$ plain form
11688 737836 1012058 884748 660348 438108 522929 1187640 1374427 698690 -225799 -350835
11678 -350835 -15040 364372 363031 227820 48040 -138005 -372035 -581371 -595896 -222915
11668 -222915 -200834 -676031 -1061075 -1349626 -1748584 -1634812 -972928 -696852 -401280 -156719
11658 -156719 22245 242574 381531 120205 -194495 -648403 -742358 -151543 310287 55110
11648 55110 -298757 -444213 -236833 5024 399823 864071 958875 927054 777950 739526
11638 739526 532220 439161 343129 248369 -92386 -365275 -375683 -111122 415743 597868
11628 597868 255017 -193832 -737608 -870965 -684200 -253170 315920 115103 -261547 -497677
11618 -497677 -296140 -72817 159075 84910 -328202 -523714 -919157 -1242356 -1182230 -717071
11608g17071O06948M64297j72864l44205M6221l18089l18121K19810N6581m32265
11598i08758l9360R4732K04576K35203q3109K14315R339K33278M52181K51818
11588F64215K84906k27277n75963n14626m43830j80035J32325L76268K38071R3478
11578a52468J58394j9115k55220k38993P5343J11629K5484N39999M36715n87890
11568I3878n42730L44557k9667r1272J08697p646k51167J7492j48221q4859L11777
11557b79161K44572j0048l39524k5022K94900J4134n090N7221k73724k94320J02958
11546e13104K65532K04378r4127l89082K9674L74148J48376L12575J77228J7265
11536E32863R3576n25931r18077n32704k10164O7562N46893N3138N0685o9368
$$ plain form
11608 -717071 -110123 354174 181310 -162895 -116674 -434763 -752884 -533074 -476493 -908758
11598 -908758 -948118 -853386 -648810 -413607 -496716 -282401 -273062 -39784 412397 664215
11588 664215 949121 721844 145881 -368745 -812575 -992610 -860285 -484017 -245946 -152468
11578 -152468 5926 -13189 -268409 -507402 -432059 -320430 -294946 245053 681768 93878
11568 93878 -448852 -104295 -133962 -225234 -116537 -124183 -375350 -357858 -506079 -590938 -279161
11557 -279161 -34589 -44637 -384161 -409183 -114283 -100149 -105239 -48018 -321742 -616062 -513104
11546 -513104 -247572 -43194 -137321 -526403 -496729 -122581 25795 338370 515598 532863
11536 532863 626439 100508 -817569 -1350273 -1560437 -1492875 -945982 -892844 -842159 -911527
11526i11527n54053M5873P76024N04333m1047p90741q00251Q7946N56443L15906
11516h11094L98657N68264j98102m99896j5875O19337K39487O1179J7428k22232
11506A57153J69891L31772O603o50892n64959l47465K37600L67236r0544k62189
11496f45794j6543m945K20574J98494K33170n4516p7821J84441J30038K61709
11486D28807P1640l85754l61965j96731l52001k18055K89458K85490j29551j11713
11476f80375L6281n1641J1596P93939O28385J2789L6487k91155j01370k350q2173
11465C10413K18622J27843J80262l97158m25920L6021J37710O7618P8132k27601
11455A05942l34538j56995L7771K28565J30185r5811k59907q7120N5228J98736
$$ plain form
11526 -911527 -1465580 -1419707 -643683 -139350 -180397 -971138 -1771389 -1683443 -1127000 -811094
11516 -811094 -412437 155827 -42275 -542171 -558046 61291 300778 361957 379385 157153
11506 157153 327044 658816 665419 14527 -550432 -897897 -660297 -293061 -383605 -645794
11496 -645794 -662337 -667282 -446708 -248214 -15044 -69560 -147381 37060 167098 428807
11486 428807 500447 114693 -247272 -444003 -796004 -1014059 -724601 -439111 -568662 -680375
11476 -680375 -644094 -695735 -684139 109800 738185 750974 787461 496306 394936 392586 310413
11465 310413 529035 656878 837140 439982 14062 50083 187793 255411 333543 105942
11455 105942 -228596 -385591 -347820 -119255 10930 -84881 -344788 -431908 -376680 -177944
11445a77944M21818O29285O12125L85322l72944j17531K05973K35738k95018j002989
11435E23835j092879j75260J19643R7906M50458M11657K21632K4957J06385j32951
11425E55383k27417l48296P9480K76194P0358j65746l6919o1184k56356l29119
11415d43622m3159j03307k70575L91832O35457N82987L85597L3516j56099m43367
11405E69260Q1522N50401M3958n04639l27621m93521j73173n2770j94966L62213
11395a39336N38027j34775q02075q82080o5702L91740N26285M34279M7887J71573
11385H5823K14839N8416L30599J82240k74394j23716o174j14630k80833R6276
11375A68446N090j21509m8441q9049j18460O1166n09070k82464K26314J90032
$$ plain form
11445 -177944 243874 873159 1485284 1870606 1497662 1380131 1586104 1821842 1526824 523835
11435 523835 -569044 -744304 -624661 -526755 -76297 335360 556992 581949 688334 555383
11425 555383 327966 -20330 59150 335344 405702 239956 203037 141853 -114503 -443622
11415 -443622 -486781 -590088 -860663 -468831 166626 749613 1135210 1168726 1012627 569260
11405 569260 650782 1201183 1245141 740502 412881 -80640 -253813 -306583 -501549 -139336
11395 -139336 398691 263916 -538159 -1420239 -1485941 -1094201 -567916 -133637 -85750 85823
11385 85823 300662 359078 689677 871917 597523 473807 467633 353003 72170 168446
11375 168446 173536 52027 3586 -85463 -203923 -142757 -651827 -934291 -707977 -517945
11365e17945L14489K91848O1135R9728j60500q32251q77419l43123J79915M24300
11355a359823R46084L08556L52036O65195M04995L54027k38148m53131q6069k1524
11345H72198J04149K01328P2729L22535k03640l62995m03687j62329j41167n0656
11335B48465J91014Q6543J52138l21690l26183q708K7898k55593j22322J50153
11325a78285J73801J03894k1985j63481n76536l09795P2730j14564K18078o5394
11315h61537p8251K15083K65451L40108q8326P3094J09403K86706L92220j80146
11305D73805l12017l25331l32929K52258K47494q6377n89915o63590j610N51069
11295g87143N48663K14560L83368M56101j412K07990J12524m47247n12915m4854
$$ plain form
11365 -517945 -203456 88392 149527 249255 88755 -743496 -1620915 -1964038 -1784123 -1359823
11355 -1359823 -413739 -105183 246853 912048 1317043 1671070 1432922 979791 893722 872198
11345 872198 976347 1177675 1250404 1572939 1369299 1006304 602617 440288 299121 248465
11335 248465 439479 526022 678160 356470 30287 21579 49477 -206116 -328438 -178285
11325 -178285 -4484 99410 77425 -86056 -662592 -972387 -899657 -1014221 -796143 -861537
11315 -861537 -939788 -724705 -459254 -119146 -207472 -134378 -24975 261731 653951 473805
11305 473805 161788 -163543 -496472 -244214 3280 -83097 -673012 -1336602 -1338212 -787143
11295 -787143 -238480 -23920 359448 815549 814137 1022127 1134651 687404 174489 129635
11285A29635R4050k02153l93009J90478N47615M50455P0305m29240l66298j38940
11275d7102j47221m55322n01599q4846K96266O17480K64273k25453P7777J53173
11265e2574J00427K5431j58302j69542r1292k72292m099J26625Q2411K16118R6446
11254a00643j76719l75312j1293L76264O29800K98906k53118m06869l52849k58050
11244f29883j02554j05193L45641M58629m6664Q4555N4873m3599L10870K84912
11234F11587l07907k59959m3438L60996O9719j52166k46838l04209k71076o1692
11224f04983M08017K79973J19011M41312M1881n28739n20704l89137n7345K49388
11214e61326N562k86525j08495K23158M89111P23132O03356k76310l53890j51780
$$ plain form
11285 129635 223685 21532 -371477 -180999 366616 817071 887376 458136 91838 -47102
11275 -47102 -194323 -649645 -1151244 -1236090 -939824 -322344 -58071 -283524 -205747 -52574
11265 -52574 47853 73284 -85018 -254560 -345852 -618144 -622243 -495618 -413207 -197089 -100643
11254 -100643 -277362 -652674 -663967 -287703 342097 641003 387885 -18984 -371833 -629883
11244 -629883 -732437 -837630 -491989 -33360 -80024 4531 59404 15805 326675 611587
11234 611587 303680 43721 283 361279 430998 278832 31994 -272215 -543291 -604983
11224 -604983 -196966 83007 202018 643330 685211 156472 -364232 -753369 -810714 -561326
11214 -561326 -555764 -842289 -950784 -727626 -238515 484617 1087973 811663 457773 305993
11204C05993l04292N8958K76015K87608J78378P7108j26205l02845k07533r8545
11194A44640l06133n04573m85902j22244N37518K55851J02251J48569n27430m45374
11184a202827j7838N77862K18432k34212Q9855R5378O0299j86102l7188O4357
11174e71984K12224M44779r2797k44390Q8951L61568r2855k03124J19310k90761
11164b69079m71913k02555k76029j8606M86463L68120J76757J42536o2242k19509
11154c46057J20340J78836p9590k08872l340Q4805l9599J38610K22460l9053L95239
11143D23779K20823m3768l25264m35363O4884K69863O8413l41789n5311L05855
11133A52122j75234m86010j73326L53324K98343n1633q9057k26645j31984m53733
$$ plain form
11204 305993 1701 60659 336674 624282 802660 879768 753563 450718 243185 144640
11194 144640 -161493 -666066 -1151968 -1274212 -736694 -480843 -378592 -230023 -757453 -1202827
11184 -1202827 -1220665 -642803 -424371 -658583 -568728 -473350 -413051 -599153 -636341 -571984
11174 -571984 -359760 85019 -7778 -252168 -163217 198351 105496 -97628 21682 -269079
11164 -269079 -740992 -943547 -1219576 -1238182 -751719 -383599 -206842 -64306 -126548 -346057
11154 -346057 -225717 -46881 -126471 -335343 -338683 -253878 -293477 -154867 67593 28540 423779
11143 423779 644602 600834 275570 -159793 -94909 174954 243367 -98422 -153733 152122
11133 152122 -23112 -509122 -682448 -329124 -30781 -82414 -171471 -398116 -530100 -983833
11123i83833j47484O25868N70741K90068j65373m79346k78990j55393N1679L6307
11113f35756N127k5484J53666K37065j47912k15659k4842m884K7490j09015j89092
11102i29296J01380L74523M71121O4711q3447J1020L30253K31300q5580j21798
11092C64187q2158Q5228L06408q3809n47058o17987m63770j50956M7788J96501
11082i45626K39362J24864k35103L38801K42032l63461m55315n56883l7670L27704
11072a321295J00180O9945L38837N46765k875L6404r9990r5464k1220K14719K58597
11061B4603K87402k3610l14114j95467M2893K06493K32647Q5704J34315K50742
11051G31608k02752J97018j23866k15923J40026Q1879k54920k18558k29023k77701
$$ plain form
11123 -983833 -1131317 -505449 65292 355360 189987 -289359 -568349 -723742 -672063 -635756
11113 -635756 -630629 -656113 -502447 -265382 -413294 -628953 -653795 -658679 -631189 -740204 -929296
11102 -929296 -827916 -453393 17728 82439 -1008 10012 340265 571565 485985 364187
11092 364187 282029 367257 673665 589856 42798 -575189 -1038959 -1189915 -1142127 -945626
11082 -945626 -706264 -581400 -816503 -477702 -235670 -599131 -1054446 -1611329 -1648999 -1321295
11072 -1321295 -1221115 -1151170 -812333 -265568 -268443 -232039 -332029 -427493 -448713 -233994 24603
11061 24603 312005 288395 -25719 -221186 -178293 28200 260847 346551 480866 731608
11051 731608 528856 725874 602008 386085 526111 607990 353070 134512 -94511 -372212
11041c72212J26449O3071j36096L29457m1343L08565J50269n5983K01480R0884
11031F64541j15371k55298k93018j62621O0725R5281L66648L06605l28360o25112
11021b85980m17212k55461m8223N33431M57033k05496L02844L92736J42960r1944
11011E24688k79572l91366k63522J44980J38489k72808l70564j23887J70358L9159
11001f84045L9512M30192K69848r6345K06338K07551m07960m85353M67927Q40755
10991G88420N72816R4604m43718l27103o3443l97163m50136Q6317K32945R684
10981A03223N7737j10005k7239L84871L38613L12766J56741k76537q05810p02950
10971e68590J55812K730k57217p2848m8204j0401J20057O35515N91503j12227
$$ plain form
11041 -372212 -245763 -182692 -318788 10669 -30674 277891 428160 372177 573657 664541
11031 664541 549170 293872 854 -161767 -101042 -5761 360887 667492 339132 -285980
11021 -285980 -703192 -958653 -1006876 -473445 -16412 -221908 80936 473672 616632 524688
11011 524688 245116 -146250 -409772 -264792 -126303 -399111 -769675 -893562 -723204 -684045
11001 -684045 -644533 -214341 55507 -40838 165500 373051 -34909 -520262 -52335 788420
10991 788420 1361236 1455840 1012122 685019 621576 224413 -225723 -139406 93539 103223
10981 103223 160960 50955 23716 408587 747200 1059966 1216707 940170 134360 -568590
10971 -568590 -412778 -410048 -667265 -740113 -788317 -798718 -678661 -43146 548357 436130
10961D36130m57540j18946K89747L17732J78783n5542k24985l53981R6489R8579
10951B06466k0904J73071Q715j28073l43029k41784j61414l00994m39272K3650
10941a223568Q02220M00759n1371p2946n930K2328l80045l05415m67513q2348
10931a363829M16526J75870k29993k06888J4774J65952j17825k60785K0472L71357
10921a014369P2940k53414j10764K91323L09128O49707L46193j05842m22987j50369
10911c88454L93842N12882N6439k17588J57849p5498l57087m75829j37119j00800
10901f31363m8624n4739p9133j85085L245L27341M62968K32493L6628k68282k5346
10890b29897J07106m32589k31697P26241N71817L07211k22096m38363j01992l07125
$$ plain form
10961 436130 -21410 -140356 149391 467123 645906 590364 365379 11398 107887 206466
10951 206466 185562 358633 367348 239275 -103754 -345538 -506952 -807946 -1247218 -1223568
10941 -1223568 -421348 -20589 -71960 -144906 -150836 -128508 -508553 -813968 -1281481 -1363829
10931 -1363829 -947303 -771433 -1001426 -1208314 -1193540 -1027588 -1145413 -1406198 -1385726 -1014369
10921 -1014369 -941429 -1194843 -1305607 -1014284 -705156 -55449 290744 184902 -238085 -388454
10911 -388454 5388 518270 574709 357121 514970 439472 82385 -393444 -530563 -631363
10901 -631363 -679987 -734726 -813859 -998944 -995699 -668358 -205390 27103 63731 -204551 -229897
10890 -229897 -122791 -555380 -787077 -60836 510981 818192 596096 157733 55741 -251384
10880b51384m78425k22744m1855R1858L26665K00893N3951J63669K01083K02495
10870B46206k0516m69785r982M24699J98547l2782j90145l26738L3294J45024
10860b178n7775j7335j39286k07519k05595k63864K36213P25112K56387k96364
10850B7796k83728n10367m4037L57768K08788M2026K4931j85036J60647J56799
10840d4413l08812m017R5482J67270N1114k02048j14810K6371K30040n0233k02183
10829c56239J41613M47403K99065J66458L3516r7313M0530k39681k77966N9365
10819B16751k64761m57022j37745J7183K95614L76163o7479j23364j99144l63653
10809g07457j71183m1379j73788L45621O36786N42906Q4485J5136o451q3742m15290
$$ plain form
10880 -251384 -729809 -952553 -994408 -902550 -575885 -374992 -321041 -157372 43711 246206
10870 246206 225690 -244095 -254077 170622 369169 336387 146242 -180496 -147202 -2178
10860 -2178 -59953 -77288 -216574 -424093 -629688 -893552 -657339 67773 324160 27796
10850 27796 -255932 -766299 -810336 -452568 -243780 -201754 -176823 -361859 -201212 -44413
10840 -44413 -353225 -357242 -261760 -94490 -43376 -245424 -360234 -333863 -103823 -154056 -356239
10829 -356239 -214626 232777 531842 698300 731816 634503 675033 435352 157386 216751
10819 216751 -48010 -505032 -642777 -625594 -329980 46183 -21296 -144660 -343804 -707457
10809 -707457 -878640 -920019 -1093807 -748186 -111400 431506 515991 531127 524676 440934 25644
10798B5644m57989j55237Q7237K14256J1688J93775J57359K15729J36583k0252
10788D08793l0217n11427m74265k06702O3240m1979Q3016K59512l9434J66432
10778c23031O6451J46146J14472l7515l33050k25291m39382n70391k69642L6055
10768a835178J59244J55479R2363N5714J84736J83110M30654J16579K8621l2263
10758d60941k63268j15549J69178J30676N28305O30009K67729l05838l58013l68931
10748a46643m53321k62456P1575R9615M26152L94593J68449j23674j68938j23614
10738a18262J43221K81764l97809j01018K83594L88693j22155l44491j54856J35444
10728e875O46036M61522k60745j78945J39402Q7295L3638M19673J04888j35040
$$ plain form
10798 25644 -432345 -587582 -500345 -286089 -274401 -80626 76733 292462 429045 408793
10788 408793 378576 -132851 -607116 -813818 -750578 -792557 -709541 -450029 -489463 -323031
10778 -323031 -256580 -110434 4038 -33477 -366527 -591818 -1031200 -1601591 -1871233 -1835178
10768 -1835178 -1675934 -1520455 -1428092 -1372378 -1187642 -1004532 -573878 -457299 -428678 -460941
10758 -460941 -724209 -839758 -670580 -539904 -11599 618410 886139 580301 222288 -146643
10748 -146643 -599964 -862420 -790845 -691230 -265078 129515 297964 174290 5352 -118262
10738 -118262 24959 306723 -91086 -192104 91490 480183 358028 13537 -141319 -5875
10728 -5875 640161 1101683 840938 661993 801395 888690 922328 1342001 1446889 1311849
10718A311849p9233P3569J05549j90078m27928k72728m5861N9595n9679k1726
10708D53329J3299j20479j53419M08895K9705k08939k27635j98479o9941O146
10698f7518M58243K26824m10136o30525m16730j37329j08345n7968k44911M987
10688a383408L22729J72341J49837L66283K87609J21241k88k24522L06066K86960
10678D04848k34055k94922l25537j87725L45108M05156p4154j89298m8719P1531
10668a27767p54j52720R8160M895k66019j46624L90791N12268M074k13261j50844
10657d7801K26511K2576J01360K54586J21761k69751m21480j97521k71418k78061
10647g59238j0664k78391R4740M51254L17788p0312j24723k81527j61609J85490
$$ plain form
10718 1311849 1232616 1306185 1411734 1221656 793728 521000 475139 534734 475055 453329
10708 453329 466628 346149 192730 601625 631330 422391 194756 -3723 -73664 -67518
10698 -67518 390725 617549 207413 -423112 -839842 -977171 -1085516 -1143484 -1388395 -1383408
10688 -1383408 -1060679 -888338 -738501 -372218 -84609 36632 36344 -188178 117888 404848
10678 404848 170793 -124129 -449666 -637391 -292283 112873 38719 -150579 -199298 -127767
10668 -127767 -128521 -281241 -183081 -178186 -444205 -590829 -200038 312230 316304 103043 -47801
10657 -47801 178710 201286 302646 557232 678993 409242 -12238 -209759 -481177 -759238
10647 -759238 -769902 -1048293 -953553 -502299 -184511 -254823 -379546 -661073 -822682 -637192
10637f37192K64472O8544k53190p01497l23270L32927L25248j34609p115L4931
10627a030751L3690J8814m170N476K71570J60803J71540M07368N5115k9617n35505
10616d75667m72671l6126P9476L75685N59919M17851P531n91958p4326J3002J96144
10605a140M56536L59006J45828j07359k38174j5467L65319N4576j38615n58811
10595C21699o26531m56241j86014l3153k55838J62872M56703O79947L40892J16366
10585E20702K01795J65232J56581j17748m03324o22772p81558l24650L31864K18305
10575f55573K62071M82511K54244J06131r5061j95638k71607m76733k31724m7012
10565h68391j47575n0986J54207K68131K00785P2549m7237n755J09658M0938l1771
$$ plain form
10637 -637192 -372720 -304176 -557366 -1258863 -1582133 -1249206 -923958 -1058567 -1065682 -1030751
10627 -1030751 -997061 -978247 -982417 -976941 -705371 -544568 -373028 34340 89455 59838 -475667
10616 -475667 -948338 -984464 -904988 -529303 30616 448467 455998 -135960 -210286 -197284 -1140
10605 -1140 455396 814402 960230 852871 614697 599230 964549 1019125 880510 321699
10595 321699 -304832 -761073 -947087 -980240 -1236078 -1073206 -616503 63444 404336 520702
10585 520702 722497 887729 1044310 926562 523238 -99534 -881092 -1205742 -873878 -655573
10575 -655573 -393502 89009 343253 449384 354323 158685 -112922 -589655 -821379 -868391
10565 -868391 -1015966 -1066952 -912745 -644614 -443829 -371280 -418517 -424272 -314614 -273676 -305447
10554c05447K49054K46486k7842j80545k3844L18406K05550k47145j28092r3102
10544A3479p0123r4547j16589k6016O52308L67682p3421n62757n33954N6681J66885
10533b20372l49999l63165J20672L66312J65666k42547k16285M41806N86435l6921
10523B51602k15773m5782J43756L41422m917k9659J71609N64288N14870n04626
10513A186790m53496m32459m79469m27093l08321j60090K3751J49066K52118L02166
10503c47037J506J9680K10661K63148j24051J12829K28544Q0267Q1460m5989j92273
10492B88745m9413R123J07393L43627k1829k75906j92634l03145o19346r842N74222
10481a49005O35900K14705p83l69659n13826l32849j4364J69271O4423q5100m06005
$$ plain form
10554 -305447 -56393 190093 162251 -18294 -42138 276268 481818 234673 106581 13479
10544 13479 -56644 -151191 -267780 -293796 358512 726194 652773 90016 -443938 -387257 -220372
10533 -220372 -570371 -933536 -812864 -446552 -280886 -523433 -739718 -297912 288523 251602
10523 251602 35829 -9953 133803 475225 470308 440649 612258 1176546 1691416 1186790
10513 1186790 733294 300835 -178634 -605727 -914048 -1074138 -1050387 -901321 -649203 -347037
10503 -347037 -345531 -325851 -115190 147958 23907 136736 365280 445547 527007 481018 288745
10492 288745 239332 248455 355848 699475 677646 401740 209106 -94039 -713385 -723227 -149005
10481 -149005 486895 701600 700817 331158 -182668 -515517 -529881 -360610 -296187 -381287 -787292
10470g87292o0993N5837l39658J15212N85522K78875J02265p6124M7910j94696
10460b73142k99867j00876K25448l987k01432k79361R3918M15542k22058l84839
10450a030654r2060j78847J59717J49369J29446J02186N56247N93436p4226m13924
10440i9310j20755o2620k35874m10521j29079K04793Q1607n7419J16965N13743
10430a98470K77195J98334j03134m49670P4890P48326K35141k79568m04971o19769
10420e21696k05465k12766k47527Q0995K95085M50588L46637r1885j25710j63034
10410c94778o12847q94674l11069Q77314J014071O05547k566m71981j92982J62649
10400b21316J50168M25254P01909M06842J18879j50838l60446k0960l06177m80929
$$ plain form
10470 -787292 -848285 -792448 -1132106 -1016894 -431372 -152497 -50232 -126356 -78446 -273142
10460 -273142 -573009 -673885 -448437 -452424 -653856 -933217 -839299 -423757 -645815 -1030654
10450 -1030654 -1122714 -1301561 -1141844 -992475 -863029 -760843 -204596 388840 314614 -99310
10440 -99310 -220065 -282685 -518559 -929080 -1058159 -853366 -771759 -829178 -712213 -198470
10430 -198470 78725 277059 173925 -275745 -200855 547471 782612 503044 98073 -521696
10420 -521696 -727161 -939927 -1187454 -1106459 -811374 -360786 -14149 -106034 -231744 -394778
10410 -394778 -1007625 -1902299 -2213368 -1336054 -321983 283564 280998 -190983 -383965 -221316
10400 -221316 -71148 354106 1056015 1462857 1581736 1430898 1070452 1049492 743315 262386
10390B62386n85214k49859R0114K34496k53991j15954K65571K65521N942j74728
10380b55716J9688K94782j5762j03478P0648j67372l20602l59472m32823J0832
10370a259275J96084L21145P17831M51631j9834r3584o3321J13562J39147J12402
10360F15788q3236m53044n68872j77650J94866J86778Q4681R6275K10140K89134
10350C94860l63192n71746j54047K55452R8827K6794K72895k07771k18233m57858
10340i24019j21033P15668O78386K24109j90361p7857L2970k35613J32042r2831
10330A41461k34750K34599L40075J68395l79596l94942J05191p157p0105J14301
10320A7472l7471k67K04082N28180p2504m14373k45062l53773j43113J54718K71044
$$ plain form
10390 262386 -322828 -572687 -482573 -248077 -502068 -618022 -352451 -86930 -80988 -255716
10380 -255716 -236028 58754 42992 -60486 10162 -157210 -477812 -837284 -1270107 -1259275
10370 -1259275 -1063191 -742046 -24215 427416 407582 313998 250677 364239 503386 615788
10360 615788 532552 79508 -489364 -667014 -472148 -285370 -200689 -104414 105726 394860
10350 394860 31668 -540078 -694125 -438673 -339846 -313052 -40157 -247928 -466161 -924019
10340 -924019 -1045052 -329384 349002 573111 382750 304893 337863 102250 234292 141461
10330 141461 -93289 141310 481385 649780 270184 -124758 -19567 -26724 -96829 17472
10320 17472 -19999 -20266 183816 711996 639492 225119 -19943 -373716 -516829 -362111 -91067
10309i1067J7829o1195R5217q8426K37127L52472k07732l98414r0062O7807M4089
10298a22355R956K3122m2455q941R5343j23016L08552N92854K87194l84560o43305
10287g611n66482j81300L80522J49719k74396o8532J73485L0737J25999j17704
10277c55563j27043L25424R3349l85619m2088L25453O15034L63681k00069j88279
10267D24280j09968J15058l0970o9280K34326N41929M9847l21397j6049K17436
10257A035212K46889J13463N9541r5138k71405o65810l73940L07395K15254o184
10247E65277j0608p5384k06509m3709J72515K14419Q7307l58241o55381j36897
10237d47211M02581M73803m2895m72942k61748K8913k2214k6535N00825P24016
$$ plain form
10309 -91067 -73238 -134433 -39216 -127642 109485 461957 254225 -144189 -234251 -166444 -122355
10298 -122355 -112399 -89277 -131732 -140673 -45330 -168346 140206 733060 1020254 635694 -7611
10287 -7611 -574093 -755393 -374871 -225152 -499548 -568080 -394595 -363858 -237859 -355563
10277 -355563 -482606 -157182 -63833 -449452 -491540 -166087 448947 812628 612559 424280
10267 424280 314312 429370 398400 329120 563446 1105375 1155222 833825 817776 1035212
10257 1035212 1282101 1395564 1455105 1359967 1088562 422752 48812 356207 571461 565277
10247 565277 554669 479285 272776 229067 401582 616001 703308 345067 -310314 -447211
10237 -447211 -44630 429173 386278 -86664 -348412 -319499 -341713 -368248 132577 856593
10227H56593k86609m35826j78993L7392l8139J0021j96158k94848j2292k11576
10217g50435J8609L19973j30331k39208J32035J92406N8204N6547k4823j51808
10207e18831K06953M42815j64541o76874m19814K4007J67286L19764M38055J13250
10197f7930k08693j14143R4598J17708p9870N1947Q465k20776J51588L26428R285
10186F8607k22278J22828L9768O8918j17406J63854L55245K41599P897l23486
10176D05546j74303Q252j97963k60079J446j50907l32568l71753q4830K90357
10166h66802L49749J54494m3936K40952J77145J87487M7137J20603l40141l62205
10156c35517n2111J7731m9320m73038J51103Q98270O14476J98589m3707m54178
$$ plain form
10227 856593 569984 134158 -44835 -7443 -45582 -35561 -231719 -526567 -538859 -750435
10217 -750435 -731826 -411853 -542184 -781392 -649357 -456951 -398747 -342200 -367023 -518831
10207 -518831 -311878 130937 -33604 -710478 -1130292 -1106285 -938999 -619235 -181180 -67930
10197 -67930 -276623 -390766 -296168 -178460 -258330 -206383 -197918 -418694 -267106 59322 68607
10186 68607 -153671 -30843 8925 77843 -39563 124291 479536 721135 729032 405546
10176 405546 231243 239495 41532 -218547 -217101 -368008 -700576 -1072329 -1157159 -866802
10166 -866802 -517053 -362559 -406495 -165543 11602 199089 246226 366829 26688 -335517
10156 -335517 -387628 -369897 -419217 -892255 -741152 157118 771594 970183 926476 472298
10146D72298l25754J19950j18216J56247J95560l07921m04249j82966j20104p4680
10136e89835k32661K0598l40l26635P6461L34293n8411m5200J09934J17208J50331
10125d44257M8649M92744O12677Q0407p1489k78264j57517J40092J47790K14775
10115G85607k75183m52787k49830L01621K71823R1383J45211q1119o3859k77699
10105A95168k07110R5928J16763K14332L18889K161m07562k6201L36888K14372
10095H53628l55988q03875m66483k66566O3628J47782j79095n5748r4979J18787
10085a038909L44194L88735L20303L56572M15472p4920o33185j02156K25556j29385
10075G2277l39179m67575j80038j89010r9684L14259K94209K81960J56938L79528
$$ plain form
10146 472298 146544 266494 148278 304525 500085 192164 -212085 -395051 -515155 -589835
10136 -589835 -822496 -801898 -802238 -1128873 -1052412 -718119 -776530 -821730 -711796 -594588 -444257
10125 -444257 -395608 97136 709813 790220 718731 440467 282950 423042 570832 785607
10115 785607 510424 57637 -192193 109428 381251 472634 617845 536726 472867 195168
10105 195168 -11942 83986 200749 415081 733970 736131 328569 302368 639256 853628
10095 853628 497640 -306235 -772718 -1039284 -975656 -827874 -1006969 -1062717 -1157696 -1038909
10085 -1038909 -694715 -305980 14323 370895 786367 711447 78262 -23894 201662 72277
10075 72277 -266902 -734477 -914515 -1103525 -1203209 -888950 -594741 -312781 -155843 223685
10065B23685K00162K8756M53358N65971J76172r7860q22513n83486n2328k95260
10055b03343K71306J72505J23253L46089r6009m97533n74144l23972m1296K13234
10045f09910O2959K3692k80495m74979J69984N64229O12873M80971l78278n5478
10035A15568N06626K04920k06428r5460M4141j69405n94604m64829K01692L78888
10025g8891J91712J4839o18117J29562N11274J58190r2589j90532l13481k58824
10015e46857m10261k82958J77567K43571K73047K95981J0781l03123q6067J12886
10005e15433J42111P4873J77256J21021j30740m19568m06501J86240L27246J46232
9995b97263L23123O50926K76509M0059N2219m03551n38543n20810l41853K58175
$$ plain form
10065 223685 423847 452603 905961 1471932 1648104 1550244 727731 144245 91917 -203343
10055 -203343 67963 240468 363721 709810 613801 116268 -457876 -781848 -823144 -609910
10045 -609910 -546951 -523259 -803754 -1278733 -1108749 -544520 68353 549324 171046 115568
10035 115568 622194 827114 620686 525226 569367 399962 -194642 -659471 -457779 -78891
10025 -78891 112821 127660 -490457 -360895 150379 308569 215980 25448 -288033 -546857
10015 -546857 -957118 -1240076 -1062509 -818938 -545891 -249910 -239129 -542252 -628319 -515433
10005 -515433 -373322 -298449 -121193 -172 -130912 -550480 -956981 -770741 -443495 -297263
9995 -297263 25860 676786 953295 993354 1045573 642022 103479 -417331 -759184 -501009
9985e01009M92105J13947P5485J13007K69597o8470j85726J91567j59521n57490
9975b16508j64327K16507k0634n09920J42016P51041P51083L43453l51117k58849
9965F82745J17959k50814n81406l57746k23247K88072J15064k7675L29991K20732
9955C13675K56511J88972R6180j20310j84850J68006J50587m75411m63498j37706
9945b07844j56712r6999K21434j81470n38292j13755o5394J33434M84123K85204
9935b36271j817o9844j80667j87490l3698K24526P1333j11180L91503L90214j78367
9924G8242j86651N5287J34527j05784M4854N36131J20428k83382j73337J51457
$$ plain form
9985 -501009 -8904 105043 180528 293535 563132 494662 308936 500503 340982 -216508
9975 -216508 -380835 -164328 -184962 -694882 -552866 198175 949258 1292711 941594 682745
9965 682745 800704 549890 -31516 -389262 -612509 -324437 -209373 -237048 92943 313675
9955 313675 570186 759158 855338 735028 550178 718184 868771 393360 -70138 -207844
9945 -207844 -364556 -461555 -240121 -421591 -959883 -1073638 -1139032 -1005598 -521475 -236271
9935 -236271 -238088 -307932 -488599 -676089 -709787 -485261 -413928 -525108 -133605 256609 78242
9924 78242 -108409 -53122 81405 -24379 20475 556606 677034 393652 220315 371772
$$ [...]
##END NTUPLES=NMR SPECTRUM
##END=
