##TITLE=C13_SR-75-TFAA3
 CDCl3,22400 sc

 10.7.2023
##JCAMPDX= 6.0         $$ Bruker NMR JCAMP-DX V2.0
##DATA TYPE= NMR SPECTRUM
##DATA CLASS= NTUPLES
##ORIGIN= UXNMR, Bruker Analytische Messtechnik GmbH
##OWNER= root
$$ XWIN-NMR		Version 3.5
$$ Tue Jul 11 13:41:00 2023 Russian Standard Time (UT+4h)  she@DPX200
##.OBSERVE FREQUENCY= 50.327896
##.OBSERVE NUCLEUS= ^13C
##.ACQUISITION MODE= SIMULTANEOUS
##.ACQUISITION SCHEME= undefined
##.AVERAGES= 22401
##.DIGITISER RES= 17
##SPECTROMETER/DATA SYSTEM= spect
##.PULSE SEQUENCE= zgpg30
##.SOLVENT NAME= DMSO
##.SHIFT REFERENCE= (INTERNAL, DMSO, 0, 222.624)
##AUDIT TRAIL= $$ (NUMBER, WHEN, WHO, WHERE, WHAT)
$$ ##TITLE= Audit trail, XWIN-NMR		Version 3.5
$$ ##JCAMPDX= 5.01
$$ ##ORIGIN= Bruker BioSpin GmbH
$$ ##OWNER= she
$$ F:/spectra/data/she/nmr/c13/1/pdata/1/auditp.txt
$$ ##AUDIT TRAIL=  $$ (NUMBER, WHEN, WHO, WHERE, WHAT)
(   1,<2023-07-11 13:38:24.15 +0400>,<she>,<DPX200>,
      <created by zg, POWCHK disabled, PULCHK disabled
       terminated by command 'halt'
       configuration hash MD5:
       00 E9 B6 7A A2 85 ED C7 34 08 36 98 17 FE 4E 26
       data hash MD5: 32K
       4B F8 FD 7B D0 37 5F A2 0E 91 21 EB 0C 33 71 60>)
(   2,<2023-07-11 13:38:34.57 +0400>,<she>,<DPX200>,
      <Start of raw data processing
       efp BC_mod = 2 LB = 2 FT_mod = 6 PKNL = 1 PHC0 = -378.7954 PHC1 = 11.93318 SI = 32K 
       data hash MD5: 32K
       FA DF 56 06 C7 BC BB 9D 67 63 A3 E6 E1 DD 82 2D>)
(   3,<2023-07-11 13:38:59.70 +0400>,<she>,<DPX200>,
      <abs ABSG = 5 
       data hash MD5: 32K
       4C 38 C7 A1 01 ED 6F F8 AA 1C 42 8E 12 CF 24 84>)
(   4,<2023-07-11 13:39:27.20 +0400>,<she>,<DPX200>,
      <abs ABSG = 5 
       data hash MD5: 32K
       D8 34 E3 9C 95 6C 55 D3 83 FD 3B 24 2B 2C 30 BC>)
(   5,<2023-07-11 13:39:58.09 +0400>,<she>,<DPX200>,
      <pk PHC0 = -8.670287 PHC1 = 20 
       data hash MD5: 32K
       A6 12 52 F0 FC 22 55 61 CD C2 8C 9B ED 76 1D 33>)
(   6,<2023-07-11 13:40:01.43 +0400>,<she>,<DPX200>,
      <abs ABSG = 5 
       data hash MD5: 32K
       E1 ED BA 1B BC A4 1C A8 43 DB D5 BF A4 72 54 96>)
$$ ##END=
$$ 
$$ hash MD5
$$ 76 DA 55 CB D6 BE 4E 08 04 E1 59 7A BF 2C 1B 7E
##$RELAX= 
##$RELAX= 
##$RELAX= 
##$RELAX= 
##$RELAX= 
##$RELAX= 
##$RELAX= 
##$RELAX= 
$$ Bruker specific parameters
$$ --------------------------
##$DU= <F:/spectra>
##$EXPNO= 1
##$NAME= <c13>
##$PROCNO= 1
##$TYPE= <nmr>
##$USER= <she>
##$AMP= (0..31)
100 100 100 100 100 100 100 100 100 100 100 100 100 100 100 100 100 100 
100 100 100 100 100 100 100 100 100 100 100 100 100 100 
##$AQSEQ= 0
##$AQ_mod= 1
##$AUNM= <au_zg>
##$AUTOPOS= <>
##$BF1= 50.322709
##$BF2= 200.13
##$BF3= 50.322709
##$BF4= 500.13
##$BF5= 500.13
##$BF6= 500.13
##$BF7= 500.13
##$BF8= 500.13
##$BYTORDA= 1
##$CFDGTYP= 0
##$CFRGTYP= 5
##$CHEMSTR= <none>
##$CNST= (0..31)
1 1 145 1 1 1 1 1 1 1 1 1 1 1 1 1 1 1 1 1 1 1 1 1 1 1 1 1 1 1 1 1 
##$CPDPRG= <waltz16>
##$CPDPRG1= <>
##$CPDPRG2= <waltz16>
##$CPDPRG3= <>
##$CPDPRG4= <mlev>
$$ [...]
##$SUBNAM4= <"">
##$SUBNAM5= <"">
##$SUBNAM6= <"">
##$SUBNAM7= <"">
##$SUBNAM8= <"">
##$SUBNAM9= <"">
##$SW= 239.972175391363
##$SWIBOX= (0..15)
0 1 3 0 0 0 0 0 0 0 0 0 0 0 0 0 
##$SW_h= 12077.2946859903
##$TD= 32768
##$TD0= 1
##$TE= 0
##$TE2= 300
##$TE3= 300
##$TEG= 300
##$TL= (0..7)
120 120 120 120 120 120 120 120 
##$TP= (0..7)
150 150 150 150 150 150 150 150 
##$TP07= 0
##$TPNAME0= <>
##$TPNAME1= <>
##$TPNAME2= <>
##$TPNAME3= <>
##$TPNAME4= <>
##$TPNAME5= <>
##$TPNAME6= <>
##$TPNAME7= <>
##$TPOAL= (0..7)
0.5 0.5 0.5 0.5 0.5 0.5 0.5 0.5 
##$TPOFFS= (0..7)
0 0 0 0 0 0 0 0 
##$TUNHIN= 0
##$TUNHOUT= 0
##$TUNXOUT= 0
##$USERA1= <user>
##$USERA2= <user>
##$USERA3= <user>
##$USERA4= <user>
##$USERA5= <user>
##$V9= 5
##$VALIST= <valist>
##$VCLIST= <CCCCCCCCCCCCCCC>
##$VD= 0
##$VDLIST= <DDDDDDDDDDDDDDD>
##$VPLIST= <PPPPPPPPPPPPPPP>
##$VTLIST= <TTTTTTTTTTTTTTT>
##$WBST= 1024
##$WBSW= 4
##$XGAIN= (0..3)
0 0 0 0 
##$XL= 0
##$YL= 0
##$YMAX_a= 141163334
##$YMIN_a= -44475558
##$ZGOPTNS= <>
##$ZL1= 120
##$ZL2= 120
##$ZL3= 120
##$ZL4= 120
##$ABSF1= 222.624
##$ABSF2= -17.3728
##$ABSG= 5
##$ABSL= 3
##$ALPHA= 0
##$AQORDER= 0
##$ASSFAC= 0
##$ASSFACI= 0
##$ASSFACX= 0
##$ASSWID= 0
##$AUNMP= <proc_1d>
##$AZFE= 0.1
##$AZFW= 0.5
##$BCFW= 0
##$BC_mod= 2
##$BYTORDP= 0
##$COROFFS= 0
##$CY= -3
##$DATMOD= 1
##$DC= 0
##$DFILT= <>
##$DTYPP= 0
##$F1P= 0
##$F2P= 0
##$FCOR= 0.5
##$FTSIZE= 32768
##$FT_mod= 6
##$GAMMA= 0
##$GB= 0
##$INTBC= 1
##$INTSCL= 4.134877e-10
##$ISEN= 128
##$LB= 2
##$LEV0= 0
##$LPBIN= 0
##$MAXI= 10000
##$MC2= 0
##$MEAN= 0
##$ME_mod= 0
##$MI= 0.1934396
##$NCOEF= 0
##$NC_proc= 2
##$NLEV= 6
##$NOISF1= 120.0001
##$NOISF2= 80.00006
##$NSP= 0
##$NTH_PI= 0
##$NZP= 0
##$OFFSET= 222.624
##$PC= 1.4
##$PHC0= -387.4657
##$PHC1= 31.93318
##$PH_mod= 1
##$PKNL= yes
##$PPARMOD= 0
##$PSCAL= 0
##$PSIGN= 0
##$REVERSE= no
##$SF= 50.3227315983092
##$SI= 32768
##$SIGF1= 140
##$SIGF2= 120
##$SINO= 11.81781
##$SIOLD= 32768
##$SREGLST= <13C.CDCl3>
##$SSB= 0
##$STSI= 32768
##$STSR= 0
##$SW_p= 12077.2946859903
##$SYMM= 0
##$S_DEV= 0
##$TDeff= 32768
##$TDoff= 0
##$TI= <>
##$TILT= no
##$TM1= 0
##$TM2= 0
##$TOPLEV= 0
##$USERP1= <user>
##$USERP2= <user>
##$USERP3= <user>
##$USERP4= <user>
##$USERP5= <user>
##$WDW= 1
##$XDIM= 32768
##$YMAX_p= 443894557
##$YMIN_p= -5575490
$$ End of Bruker specific parameters
$$ ---------------------------------
##NTUPLES= NMR SPECTRUM
##VAR_NAME=  FREQUENCY,     SPECTRUM/REAL,   SPECTRUM/IMAG
##SYMBOL=    X,             R,               I
##VAR_TYPE=  INDEPENDENT,   DEPENDENT,       DEPENDENT
##VAR_FORM=  AFFN,          ASDF,            ASDF
##VAR_DIM=   32768,         32768,           32768
##UNITS=     HZ,            ARBITRARY UNITS, ARBITRARY UNITS
##FACTOR=    0.368581032318806, 1,           1
##FIRST=     11203.0474430531, 0,            0
##LAST=      -874.247242937185, 0,           0
##MIN=       -874.247242937185, -5575490,    0
##MAX=       11203.0474430531, 443894557,    0
$$ Real data points
##PAGE= N=1
##DATA TABLE= (X++(R..R)), XYDATA
$$ [...]
16056d23372q4814j17972n5793L8238Q9909Q4487M4100K5195K3934M4052J26368
$$ -423372 -508186 -626158 -681951 -643713 -553804 -469317 -425217 -400022 -376088 -332036 -205668
16045b05668K34066K48192J22222k8774p3830J0606J50376K20741J57595J9352
$$ -205668 28398 276590 398812 370038 296208 306814 457190 677931 835526 854878
16035H54878o7800n6716l8890o5361j18617k07555k43208j42700J2203R9113N0047
$$ 854878 787078 730362 691472 626111 507494 299939 56731 -85969 -73766 25347 75394
16024G5394q234K8456O0159M5495l3192j19665j38561j15816p7567n9180p4822
$$ 75394 67160 95616 155775 201270 168078 48413 -90148 -205964 -283531 -342711 -417533
16013d17533o9855J8447J16280J12750L9271j7773k1001j6555M0051J08739R4746
$$ -417533 -487388 -468941 -352661 -239911 -200640 -218413 -239414 -255969 -215918 -107179 -12433
16002a2433K2064l6690m8452k7266R633k531n2347j08558j46569j52297j14688
$$ -12433 9631 -27059 -75511 -102777 -93144 -95675 -148022 -256580 -403149 -555446 -670134
15991f70134k1800R6518J96235K16763J67797J16400O2777l0909j48788j90472
$$ -670134 -691934 -595416 -399181 -182418 -14621 101779 164556 133647 -15141 -205613
15981b05613j44414k0060J06516J42683J23905P8690J7157j00244j84951j36106
$$ -205613 -350027 -370087 -263571 -120888 3017 81707 98864 -1380 -186331 -322437
15971c22437q3239n9632J7630J51393K61764K21056M4240j22722j70558j42171
$$ -322437 -405676 -465308 -447678 -296285 -34521 186535 230775 108053 -62505 -204676
15961b04676j30289o9229O0001J69426J78969O8108n6404q5864m8676k2921j0337
$$ -204676 -334965 -404194 -344193 -174767 4202 72310 15906 -69958 -118634 -141555 -151892
15950a51892j2088m4200m4908M3886J55642K19401K17211J58156O6875l01j1644
$$ -151892 -163980 -208180 -253088 -209202 -53560 165841 383052 541208 608083 607782 596138
15939E96138n273K688L4220M0223K2434j6416j17301j82877j46472p0606J1525
$$ 596138 590865 593553 627773 667996 690430 674014 556713 373836 227364 156758 168283
15928A68283P0939P8533K3385k9801l5109p9577j65688j64400p9564J0436P9813
$$ 168283 239222 317755 341140 311339 276230 196653 30965 -133435 -212999 -202563 -122750
15917a22750P9894k1936j66802k91207l10645j99594r0930l9309j7582j0015L0377
$$ -122750 -42856 -64792 -231594 -522801 -833446 -1033040 -1123970 -1163279 -1180861 -1190876 -1160499
15906a160499Q8804J32455J50435J25997J07197J10547J40962J51558Q6601J9553
$$ -1160499 -1071695 -939240 -788805 -662808 -555611 -445064 -304102 -152544 -65943 -46390
15896d6390j2515m3315m2005J1778K2441l1865m8822l0844J6343J03491J76327
$$ -46390 -58905 -102220 -144225 -132447 -110006 -141871 -190693 -221537 -205194 -101703 74624
15885G4624J94941R1323r4224k05653j90260q4814K3509M9712J2637O000M9851
$$ 74624 269565 360888 266664 61011 -129249 -214063 -190554 -140842 -128205 -122205 -72354
15874g2354Q6986P6913o379r9156r7797j1817R2789J72469J72778Q3116m3520
$$ -72354 14632 91545 85166 -13990 -111787 -123604 -30815 141654 314432 397548 354028
15863C54028j04925p6380n2865j06251j72865j73760j32670j02911p1478J475
$$ 354028 249103 172723 119858 13607 -159258 -333018 -465688 -568599 -640077 -638602
15853f38602L0476j6204m5819j5696P0551J39088J31429P6407J3106k7575l2329
$$ -638602 -608126 -624330 -670149 -685845 -615294 -476206 -344777 -268370 -255264 -282839 -315168
15842c15168m1396j1821R1685J53287J03326kn8414o7560q6367j01463m2981L4152
$$ -315168 -356564 -368385 -276700 -123413 -20087 -20089 -78503 -146063 -232430 -333893 -376874 -342722
15830c42722L2943N1085J69510K56309K23007J02746k0753r6581j63693k06724
$$ -342722 -309779 -258694 -89184 167125 390132 492878 472125 375544 211851 5127
15820E127j89318j31304j2708J47384K09066J54539R8527L7159n9454j24819j26346
$$ 5127 -184191 -315495 -328203 -180819 28247 182786 281313 318472 259018 134199 7853
15809G853j03095o3687k980O010l2963o7860q8246o5337l6936o2327q8274p6091
$$ 7853 -95242 -158929 -161909 -155899 -188862 -256722 -344968 -410305 -447241 -509568 -597842 -673933
15797f73933p0735p8843n8577k0217K6371P6121Q1736N6569O7777J12314J59196
$$ -673933 -744668 -823511 -882088 -902305 -875934 -799813 -718077 -661508 -593731 -481417 -322221
15786c22221J73937J34827J7046j38259j89026j33763o9445m1204m439L0981L0387
$$ -322221 -148284 -13457 3589 -134670 -323696 -457459 -526904 -568108 -572547 -541566 -511179
15775e11179J3301j1224l096R1464K35607L03524K09484M0938n2312l5781P045
$$ -511179 -497878 -509102 -512198 -420734 -185127 118397 327881 368819 316507 280726 287771
15764B87771M1114N4135M4170P0055J34479J51904Q7041j1520o1634r1965j81883
$$ 287771 328885 383020 427190 497245 631724 783628 870669 859149 797515 705550 523667
15753E23667k44356j59453k6431K1378L23k9527m0916m3347O375J38787K46355
$$ 523667 279311 119858 93427 114805 115128 85601 44685 1338 7713 146500 392855
15742C92855K28786J31392N9777M0375K2088m8850j53965k18877k26433j94879
$$ 392855 621641 753033 812810 853185 875273 826423 672458 453581 227148 32269
15732C2269j69370j73849j44549q0105o8194p4396l6343Q9431K45167K77207K05721
$$ 32269 -137101 -310950 -455499 -535604 -603798 -678194 -714537 -625106 -379939 -102732 102989
15721A02989J34942R8399Q7244L9837q0620j97240k32703j73008o3043K0305K8232
$$ 102989 237931 336330 423574 463411 382791 185551 -47152 -220160 -283203 -262898 -234666
15710b34666L255k6368q8583r2668R862J07077J22305O5645m3405j40704j08421
$$ -234666 -231411 -257779 -346362 -439030 -429168 -322091 -199786 -134141 -177546 -318250 -426671
15699d26671K1394J29061J52536J07882M2991k1809m0163n113L1209N7714Q6646
$$ -426671 -405277 -276216 -123680 -15798 27193 5384 -34779 -39892 -8683 49031 135677
15688A35677Q4521J6425l4923k0686J6917R658j7374R267J6683m3772p8124l6394
$$ 135677 220198 236623 201700 181014 197931 207589 190215 199482 216165 172393 94269 57875
15676E7875K2280O2409M5366m4649j05594q7907m7170k9709O155J01746K06603
$$ 57875 80155 142564 187930 143281 37687 -50220 -97390 -127099 -120944 -19198 187405
15665A87405K20690J09154k5174o2839n4185j40108k34521k09356j33317j17620
$$ 187405 408095 517249 492075 429236 375051 234943 422 -208934 -342251 -459871
15655d59871j22246p4390k7015R185N0610N4985J1613o5545j44771j57755j03568
$$ -459871 -582117 -656507 -683522 -674337 -623727 -568742 -557129 -622674 -767445 -925200 -1028768
15644a028768k1404J04885K30121K66373K19805J66592J19716M5820K394k892
$$ -1028768 -1050172 -945287 -715166 -448793 -228988 -62396 57320 103140 105534 102642
15634A02642o1561j84250k24852j42063j3509J02602J42625J31003J05915Q4885
$$ 102642 41081 -143169 -368021 -510084 -523593 -420991 -278366 -147363 -41448 43437
15624D3437Q8504N2921q539l4044M204M0339j0837j05337j66277j73994j42686
$$ 43437 131941 184862 176323 142279 146483 186822 175985 70648 -95629 -269623 -412309
15613d12309o7166J6849P5858J22612J33868N6088m6324p6727k5720K0319J4908
$$ -412309 -479475 -462626 -386768 -264156 -130288 -74200 -120524 -197251 -222971 -202652 -187744
15602a87744k2116m5358o2204p6271p5005p0394p8587p1160m1579l0497o085M1818
$$ -187744 -209860 -255218 -317422 -393693 -468698 -539092 -617679 -688839 -730418 -760915 -767000 -725182
15590g25182P4270R2502J22573J20364R6962Q2588J08240J70377J53408O4886
$$ -725182 -650912 -558410 -435837 -315473 -218511 -135923 -27683 142694 296102 360988
15580C60988m37q8940j45260o4237O5430J27776O0701p3162j51481j13702J9808
$$ 360988 360551 271611 126351 62114 127544 255320 316021 242859 91378 -22324 -2516
15569b516J37106J18602N2305P1909R9421M3703m7533r8747j20328j63564j91516
$$ -2516 134590 253192 305497 377406 476827 520530 472997 374250 253922 90358 -101158
15558a01158j19765K8211J27169J04236k5780j55275k10289j83566q4940J6512
$$ -101158 -220923 -192712 -65543 38693 12913 -142362 -352651 -536217 -621157 -604645
15548f04645O1811M9244P1257J48995J88765J05319o5942j71626j46080r2528
$$ -604645 -542834 -493590 -422333 -273338 -84573 20746 -45196 -216822 -362902 -455430
15538d55430q3969m8394R844K4433j7261p3287q8194j18790j43609m3281R8856
$$ -455430 -539399 -587793 -577949 -553516 -570777 -644064 -732258 -851048 -994657 -1037938 -939082
15527i39082J12173L2015m7044j14178q6590K7860J01666R0029M2927Q896J1609
$$ -939082 -826909 -794894 -841938 -956116 -1042706 -1014846 -913180 -823151 -780224 -771328 -759719
15516g59719O1637P8216K2612J3684M1594J4724K060L6377P2145O9989j1080j10027
$$ -759719 -698082 -619866 -597254 -583570 -541976 -527252 -525192 -488815 -416670 -346681 -357761 -467788
15504d67788r7966j7707K3788L6692L2570K1837j5396o9490l6566J01461J93279
$$ -467788 -565754 -583461 -559673 -522981 -490411 -468574 -483970 -553460 -590026 -488565 -295286
15493b95286J54300N1806l3934q9458q8884k3827k907o3452j33539j34965q6647
$$ -295286 -140986 -89180 -123114 -212572 -301456 -325283 -328190 -391642 -525181 -660146 -746793
15482g46793n2579q5696j45716j28684o4588k928N0485J07271J77042K32258K08467
$$ -746793 -799372 -885068 -1030784 -1159468 -1224056 -1226984 -1176499 -1069228 -892186 -659928 -451461
15471d51461J30904R7787J30740J47005R0361j5369j24883j21761n568R3275J07788
$$ -451461 -320557 -222770 -92030 54975 145336 129967 5084 -116677 -122245 -28970 78818
15460G8818J7611o0878k1903L6309J0151l4857q1187j43339j81033j84313j62661
$$ 78818 96429 35551 13648 49957 60108 25251 -55936 -199275 -380308 -564621 -727282
15449g27282j25821n2998O247K4513Q8801J99775K20186J32577P2478P6390N1362
$$ -727282 -853103 -906101 -899854 -875341 -786540 -586765 -366579 -234002 -161524 -85134 -33772
15438c3772k1870p9063q7583j00722j48160j63872j27824r7736p5118k657M2318
$$ -33772 -55642 -134705 -222288 -323010 -471170 -635042 -762866 -860602 -935720 -938377 -896059
15427h96059j2890q1973k7847J09715J38279K9493n3511m91J17291J58127J03588
$$ -896059 -908949 -990922 -1018769 -909054 -770775 -741282 -794793 -795284 -677993 -519866 -416278
15416d16278M5560L3479J5908l6170p3229o8761o0687n1719p678K9417N7702Q7501
$$ -416278 -370718 -337239 -321331 -357501 -430730 -499491 -560178 -611897 -619575 -590158 -532456 -444955
15404d44955O3290L7146N3385J887o9273n9603q081Q2983J46504J55157J56012
$$ -444955 -381665 -344519 -291134 -289247 -358520 -418123 -426204 -343221 -196717 -41560 114452
15393A14452J28377K7863o3893n1343J4994M3578J0906m7026r6122j15769q8150
$$ 114452 242829 270692 206799 155456 170450 214028 224934 177908 81786 -33983 -122133
15382a22133j4532K1442j9632l2326J7075K1432k4309n2592m5730m7481o8376
$$ -122133 -136665 -115223 -134855 -167181 -150106 -128674 -152983 -205575 -251305 -298786 -367162
15371c67162o1612m533O2719O8537L99j03056j78978j49870n5145Q407K4286j4200
$$ -367162 -428774 -433307 -370588 -302051 -301652 -404708 -583686 -733556 -788701 -780294 -756008 -770208
15359g70208p8831j00925q1598m6606M108Q6613J87384K25502J22657j7368m1835
$$ -770208 -849039 -949964 -1031562 -1078168 -1074060 -987447 -800063 -574561 -451904 -469272 -511107
15348e11107L1798J17220J25585M7591k3062J3779J05625J30482O6355l1397q6287
$$ -511107 -479309 -362089 -236504 -188913 -211975 -198196 -92571 37911 104266 72869 -13418
15337a3418k343J40228J51643K9915j02643j36142j33085j63919j73035j48258
$$ -13418 -15761 124467 276110 306025 203382 67240 -65845 -229764 -402799 -551057
15327e51057j00349K4456J83953K38524J88160J23475N9056k3763j25241j88476
$$ -551057 -651406 -626950 -442997 -204473 -16313 107162 166218 142455 17214 -171262
15317a71262k03690k11464j94617j29189o0668j5637N0167R6041J18592J19844
$$ -171262 -374952 -586416 -781033 -910222 -970890 -986527 -936360 -840319 -721727 -601883
15307f01883O9698n56l7193j542L6103N4124R9204R7727J5875n2010r3109j02298
$$ -601883 -532185 -532741 -569934 -571476 -535373 -481249 -382045 -284318 -268443 -320453 -413562 -515860
15295e15860o0343P61K9792J2985k3808k0165K3529L8609K5629k0513q1185j06921
$$ -515860 -576203 -575442 -545650 -532665 -556473 -576638 -553109 -514500 -488871 -509384 -590569 -697490
15283f97490r6686n8031L878N970n4707o7595l4884K2487Q9784J63276K28569
$$ -697490 -794176 -852207 -848329 -842359 -897066 -964661 -999545 -977058 -887274 -723998 -495429
15272d95429K13335J00888j1648o1034o1260j9186M9693J23630J25906O9758R350
$$ -495429 -282094 -181206 -192854 -253888 -315148 -334334 -284641 -161011 -35105 34653 44003
15261D4003n4592p1192n2688n3976n9958m0611k3606j7706N18P4024K09567L07965
$$ 44003 -10589 -81781 -134469 -188445 -248403 -289014 -312620 -330326 -329808 -255784 -46217 261748
15249B61748L29939K75051J20910o4342k11975k82286k48784j85630j55452o5200
$$ 261748 591687 866738 987648 923306 711331 429045 180261 -5369 -160821 -226021
15239b26021P0385J43279P7551m5201p9666n1712l5718L477P4679Q6913J5894
$$ -226021 -155636 -12357 65194 19993 -59673 -111385 -147103 -143626 -68947 17966 33860
15228C3860j07793k09383j86387q1703j2575k164L226N6548J05834J34609J40136
$$ 33860 -73933 -283316 -469703 -551406 -563981 -566145 -562919 -506371 -400537 -265928 -125792
15217a25792J08283Q4043Q6896R9145J02082O3685j6378m6552k9928p9834j77370
$$ -125792 -17509 66534 153430 252575 354657 418342 401964 355412 325484 245650 68280
15206F8280k25291j94902p9889N8686J07504Q2897K3784q4558j59066j30084m2256
$$ 68280 -157011 -351913 -431802 -373116 -265612 -182715 -158931 -243489 -402555 -532639 -574895
15195e74895P3789J75346K07889J26670j5096j50902k79547l68194l34871j62966
$$ -574895 -501106 -325760 -117871 8799 -6297 -157199 -436746 -804940 -1139811 -1302777
15185a302777M3601J12905N6753J8336O8914J68193K13283J75786Q1717j1025
$$ -1302777 -1259176 -1146271 -1089518 -1071182 -1002268 -834075 -620792 -445006 -363289 -374314
15175c74314l7208O9854K40987K65604J03418o6188j30954j18737r4147n1404
$$ -374314 -411522 -341668 -100681 164923 268341 202153 71199 -47538 -141685 -193089
15165a93089N7859J56024J29734M0865m2848n1479K2712J16152J30169N9897L116
$$ -193089 -135230 20794 150528 191393 148545 97066 119778 235930 366099 425996 429112
15154D29112j1953o685m1115j03310j32582j10000o1986p6377j41198j15530K3777
$$ 429112 417159 410474 369359 266049 133467 23467 -38519 -114896 -256094 -371624 -347847
15143c47847J25217J24162N1739l8356p4511n6289l9557j7075K3223M9682N6271
$$ -347847 -222630 -98468 -46729 -85085 -159596 -215885 -255442 -272517 -249294 -199612 -143341
15132a43341Q1674Q8167l501j65585k40152j44020j5718L0526L0681L9106J8838
$$ -143341 -61667 26500 22999 -142586 -382738 -526758 -542476 -511950 -481269 -442163 -423325
15121d23325q6436k40867k89080k02085p6980K7786J06648J89537K46549K59252
$$ -423325 -509761 -750628 -1039708 -1241793 -1318773 -1290987 -1184339 -994802 -748253 -489001
15111d89001K58966K24058J18195J6555O72j1726p3153p3882k9046k5119q9010
$$ -489001 -230035 -5977 112218 128773 129445 117719 44566 -29316 -58362 -83481 -172491
15100a72491k03515k33176j75812j42524j16961q8536q0093k4324Q6174J78961
$$ -172491 -376006 -609182 -784994 -927518 -1044479 -1133015 -1213108 -1237432 -1151258 -972297
15090i72297K13637K27362K23466J73847J14068Q9229M6237j1787m4225n3035
$$ -972297 -758660 -531298 -307832 -133985 -19917 69312 115549 103762 59537 6502
15080F502o0377q4878j35705k36763k70661j24296N2575J44533J97207K33374
$$ 6502 -53875 -138753 -274458 -511221 -781882 -906178 -853603 -709070 -511863 -278489
15070b78489K58780K50596J57277L7951m0329o3242m8607k9136l9205q1316n7346
$$ -278489 -19709 230887 388164 426115 385786 322544 273937 244801 205596 124280 66934
15059F6934M7986J49388J69108Q8880o0136j74712j64127j15769o9495O768N9030
$$ 66934 114920 264308 433416 522296 462160 287448 123321 7552 -61943 -55175 3855
15048C855O8383N3264J2642j2716J1938L7354K2779j4075j7607J4316M9063O2740
$$ 3855 72238 125502 138144 125428 137366 174720 197499 183424 165817 180133 229196 291936
15036B91936k2562j49882j80835j25712p3868o1562o7365n3682l454O6228Q0147
$$ 291936 269374 119492 -61343 -187055 -260923 -322485 -389850 -443532 -446986 -380758 -300611
15025c00611K7991m5247n1491M8220J68583K05804J18312L860n6951n4695j3208
$$ -300611 -272620 -317867 -369358 -321138 -152555 53249 171561 175421 118470 63775 50567
15014E0567J3730K764n1312r9411q0717P726M9971N1384J02392J05909k3375j68360
$$ 50567 64297 67061 15749 -83662 -164379 -156653 -106682 -55298 47094 153003 129628 -38732
15002c8732k40259k71497k73965k06460k8469J68322K21464J47438N9014J0652
$$ -38732 -278991 -550488 -824453 -1030913 -1059382 -891060 -669596 -522158 -463144 -452492
14992d52492l0812q5214j29828j29610m5994N9507R3391P2194N6577M8668L8973
$$ -452492 -483304 -568518 -698346 -827956 -873950 -814443 -721052 -648858 -592281 -543613 -504640
14981e04640O298k6655n4320j09810j48378j38444j19148q9101m6576K0534R0453
$$ -504640 -498342 -524997 -579317 -689127 -837505 -975949 -1095097 -1184198 -1230774 -1210240 -1119787
14970a119787J26188J52860J85540K19576K00228J11200L5117K0714K2479J150
$$ -1119787 -993599 -840739 -655199 -435623 -235395 -124195 -89078 -68364 -45885 -44735
14960d4735j2331J6125N8129Q4205P0475P3331J07163R4710K1117p1301r1191
$$ -44735 -57066 -40941 17188 101393 171868 245199 352362 447072 468189 396888 305697
14949C05697o2261q1502j35478j24484o6837j4942M7723J00841J33465J95293
$$ 305697 243436 161934 26456 -98028 -164865 -179807 -132084 -31243 102222 297515
14939B97515K99540L27813K03191K9387n4045j9973j1759j17175k59583k79531
$$ 297515 597055 924868 1128059 1157446 1103401 1083428 1071669 954494 694911 415380
14929D15380j83281j05716p4046n9618k6393K5436K9859l2348r5802j47073j81051
$$ 415380 232099 126383 52337 -7281 -33674 -8238 21621 -10727 -106529 -253602 -434653
14918d34653j31159o3090m0299M3079J60927K29285K30662J41970P68r2162p6631
$$ -434653 -565812 -628902 -669201 -626122 -465195 -235910 -5248 136722 137490 45328 -31303
14907c1303j1935M9062O9530M5615J7356j3512o2971j26043j58416j43894r6329
$$ -31303 -43238 5824 75354 120969 138325 124813 61842 -64201 -222617 -366511 -462840
14896d62840m7221m6720m19R8614J52510J49613J06159O7738J8240o8686j46555
$$ -462840 -510061 -556781 -557200 -458586 -306076 -156463 -50304 17434 35674 -33012 -179567
14885a79567j69221j58440j18087q882O1328L6927K2529L0009Q265l259j5573
$$ -179567 -348788 -507228 -625315 -634197 -572869 -535942 -513413 -483404 -475139 -478398 -493971
14874d93971m2766n6516o9694p6073n5335J1607R5421J47681J70695J56781R4545
$$ -493971 -536737 -593253 -662947 -739020 -794355 -782748 -687327 -539646 -368951 -212170 -117625
14863a17625M4882L1464N315j6980K5993Q6845O0695l3166q5544q7291q4429o4813
$$ -117625 -72743 -41279 -35964 -52944 -26951 59894 120589 87423 1879 -85412 -169841 -234654
14851b34654n3035o7381q0484q0910m8575M081K9853J1275J7857O7291M9767L052
$$ -234654 -287689 -355070 -435554 -516464 -565039 -560958 -531105 -519830 -501973 -434682 -384915 -381863
14839c81863o172L0729J20848K07567K16613J60892J05921J7952r8347j36516
$$ -381863 -388035 -357306 -236458 -28891 187722 348614 454535 472487 374140 237624
14829B37624j42954j73013j57628r5901j5753J1472l1317n9549l6899L987J3339
$$ 237624 94670 -78343 -235971 -331872 -347625 -336153 -367470 -427019 -463918 -459931 -446592
14818d46592l8834j35333k19274k57536k34134j83563j49481j17548q4461k7766
$$ -446592 -485426 -620759 -840033 -1097569 -1331703 -1515266 -1664747 -1782295 -1866756 -1894522
14808a894522L8451N5829L8686K3700R0569K44207L66773M13394L43340K04718
$$ -1894522 -1856071 -1800242 -1761556 -1737856 -1647287 -1403080 -1036307 -622913 -279573 -74855
14798g4855J47390J25213K9189j16793j89102j53096q4931k4035L688k6944j25274
$$ -74855 72535 197748 226937 110144 -78958 -232054 -316985 -341020 -337332 -364276 -489550
14787d89550j94651j13502K7379J21871J73469J65191Q0184p09m045J1590l1866
$$ -489550 -684201 -797703 -770324 -648453 -474984 -309793 -229609 -230318 -234363 -222773 -254639
14776b54639q5991m6603M5236J10473J33286J06495N2525J1387l4014p7818q8998
$$ -254639 -340630 -387233 -341997 -231524 -98238 8257 60782 72169 38155 -39663 -128661
14765a28661p7676q5668p3669j2672N344m3448p3132q8785r8930r5875j18751
$$ -128661 -206337 -292005 -365674 -378346 -373002 -416450 -489582 -578367 -677297 -773172 -891923
14754h91923j35751q2984k0095k8028m8763j2024K9510K0124P678M4390R0448
$$ -891923 -1027674 -1110658 -1130753 -1158781 -1207544 -1219568 -1190058 -1169934 -1162256 -1117866 -1027418
14743a027418Q5129Q6077J24958J12555L3389n6877r1595r0996q8842m8416M3625
$$ -1027418 -942289 -856212 -731254 -618699 -585310 -642187 -733782 -824778 -913620 -962036 -918411
14732i18411J29016J61812J24451K978r8823r2160k3000O0550J12380J15389J30872
$$ -918411 -789395 -627583 -503132 -500154 -598977 -691137 -714137 -653587 -541207 -425818 -294946
14721b94946J90420K38644K34304R8432j27580k44004k27501j73831j09001n6956
$$ -294946 -104526 134118 368422 466854 339274 95270 -132231 -306062 -415063 -472019
14711d72019l2822J8053P8733Q7444J4091o8268o6227J365O7236J03520J05336
$$ -472019 -504841 -486788 -408055 -320611 -306520 -374788 -441015 -439650 -372414 -268894 -163558
14700a63558P5259J3101m4774j13226j81308j46429l9627M7407R8760J28282J10596
$$ -163558 -88299 -75198 -119972 -233198 -414506 -560935 -600562 -553155 -454395 -326113 -215517
14689b15517O6784K0266j3517J6446Q0930M5194r3242j21179l0854N1311M7453
$$ -215517 -148733 -128467 -141984 -125538 -44608 586 -92656 -213835 -244689 -193378 -145925
14678a45925J1490J9368k5610j04261j25733j10374j08573j23617r3679j9743
$$ -145925 -134435 -115067 -140677 -244938 -370671 -481045 -589618 -713235 -806914 -826657
14668h26657K9760L7332K3800J1792j2467o5362n9229L1721J19021J72899J63212
$$ -826657 -796897 -759565 -735765 -723973 -736440 -801802 -861031 -829310 -710289 -537390 -374178
14657c74178Q5935L2865M2662O6960P6769J24420J49472Q7099j7238p3700o6364
$$ -374178 -288243 -255378 -212716 -145756 -68987 55433 204905 292004 274766 201066 134702
14646A34702n0690n4964o5349q4075q2722q0811o5023j8712l2608p0776m0760
$$ 134702 84012 29048 -36301 -120376 -203098 -283909 -348932 -367644 -400252 -471028 -511788
14635e11788O5188J29274P9583k9605j07644j07171j7583O0779Q8364P2400N8434
$$ -511788 -446600 -317326 -237743 -267348 -374992 -482163 -499746 -438967 -350603 -278203 -219769
14624b19769O7205L4509l6509q3882o6425k1865K2657O2028N2017K2888L9162
$$ -219769 -152564 -118055 -154564 -238446 -304871 -326736 -304079 -242051 -190034 -167146 -127984
14613a27984Q8883J11373O5994j2470q0417j40242j64321j81444j70693o0291
$$ -127984 -39101 72272 138266 125796 45379 -94863 -259184 -440628 -611321 -671612
14603f71612Q2621J44527J56509J51742R9680M2162l091p62O8617J27437J26251
$$ -671612 -588991 -444464 -287955 -136213 -36533 5629 2538 1776 70393 197830 324081
14592C24081Q3742K3384j8237l8462o2904p1930m3918l6441k3887M5288R6420
$$ 324081 407823 431207 412970 374508 311604 239674 195756 159315 135428 180716 277136
14581B77136N8649j601k0726j5336o64p915m3172j00173j52919j90704k42980
$$ 277136 335785 334184 313458 298122 297458 289543 246371 146198 -6721 -197425 -440405
14570d40405k58762j45841J8818P7049M0493K5039O6721Q8415L2479m7305p4644
$$ -440405 -699167 -845008 -826190 -749141 -708648 -683609 -616888 -528473 -495994 -543299 -617943
14559f17943k9971M4947O5831L6337M8367Q6014R6769P2145J5960J0130Q1303
$$ -617943 -647914 -602967 -537136 -500799 -452432 -366418 -269649 -197504 -181544 -171414 -90111
14548i0111J49412J85758J63254M7804o3942r9753q0049o2959p1893j17280j30419
$$ -90111 59301 245059 408313 456117 392175 292422 212373 149414 77521 -39759 -170178
14537a70178o7398R595Q1098R3174N0354M1259R7819J79854J91841Q8401m3951
$$ -170178 -237576 -227981 -146883 -53709 -3355 37904 135723 315577 507418 595819 551868
14526E51868j47803j95325j74036o6883J06807K21143K51784K16772J13634N5942
$$ 551868 404065 208740 34704 -32179 74628 295771 547555 764327 877961 933903
14516I33903P3392M4766r3765k52589k84645j61147p674Q9946J03087N0099k0531
$$ 933903 1007295 1052061 958296 705707 421062 259915 252241 342187 445274 495373 474842
14505D74842q4211r7002p7402p8507q7039o4513n8097p7403q2704p3020o4631
$$ 474842 390631 293629 216227 137720 50681 -13832 -71929 -149332 -232036 -305056 -369687
14494c69687n1928n4105p1773m9355J592O4962P0728K8098K9269O2962Q6586P2994
$$ -369687 -421615 -475720 -547493 -596848 -595256 -530294 -459566 -431468 -402199 -339237 -252651 -179657
14482a79657M02m0169r821O8970J30223R7420O0826P6307O7534J367j7937O3526
$$ -179657 -179255 -219424 -229245 -160275 -30052 67368 128194 204501 272035 273402 255465 318991
14470C18991J23984R7510M3399m4639j61460k22111j77007j17415j47557k18695
$$ 318991 442975 540485 583884 539245 377785 155674 -21333 -138748 -286305 -505000
14460e05000j90668j9551J30315J22059N3864J8086Q057J2136j2969l6331k2863
$$ -505000 -695668 -715219 -584904 -462845 -408981 -390895 -382838 -370702 -383671 -420002 -442865
14449d42865k4657o1949j22447j46119p0146M7137J03759J08762J21349J18833
$$ -442865 -467522 -529471 -651918 -798037 -868183 -821046 -717287 -608525 -487176 -368343
14439c68343P2899l6723j28980j21095l1146O6738J01324Q5351Q1195P7761M6765
$$ -368343 -295444 -332167 -461147 -582242 -613388 -546650 -445326 -359975 -278780 -201019 -154254
14428a54254J1253M4732J10570J03665L6365J153L423L9726N5002k8586j38098
$$ -154254 -143001 -98269 12301 115966 152331 153484 156907 196633 251635 223049 84951
14417H4951j69574j02854l540L8259J1193l0058k356P3264Q1860K1580q6416j60006
$$ 84951 -84623 -187477 -191017 -152758 -141565 -171623 -173979 -100715 -18855 2725 -83691 -243697
14405b43697j07653J282L2954k5765r1950j31482j54107j11325k240O3321Q3690
$$ -243697 -351350 -350068 -317114 -342879 -434829 -566311 -720418 -831743 -833983 -770662 -686972
14394f86972J29272J63044J57219J38738P7283k7856j06680j35748j22124q8903
$$ -686972 -557700 -394656 -237437 -98699 -21416 -49272 -155952 -291700 -413824 -502727
14384e02727j2225R5099J24816O4505K6515N5020Q9806N4480o5236j75050k00993
$$ -502727 -514952 -419853 -295037 -230532 -204017 -148997 -59191 -4711 -69947 -244997 -445990
14373d45990j90085j69362j19059Q519J79170K63316J96707R0180L9436L500j5145
$$ -445990 -636075 -805437 -924496 -915977 -736807 -473491 -276784 -186604 -147168 -143668 -158813
14362a58813k0730q1958j48272j30022l077J18995J39008J57057J78968P1095
$$ -158813 -179543 -261501 -409773 -539795 -542872 -423877 -284869 -127812 51156 122251
14352A22251n6525n4375P490M3549O5064N1416K246o1454r8187n9358l035J6163
$$ 122251 65726 11351 18841 62390 127454 178870 181116 119662 21475 -37883 -40918 -24755
14340b4755K1461l6524j68100k34318j28189O0395J54567R9480j6701o9335j2200
$$ -24755 -3294 -39818 -207918 -442236 -570425 -510030 -355463 -255983 -272684 -342019 -354219
14329c54219P4303J17066J12445O4029k3154r1969q9892o2427r6299j35077j77626
$$ -354219 -279916 -162850 -50405 13624 -9530 -101499 -191391 -253818 -350117 -485194 -662820
14318f62820k44889k71919k07470r3763m420R2216J85226J78545R9150L9890J5127
$$ -662820 -907709 -1179628 -1387098 -1480861 -1485281 -1393065 -1207839 -1029294 -930144 -890254 -875127
14307h75127K5175J07706K20158K16758J01714l0194j44604j83270j02266K9070
$$ -875127 -849952 -742246 -522088 -305330 -203616 -233810 -378414 -561684 -663950 -634880
14297f34880J99141L31653K91649J31473j7085q9499p3434m3681o2046n2548M2704
$$ -634880 -435739 -104086 187563 319036 301951 212452 139018 95337 33291 -19257 23447
14286B3447J08711N5279o6916j33207o1835L2078K3750m0773q9835r1723p7312
$$ 23447 132158 187437 120521 -12686 -74521 -42443 -18693 -59466 -149301 -241024 -318336
14275c18336o2871m4091j0777K5351M1497N5462L4129o0930j53799j02429N5553
$$ -318336 -381207 -425298 -436075 -410724 -369227 -313765 -279636 -340566 -494365 -596794 -541241
14264e41241J81187K35131K30706J59390M2629k7164p156M7153O2614K0870j8453
$$ -541241 -360054 -124923 105783 265173 307802 280638 273482 320635 383249 404119 385666
14253C85666l6879j27456k79769l89624l55000j92868n7830n7364j35770j77532
$$ 385666 348787 221331 -58438 -448062 -803062 -995930 -1053760 -1111124 -1246894 -1424426
14243a424426j64916j19079p916J31377J82268J49100P1507M365L8447J11770
$$ -1424426 -1589342 -1708421 -1716337 -1584960 -1402692 -1253592 -1182085 -1177720 -1139273 -1027503
14233a027503J32400J06923P1957O5903R8875M9786j07823k01630j80249j13530
$$ -1027503 -895103 -788180 -716223 -650320 -551445 -501659 -609482 -811112 -991361 -1104891
14223a104891l1856O0031R8197P7437Q1910J02922J11871J45684J66093J11265
$$ -1104891 -1136747 -1076716 -978519 -901082 -819172 -716250 -604379 -458695 -292602 -181337
14213a81337O7408J02639J71271K04284J30436k0429j35844j77212j62928j29538
$$ -181337 -113929 -11290 159981 364265 494701 474272 338428 161216 -1712 -131250
14203a31250r7357o3172k9819M1301J07608P8812K047n270N5936Q1927O0745K0428
$$ -131250 -228607 -291779 -321598 -280297 -172689 -93877 -91830 -97100 -41164 40763 101508 121936
14191A21936r635j7293l0891n8909q4604o2115k9546j8192r447O32L7340P5816
$$ 121936 112301 95008 64117 5208 -79396 -141511 -171057 -189249 -198696 -198064 -160724 -84908
14179h4908O4658P8859J20661J22437J30511J15237O4244j0166r8543j78183k41036
$$ -84908 -20250 58609 179270 301707 432218 547455 611699 601533 502990 324807 83771
14168H3771k37836j22505M6059J56509J65404Q1683m0895p9440N278J10465J14381
$$ 83771 -154065 -276570 -230511 -74002 91402 173085 132190 52750 58028 168493 282874
14157B82874J6487r7546j86088j91293j02265K6160P0378m868n0411r57P5825
$$ 282874 299361 201815 15727 -175566 -277831 -251671 -181293 -186161 -236572 -237529 -161704
14146a61704J49737K11354J92540O9464o3227j04384m8040l6123j27887j57012
$$ -161704 -11967 199387 391927 461391 398164 293780 245740 209617 81730 -75282
14136g5282l1293J27014J86356Q8213q9097k36150k84020k34172j47307j77J56931
$$ -75282 -106575 20439 206795 295008 205911 -30239 -314259 -548431 -695738 -695915 -538984
14125e38984K08779J30059K9679J6507P0932J07369P2459p734q3016q9461j4003
$$ -538984 -330205 -200146 -170467 -153960 -83028 24341 96800 89066 6050 -83411 -97414
14114i7414N4337R1449J05175J00049M9879n2396j40219j71723j47831r7778m3116
$$ -97414 -43077 48372 153547 253596 303475 251079 110860 -60863 -208694 -306472 -349588
14103c49588N9648J50990J43372O6982j5298q6683j41774j33507p2682l5642o177
$$ -349588 -289940 -138950 4422 71404 56106 -30577 -172351 -305858 -378540 -414182 -420359
14092d20359O876o555J6082N0153O3776Q6873L1515r2240j05013L2525J62657
$$ -420359 -413483 -420038 -403956 -353803 -290027 -203154 -171639 -263879 -368892 -336367 -173710
14081a73710J63838J25970J25536R6041L7811p878m1862o5644q7794j16344j39713
$$ -173710 -9872 116098 241634 337675 375486 367608 325746 260102 172308 55964 -83749
14070h3749r7935L299P2277R9967P0286p7822k11484j49474J1940R2923Q2415
$$ -83749 -181684 -178385 -106108 -6141 64145 -13677 -225161 -374635 -362695 -269772 -187357
14059a87357N0670R672O976O3753R3300N5615M484K6891J07107J15891P7652J8146
$$ -187357 -136687 -127015 -120039 -56286 37014 92629 97113 124004 231111 347002 424654 442800
14047D42800j14723k24306k06682j17425p1042o6458n9157l1779M8674J13972
$$ 442800 328077 103771 -102911 -220336 -291378 -357836 -416993 -448772 -400098 -286126
14037b86126Q1507J7127q7605j77122r6745M3507J27410J41016P1329o639j61
$$ -286126 -204619 -187492 -275097 -452219 -548964 -505457 -378047 -237031 -165702 -172341 -172502
14026a72502L4312O613k2947j4042j3044j8622K3298J21206J81047J52985J09004
$$ -172502 -138190 -131577 -154524 -168566 -181610 -200232 -176934 -55728 125319 278304 387308
14015C87308K9045k5819L4422J09136J19438N0871m7789j05235j55182j89915
$$ 387308 416353 390534 424956 534092 653530 704401 656612 551377 396195 206280
14005B06280j53735o3996J0461L4294L9626O3537O8056N2918O1015N6687J6280
$$ 206280 52545 -11451 -990 33304 72930 136467 204523 257441 318456 375143 391423
13994C91423J2667L0038K8568j2823p2641o4420K6607Q1578L3442j12997k24480
$$ 391423 404090 434128 462696 449873 377232 312812 339419 420997 454439 341442 116962
13983A16962j54642K6638J11777Q0716J0810n0775n9357j04387j76960j66140
$$ 116962 -37680 -11042 100735 181451 192261 141486 82129 -22258 -199218 -365358
13973c65358j03317k0633O2650P6533J1064l7672J985J04940J66532J43217J10348
$$ -365358 -468675 -489308 -426658 -350125 -339061 -376733 -374748 -269808 -103276 39941 150289
13962A50289P8057J299o9291j03556j23714r6675k7409J4419k6164p1358j8084
$$ 150289 228346 229645 160354 56798 -66916 -163591 -191000 -176581 -202745 -274103 -292187
13951b92187P6100J19663J05573M0439p6817j50884j09185k8645M7962J14030
$$ -292187 -216087 -96424 9149 49588 -27229 -178113 -287298 -315943 -267981 -153951
13941a53951J15078M9826l4533o6794p646L3852L1691L0959K2777j3941m1039
$$ -153951 -38873 10953 -23580 -90374 -98020 -64168 -32477 -1518 21259 7318 -33721
13930c3721m3055o340P0305Q1975m063j10335j77796k10223j93795j18074j0043
$$ -33721 -76776 -83116 -12811 69164 65101 -45234 -223030 -433253 -627048 -745122 -755165
13919g55165P8547P4755J4908K6131O8498J9591q0694j46041j72929j90516j52374
$$ -755165 -676618 -601863 -586955 -560824 -492326 -472735 -553429 -699470 -872399 -1062915 -1215289
13908a215289o1555L9317J23613R9738N0786J08980J56243J13774O6948N8526
$$ -1215289 -1276844 -1237527 -1113914 -1014176 -963390 -854410 -698167 -584393 -517445 -458919
13898d58919J03138J44634J21201O3876K6934r646p6605j07871o3896K4621R7313
$$ -458919 -355781 -211147 -89946 -26070 864 -8782 -85387 -193258 -257154 -232533 -135220
13887a35220P2376l2727j23363j47895j13665o1364o1843j16158j01416j8627
$$ -135220 -62844 -95571 -218934 -366829 -480494 -541858 -603701 -719859 -821275 -839902
13877h39902P5095J37432J28297P1802K2738k4621n0736k1310n220m9368n3055
$$ -839902 -764807 -627375 -499078 -427276 -404538 -429159 -479895 -501205 -506425 -555793 -608848
13866f08848O1279J70267J98231J74435P9297l2275o3577N020O1824k0693j45797
$$ -608848 -547569 -377302 -179071 -4636 74661 42386 -21191 -16171 45653 24960 -120837
13855a20837j65877l9124P6514M0242n9632j22524r1667o2236r8863j26127p1911
$$ -120837 -286714 -325838 -249324 -209082 -268714 -391238 -482905 -545141 -644004 -770131 -842042
13844h42042M4492J11682J29795J41414J19765P1224K4279k8525p0775n1532j0062
$$ -842042 -797550 -685868 -556073 -414659 -294894 -223670 -199391 -227916 -298691 -350223 -360285
13833c60285J8658O4037O4462j7771m3973J0112K6215j4071j4209N6906J38069
$$ -360285 -341627 -277590 -213128 -230899 -274872 -264760 -238545 -252616 -266825 -209919 -71850
13822g1850J91774K01337J62931J34832J67667J65022J02409O4208M815j29904
$$ -71850 119924 321261 484192 619024 786691 951713 1054122 1118330 1123145 993241
13812I93241k71858l15962k45285j85514j38490n0047K4104L287j02452j86576
$$ 993241 721383 405421 160136 -25378 -163868 -213915 -189811 -186524 -288976 -475552
13802d75552j42392n4084Q827J32719K64294K86558J87488R3073N5395Q690l4157
$$ -475552 -617944 -672028 -663201 -530482 -266188 20370 207858 300931 356326 365016 330859
13791C30859p6137j49815j88768j48995j10821j45884j74890j07676M0593J50338
$$ 330859 254722 104907 -83861 -232856 -343677 -489561 -664451 -772127 -731534 -581196
13781e81196J05960k8346q4739l0283N0729Q7980M3618l1977o8873k5148N0346
$$ -581196 -475236 -503582 -588321 -618604 -567875 -479895 -436277 -468254 -537127 -562275 -511929
13770e11929J10352J53790J65669J15206O865n3706q8556j16593j07966j13105
$$ -511929 -401577 -247787 -82118 33088 39953 -13753 -102309 -218902 -326868 -439973
13760d39973j30958j30824j09959n3218L0544J60426K74535K57456J51460K8642
$$ -439973 -570931 -701755 -811714 -864932 -834388 -673962 -399427 -141971 9489 38131
13750C8131p3158j31468j39983j10500n5742J6828M9766L6592N1800O8987M7411
$$ 38131 -35027 -166495 -306478 -416978 -472720 -455892 -406126 -369534 -317734 -248747 -201336
13739b01336K0998l1338j35175j88278j40061n5216M6236J53480J54192Q8128
$$ -201336 -180338 -211676 -346851 -535129 -675190 -730406 -684170 -530690 -376498 -288370
13729b88370M7881K9283M1869J6727l2919m6206o6068j07791j43670j25712m6155
$$ -288370 -240489 -211206 -169337 -152610 -185529 -231735 -297803 -405594 -549264 -674976 -721131
13718g21131K8465l039j32816k50556k40321p0970J20494K02374J99435J23200
$$ -721131 -692666 -695705 -828521 -1079077 -1319398 -1390368 -1269874 -1067500 -868065 -744865
13708g44865K8743M4550J20472J58383J69541J68049J93128K29412J95929Q0718
$$ -744865 -716122 -671572 -551100 -392717 -223176 -55127 138001 367413 563342 644060
13698F44060m5244j25753j45563j53865j86559j80695j28182m5060N3250J38340
$$ 644060 598816 473063 327500 173635 -12924 -193619 -321801 -366861 -313611 -175271
13688a75271J72725J15741L9971K4654Q7930J30852K7327j83040l61601l74638
$$ -175271 -2546 113195 153166 177820 265750 396602 423929 240889 -120712 -495350
13678d95350k34846o0451M1063Q0384J18908J17381R2202J06347J30996J22985
$$ -495350 -730196 -790647 -749584 -669200 -550292 -432911 -340709 -234362 -103366 19619
13668A9619J26666J26301M3902p8151j19203m7798J6224j9543r4735j25818o2444
$$ 19619 146285 272586 316488 238337 119134 71336 87560 68017 -26718 -152536 -214980
13657b14980N7453J14103N4116q8185j94134k07213j31776l3317O2884J88760
$$ -214980 -157527 -43424 10692 -77493 -271627 -478840 -610616 -643933 -581049 -392289
13647c92289K82728K73064J70748P5999N5096L7483m1468r2952o3455n1339r8865
$$ -392289 -109561 163503 334251 410250 465346 502829 461361 368409 304954 253615 154750
13636A54750j59755j34369l2511O7363J46062J95544J89139J06101k6450j42444
$$ 154750 -5005 -139374 -171885 -104522 41540 237084 426223 532324 505874 363430
13626C63430j69583j39996j04781o6834o1728p5222m2549r247o347j0K3285K9029
$$ 363430 193847 53851 -50930 -117764 -179492 -254714 -297263 -306510 -312857 -312867 -289582 -260553
13614b60553m8746j32536j49534r1042J8965J25301K01608K09225J59740J08937
$$ -260553 -309299 -441835 -591369 -682411 -663446 -538145 -336537 -127312 32428 141365
13604A41365Q1944J07547J64640J75197J33385N0746l3143n9696l0798K4194M3651
$$ 141365 223309 330856 495496 670693 804078 854824 821681 761985 731187 755381 799032
13593G99032n798j06610j57125j10818n7432r8273j92250j81684r8346n4405j7056
$$ 799032 793234 686624 529499 418681 361249 262976 70726 -110958 -209304 -263709 -280765
13582b80765L0640N1696N1388Q3358J06642Q0555l172r8860p8718K2816O9418
$$ -280765 -250125 -198429 -147041 -63683 42959 123514 120342 21482 -57236 -34420 34998
13571C4998K8736j0167j1083K6058Q5358J39896J05971j7738p4520o9955r5863
$$ 34998 63734 53567 42484 68542 153900 293796 399767 382029 307509 237554 141691
13560A41691j16085j30091j48057j04848j1165M9167M0450J9083j6755k4976J4713
$$ 141691 25606 -104485 -252542 -357390 -368555 -319388 -278938 -259855 -276610 -301586 -286873
13549b86873N6687R4362J40082J71935J95652J84964O2099m5881l1573J3290R307
$$ -286873 -230186 -135824 4258 176193 371845 556809 618908 573027 541454 554744 564051
13538E64051k8030p4984j44363k07651k34818k41549j93878j10638m7892K1632
$$ 564051 536021 461037 316674 109023 -125795 -367344 -561222 -671860 -719752 -698120
13528f98120R4782J14912O1840N955J0757j187p1055q3676j4175Q5094J68706
$$ -698120 -603338 -488426 -426586 -420631 -409874 -411061 -482116 -565792 -579967 -494873 -326167
13517c26167J87079J10523J1183n2860j17785j28136J1884J23021P5837K8751
$$ -326167 -139088 -28565 -17382 -70242 -188027 -316163 -304279 -181258 -105421 -76670
13507g6670N2680p054j68124k07326p6745J9730q068n6763J1409J45371K02424
$$ -76670 -23990 -31044 -199168 -406494 -483239 -463509 -471577 -528340 -516931 -371560 -169136
13496a69136J79089R3308j0914n6799l5909j9626m0329k5522O874l5937j17218
$$ -169136 9953 103261 92347 35548 -361 -19987 -60316 -85838 -78964 -114901 -232119
13485b32119j36956q2271j3718L5361N4570P5371J25956J91654J97897J06170
$$ -232119 -369075 -451346 -465064 -429703 -375133 -299762 -173806 17848 215745 321915
13475C21915k5494q4785j1125J05019J39270J02117J4824p2017r3081p1953o1925
$$ 321915 296421 211636 200511 305530 444800 546917 561741 489724 396643 324690 262765
13464B62765p3416p1990k0734L0103L4242K6625N4324Q8179J05875J32316J47504
$$ 262765 189349 117359 96625 126728 160970 187595 241919 330098 435973 568289 715793
13453G15793R5047L4132O9511J64429J70091O4633J6815K8371o680m1985p5526
$$ 715793 810840 844972 914483 1078912 1249003 1313636 1330451 1358822 1352142 1310157 1234631
13442A234631j21063k08665k92210k61014j62927j21752j10669q7340o5025j7626
$$ 1234631 1113568 904903 612693 351679 188752 67000 -43669 -131009 -196034 -213660
13432b13660J4819k1535p9195r0672j8398J01659J96218K27408J72716Q7522M9506
$$ -213660 -198841 -220376 -299571 -390243 -408641 -306982 -110764 116644 289360 376882 426388
13421D26388P7547J09482N8825k2263k3430j7430r0472j34719j04862k4843R2650
$$ 426388 503935 613417 672242 649979 626549 609119 518647 383928 279066 254223 346873
13410C46873J67639J53337Q0394K1282m808m7622j02565j34127j59119k04770
$$ 346873 514512 667849 748243 769525 764717 717095 614530 480403 321284 116514
13400A16514j96859p3370O3701J10991R3826M7581j539l5608q7621j10425q6716
$$ 116514 -80345 -153715 -90014 20977 114803 162384 160845 125237 37616 -72809 -159525
13389a59525p7386r9993q9364l700R8664J60751K02668J94061J12876J8194p7623
$$ -159525 -236911 -336904 -426268 -429968 -331304 -170553 32115 226176 339052 357246 279623
13378B79623j57528j47669o5116O338K2053K9676O3889R9294J00815N4440K4548
$$ 279623 122095 -25574 -90690 -84352 -62299 -32623 31266 130560 231375 285815 310363
13367C10363L6323K3290k8397j17696j70776o0614R3514J33994R2620J03716J85684
$$ 310363 346686 369976 341579 223883 53107 -7507 86007 220001 312621 416337 602021
13356F02021K22526J75166K4536j55581k20393j47920n0485j9231m839L8098O2861
$$ 602021 824547 999713 1024249 868668 648275 500355 449870 430639 425800 463898 526759
13345E26759L9531N1804P3930M6684J916n9827j25138j59336j42883n3892M1709
$$ 526759 566290 618094 692024 738708 740624 680797 555659 396323 253440 199548 241257
13334B41257P4100N8273J1302l7203m0018M818J4488l3303q5729q4548k9560j0978
$$ 241257 315357 373630 384932 347729 307711 312529 327017 293714 207985 123437 93877 82899
13322H2899l5140n764L6755L4748J4156M543Q2701K08179K59197J93227M4968
$$ 82899 47759 41995 78750 113498 127654 132197 214898 423077 682274 875501 920469
13311I20469p3954j08115j28620j63960j78641j60636r2902j7709L6351R6592
$$ 920469 846515 738400 609780 445820 267179 106543 13641 -4068 32283 128875
13301A28875J17702N3069j9473k7556k4908j5081J5426L8629O4964O9175N6784
$$ 128875 246577 299646 280173 252617 227709 212628 228054 266683 331647 400822 457606
13290D57606N7910Q7941J22985J48684J07026j592n9703q732P2771L0747q8844
$$ 457606 515516 603457 726442 875126 982152 980560 920857 912125 984896 1015643 926799
13279I26799j59343j63564j45706r9772p8388o5934L9797J46673J44368O7584
$$ 926799 767456 603892 458186 358414 280026 214092 253889 400562 544930 612514
13269F12514M443k9569p6499j01249N791J48200J89040J68585O5066p3413j44461
$$ 612514 616957 587388 510889 409640 415431 563631 752671 921256 986322 912909 768448
13258G68448r8825J2712M5539K4099O7359J00471L7512R203J09517J72172R4639
$$ 768448 669623 682335 727874 751973 819332 919803 957315 966518 1076035 1248207 1342846
13247A342846K742M079L7837J1665p0217r6138j9745O9941R5235K7568o6893r5861
$$ 1342846 1345588 1349667 1387504 1399169 1328952 1232814 1213069 1283010 1378245 1405813 1338920 1243059
13235A243059p3159o4206l5044M8357R3828J9081j25737k15197k06727j42500
$$ 1243059 1169900 1105694 1070650 1119007 1212835 1231916 1106179 890982 684255 541755
13225E41755j00909o1609K376M1332O6952P8320R2174J58261K75506L21304K01062
$$ 541755 440846 379237 381613 422945 489897 568217 660391 818652 1094158 1415462 1616524
13214A616524L1770q3261j25883n1526O6967J19765J19377R4217J9866p7746k01456
$$ 1616524 1648294 1565033 1439150 1387624 1454591 1574356 1693733 1787950 1807816 1730070 1528614
13203A528614k76320k64568k29342j30771J7819J06801R9823O0126J6099r491
$$ 1528614 1252294 987726 758384 627613 645432 752233 852056 912182 928281 918790
13193I18790m578O913o645m3084n3017J0446P7416R3806R2515Q4797J03054J73186
$$ 918790 914212 921125 914480 871396 818379 828825 906241 1000047 1092562 1177359 1280413 1453599
13181A453599K02126J30864N7019K0891j581n9802j17497j39964j69375j83042
$$ 1453599 1655725 1786589 1843608 1864499 1862918 1803116 1685619 1545655 1376280 1193238
13171A193238j25328k3278Q6983J26346N5478L305J9647L0640L0925M3733L2360
$$ 1193238 1067910 1044632 1131615 1257961 1313439 1316744 1336391 1367031 1397956 1441689 1474049
13160A474049p19m9960j03423p7915j4754k570m4329m4915O6089J88643K18103
$$ 1474049 1473330 1423370 1319947 1242032 1227278 1224708 1180379 1135464 1201553 1390196 1608299
13149A608299J98801J79930J26237M2547l9580r6333j11840j30358j72870k03318
$$ 1608299 1807100 1987030 2113267 2155814 2116234 2019901 1908061 1777703 1604833 1401515
13139A401515j61837j0873J41744J98266J49616L1997q8893j46750j39875j25695
$$ 1401515 1239678 1228805 1370549 1568815 1718431 1750428 1661535 1514785 1374910 1249215
13129A249215j01720o2818q176M0235L6580k0311l153Q9165J69900J96295J23371
$$ 1249215 1147495 1084677 1076501 1116736 1153316 1133005 1129852 1219017 1388917 1585212 1708583
13118A708583L8627O9433J72752J58396L4906l4338n2612p5081o6075l9604Q464
$$ 1708583 1747210 1816643 1989395 2147791 2182697 2148359 2095747 2020666 1954591 1914987 1923451
13107A923451J09108J93697J92769J12317J3697n0478m9065m600P712k4593j3801
$$ 1923451 2032559 2226256 2419025 2531342 2545039 2494561 2445496 2440896 2448608 2424015 2410214
13096B410214M8085J01877J39969J33420O7933j7339l0145J6310J5790m697p148
$$ 2410214 2458299 2560176 2700145 2833565 2901498 2884159 2854014 2870324 2886114 2881417 2874269
13085B874269M034M492j0943o9483j52048j52652o3914K8771Q7314J25112J32656
$$ 2874269 2878303 2882795 2871852 2802369 2650321 2497669 2433755 2462526 2549840 2674952 2807608
13074B807608J19508J06424R7080P9493M4502J8445M7117J02571J55921J86259
$$ 2807608 2927116 3033540 3130620 3210113 3254615 3273060 3320177 3422748 3578669 3764928
13064C764928J47389N4137l7780p8361o9262p5469j10896j22363j05676k1915
$$ 3764928 3912317 3966454 3928674 3850313 3781051 3705582 3594686 3472323 3366647 3344732
13054C344732J08182J63695J30301O2850J8112K3875M9485M0772J8060M2867J13190
$$ 3344732 3452914 3616609 3746910 3809760 3827872 3851747 3901232 3942004 3960064 4002931 4116121
13043D116121J97214K32513J60007L8065O946M0477L3088n910O713P4505Q9062
$$ 4116121 4313335 4545848 4705855 4743920 4750866 4791343 4824431 4818521 4825234 4899739 4988801
13032D988801N6266N937j6732O7290J90826K55114K83276K81414K03446J13287
$$ 4988801 5045067 5051004 5034272 5101562 5292388 5547502 5830778 6112192 6315638 6428925
13022F428925R9062J34021K05097L21701M50030M70933L38738J83552J19379J12326
$$ 6428925 6527987 6662008 6867105 7188806 7638836 8109769 8448507 8632059 8751438 8863764
13012H863764J16759J94874L21398M12638M53301M17369L51590L84053M42786
$$ 8863764 8980523 9175397 9496795 9909433 10362734 10780103 11131693 11515746 11958532
13003A1958532M13823L92706M65259N68503O40397P15912Q52680J024528J174178
$$ 11958532 12372355 12765061 13230320 13798823 14439220 15155132 16007812 17032340 18206518
12994A8206518J294370J429230J596152J709345J810381K013464K333420K764712
$$ 18206518 19500888 20930118 22526270 24235615 26045996 28059460 30392880 33157592
12986C3157592L241220L664868M111915M735685N507623O403363P517240Q903378
$$ 33157592 36398812 40063680 44175595 48911280 54418903 60822266 68339506 77242884
12978G7242884J0556663J2448935J4624384J7253161K0505911K4503007K9333120
$$ 77242884 87799547 100248482 114872866 132126027 152631938 177134945 206468065
12971B06468065L4929396M0804930M5702456M6962434M0152763K1561072o138032
$$ 206468065 241397461 282202391 327904847 374867281 415020044 436581116 430443084
12964D30443084l2613417m8263570n1746705m7618303m0586879l3292951k6900973
$$ 430443084 397829667 349566097 297819392 250201089 209614210 176321259 149420286
12957A49420286k1715983j7643421j4473168j1945726r870115q187757o845727
$$ 149420286 127704303 110060882 95587714 83641988 73771873 65584116 58738389
12950E8738389n754292m821455m020807l450813l050726k660696k278674k045462
$$ 58738389 52984097 48162642 44141835 40691022 37640296 34979600 32700926 30655464
12942C0655464j913259j689130j420782j252403j091870q93447p64247p29945
$$ 30655464 28742205 27053075 25632293 24379890 23288020 22394573 21630326 20900381
12934B0900381p29070p04743o56548o28136n29077k91369n3842N8688M3483n691
$$ 20900381 20171311 19466568 18810020 18181884 17652807 17361438 17307596 17366284 17409767 17404076
12924A7404076k4831k0400J2970J06797K47932L38429L67747M05165M61074M95489
$$ 17404076 17379245 17358845 17371815 17478612 17726544 18064973 18432720 18837885 19298959 19794448
12914A9794448N10093N43088O47148Q60908J122341J349639J508277J511244J321983
$$ 19794448 20304541 20847629 21494777 22355685 23478026 24827665 26335942 27847186 29169169
12905B9169169J076824J006013J207458J543427J838380K117445K547378L162712
$$ 29169169 30245993 31252006 32459464 34002891 35841271 37958716 40506094 43668806
12897D3668806L862560M602461N447909O467096P688351R170622J0887416J2877449
$$ 43668806 47531366 52133827 57581736 64048832 71737183 80907805 91795221 104672670
12889A04672670J5242282J8088420K1580981K5839560L0948453L6776649M2745009
$$ 104672670 119914952 138003372 159584353 185423913 216372366 253149015 295894024
12882B95894024M7318747M7248812L7701235J5731739j3754767l8960056n1590810
$$ 295894024 343212771 390461583 428162818 443894557 430139790 391179734 339588924
12875C39588924n2458717m6865315l9282982l1954470k5679664k0637191j6724078
$$ 339588924 287130207 240264892 200981910 169027440 143347776 122710585 105986507
12868A05986507j3671893j1230902r284705p759327o540124n507685m640893l991728
$$ 105986507 92314614 81083712 71799007 64039680 57499556 51991871 47350978 43359250
12860D3359250l544443l194076k839952k465099k078739j712245j423711j202711
$$ 43359250 39814807 36620731 33780779 31315680 29236941 27524696 26100985 24898274
12852B4898274j042283r67554r56555r28748q42542p45274o83168n96429m92459
$$ 24898274 23855991 22888437 21931882 21003134 20160592 19415318 18732150 18135721 17643262
12843A7643262l96654l53206l37300k51271j91545k08757k03993j28053k8582
$$ 17643262 17246608 16893402 16556102 16304831 16113286 15904529 15700536 15572483 15543901
12834A5543901J03323J86234J63452J34211K24726L96728N16896N48157N08842
$$ 15543901 15647224 15833458 15996910 16131121 16355847 16752575 17269471 17817628 18326470
12825A8326470N14850O23096P34469P77933Q44855J027767J214336J367592J574707
$$ 18326470 18841320 19464416 20198885 20976818 21821673 22849440 24063776 25431368 27006075
12816B7006075J793376K025573K350529K744456L197440L713566M293762M978657
$$ 27006075 28799451 30825024 33175553 35920009 39117449 42831015 47124777 52103434
12808E2103434N785503O778088Q022571R540771J1317600J3359526J5715913J8581526
$$ 52103434 57888937 64667025 72689596 82230367 93547967 106907493 122623406 141204932
12800A41204932K2160408K6578346L1786172L7519169M3095080M6747546M4888452
$$ 141204932 163365340 189943686 221729858 259249027 302344107 349091653 393980105
12793C93980105L2882797R264933j9351420m1624068n1381892n0665190m4690600
$$ 393980105 426862902 436127835 416776415 375152347 323770455 273105265 228414665
12786B28414665l7361022l0473645k4648033j9954224j6217910j3232213j0842212
$$ 228414665 191053643 160579998 135931965 115977741 99759831 86527618 75685406
12779G5685406q973701p487614o285536n360102m632155m010447l443088k930881
$$ 75685406 66711705 59224091 52938555 47578453 42946298 38935851 35492763 32561882
12771C2561882k511441k195498j928176j677397j541681j495212j361548j190749
$$ 32561882 30050441 27854943 25926767 24249370 22707689 21212477 19850929 18660180
12763A8660180j128293j088280j008021r09073q17675p98225q15845p53697o48531
$$ 18660180 17531887 16443607 15435586 14526513 13708838 12910613 12094768 11341071 10692540
12754A0692540n90592n28145m26574l75282l72770l41961l26820l55452l75069
$$ 10692540 10101948 9573803 9147229 8771947 8399177 8057216 7730396 7374944 6999875
12745F999875l36672k75443k85637l78934l88467k44066j08705p2230j09630k04283
$$ 6999875 6663203 6387760 6102123 5723189 5334722 5090656 4981951 4909721 4800091 4595808
12735D595808k74069k69015k59095k63128j92480o8818p210R045j980l0603l8422
$$ 4595808 4321739 4052724 3793629 3530501 3338021 3269203 3261993 3271038 3269058 3238455 3200033
12724C200033j4046O261j8271m3253n4869m4705k803M8392O8546j6676j50214
$$ 3200033 3185987 3192248 3173977 3130724 3075855 3031150 3028347 3076739 3145285 3128609 2978395
12713B978395k14760j82875j36598j51625j81696j32404J5102J33956J42456O8447
$$ 2978395 2763635 2580760 2444162 2292537 2110841 1978437 1993539 2127495 2269951 2338398
12703B338398k0408n3189l0043O0162J34718R7800l3716j69828k33614j89372
$$ 2338398 2317990 2264801 2234758 2294920 2429638 2527438 2493722 2323894 2090280 1900908
12693A900908o2116K6822L5106L5931M2622l6651j34040j36516p3777j4758K3085
$$ 1900908 1838792 1865614 1900720 1936651 1979273 1942622 1808582 1672066 1598289 1583531 1606616
12682A606616O3196P1992L3383J0816M7997R0376N3616j6984o5915n9160j498
$$ 1606616 1669812 1741804 1775187 1786003 1834000 1924376 1977992 1961008 1895093 1835933 1834435
12671A834435N8213L7282l4071n873J11787J19838j8055j25547j38702j35994
$$ 1834435 1892648 1929930 1895859 1889986 2001773 2121611 2103556 1978009 1839307 1703313
12661A703313j44048j07673j0445N3448M6815K3640r484r2893j99555k37698j77724
$$ 1703313 1559265 1451592 1441147 1494595 1541410 1565050 1555566 1462673 1263118 1025420 847696
12650H47696q8589j9024J7561O8100J42744J13332j4385j21892j80308j67044
$$ 847696 759107 740083 757644 825744 968488 1081820 1067435 945543 765235 598191
12640E98191o6605M9801O0619k4879j10368j62826j76043j69730j19717j1473
$$ 598191 531586 581387 642006 617127 506759 343933 167890 -1840 -121557 -133030
12630a33030J21586K27872K45140J56583Q0642P9046O8376N5981L1842m0777j63813
$$ -133030 -11444 216428 461568 618151 698793 777839 846215 902196 934038 893261 729448
12619G29448k69939k88767k33901r3993Q2028J92568J87056J37203J47013J41743
$$ 729448 459509 170742 -63159 -157152 -75124 117444 304500 441703 588716 730459
12609G30459N1884n6111q8400m4382j0856m1416n2603K0615N1819N780K8182P9829
$$ 730459 782343 726232 637832 593450 582594 541178 488575 509190 561009 566789 594971 674800
12597F74800M3101l8537l6331M657l3505p9670m6204r906l2163j9851N2663J07324
$$ 674800 717901 679364 643033 647690 614185 534515 488311 478405 446242 426391 479054 586378
12585E86378J22429J05402J6342o8153q9219j13272j56631j60632q2289N7671
$$ 586378 708807 814209 830551 762398 673179 559907 403276 242644 160355 218026
12575B18026J87445K78849K61954R5348p1347q2467k6519k2310o2389q6167n4120
$$ 218026 405471 684320 946274 1041622 970275 887808 861289 838979 776590 690423 636303
12564F36303k3207k8631o2124q4916q5233q1961o9890m3061J4316L7653L4219
$$ 636303 613096 584465 522341 437425 352192 270231 200341 157280 171596 209249 243468
12553B43468L7160L6536O2771M1169n3304r6936o4593l8853o8699p3251m7818
$$ 243468 280628 317164 379935 421104 367800 270864 206271 167418 98719 25468 -22350
12542b2350k3108M9109J29903P9888l563M0921J52761J91462J22046K2294m4451
$$ -22350 -45458 3651 133554 213442 209879 250800 403561 595023 717069 739363 694912
12531F94912p6959j08276q1886R688O9588J07546J83165K36365J60079j7412j92388
$$ 694912 617953 509677 427791 437479 507067 614613 797778 1034143 1194222 1176810 984422
12520I84422k89802k39603l7377J59276J89363J00044P9584J45147J49412O1751
$$ 984422 694620 455017 417640 576916 766279 866323 945907 1091054 1240466 1302217
12510A302217l6101j50075k22771k00799j30777n7274p5974j73650k14094j49635
$$ 1302217 1266116 1116041 893270 692471 561694 504420 428446 254796 40702 -108933
12500a08933o3217n465M2124P0928J21875J78904J98977J84200Q7353n7570j49487
$$ -108933 -172150 -177615 -135491 -64563 57312 236216 435193 619393 706746 649176 499689
12489D99689j30198p8292n9939m9993l2894r185j4841m0644l5115N900M8810P0904
$$ 499689 369491 291199 231260 181267 148373 139188 124347 83703 48588 54488 103298 174202
12477A74202N2313k2827j00072j07671m067J07233J05893L1492k8885r1740j40337
$$ 174202 226515 203688 103616 -4055 -8122 99111 205004 236496 207611 115871 -24466
12466b4466j31667n4920L9173P1850M5353O5303J31365J14758M1204k7443m1855
$$ -24466 -156133 -211053 -171880 -100030 -54677 10626 141991 256749 297953 270510 228655
12455B28655J5235M7287N0022L7330p95j98K5270M6871O8004O2971J2560l0080
$$ 228655 243890 291177 341199 378529 377734 377536 402806 449677 517681 580652 593212 563132
12443E63132k6039o127k152k7947n0781l8594K2109Q7344J00648R6054M9992o7893
$$ 563132 537093 530966 528814 500867 450086 411492 433601 520945 621593 717647 767639 699746
12431F99746j37417j13531j11218j33769o5402N3195Q8091K462j47328k31802
$$ 699746 562329 448798 337580 203811 138409 191604 279695 282157 134829 -96973
12421i6973k16293j78188j00657k1804M02L4177Q2346J15966J66814K23415K25566
$$ -96973 -313266 -491454 -592111 -613915 -613513 -579336 -496990 -381024 -214210 9205 234771
12410B34771J73774Q4489k2227q5825j49337k24004j73303J4810J19612L0946
$$ 234771 408545 493034 470807 384982 235645 11641 -161662 -146852 -27240 3706
12400C706r7586j34287j27723j48876j46577n0213Q2869J92802K48611K41242
$$ 3706 -93880 -228167 -355890 -504766 -651343 -701556 -618687 -425885 -177274 63968
12390F3968K05895J49891R1497J5662l4938J6616J17450J52473P9786m6044j29391
$$ 63968 269863 419754 511251 526913 491975 508591 626041 778514 858300 812256 682865
12379F82865j54325j42632j11627q5465j28036k04206j52172J4206N1784n5298
$$ 682865 528540 385908 274281 188816 60780 -143426 -295598 -281392 -229608 -284906
12369b84906p6185L954L6710k5121q6418r9640n1173M4087J16203J07100N8028
$$ -284906 -361091 -357137 -320427 -345548 -431966 -531606 -582779 -538692 -422489 -315389 -257361
12358b57361N8325O2792R195j5237L1662P0516N8725L6218M3118N2299N8442M4053
$$ -257361 -199036 -136244 -127049 -142286 -110624 -40108 18617 54835 97953 150252 208694 252747
12346B52747m7003j22239j22142l5636J21668K48658K28221K8402j89538k41948
$$ 252747 205744 83505 -38637 -74273 47395 296053 524274 552676 363138 121190
12336A21190j66763l7657R7593J50420P6299l0771q0804n8988N320M4667P6071
$$ 121190 -45573 -83230 14363 164783 241082 210311 129507 70519 75839 120506 196577
12325A96577P8079Q259o8740q2374l2818J9970L8005N7000Q1373P9116M564j46628
$$ 196577 274656 282915 214175 131801 98983 118953 156958 213958 295331 374447 379011 232383
12313B32383k77212k41390q2159M0293J29060K31199K52715J57670P9918P6851
$$ 232383 -44829 -286219 -368378 -328085 -199025 32174 284889 442559 522477 599328
12303E99328J05435O6847n3947j43389j44679q7033k6252J4347K3838k8484j13122
$$ 599328 704763 771610 717663 574274 429595 342562 316310 330657 354495 326011 212889
12292B12889j21609k5831J03485J95893K20070J93080J60354J31444O4576k2556
$$ 212889 91280 65449 168934 364827 584897 777977 938331 1069775 1134351 1111795
12282A111795n3915o2612p3238p0304p0565r5822j05583j19036j18601p8290o1173
$$ 1111795 1057880 995268 922030 851726 781161 685339 579756 460720 342119 263829 202656
12271B02656o3072k5012L7550N5494L9345M8991N9817j742r4036j21491j03661
$$ 202656 139584 114572 152122 207616 246961 295952 355769 354027 259991 138500 34839
12260C4839n4725K1555P3813Q5433O3766J9683k5518m1885k0305R979M1279L641
$$ 34839 -19886 1669 75482 160915 224681 244364 218846 176961 156656 166635 207914 211555
12248B11555o3881j7087J55904L11611K89135J17308n3779j28055j34405j36573
$$ 211555 147674 130587 286491 598102 887237 1004545 950766 822711 688306 551733
12238E51733j40316o3244R9436K45322L02811K81474K33311K28970K49519K01036
$$ 551733 411417 348173 447609 692931 995742 1277216 1510527 1739497 1989016 2190052
12228B190052Q5746N8933J58272K93892L86081M41241M80148N01942N54872O85140
$$ 2190052 2275798 2334731 2493003 2786895 3172976 3614217 4094365 4596307 5151179 5836319
12218E836319Q88385J112548J394527J696102J799498J437463M51011q77216j852792
$$ 5836319 6724704 7837252 9231779 10927881 12727379 14164842 14615853 13738637 11885845
12209A1885845k109907j888828j502384j119360q08427o06416n10634m80029m93344
$$ 11885845 9775938 7887110 6384726 5265366 4456939 3850523 3339889 2859860 2366516
12200B366516m47369l41697k68778k10714j10425L277K4296m9026j21862j36223
$$ 2366516 1919147 1577450 1308672 1097958 987533 990810 1015106 966080 844218 707995
12190G07995p3184J1720N1250J4250r0836j74247j00925Q890l0751j23165j50227
$$ 707995 634811 646531 697781 712031 621195 446948 346023 354913 324162 200997 50770
12179E0770q5221J3194N3587N9626P2175O4255L1184K3400M7726L9711q252o7413
$$ 50770 -34451 -21257 32330 91956 164131 228386 259570 282970 330696 370407 362155 294742
12167B94742r7635q1732n2192k1687j577r060n3951r6206q4317k3564M3409N6273
$$ 294742 197107 115375 63183 41496 39919 30859 -23092 -119298 -203615 -227179 -183770 -127497
12155a27497J5276n9588j08725p3551l5542p794P8571J81780K11603J31460M1266
$$ -127497 -112221 -171809 -280534 -354085 -389627 -397421 -318850 -137070 74533 205993 247259
12144B47259M8355J07931J19825O1610J9510l2130j04890j34359j03459r1517
$$ 247259 295614 403545 523370 584980 604490 572360 467470 333111 229652 138135
12134A38135r6374o643J21618J77642J08119j4789r3190j10771j16960j33140
$$ 138135 41761 35118 156736 334378 442497 427708 334518 223747 106787 -26353
12124b6353j39660j24962r2544k8699M4330Q3033Q6182J32573K22220J91346M9302
$$ -26353 -166013 -290975 -383519 -412218 -367888 -284855 -198673 -66100 156120 347466 396768
12113C96768o9581j24298j72916k27307k30081j70836l9661O0132O5898O0020
$$ 396768 327187 202889 29973 -197334 -427415 -598251 -637912 -577780 -511882 -451862
12103d51862P3171P4748O3251L6409J2664N4778R8098P3084K3445o5134j60909
$$ -451862 -378691 -303943 -240692 -204283 -191619 -136841 -38743 34341 57786 -7348 -168257
12092a68257j22594M2580J62443J58100O8979l9179r5687j22311j28945q3916
$$ -168257 -290851 -248271 -85828 72272 141251 102072 6385 -115926 -244871 -328787
12082c28787n7685q8257j38338j11982k1890J8195M963m841M121O1023J67580
$$ -328787 -386472 -474729 -613067 -725049 -746939 -728744 -723781 -728622 -724501 -663478 -495898
12071d95898K32809J79170Q0128M7026M1033q225j8552Q1160J89933J76865K9815
$$ -495898 -263089 -83919 -3791 43235 84268 76043 57491 138651 328584 505449 535264
12060E35264j25326k40358k95649k10635n5427L8190N8977P4406J23083J45886
$$ 535264 409938 169580 -126069 -336704 -392131 -353941 -294964 -220558 -97475 48411
12050D8411R5328K7414k3786p8252j13774j19944r2809J6414J26197J22010R804
$$ 48411 143739 171153 147367 69115 -44659 -164603 -257412 -240998 -114801 7209 17013
12039A7013r9752j45199j39018q8227l0268M3124J62907K51508K44798J78532
$$ 17013 -82739 -227938 -366956 -455183 -485451 -442327 -279420 -27912 216886 395418
12029C95418Q3019M825m1873p7097o3920M106O2495R2209Q9279M7546l5604j66907
$$ 395418 478437 483262 441389 364292 300372 304478 366973 459182 548461 596007 560403 393496
12017C93496k52396k32428j68604r5196m3517k543M0726L5559l124J2843K4898
$$ 393496 141100 -91328 -259932 -355128 -398645 -401188 -360462 -324903 -328027 -315184 -290286
12006b90286J0455L0902N9306M3946m8911j39138j12186j1809N8852O0164p932
$$ -290286 -279831 -248929 -189623 -145677 -194588 -333726 -445912 -457721 -398869 -338705 -346637
11995c46637m9605J1931J08303J07324K81l9256M4935J09307R4882L0841o7687
$$ -346637 -396242 -384311 -276008 -168684 -168403 -207659 -162724 -53417 41465 72306 4619
11984D619j26745o3614P2263K18234K65339J61904L6571K2849N4939J5156J9180
$$ 4619 -122126 -185740 -113477 104757 370096 532000 568571 591420 646359 661515 680695
11973F80695R4231J27003R8097J044j38350k00905j88804j48717o4853N1835J39365
$$ 680695 774926 901929 1000026 1001070 862720 661815 473011 324294 259441 311276 450641
11962D50641J23105L0974n5371j27022j34467o9145j2784n813j6868m9507q1834
$$ 450641 573746 604720 549349 422327 287860 218715 205931 200118 183250 133743 51909
11951E1909l7147O5995J27535O0310q6163j58279j33923r2981m9401M6061J82975
$$ 51909 14762 80757 208292 268602 182439 24160 -109763 -202744 -252145 -206084 -23109
11940b3109K20747J44495J34423K30398K44719J40633O4093R0166J51488J21194
$$ -23109 197638 342133 476556 706954 951673 1092306 1156399 1246565 1398053 1519247
11930A519247L7750K6286N2872N7285L3284k7961j42138k11664r2699Q8985J53829
$$ 1519247 1556997 1583283 1636155 1693440 1726724 1698763 1556625 1344961 1252262 1341247 1495076
11919A495076J75087K50669K99367K82419K53262K84148L53143L74610L68343
$$ 1495076 1670163 1920832 2220199 2502618 2755880 3040028 3393171 3767781 4136124
11910D136124L71969L72664M09973M74418N23543N31454N08415M82148M58964
$$ 4136124 4508093 4880757 5290730 5765148 6288691 6820145 7328560 7810708 8269672
11901H269672M70124M70123M11252L37059K27064Q0155j6486n4879j02946j99645
$$ 8269672 8739796 9209919 9621171 9958230 10185294 10265449 10248963 10194084 10091138 9891493
11891I891493l38841n32030o85516p16995o58997n53484m34282l46305k93461
$$ 9891493 9552652 9020622 8335106 7618111 6959114 6405630 5971348 5625043 5331582
11882E331582l52589n09116n51275m66766l29138j56652j2800L4899K864n389
$$ 5331582 4978993 4469877 3918602 3451836 3122698 2966046 2953246 2988145 2991009 2985620
11872B985620o809o2174j13761j27106j28491j65181k09629j97438j48172j35102
$$ 2985620 2978811 2916637 2802876 2675770 2547279 2382098 2172469 1975031 1826859 1691757
11862A691757j15222l7436K2026N7073J37798K20417K35813J96426R0114m6501
$$ 1691757 1576535 1539099 1561125 1618198 1755996 1976413 2212226 2408652 2498766 2452265
11852B452265j04218o2659j6787p643L9031J10188J28381Q2628K5729j2111l1079
$$ 2452265 2348047 2285388 2268601 2260958 2299989 2410177 2538558 2621186 2646915 2634804 2603725
11841B603725K6079J23037J20003M8660J7702Q725l2320o1450o5499o6314m8332
$$ 2603725 2629804 2752841 2872844 2921504 2939206 2947931 2915611 2854161 2788662 2722348 2674016
11830B674016n7349j22624k02353k23064j79654j41394j36432r0615M3680J52562
$$ 2674016 2616667 2494043 2291690 2068626 1888972 1747578 1611146 1520531 1564211 1716773
11820A716773J56490J20301R6070Q5795J23727J94191K08499J37112L7811o9398
$$ 1716773 1873263 1993564 2089634 2175429 2299156 2493347 2701846 2838958 2876769 2807371
11810B807371j45442j69698j71726j37463l1605J49504K91124L27753K79787J55935
$$ 2807371 2661929 2492231 2320505 2183042 2151437 2300941 2592065 2919818 3199605 3355540
11800C355540Q7725J67554K57009K97061L47718M18747N00338N95028P22819Q72883
$$ 3355540 3443265 3610819 3867828 4164889 4512607 4931354 5431692 6026720 6749539 7622422
11790G622422R43249R36122R27358R87539J174644J432041J668910J808231J888016
$$ 7622422 8565671 9501793 10429151 11416690 12591334 14023375 15692285 17500516 19388532
11781A9388532K001946K214669K549608K921692L224466L395591L407438L132126
$$ 19388532 21390478 23605147 26154755 29076447 32300913 35696504 39103942 42236068
11773D2236068K483405J518895L36609r31036k099527k987212l488301l675746
$$ 42236068 44719473 46238368 46574977 45643941 43544414 40557202 37068901 33393155
11765C3393155l649414l447006l144453k818163k474690k112130j790173j534431
$$ 33393155 29743741 26296735 23152282 20334119 17859429 15747299 13957126 12422695
11757A2422695j309410j098608r33718q53638q64605q91979q31901o75009m94943
$$ 12422695 11113285 10014677 9080959 8227321 7362716 6470737 5638836 4963827 4468884
11748D468884l60469k82907k30795j88711j60541j53270j77307k22647k43319
$$ 4468884 4108415 3825508 3594713 3406002 3245461 3092191 2914884 2692237 2448918
11739B448918k29181j92581j24785l3665L4515J9675m6567j18214j88100k10306
$$ 2448918 2219737 2027156 1902371 1868706 1903221 1922896 1876329 1758115 1570015 1359709
11729A359709j23670o711M7912M1477L0837P133n1643q2406m1814R360p908n3689
$$ 1359709 1236039 1229328 1277240 1318717 1349554 1356687 1305044 1222638 1180824 1190184 1182276 1128587
11717A128587r0122j08324r1378j5970J431l401K8351L6995J7487k38M1717J04693
$$ 1128587 1038465 930141 838763 822793 824224 820823 849174 886169 903656 903418 945135 1049828
11705A049828J14050O6963j3783j09629j45180j14393q8436o6080j2724O1012
$$ 1049828 1163878 1230841 1217058 1107429 962249 847856 759420 693340 680616 741628
11695G41628Q8975O6991K7427l0599q5279r2096n6010o482K2170J5370q469n3258
$$ 741628 830603 897594 925021 894422 809143 717047 661037 654555 676725 692095 683626 630368
11683F30368q5067l9226N2500P0715K1159L1090J15021J52969K12899L03056K70629
$$ 630368 545301 506075 558575 629290 650449 681539 796560 949529 1162428 1465484 1736113
11672A736113J25285j7595j27508k02354k04295j62486j57665j67642r4010l350
$$ 1736113 1861398 1843803 1716295 1513941 1309646 1147160 989495 821853 727843 724493
11662G24493L6246N1262J5758p1471j41442j70723j75135j52867q2498L7088R7643
$$ 724493 760739 812001 827759 756288 614846 444123 268988 116121 33623 70711 168354
11651A68354O4726P1828J65030J74397J3482j42347j21174l1077m9634j75240
$$ 168354 233080 304908 469938 644335 657817 515470 394296 363219 313585 138345
11641A38345k63942k14943o0502R4080J32568M5091n2933p3655m6887j6491N593
$$ 138345 -125597 -340540 -401042 -306962 -174394 -129303 -182236 -255891 -302778 -319269 -313676
11630c13676M1942R9193P5173l7456j64018k09787j13817O9133J99716J71838
$$ -313676 -271734 -172541 -97368 -134824 -298842 -508629 -622446 -553313 -353597 -181759
11620a81759M4057o9591j15019j37738j42611j20899o9160K9750J10894P9728
$$ -181759 -137702 -207293 -322312 -460050 -602661 -723560 -792720 -762970 -652076 -572348
11610e72348k9707o6347k3894K20P544N1949J13711J56307K07933K23119J26981
$$ -572348 -602055 -668402 -692296 -692076 -684532 -632583 -518872 -362565 -154632 68487 195468
11599A95468K0407j2874k3521j0728R461K4755R190q1016j89979k43691j98578
$$ 195468 215875 203001 179480 168752 178213 202968 212158 131142 -58837 -302528 -501106
11588e01106k7826J57956J88176N7227r3055j62737j40744n8016K9014M4685L7998
$$ -501106 -528932 -370976 -182800 -125573 -218628 -381365 -522109 -580125 -551111 -506426 -468428
11577d68428M9025L3558N1966Q0142M2584k6508p5004p8881R508J68905K76427
$$ -468428 -419403 -385845 -333879 -253737 -211153 -237661 -312665 -391546 -382038 -213133 63294
11566F3294K14686K6534j08909j13135m2117r148n9156j41898j57506j00884l7413
$$ 63294 277980 304514 195605 82470 40353 31205 -27951 -169849 -327355 -428239 -465652
11555d65652K9524R7782J48426J54589O1106n5799o0698L7082J19879J18874N5131
$$ -465652 -436128 -338346 -189920 -35331 25775 -30024 -90722 -53640 66239 185113 240244
11544B40244m7426r1668j01461j43381j79140j59260r3500J1302J12719J26292
$$ 240244 192818 101150 -311 -143692 -322832 -482092 -575592 -564290 -451571 -325279
11534c25279J02344Q8037M5465J4957N7550R9379O8874J3057Q137L0878K7207
$$ -325279 -222935 -134898 -89433 -74476 -16926 82453 151327 164384 172521 203399 230606
11523B30606K8528L6372m8067j71141j74220j09866p5570k7182M3983Q8678J24235
$$ 230606 259134 295506 247439 76298 -97922 -207788 -283358 -310540 -266557 -177879 -53644
11512e3644J95008K24232J22920l6232j05521q5111k5146K2945n846q2138j09204
$$ -53644 141364 365596 488516 452284 346763 261652 236506 259451 253605 171467 62263
11501F2263j04740j08835l1614J34425K29605J59427K3396l9185l3117n4771j32531
$$ 62263 -42477 -151312 -182926 -48501 181104 340531 363927 324742 291625 236854 104323
11490A04323k17539k57316k10895j34814p1096O0038K25782K63921J30797n1930
$$ 104323 -113216 -370532 -581427 -716241 -787337 -727299 -501517 -237596 -106799 -158729
11480a58729q0813J8020L6666l4822j00534j51069j48753j7418J49493K37400
$$ -158729 -239542 -221522 -184856 -219678 -320212 -471281 -620034 -637452 -487959 -250559
11470b50559K45299K18046J36644N6981R6404J24632j0151j87135k64411k94427
$$ -250559 -5260 212786 349430 406411 502815 627447 617296 430161 165750 -128677
11460a28677l07170k55573j72399q5681P385N3165Q3865J41327J75935J43892
$$ -128677 -435847 -691420 -863819 -949500 -942115 -888950 -805085 -663758 -487823 -343931
11450c43931L1559o6867o2967K9769J11699R4722N228k1099N1070J07035J27013
$$ -343931 -312372 -379239 -442206 -412437 -300738 -206016 -200788 -221887 -170817 -63782 63231
11439F3231J05813M8009K1771L2283L3371K2434j7954p5786m9906N7957R5043
$$ 63231 169044 217053 238824 271107 304478 326912 308958 233172 183266 241223 336266
11428C36266N4950K265p0835j13366j09784j13147j36788j23754r0496q6700o9357
$$ 336266 391216 393481 322646 209280 99496 -13651 -150439 -274193 -364689 -451389 -520746
11417e20746K4520J79414K62655K29329J11986j3986r1196j27045j14879r5438
$$ -520746 -496226 -316812 -54157 175172 287158 273172 181976 54931 -59948 -155386
11407a55386j14371p7176L3376K6464o0640r7377r1533o9310r737J11736J78359
$$ -155386 -269757 -346933 -313557 -287093 -347733 -445110 -536643 -605953 -615690 -503954 -325595
11396c25595J19531l277q1594o2626p1220j02013n5501K3824M2952M4394Q4295
$$ -325595 -206064 -209341 -290935 -353561 -424781 -526794 -582295 -558471 -515519 -471125 -386830
11385c86830R9018J05629J39487J47118P9331m70n3095p8078p9647n7268j7108
$$ -386830 -287812 -182183 -42696 104422 183753 183283 130188 52110 -27537 -84805 -101913
11374a01913n041o586J4189N4144J08302J15687P4778M4362K5299K7107N8106
$$ -101913 -106954 -113540 -99351 -45207 63095 178782 253560 297922 323221 350328 408434
11363D08434P4443K9120Q18L7654N0781K4102K7297N8078K3965q1846j56610j49725
$$ 408434 482877 511997 512815 550469 601250 625352 652649 710727 734692 652846 496236 346511
11351C46511q4060j4059M3224Q9812J05400R3146L5508o3873j05894p6108l2536
$$ 346511 262451 248392 291616 381428 486828 579974 615482 551609 445715 369607 337071
11340C37071n740l28n1649j21731j19790j01585r2405j0358J02914J48979J31203
$$ 337071 331331 331003 279354 157623 37833 -63752 -156157 -166515 -63601 85378 216581
11329B16581N8156n1761j10994j29906j91259k72897k45002j07404J4317O7934
$$ 216581 274737 222976 111982 -17924 -209183 -482080 -727082 -834486 -820169 -752235
11319g52235R1897J13838J00263P7115R1051P2370K7219L4610K8348o813k6016
$$ -752235 -660338 -546500 -446237 -369122 -278071 -205701 -178482 -143872 -115524 -122337 -148353
11308a48353m8175m2833j5768N713r375j14427k39773k22842m3038J41891K20661
$$ -148353 -196528 -239361 -255129 -249416 -258791 -373218 -612991 -835833 -878871 -736980 -516319
11297e16319K60530K43545J59573R2419J9031p3542j65022j88514o0502R2882
$$ -516319 -255789 -12244 147329 239748 258779 185237 20215 -168299 -228801 -135919
11287a35919J28793J15895P0296j03374k97608l17642j54458M5407J72256K30394
$$ -135919 -7126 108769 179065 75691 -221917 -539559 -694017 -648610 -476354 -245960
11277b45960K16257J46704P0081N0377M3389J5912o894o186j7252n0950n1681
$$ -245960 -29703 117001 187082 237459 280848 296760 289866 283680 266428 215478 163797
11266A63797j9648L2659N4193M0987M174j10021k66858l21686k42809o8567J38077
$$ 163797 144149 176808 231001 271988 276162 166141 -100717 -422403 -665212 -733779 -595702
11255e95702K43596J90008N4262n8912j29050j47014j10125n5246k216K7952K4691
$$ -595702 -352106 -162098 -107836 -166748 -295798 -442812 -552937 -608183 -610399 -582447 -557756
11244e57756j690k1949l1364m317O2666R6069N4742J0280N411M4925P6292L9434
$$ -557756 -559446 -581395 -612759 -617076 -554410 -458341 -403599 -393319 -387908 -342983 -266691 -227257
11232b27257j5612j2203O0956R1534L9209M3299J09466R6869k6751j39050j32850
$$ -227257 -242869 -255072 -194116 -102582 -63373 -20074 89392 186261 159510 20460 -112390
11221a12390k4487P4060R4978J8823q2496q2588n5664j10376j18384j9054L7902
$$ -112390 -136877 -62817 32161 50984 -31512 -114100 -169764 -280140 -398524 -417578 -379676
11210c79676J2331k5952J1089J31809K11596J26256k7782j19440j45745j08854
$$ -379676 -367345 -393297 -382208 -250399 -38803 87453 59671 -59769 -205514 -314368
11200c14368m5762J3710Q0212Q2581K2732j5111k9043l0255L4691J25567J72664
$$ -314368 -360130 -346420 -266208 -183627 -160895 -176006 -205049 -235304 -200613 -75046 97618
11189I7618J86319J44010J8134p2111j5221J19449K17580K12150J48821P6494
$$ 97618 283937 427947 446081 373970 358749 478198 695778 907928 1056749 1133243
11179A133243K6643j9123r3960j19896q5751p1662j13823j46791j04543l1270
$$ 1133243 1159886 1140763 1046803 926907 841156 769494 655671 508880 404337 373067
11169C73067r993R406Q4253J46093J21690R6999J43455J47474K3649j03832j17805
$$ 373067 363074 372480 456733 602826 724516 821515 964970 1112444 1136093 1032261 914456
11158I14456q1114q1994j39089j79339j65424j48320j06483k0897N1997N4080
$$ 914456 833342 751348 612259 432920 267496 119176 12693 -8204 43793 97873
11148I7873J4951P15J4485L817n3153j17512j54434j33769n0741M0575N4101J4058
$$ 97873 112824 113539 128024 131841 78688 -38824 -193258 -327027 -377768 -337193 -283092 -269034
11136b69034l9092j06198p8077K8058M6993L868o823r312q681K7823L7798J806
$$ -269034 -308126 -414324 -492401 -464343 -417350 -413482 -420305 -429617 -438298 -410475 -372677 -370871
11124c70871j8946L0648J10121J08500P5392J35738K08854J58332K4252n2888
$$ -370871 -389817 -359169 -249048 -140548 -65156 70582 279436 437768 462020 409132
11114D09132k6595N7219Q7838K8381Q814Q7520K11963K40432R7857q4676k20897
$$ 409132 382537 439756 527594 555975 564789 652309 864272 1104704 1202561 1117885 896988
11103H96988k79994k59567k09142j31690r9682j18563j13298o2581P8151K01025
$$ 896988 616994 357427 148285 16595 -83087 -201650 -314948 -377529 -299378 -98353
11093i8353J53411K2179l2000j0127j552l8913j23036j74901j37417n4423J7330
$$ -98353 55058 77237 45237 35110 33558 -5355 -128391 -303292 -440709 -495132 -477802
11082d77802P0865Q3237M8779J3395P9751K07475K79790K68444J48249l8210j76505
$$ -477802 -406937 -323700 -274921 -261526 -181775 25700 305490 573934 722183 683973 507468
11071E07468j81489q9362m3122m5526o890N2189Q1764N3696j4096o9366m9674
$$ 507468 325979 236617 193495 147969 141079 193268 275032 328728 314632 245266 195592
11060A95592k8471n7132q5212p0695L992P8659N4234p2681j48669r6280k3367
$$ 195592 167121 109989 24777 -45918 -41926 36733 90967 18286 -130383 -226663 -250030
11049b50030j3823k5588j7854M2836J14300R0657R504k4960k0491k8430l9368
$$ -250030 -263853 -289441 -307295 -264459 -150159 -59502 -49998 -74958 -95449 -123879 -163247
11038a63247n0246q2689j35295j59288j40718q0978M3202J75250K12272J67018
$$ -163247 -213493 -296182 -431477 -590765 -731483 -812461 -769259 -594009 -381737 -214719
11028b14719M4529r3232j37196j06977m7876k089O971L3506P0462J08674J88937
$$ -214719 -170190 -263422 -400618 -507595 -555471 -557560 -550589 -517083 -446621 -337947 -149010
11017a49010K70516K41684J24647N1085L3101N7690R4450P6543l660r1397j14774
$$ -149010 121506 363190 487837 538922 572023 629713 724163 800706 797046 705649 590875
11006E90875p2984n1072n3648q7352j62463k31467k25351j11790J2993P6734P9945
$$ 590875 517891 466819 413171 325819 163356 -68111 -293462 -405252 -392259 -315525 -235580
10995b35580M5673j5420m6887j8403m0772p8819k5761Q9051J14077J1209l7580
$$ -235580 -189907 -205327 -252214 -270617 -311389 -390208 -415969 -326918 -212841 -201632 -239212
10984b39212J6563L8385J4760K2776O6117J22596J16332M594q5246q0089r4699
$$ -239212 -222649 -184264 -169504 -146728 -80611 41985 158317 162911 77665 -2424 -97123
10973i7123j82467k15833j05222J21564K65423K29267J47904R9503J05300J07129
$$ -97123 -279590 -495423 -600645 -479081 -213658 15609 163513 263016 368316 475445
10963D75445O9433k252m4809K269M9721L7127j9134q7982j16928j10970j25418
$$ 475445 544878 542626 497817 500086 549807 586934 567800 479818 362890 251920 126502
10952A26502j79690k00797j54472r8251k7213J04247K63494L13307K00201Q2563
$$ 126502 -53188 -253985 -408457 -506708 -533921 -429674 -166180 147127 347328 429891
10942D29891q365p6298r2178r4526p5688l5380PK5518l2360j44647j94424j95464
$$ 429891 421526 345228 253050 158524 82836 47456 47463 72981 40621 -104026 -298450 -493914
10930d93914j81729j12164m19Q6705J52075J17592k3600j01087j02770o3273N1210
$$ -493914 -675643 -787807 -788226 -701521 -549446 -431854 -455454 -556541 -659311 -722584 -671374
10919f71374J23840J02786J16678J69578J60728R5864L4251K8747O8206J04636
$$ -671374 -547534 -444748 -328070 -158492 2236 98100 132351 161098 229304 333940
10909C33940J36809J85175J89368J01093l9592j30514j40818j48475k13267k86479
$$ 333940 470749 655924 845292 946385 906793 776279 635461 486986 273719 -12760
10899a2760k91118k15416j09679j6205J8141m5802j31061j15806k5138N9315J13294
$$ -12760 -303878 -519294 -628973 -645178 -627037 -672839 -803900 -919706 -944844 -885529 -772235
10888g72235J63008J89968J47003N9134k8325p4060q7372r2304m8682M3862J48914
$$ -772235 -609227 -419259 -272256 -213122 -241447 -315507 -402879 -495183 -543865 -500003 -351089
10877c51089J75533Q8916M061o3824r7841r0776p1254o0897n6572j3970P4778
$$ -351089 -175556 -86640 -82579 -146403 -244244 -335020 -406274 -467171 -523743 -537713 -462935
10866d62935J17915Q6714O8141P0163N2666M6262R6063J27294O6047m252p7638
$$ -462935 -345020 -258306 -190165 -120002 -67336 -21074 74989 202283 268330 264078 186440
10855A86440j61087j82904j16992J8684J50529J90360J40966Q3371L4047j2141
$$ 186440 25353 -157551 -274543 -255859 -105330 85030 225996 309367 343414 331273
10845C31273m9892j19407j88960j44877Q253J01380K9670o4462m3954L8782J51298
$$ 331273 281381 161974 -26986 -171863 -163610 -62230 -32560 -97022 -140976 -102194 49104
10834D9104K60800K67818J88246N5193q7543j41955j15970r2500q5242j12792
$$ 49104 309904 577722 765968 821161 733618 591663 475693 383193 297951 185159
10824A85159j32430r8868q6785r5878r2969j32971j64561q4248N4860J70297J89904
$$ 185159 52729 -46139 -132924 -228802 -321771 -454742 -619303 -703551 -648691 -478394 -288490
10813b88490J09762p215q5686n6733N5077J22209R4588P3505J14672J45788P6621
$$ -288490 -178728 -185943 -271629 -328362 -273285 -151076 -56488 17017 131689 277477 354098
10802C54098l5892q4599l2931N4962P4287L8264m3505j88315k72596k21950q9486
$$ 354098 318206 233607 200676 255638 329925 368189 324684 136369 -136227 -358177 -447663
10791d47663M9963J31342J57932J49222J32647J34857J39195M5245j37354k94742
$$ -447663 -397700 -266358 -108426 40796 173443 308300 447495 492740 355386 60644
10781F0644l75996l29547j54371K7622J20893J22394P5232M2377J7218r830l0309
$$ 60644 -315352 -644899 -799270 -771648 -650755 -528361 -453129 -410752 -393534 -403364 -433673
10770d33673n5921n8735l6854n397j1511k8047j6870j4864k6810l6014n6479q0275
$$ -433673 -489594 -548329 -585183 -590580 -602091 -630138 -647008 -661872 -688682 -724696 -781175 -861450
10758h61450n4787J8646M2229L8862O8314N9442L6126O6337J14349J26157J07789
$$ -861450 -916237 -897591 -855362 -816500 -748186 -688744 -652618 -586281 -471932 -345775 -237986
10747b37986O3053J3024n2359j36464j92337j41019j3294J02148J80150J75129
$$ -237986 -174933 -161909 -214268 -350732 -543069 -684088 -697382 -595234 -415084 -239955
10737b39955J09256M5174j591j9631r123J1709L8753R5556J23127K5732j12788
$$ -239955 -130699 -85525 -87116 -106747 -115870 -104161 -65408 30148 153275 179007 66219
10726F6219j49686r8407n7034q538P2558J11301J12821J30916J61374K06531K13609
$$ 66219 -83467 -181874 -238908 -247446 -174888 -63587 49234 180150 341524 548055 761664
10715G61664J17061m8666j70416j81260j31840r9932o4402J4970O0093L0182k1595
$$ 761664 878725 830059 659643 478383 346543 246611 182209 197179 257272 287454 265859
10704B65859r8337j21658j5709J05646J44276J19556M3945n0696r3146o4898q062
$$ 265859 167522 45864 30155 135801 280077 399633 443578 392882 299736 234838 226776
10693B26776m050n7489q2256n0541k4213n799j6357o8000j27290j60957j47555
$$ 226776 222726 165237 82981 32440 8227 2428 -13929 -81929 -209219 -370176 -517731
10682e17731q3815j9704m393M7551J56266K08035J81898J03211K0515k851p113
$$ -517731 -601546 -621250 -625643 -578092 -421826 -213791 -31893 71318 91833 88982 81869
10671H1869k5276n7826j01956j15852r3174q3331p3248p034P1603R3672N3154
$$ 81869 56593 -1233 -103189 -219041 -312215 -395546 -468794 -475828 -404225 -310553 -257399
10660b57399k6033j01207j03388j2787J07229K15471K64494K03210R7518K2706
$$ -257399 -283432 -384639 -488027 -500814 -393585 -178114 86380 289590 387108 409814
10650D09814l9339p9784p7349j18238k10846k66980k60823j67279l7197M3810
$$ 409814 370475 290691 213342 95104 -115742 -382722 -643545 -810824 -848021 -804211
10640h04211N0892N7441J14424J83247K22660K10756J34190N1835L6046N7701
$$ -804211 -753319 -695878 -581454 -398207 -175547 35209 169399 221234 257280 314981
10630C14981M3984J3789N771j1589n7245p5322l6414l591l6445j31520k26689
$$ 314981 358965 372754 378525 366936 309691 234369 197955 194364 157919 26399 -200290
10619b00290k67275k58473k33180j73975m1375J36202K52734K70518K34152J34899
$$ -200290 -467565 -726038 -959218 -1133193 -1174568 -1038366 -785632 -515114 -280962 -146063
10609a46063J9913k7194r502L2691N5700P0350Q6362R4761O5572M1557l6149j52566
$$ -146063 -126150 -153344 -162846 -130155 -74455 -4105 82257 177018 242590 284147 247998 95432
10597I5432j75118j32043o4541n4165p9473k0409M7064P2489M7133M218M6570
$$ 95432 -79686 -211729 -276270 -330435 -409908 -430317 -383253 -310764 -263631 -259413 -212843
10586b12843J10617P7422m1559j38459j76031j33913l2326K8194K1323o564l1433
$$ -212843 -102226 -24804 -66363 -204822 -380853 -514766 -547092 -518898 -497575 -504139 -535572
10575e35572k2582M8077J34923J46374P2236k4969j09460j96224k77081k39741
$$ -535572 -558154 -510077 -375154 -228780 -156544 -181513 -290973 -487197 -764278 -1004019
10565a004019m0734J78940K75400K75271K55893J82340Q3604n164o8836m4090
$$ -1004019 -1044753 -865813 -590413 -315142 -59249 123091 206695 201531 132695 88605
10555H8605j6870o1132p5202R48Q2132P2834j2702m8110k6374m2243j11572j57703
$$ 88605 71735 10603 -64599 -63651 18481 91315 78613 30503 4129 -38114 -149686 -307389
10543c07389j17533P77J02557J05697L8631J066K5395L1161j7324m6500K122Q3432
$$ -307389 -424922 -424145 -321588 -215891 -177260 -176194 -150799 -119638 -136962 -183462 -181340 -97908
10531i7908J09396J01106J01586N9071j5145m6210o4440j26069k31597k72205
$$ -97908 11488 112594 214180 273251 258106 211896 147456 21387 -210210 -482415
10521d82415j77617m195J52666K29630K35098K08160J65630R5632l0126j54038
$$ -482415 -660032 -664227 -511561 -281931 -46833 161327 326957 422589 392463 238425
10511B38425j66493j09825o5502j0322M7345N0213R371p9413j61054k06317j80540
$$ 238425 71932 -37893 -103395 -113717 -66372 -16159 -6788 -86201 -247255 -453572 -634112
10500f34112k1406J35711J44108R5836Q2790N7600J0706o3509j51011j61162j02717
$$ -634112 -655518 -519807 -375699 -279863 -197073 -139473 -128767 -192276 -343287 -504449 -607166
10489f07166m2892J2133O5307R7499R7434O4261l312q1446p6355J7191R0380P4578
$$ -607166 -650058 -637925 -572618 -475119 -377685 -313424 -316736 -398182 -474537 -457346 -366966 -292388
10477b92388l0339r4479m6964K58k5895o3582m4923m920l260N458K3066m6041
$$ -292388 -322727 -417206 -464170 -463912 -489807 -553389 -598312 -603232 -606492 -601034 -577968 -624009
10465f24009j06082k0223Q4756J17851J19759Q4455K2845k9474r1985j38544q1959
$$ -624009 -730091 -750314 -665558 -547707 -427948 -343493 -320648 -350122 -442107 -580651 -662610
10454f62610J0094O9797J08041J60535J98209J15630l4917j39928j42734q8497
$$ -662610 -652516 -582719 -474678 -314143 -115934 -304 -35221 -175149 -317883 -406380
10444d06380l1629J1469N7163J35303K01007J60217K5395p6426j09712j16661
$$ -406380 -438009 -426540 -369377 -234074 -33067 127150 152545 76119 -33593 -150254
10434a50254q3612j7925R448j1576J1980R0042Q7926K6243k6504p1522p9891p1535
$$ -150254 -233866 -251791 -242343 -253919 -241939 -151897 -63971 -37728 -64232 -135754 -215645 -287180
10422b87180l0611M8864O9162N1809Q0866J02967N5887l1988j16624j63266j59628
$$ -287180 -317791 -268927 -199765 -147956 -67090 35877 91764 59776 -56848 -220114 -379742
10411c79742r8300J6436Q7311J6234o9567p1310r008M7813O5658Q2857J07794
$$ -379742 -478042 -461606 -374295 -358061 -427628 -498938 -507946 -460133 -394475 -311618 -203824
10400b03824J20828O8503P681L6991R6411R3538K0809j01699k25808k26878p0875
$$ -203824 -82996 -14493 -6812 30179 126590 220128 240937 139238 -86570 -313448 -384323
10389c84323R3434J61721R9055m5711j37633j33991p4626j6723j0554m8771j00062
$$ -384323 -290889 -129168 -30113 -75824 -213457 -347448 -422074 -438797 -449351 -498122 -598184
10378e98184p1736M5536J41759J92456K02874J21199K990m0079J1598Q9071R8624
$$ -598184 -669920 -624384 -482625 -290169 -87295 33904 36894 -3185 8413 97484 196108
10367A96108K0605j7464P3247J90640K37196K08260J16690q963j08146j36883
$$ 196108 216713 199249 272496 463136 700332 908592 1025282 1016319 908173 771290
10357G71290p7744l0038j16382k46566k98596k77581j72895K0539J51209J38899
$$ 771290 693546 663508 547126 300560 1964 -275617 -448512 -427973 -276764 -137865
10347a37865J19151J15743R1787M3161m0749j35613j37629m7089K4263M7069M5182
$$ -137865 -18714 97029 188816 231977 191228 55615 -82014 -129103 -104840 -57771 -12589
10336a2589P1274J34015J64974J39691Q2301N5313R9945J75941J93948R5357n1534
$$ -12589 58685 192700 357674 497365 579666 634979 734924 910865 1104813 1200170 1148636
10325A148636j81897k25199j88353j45986j08466q7156o7168m8224m3694m0793
$$ 1148636 966739 741540 553187 407201 298735 211579 144411 96187 52493 11700
10315A1700J1474Q1599J13266R2338M0576j3234l0177J7119L1599j7263l5851
$$ 11700 23174 104773 218039 310377 350953 337719 307542 324661 356260 338997 303146
10304C03146N730R581m1855n3766j9006j2382m0293l3541N994Q914j9319m5153
$$ 303146 308876 318457 276602 222836 203830 191448 151155 117614 123608 132522 113203 68050
10292F8050o5022n9445L204N5317K5850l2836l2976J01083K44182K44306J65519
$$ 68050 3028 -56417 -53213 2104 27954 -4882 -37858 63225 307407 551713 717232
10281G17232R2585O2613K7820n5728j26465j52634j79217j84205r8678k0085L0489
$$ 717232 809817 872430 900250 844522 718057 565423 386206 202001 103323 83238 113727
10270A13727J08451J30636N4408P068J4926j4371p9568j33048k12665k74661k04030
$$ 113727 222178 352814 407222 414290 429216 414845 335277 202229 -10436 -285097 -489127
10259d89127m7396P9195J29568J07228M7936p4006j86707j70360r7182j09575
$$ -489127 -536523 -457328 -327760 -220532 -172596 -246602 -433309 -603669 -700851 -810426
10249h10426j57192j07452K7827J20605R9425N3951R1052J38546J36832J19240
$$ -810426 -967618 -1075070 -1047243 -926638 -827213 -773262 -682210 -543664 -406832 -287592
10239b87592Q8876N3334J6289K408J0791l5547j14883j39034r4572k8107N052
$$ -287592 -198716 -145382 -129093 -126685 -115894 -151441 -266324 -405358 -499930 -528037 -522985
10228e22985l688k6425l9413n8595p8013n5466j187K4501J2292j0853N175P3321
$$ -522985 -526673 -553098 -592511 -651106 -729119 -784585 -785772 -761271 -748979 -759832 -754657 -681336
10216f81336J59281J77472J21148N7213J1076k3764j0293K8421M0637K8076N3040
$$ -681336 -522055 -344583 -223435 -166222 -155146 -178910 -189203 -160782 -120145 -92069 -39029
10205c9029R8322J26071J07206N5165p24o7167p5848n547M1982M3160K3559k3372
$$ -39029 59293 185364 292570 347735 347011 279844 203996 198449 240431 283591 307150 283778
10193B83778o1555n7212k9016k2413M688R1123J47905J42954O2256n1888j06402
$$ 283778 222223 165011 135995 113582 118270 209393 357298 500252 562508 510620 404218
10182D04218n7858Q1886K13951K05263O2409j15504k60413k81799j57309j1108
$$ 404218 346360 428246 642197 847460 909869 794365 533952 252153 94844 83736
10172H3736Q9062J52792J86711J23349m2702j84206j85137j25801j09442r1378
$$ 83736 172798 325590 512301 635650 592948 408742 223605 97804 -11638 -103016
10162a03016q8412r0544q0875r4276r3424l6667M4034J26061J82048J76794J20811
$$ -103016 -191428 -281972 -362847 -457123 -550547 -587214 -543180 -417119 -235071 -58277 62534
10151F2534R5392R0428l1531j80085j70332j11597j46061j84872j23389n762J04877
$$ 62534 157926 248354 216823 36738 -133594 -245191 -391252 -576124 -699513 -705275 -600398
10140f00398J58481J28174R0006J04276J29891J17041N2666j2488o3884j29343
$$ -600398 -441917 -313743 -223737 -119461 10430 127471 180137 167649 103765 -25578
10130b5578j95570j80117l9573N1208n659m2717K037L752J3837Q6906J26149J46345
$$ -25578 -221148 -401265 -440838 -389630 -395289 -438006 -435969 -432217 -418380 -331474 -205325 -58980
10118e8980K02104K16790J27260L0559l5512q2055m2188M2609L2581n6887q8574
$$ -58980 143124 359914 487174 517733 482221 400166 357978 400587 433168 376281 287707
10107B87707n3034n1013n8380k4790J1185L508j9810l6573m4083j1660O5456J41412
$$ 287707 234673 183660 125280 100490 111675 115183 95373 58800 14717 3057 68513 209925
10095B09925J56384J30285J02609Q2551j197q3288o9242N8J3083j6756m2545n2061
$$ 209925 366309 496594 599203 681754 680557 597269 528027 528085 541168 524412 481867 429806
10083D29806J0610M3420L5753Q8947J00943J1728o1488p9997j37689k22234k28019
$$ 429806 440416 483836 519589 608536 709479 721207 659719 579722 442033 219799 -8220
10072h220j67889q7933o7500j18636j07535j9179N3749O7430M9314O4039J16999
$$ -8220 -176109 -264042 -331542 -450178 -557713 -576892 -523143 -455713 -406399 -342360 -225361
10061b25361J12758J1344p3734l6300P7581J43214J36190P8945O3052R0737P0993
$$ -225361 -112603 -101259 -174993 -211293 -133712 9502 145692 224637 287689 378426 449419
10050D49419K013m8064m1451n4595j70965k83442k80673k05249j15693q926R5603
$$ 449419 451432 403368 361917 307322 136357 -147085 -427758 -633007 -748700 -757626 -662023
10039f62023J80967K55165K77083K28902J66040Q6369l5143j22764j60396j47399
$$ -662023 -481056 -225891 51192 280094 446134 532503 497360 374596 214200 66801
10029F6801j28001j19592p0721J4912Q8828O4657k1414j252O3951K4900m3095
$$ 66801 -61200 -180792 -251513 -236601 -147773 -83116 -104530 -105782 -41831 -16931 -60026
10018f0026m6719j693O5743R6889R2557Q1666O041p7426q1391k4845J9874J0143
$$ -60026 -106745 -108438 -42695 54194 146751 228417 234458 157032 75641 50796 70670 80813
10006H0813r584l091l2630p8200o2224j5964K8797P3181R6002N6518k1123q3717
$$ 80813 71229 68138 35508 -42692 -104916 -120880 -92083 -18902 77100 133618 112495 28778
9994B8778j15873n9029K8524M8613J6975m4759j30736j89681j77117j29886n8499
$$ 28778 -87095 -146124 -117600 -68987 -52012 -96771 -227507 -417188 -594305 -724191 -782690
9983g82690O3223J52029J59671J16538M7027j8558j14796j77033j12244j9332
$$ -782690 -719467 -567438 -407767 -291229 -244202 -262760 -377556 -554589 -666833 -686165
9973f86165K8101Q8704J60282K07649K31024K35051K06835J55471R5171J286r2925
$$ -686165 -658064 -569360 -409078 -201429 29595 264646 471481 626952 722123 723409 630484
9962F30484j47349j51878j43594j73555k07265j31635J0218O2238K0125L999R4549
$$ 630484 483135 331257 187663 14108 -193157 -324792 -314574 -252336 -232211 -228212 -133663
9951a33663K41728K33391J4422j44636r2917q428L277O217l1500j23698j84315
$$ -133663 108065 341456 355878 211242 118325 109897 113174 119391 87891 -35807 -220122
$$ [...]
##END NTUPLES=NMR SPECTRUM
##END=
