##TITLE=C13_SR-75-TFAA3-V2
 CDCl3,22400 sc

 12.7.2023
##JCAMPDX= 6.0         $$ Bruker NMR JCAMP-DX V2.0
##DATA TYPE= NMR SPECTRUM
##DATA CLASS= NTUPLES
##ORIGIN= UXNMR, Bruker Analytische Messtechnik GmbH
##OWNER= root
$$ XWIN-NMR		Version 3.5
$$ Thu Jul 13 13:37:47 2023 Russian Standard Time (UT+4h)  she@DPX200
##.OBSERVE FREQUENCY= 50.327896
##.OBSERVE NUCLEUS= ^13C
##.ACQUISITION MODE= SIMULTANEOUS
##.ACQUISITION SCHEME= undefined
##.AVERAGES= 17070
##.DIGITISER RES= 17
##SPECTROMETER/DATA SYSTEM= spect
##.PULSE SEQUENCE= zgpg30
##.SOLVENT NAME= DMSO
##.SHIFT REFERENCE= (INTERNAL, DMSO, 0, 222.624)
##AUDIT TRAIL= $$ (NUMBER, WHEN, WHO, WHERE, WHAT)
$$ ##TITLE= Audit trail, XWIN-NMR		Version 3.5
$$ ##JCAMPDX= 5.01
$$ ##ORIGIN= Bruker BioSpin GmbH
$$ ##OWNER= she
$$ F:/spectra/data/she/nmr/c13/1/pdata/1/auditp.txt
$$ ##AUDIT TRAIL=  $$ (NUMBER, WHEN, WHO, WHERE, WHAT)
(   1,<2023-07-13 08:40:17.15 +0400>,<she>,<DPX200>,
      <created by zg, POWCHK disabled, PULCHK disabled
       terminated by command 'halt'
       configuration hash MD5:
       00 E9 B6 7A A2 85 ED C7 34 08 36 98 17 FE 4E 26
       data hash MD5: 32K
       8D 4F 06 07 CB D3 51 59 16 1B 63 6E 51 CD 35 27>)
(   2,<2023-07-13 13:35:47.96 +0400>,<she>,<DPX200>,
      <Start of raw data processing
       efp BC_mod = 2 LB = 2 FT_mod = 6 PKNL = 1 PHC0 = -386.7303 PHC1 = 29.13753 SI = 32K 
       data hash MD5: 32K
       FC B8 25 1B F8 F8 8B 26 A8 7C 3C 56 1F CA 91 A9>)
(   3,<2023-07-13 13:35:50.64 +0400>,<she>,<DPX200>,
      <abs ABSG = 5 
       data hash MD5: 32K
       89 1D 69 B4 63 EF E3 BB 56 D1 F0 2B EE 70 3B 60>)
(   4,<2023-07-13 13:36:10.39 +0400>,<she>,<DPX200>,
      <pk PHC0 = -6.073593 PHC1 = 10 
       data hash MD5: 32K
       F7 A4 F1 B0 F7 55 54 1E D3 14 5F 57 C3 B4 9A 93>)
(   5,<2023-07-13 13:36:13.39 +0400>,<she>,<DPX200>,
      <abs ABSG = 5 
       data hash MD5: 32K
       B7 70 99 F9 C4 1F A1 C4 DA 05 50 70 D9 A3 E8 53>)
(   6,<2023-07-13 13:37:05.92 +0400>,<she>,<DPX200>,
      <pk PHC0 = -0.929216 PHC1 = 2.199997 
       data hash MD5: 32K
       B8 BB 95 C7 D6 CA 50 FD F9 D2 71 EB F8 55 FC D7>)
(   7,<2023-07-13 13:37:09.28 +0400>,<she>,<DPX200>,
      <abs ABSG = 5 
       data hash MD5: 32K
       4F 30 9D 57 7E 0E 4E D9 DE D4 60 74 B9 E8 10 A2>)
$$ ##END=
$$ 
$$ hash MD5
$$ 6D 1F 6A 44 17 86 4B EE 59 DB A8 BC 8F CD EC 2C
##$RELAX= 
##$RELAX= 
##$RELAX= 
##$RELAX= 
##$RELAX= 
##$RELAX= 
##$RELAX= 
##$RELAX= 
$$ Bruker specific parameters
$$ --------------------------
##$DU= <F:/spectra>
##$EXPNO= 1
##$NAME= <c13>
##$PROCNO= 1
##$TYPE= <nmr>
##$USER= <she>
##$AMP= (0..31)
100 100 100 100 100 100 100 100 100 100 100 100 100 100 100 100 100 100 
100 100 100 100 100 100 100 100 100 100 100 100 100 100 
##$AQSEQ= 0
##$AQ_mod= 1
##$AUNM= <au_zg>
##$AUTOPOS= <>
##$BF1= 50.322709
##$BF2= 200.13
##$BF3= 50.322709
##$BF4= 500.13
##$BF5= 500.13
##$BF6= 500.13
##$BF7= 500.13
##$BF8= 500.13
##$BYTORDA= 1
##$CFDGTYP= 0
##$CFRGTYP= 5
##$CHEMSTR= <none>
$$ [...]
##$SUBNAM4= <"">
##$SUBNAM5= <"">
##$SUBNAM6= <"">
##$SUBNAM7= <"">
##$SUBNAM8= <"">
##$SUBNAM9= <"">
##$SW= 239.972175391363
##$SWIBOX= (0..15)
0 1 3 0 0 0 0 0 0 0 0 0 0 0 0 0 
##$SW_h= 12077.2946859903
##$TD= 32768
##$TD0= 1
##$TE= 0
##$TE2= 300
##$TE3= 300
##$TEG= 300
##$TL= (0..7)
120 120 120 120 120 120 120 120 
##$TP= (0..7)
150 150 150 150 150 150 150 150 
##$TP07= 0
##$TPNAME0= <>
##$TPNAME1= <>
##$TPNAME2= <>
##$TPNAME3= <>
##$TPNAME4= <>
##$TPNAME5= <>
##$TPNAME6= <>
##$TPNAME7= <>
##$TPOAL= (0..7)
0.5 0.5 0.5 0.5 0.5 0.5 0.5 0.5 
##$TPOFFS= (0..7)
0 0 0 0 0 0 0 0 
##$TUNHIN= 0
##$TUNHOUT= 0
##$TUNXOUT= 0
##$USERA1= <user>
##$USERA2= <user>
##$USERA3= <user>
##$USERA4= <user>
##$USERA5= <user>
##$V9= 5
##$VALIST= <valist>
##$VCLIST= <CCCCCCCCCCCCCCC>
##$VD= 0
##$VDLIST= <DDDDDDDDDDDDDDD>
##$VPLIST= <PPPPPPPPPPPPPPP>
##$VTLIST= <TTTTTTTTTTTTTTT>
##$WBST= 1024
##$WBSW= 4
##$XGAIN= (0..3)
0 0 0 0 
##$XL= 0
##$YL= 0
##$YMAX_a= 103409610
##$YMIN_a= -65273767
##$ZGOPTNS= <>
##$ZL1= 120
##$ZL2= 120
##$ZL3= 120
##$ZL4= 120
##$ABSF1= 222.624
##$ABSF2= -17.3728
##$ABSG= 5
##$ABSL= 3
##$ALPHA= 0
##$AQORDER= 0
##$ASSFAC= 0
##$ASSFACI= 0
##$ASSFACX= 0
##$ASSWID= 0
##$AUNMP= <proc_1d>
##$AZFE= 0.1
##$AZFW= 0.5
##$BCFW= 0
##$BC_mod= 2
##$BYTORDP= 0
##$COROFFS= 0
##$CY= -3
##$DATMOD= 1
##$DC= 0
##$DFILT= <>
##$DTYPP= 0
##$F1P= 0
##$F2P= 0
##$FCOR= 0.5
##$FTSIZE= 32768
##$FT_mod= 6
##$GAMMA= 0
##$GB= 0
##$INTBC= 1
##$INTSCL= 4.134877e-10
##$ISEN= 128
##$LB= 2
##$LEV0= 0
##$LPBIN= 0
##$MAXI= 10000
##$MC2= 0
##$MEAN= 0
##$ME_mod= 0
##$MI= 0.1934396
##$NCOEF= 0
##$NC_proc= 2
##$NLEV= 6
##$NOISF1= 120.0001
##$NOISF2= 80.00006
##$NSP= 0
##$NTH_PI= 0
##$NZP= 0
##$OFFSET= 222.624
##$PC= 1.4
##$PHC0= -393.7331
##$PHC1= 41.33753
##$PH_mod= 1
##$PKNL= yes
##$PPARMOD= 0
##$PSCAL= 0
##$PSIGN= 0
##$REVERSE= no
##$SF= 50.3227315983092
##$SI= 32768
##$SIGF1= 140
##$SIGF2= 120
##$SINO= 11.81781
##$SIOLD= 32768
##$SREGLST= <13C.CDCl3>
##$SSB= 0
##$STSI= 32768
##$STSR= 0
##$SW_p= 12077.2946859903
##$SYMM= 0
##$S_DEV= 0
##$TDeff= 32768
##$TDoff= 0
##$TI= <>
##$TILT= no
##$TM1= 0
##$TM2= 0
##$TOPLEV= 0
##$USERP1= <user>
##$USERP2= <user>
##$USERP3= <user>
##$USERP4= <user>
##$USERP5= <user>
##$WDW= 1
##$XDIM= 32768
##$YMAX_p= 342199934
##$YMIN_p= -2175226
$$ End of Bruker specific parameters
$$ ---------------------------------
##NTUPLES= NMR SPECTRUM
##VAR_NAME=  FREQUENCY,     SPECTRUM/REAL,   SPECTRUM/IMAG
##SYMBOL=    X,             R,               I
##VAR_TYPE=  INDEPENDENT,   DEPENDENT,       DEPENDENT
##VAR_FORM=  AFFN,          ASDF,            ASDF
##VAR_DIM=   32768,         32768,           32768
##UNITS=     HZ,            ARBITRARY UNITS, ARBITRARY UNITS
##FACTOR=    0.368581032318806, 1,           1
##FIRST=     11203.0474430531, 0,            0
##LAST=      -874.247242937185, 0,           0
##MIN=       -874.247242937185, -2175226,    0
##MAX=       11203.0474430531, 342199934,    0
$$ Real data points
##PAGE= N=1
##DATA TABLE= (X++(R..R)), XYDATA
$$ [...]
$$ plain form
16068 55044 86487 110266 125595 115829 121181 192963 269929 246253 180375 175547 173661 149651
16056 149651 147712 153314 138956 102421 60673 54560 38631 -46259 -123323 -124837 -106070 -143429
16044 -143429 -192656 -141451 58895 321458 445200 323781 31867 -303775 -620020 -863125
16034 -863125 -967598 -954990 -917078 -846772 -712350 -583766 -514016 -487161 -434937 -310573 -137602
16023 -137602 -9473 66508 190475 372090 546026 677100 699289 618399 597078 708610
16013 708610 894322 1069742 1208479 1314831 1383208 1425715 1437541 1404833 1299169 1076320
16003 1076320 746852 372521 41040 -155147 -180579 -89599 85505 234818 240207 104021
15993 104021 -91473 -215369 -209719 -133658 -94049 -130992 -190649 -230540 -218018 -146113 -82015
$$ packed form
16068E5044L1443K3779J5329r766N352P1782P6966k3676o5878m828j886k4010
16056A49651j939N602j4358l6535m1748o113j5929q4890p7064j514J8767l7359
16044a43429m9227N1205K00346K62563J23742j21419k91914l35642l16245k43105
16034h63125j04473J2608L7912P0306J34422J28584O9750K6855N2224J24364J72971
16023a37602J28129P5981J23967J81615J73936J31074K2189q0890k1321J11532
16013G08610J85712J75420J38737J06352O8377M2507J1826l2708j05664k22849
16003A076320l29468l74331l31481j96187k5432R0980J75104J49313N389j36186
15993A04021j95494j23896N650P6061L9609l6943n9657l9891J2522P1905O4098
$$ plain form
15982 -82015 -25550 68768 174008 228641 211435 143391 71355 63153 92970 64376 29674 81671
15970 81671 193292 285556 295658 206841 35341 -196702 -439094 -586325 -633096 -672354 -741305
15959 -741305 -766272 -721696 -709987 -763254 -794235 -727871 -612126 -530340 -531707 -589407 -625376
15948 -625376 -603088 -533437 -397207 -214135 -47009 119405 289882 388967 379744 288908 138870
15937 138870 -42598 -155938 -113328 29272 159032 194206 127312 13082 -69426 -105997
15927 -105997 -140853 -140842 -122890 -138605 -117380 24080 212863 353017 427621 443623 434827 409373
15915 409373 365032 317206 300787 339961 370507 319570 191533 8060 -217228 -429205 -547558
15904 -547558 -537576 -459173 -404422 -422146 -543642 -733238 -896988 -970287 -968421 -964271 -999772
$$ packed form
15982h2015N6465R4318J05240N4633j7206o8044p2036q202K9817k8594l4702N1997
15970H1671J11621R2264J0102q8817j71500k32043k42392j47231m6771l9258o8951
15959g41305k4967M4576J1709n3267l0981O6364J15745Q1786j367n7700l5969
15948f25376K2288O9651J36230J83072J67126J66414J70477R9085r223r0836j50038
15937A38870j81468j13340M2610J42600J29760L5174o6894j14230q2508l6571
15927a05997l4856J1J7952j5715K1225J41460J88783J40154P4604J6002q796k5454
15915D09373m4341m7826j6419L9174L0546n0937j28037j83473k25288k11977j18353
15904e47558R982P8403N4751j7724j21496j89596j63750p3299J866M150l5501
$$ plain form
15893 -999772 -1029241 -1001308 -958013 -958118 -980514 -996141 -984434 -892781 -700857 -471522 -359471
15882 -359471 -394682 -441812 -471033 -522600 -591703 -647851 -694212 -779353 -847595 -775122 -590507
15871 -590507 -461606 -467019 -544136 -583194 -531639 -403189 -262164 -167032 -147858 -216369 -329350
15860 -329350 -409152 -408074 -355039 -321419 -310577 -269812 -202624 -160275 -157934 -144576 -68433 97958
15848 97958 298888 421968 430664 363505 276752 191723 94281 -22622 -127359 -199750 -257208
15837 -257208 -278107 -219269 -79979 25855 37822 -14515 -91967 -190423 -307534 -360911 -301366
15826 -301366 -200492 -134709 -123276 -181816 -321473 -517192 -711678 -853419 -919881 -902218
15816 -902218 -818751 -750924 -799055 -895758 -914770 -872223 -879202 -1001993 -1129888 -1146359 -1099008
$$ packed form
15893i99772k9469K7933M3295j05k2396j5627J1707R1653J91924K29335J12051
15882c59471l5211m7130k9221n1567o9103n6148m6361q5141o8242P2473J84615
15871e90507J28901n413p7117l9058N1555J28450J41025R5132J9174o8511j12981
15860c29350p9802J078N3035L3620J0842M0765O7188M2349K341J3358P6143J66391
15848I7958K00930J23080Q696o7159q6753q5029r7442j16903j04737p2391n7458
15837b57208k0899N8838J39290J05834J1967n2337p7452r8456j17111n3377N9545
15826c01366J00874O5783J1433n8540j39657j95719j94486j41741o6462J7663
15816i02218Q3467O7827m8131r6703j9012M2547o979j22791j27895j6471M7351
$$ plain form
15805 -1099008 -1008928 -817005 -586214 -433979 -332352 -206643 -56556 69228 106856 16004
15795 16004 -123415 -208907 -227711 -173599 -109318 -142721 -227142 -241664 -171408 -81102 -54325
15784 -54325 -140003 -294355 -461743 -585658 -645383 -699949 -750230 -753462 -662042 -464337 -223982
15773 -223982 -32986 116209 251211 332853 332367 265478 247169 344013 485022 555038 451715
15762 451715 162431 -280444 -698670 -850098 -760907 -613256 -502432 -431698 -361937 -252799
15752 -252799 -155414 -112323 -129060 -228613 -400627 -517634 -511903 -505259 -579803 -636871 -559048
15741 -559048 -405171 -340746 -359197 -293949 -111284 94095 248716 321448 291529 180268
15731 180268 142251 250930 350883 306839 126073 -104295 -276458 -397567 -529250 -664741
$$ packed form
15805a099008R0080J91923K30791J52235J01627J25709J50087J25784L7628r0852
15795A6004j39419q5492j8804N4112O4281l3403q4421j4522P0256R0306K6777
15784e4325q5678j54352j67388j23915n9725n4566n0281l232R1420J97705K40355
15773b23982J90996J49195J35002Q1642m86o6889j8309R6844J41009P0016j03323
15762D51715k89284m42875m18226j51428Q9191J47651J10824P0734O9761J09138
15752b52799R7385M3091j6737r9553j72014j17007N731O644p4544n7068P7823
15741e59048J53877O4425j8451O5248J82665K05379J54621P2732k9919j11261
15731A80268l8017J08679R9953m4044j80766k30368j72163j21109j31683j35491
$$ plain form
15721 -664741 -728106 -684748 -562171 -376471 -148925 31149 73466 14169 -98284 -216623
15711 -216623 -270562 -262626 -274800 -342423 -437206 -502653 -470665 -353192 -268922 -259181 -302056 -413713
15699 -413713 -553252 -670943 -704271 -659095 -671736 -772210 -812140 -660476 -365550 -105429
15689 -105429 -7801 -43182 -115583 -206388 -401805 -691001 -976885 -1197078 -1333398 -1418355
15679 -1418355 -1495648 -1522524 -1430411 -1204081 -917356 -607335 -280005 -8854 159863 226461
15669 226461 196386 113467 43273 12845 -10271 -72722 -190636 -285464 -316691 -366798 -513388
15658 -513388 -701950 -781112 -712464 -582340 -450591 -394587 -420200 -387245 -255763 -157215 -148602
15647 -148602 -168782 -195133 -275960 -382288 -420119 -398420 -355960 -319506 -332424 -418446 -558553
$$ packed form
15721f64741o3365M3358J22577J85700K27546J80074M2317n9297j12453j18339
15711b16623n3939P936j2174o7623r4783o5447L1988J17473Q4270R741m2875j11657
15699d13713j39539j17691l3328M5176j2641j00474l9930J51664K94926K60121
15689a05429R7628l5381p2401r0805j95417k89196k85884k20193j36320q4957
15679a418355p7293k6876R2113K26330K86725L10021L27330K71151J68717O6598
15669B26461l0075q2919p0194l0428k3116o2451j17914r4828l1227n0107j46590
15658e13388j88562p9162O8648J30124J31749N6004k5613L2955J31482R8548Q613
15647a48602k0180k6351q0827j06328l7831K1699M2460L6454j2918q6022j40107
$$ plain form
15636 -558553 -657366 -650282 -575907 -463627 -343791 -276314 -241130 -154089 4428 178244 320312
15625 320312 395138 394587 370611 339355 262989 180653 231567 382822 447294 425525 449556 557332
15613 557332 713833 815201 785782 664595 483169 240726 -11724 -192058 -250049 -234452
15603 -234452 -233441 -307610 -413631 -467943 -474062 -483706 -541633 -596244 -569488 -435268 -289792
15592 -289792 -240855 -252120 -260022 -260621 -238505 -196574 -103685 44458 132127 81350 -40967 -101779
15580 -101779 -63326 17534 69293 15355 -157061 -355456 -443938 -409186 -347277 -320068 -319551
15569 -319551 -329307 -327929 -305740 -330300 -437671 -516411 -513718 -471958 -423475 -408943 -431629 -459061
15557 -459061 -427918 -310715 -140575 18989 139225 214891 210655 167027 124296 76009 5172
$$ packed form
15636e58553r8813P084P4375J12280J19836O7477L5184Q7041J58517J73816J42068
15625C20312P4826n51k3976l1256p6366q2336N0914J51255O4472k1769K4031J07776
15613E57332J56501J01368k9419j21187j81426k42443k52450j80334n7991J5597
15603b34452J011p4169j06021n4312o119r644n7927n4611K6756J34220J45476
15592b89792M8937j1265p902n99K2116M1931R2889J48143Q7669n0777j22317o0812
15580a01779L8453Q0860N1759n3938j72416j98395q8482L4752O1909K7209N17
15569c19551r756J378K2189k4560j07371p8740K693M1760M8483J4532k2686k7432
15557d59061L1143J17203J70140J59564J20236P5666m236m3628m2731m8287p0837
$$ plain form
15546 5172 -93742 -188769 -281527 -342954 -330316 -335443 -444732 -549323 -574090 -567665 -584155 -634216
15534 -634216 -639134 -508124 -294160 -42980 204729 375213 449364 474533 489441 450767 327150
15523 327150 179979 41047 -103839 -227210 -287940 -292349 -274318 -293469 -310986 -236073 -80639
15512 -80639 71903 202368 295851 269090 127439 -31334 -167566 -255893 -284755 -319219 -388634
15501 -388634 -464233 -491688 -442517 -364946 -336664 -413584 -520562 -568194 -571274 -574289 -620348 -734241
15489 -734241 -861248 -962666 -1048125 -1087883 -1036975 -887041 -663797 -418854 -229227 -77269
15479 -77269 94194 238860 339865 452923 593995 755320 864333 844306 676660 375717
15469 375717 887 -327359 -535155 -629085 -616138 -521097 -414220 -353992 -366813 -395787 -318264
$$ packed form
15546E172r8914r5027r2758o1427J2638n127j09289j04591k4767O425j6490n0061
15534f34216m918J31010K13964K51180K47709J70484P4151K5169J4908l8674j23617
15523C27150j47171j38932j44886j23371o0730m409J8031j9151j7517P4913J55434
15512h0639J52542J30465R3483k6761j41651j58773j36232q8327k8862l4464o9415
15501c88634p5599k7455M9171P7571K8282p6920j06978m7632l080l015m6059j13893
15489g34241j27007j01418q5459l9758N0908J49934K23244K44943J89627J51958
15479g7269J71463J44666J01005J13058J41072J61325J09013k0027j67646l00943
15469C75717l74830l28246k07796r3930J2947R5041J06877O0228j2821k8974P7523
$$ plain form
15458 -318264 -130965 81460 292642 470253 552076 551384 539818 519689 447535 330309 182331
15447 182331 43662 -38638 -90855 -219504 -453082 -721317 -970920 -1173054 -1286354 -1259017
15437 -1259017 -1125341 -922562 -665137 -474041 -456470 -595683 -776241 -908903 -981699 -950039
15427 -950039 -784997 -524644 -258523 -42046 82680 129930 162990 151947 91323 81439 177457
15416 177457 341619 509105 585473 526271 382059 237789 189647 209700 202866 132382 5982
15405 5982 -131214 -286618 -472098 -599051 -575774 -443264 -297929 -152209 -10359 65937
15395 65937 16845 -122221 -251117 -334552 -395856 -439140 -482718 -514395 -479804 -397192 -336407
15384 -336407 -277077 -164194 -54542 -51495 -109657 -125808 -96825 -57071 -72473 -179128 -316507
$$ packed form
15458c18264J87299K12425K11182J77611Q1823o92j1566k0129p2154j17226j47978
15447A82331j38669q2300n2217j28649k33578k68235k49603k02134j13300K7337
15437a259017J33676K02779K57425J91096J7571j39213j80558j32662p2796L1660
15427i50039J65042K60353K66121K16477J24726M7250L3060j1043o0624r884R6018
15416A77457J64162J67486P6368n9202j44212j44270m8142K0053o834p0484j26400
15405E982j37196j55404j85480j26953K3277J32510J45335J45720J41850P6296
15395F5937m9092j39066j28896q3435o1304m3284m3578l1677L4591Q2612O0785
15384c36407N9330J12883J09652L047n8162j6151K8983L9754j5402j06655j37379
$$ plain form
15373 -316507 -430150 -520959 -609794 -717614 -823292 -847237 -784046 -728445 -692525 -598073 -459488
15362 -459488 -385984 -419735 -510155 -649354 -862585 -1096944 -1254136 -1281396 -1203077 -1051838
15352 -1051838 -886475 -780195 -715988 -608920 -491263 -440631 -480530 -604900 -762369 -909864
15342 -909864 -1095266 -1383736 -1703243 -1866221 -1784561 -1616957 -1540531 -1529730 -1466800 -1251510
15332 -1251510 -909488 -587500 -348673 -147641 27136 166180 316529 532109 730846
15323 730846 783997 663246 505635 423494 358956 243590 104828 26621 39630 98970 167577
15312 167577 203113 203632 234822 311913 387744 462304 578765 679295 702603 700492 713175 756747
15300 756747 819267 843578 805135 761301 714085 597338 432591 297818 236076 199709 160539
$$ packed form
15373c16507j13643r0809q8835j07820j05678k3945O3191N5601L5920R4452J38585
15362d59488P3504l3751r0420j39199k13231k34359j57192k7260P8319J51239
15352a051838J65363J06280O4207J07068J17657N0632l9899j24370j57469j47495
15342i09864j85402k88470l19507j62978Q1660J67604P6426J0801O2930K15290
15332a251510L42022L21988K38827K01032J74777J39044J50349K15580J98737
15323G30846N3151j20751j57611q2141o4538j15366j38762p8207J3009N9340O8607
15312A67577L5536N19L1190P7091P5831P4560J16461J00530K3308k111J2683M3572
15300G56747O2520K4311l8443m3834m7216j16747j64747j34773o1742l6367l9170
$$ plain form
15289 160539 60200 -160440 -395468 -508852 -509128 -464527 -385781 -208356 69091 304402
15279 304402 389912 366001 311069 252271 180908 84059 -1932 -24990 -20291 -28313 -24748 -3969
15267 -3969 -17490 -71072 -53645 56753 98122 20366 8683 170350 376205 476824 472363
15256 472363 408606 262423 12606 -288808 -541110 -687771 -714140 -638204 -588093 -642922
15246 -642922 -736038 -788944 -724064 -516318 -229380 36943 234850 336261 352270 392484
15236 392484 432268 399953 342423 305960 285277 268036 197004 30680 -167886 -335253 -506703
15225 -506703 -792399 -1170902 -1433228 -1454372 -1322343 -1143624 -947462 -755018 -593845 -449823
15215 -449823 -292074 -93197 145360 372258 496981 481848 403677 347599 280021 150134
$$ packed form
15289A60539j00339k20640k35028j13384k76M4601P8746J77425K77447K35311
15279C04402Q5510k3911n4932n8798p1363r6849q5991k3058M699q022L565K0779
15267c969j3521n3582J7427J10398M1369p7756j1683J61667K05855J00619m461
15256D72363o3757j46183k49817l01414k52302j46661k6369P5936N0111n4829
15246f42922r3116n2906O4880K07746K86938K66323J97907J01411J6009M0214
15236C92484L9784l2315n7530l6463k0683j7241p1032j66324j98566j67367j71450
15225e06703k85696l78503k62326k1144J32029J78719J96162J92444J61173J44022
15215d49823J57749J98877K38557K26898J24723j5133p8171n6078o7578j29887
$$ plain form
15205 150134 12847 -124862 -345010 -627206 -802475 -761717 -574786 -382357 -278489 -261680
15195 -261680 -326129 -493336 -727112 -917399 -977561 -953164 -914978 -898725 -934931 -978376 -1011749
15184 -1011749 -1040546 -1062636 -1077208 -1011075 -839322 -699193 -668026 -645206 -545066 -423308
15174 -423308 -356980 -336420 -305969 -260022 -246756 -318252 -428532 -484930 -415494 -215467 16206
15163 16206 177070 244274 234969 120900 -61220 -255307 -490931 -737203 -944361 -1094032
15153 -1094032 -1153777 -1033149 -716482 -320507 58867 347568 500087 558566 569677 553778
15143 553778 539106 551389 590824 594747 511464 348891 165419 10725 -86682 -148660 -267621
15132 -267621 -473989 -686435 -842815 -985352 -1163846 -1319129 -1349569 -1220507 -976975 -669387
$$ packed form
15205A50134j37287j37709k20148k82196j75269M0758J86931J92429J03868J6809
15195b61680o4449j67207k33776j90287o0162K4397L8186J6253l6206m3445l3373
15184a011749k8797k2090j4572O6133J71753J40129L1167K2820J00140J21758
15174d23308O6328K0560L0451M5947J3266p1496j10280n6398O9436K00027K31673
15163A6206J60864O7204r305j14069j82120j94087k35624k46272k07158j49671
15153a094032n9745J20628L16667L95975L79374K88701J52519N8479J1111j5899
15143E53778j4672J2283L9435L923q3283j62573j83472j54694r7407o1978j18961
15132b67621k06368k12446j56380j42537j78494j55283l0440J29062K43532L07588
$$ plain form
15122 -669387 -406225 -348764 -524859 -808010 -1022081 -1065638 -1006303 -929471 -849919 -787742 -789575
15111 -789575 -832418 -860207 -874314 -880800 -798691 -657307 -571824 -543576 -518859 -486902 -488921 -500546
15099 -500546 -415423 -248134 -99716 -39340 -86704 -199139 -319903 -461406 -575936 -581946
15089 -581946 -512595 -439693 -407916 -390752 -305961 -136265 38250 112176 74980 -21385 -165579
15078 -165579 -335848 -487485 -570690 -626026 -704590 -799111 -897353 -1016166 -1101467 -1012001 -740668
15067 -740668 -442382 -247817 -158202 -98918 -11267 50624 14712 -101682 -279723 -424185
15057 -424185 -477720 -553124 -746409 -970886 -1066142 -964879 -739048 -543369 -414178 -265230
15047 -265230 -92936 4752 -33439 -180600 -389481 -591633 -684534 -638432 -473428 -303437
$$ packed form
15122f69387K63162N7461j76095k83151k14071m3557N9335P6832P9552O2177j833
15111g89575m2843k7789j4107o486Q2109J41384Q5483K8248K4717L1957k019j1625
15099e00546Q5123J67289J48418O0376m7364j12435j20764j41503j14530o010
15089e81946O9351P2902L1777J7164Q4791J69696J74515P3926l7196r6365j44194
15078a65579j70269j51637q3205n5336p8564r4521r8242j18813q5301Q9466K71333
15067g40668K98286J94565Q9615N9284Q7651O1891l5912j16394j78041j44462
15057d24185n3535p5404j93285k24477r5256J01263K25831J95679J29191J48948
15047b65230J72294R7688l8191j47161k08881k02152r2901M6102J65004J69991
$$ plain form
15037 -303437 -320818 -508988 -702510 -823178 -866450 -889380 -940054 -1000191 -1015720 -979934 -905516
15026 -905516 -799289 -682548 -576656 -495892 -431876 -378562 -337912 -360698 -461415 -551320 -571098
15015 -571098 -546006 -572213 -734964 -951031 -1015640 -870520 -697851 -667770 -772774 -868530
15005 -868530 -826364 -680871 -551052 -453619 -388581 -384575 -397885 -325870 -165545 1225 137544
14994 137544 211775 161035 -24416 -221550 -255280 -117368 35549 74328 -46816 -293026
14984 -293026 -544689 -697259 -728398 -714651 -709900 -699534 -693764 -703730 -687151 -659539 -702491 -802833
14972 -802833 -872624 -893073 -911698 -991944 -1141761 -1278667 -1318046 -1251082 -1133131 -1032021 -972563
14961 -972563 -934575 -907553 -854320 -755348 -662413 -637424 -684456 -762932 -810855 -775014 -694198
$$ packed form
15037c03437j7381j88170j93522j20668m3272k2930n0674o0137j5529L5786P4418
15026i05516J06227J16741J05892Q0764O4016N3314M0650k2786j00717q9905j9778
15015e71098K5092k6207j62751k16067o4609J45120J72669L0081j05004r5756
15005h68530M2166J45493J29819R7433O5038M006j3310P2015J60325J66770J36319
14994A37544P4231n0740j85451j97134l3730J37912J52917L8779j21144k46210
14984b93026k51663j52570l1139J3747M751J0366N770r966J6579K7612m2952j00342
14972h02833o9791k0449j8625q0246j49817j36906l9379O6964J17951J01110N9458
14961i72563L7988K7022N3233R8972R2935K4989m7032p8476m7923L5841Q0816
$$ plain form
14950 -694198 -622370 -503744 -286553 -28435 154041 202623 129097 -33932 -276174 -555871
14940 -555871 -797681 -975237 -1066716 -1053714 -987829 -926204 -883317 -869933 -862672 -868660 -893264
14929 -893264 -880205 -802124 -681158 -571287 -467765 -350092 -215106 -107028 -62160 -59403
14919 -59403 -113020 -233757 -356486 -398955 -331684 -194893 -15690 220270 456924 615232
14909 615232 620183 427143 95573 -253033 -480516 -515287 -414762 -323553 -319785 -307763 -200464
14898 -200464 -53203 51903 12375 -171191 -362661 -499655 -593581 -596647 -508199 -432201 -403168
14887 -403168 -416587 -470669 -533513 -593784 -681515 -796185 -894855 -946040 -919590 -803966 -633992
14876 -633992 -481030 -401806 -351007 -262642 -156268 -81303 -108002 -242790 -339123 -305084 -275541
$$ packed form
14950f94198P1828J18626K17191K58118J82476M8582p3526j63029k42242k79697
14940e55871k41810j77556r1479J3002O5885O1625M2887J3384P261n988k4604
14929h93264J3059P8081J20966J09871J03522J17673J34986J08078M4868K757
14919e9403n3617j20737j22729m2469O7271J36791J79203K35960K36654J58308
14909F15232M951j93040l31570l48606k27483l4771J00525R1209L768J2022J07299
14898b00464J47261J05106l9528j83566j91470j36994r3926l066Q8448P5998K9033
14887d03168j3419n4082o2844o0271q7731j14670r8670n1185K6450J15624J69974
14876f33992J52962P9224N0799Q8365J06374P4965k6699j34788r6333L4039K9543
$$ plain form
14865 -275541 -355771 -458399 -472185 -367199 -202459 -131583 -279123 -536863 -714358 -798650
14855 -798650 -828523 -808445 -737711 -599496 -367247 -74855 159240 239175 188757 76238
14845 76238 -30417 -70113 -41485 39620 184891 402919 656447 828951 840346 704000
14835 704000 476811 263933 121949 21111 -70380 -130235 -110871 10068 161661 193987
14825 193987 91578 -8087 -46304 -60905 -103160 -153573 -145929 -88000 -48237 -109169 -241758
14814 -241758 -350961 -435383 -530870 -613602 -654215 -645647 -619285 -596467 -583942 -587017 -559930 -498295
14802 -498295 -451381 -520823 -724376 -917767 -963647 -809938 -514096 -211619 -17647 44614
14792 44614 52501 77573 120909 219356 419703 637797 727890 689913 622928 622802 689933 743170
$$ packed form
14865b75541q0230j02628j3786J04986J64740P0876j47540k57740j77495q4292
14855g98650k9873K0078P0734J38215K32249K92392K34095P9935n0418j12519
14845G6238j06655l9696K8628Q1105J45271K18028K53528J72504J1395j36346
14835G04000k27189k12878j41984j00838r1491n9855J9364J20939J51593L2326
14825A93987j02409r9665l8217j4601m2255n0413P644N7929L9763o0932j32589
14814b41758j09203q4422r5487q2732m0613Q568K6362K2818J2525l075K7087O1635
14802d98295M6914o9442k03553j93391m5880J53709K95842L02477J93972O2261
14792D4614P887K5072M3336R8447K00347K18094R0093l7977o6985j26O7131N3237
$$ plain form
14780 743170 782311 863764 976553 1037061 1033960 957197 724243 356096 -2148 -240841 -364214
14769 -364214 -432271 -393858 -213458 14046 170482 199894 142402 74211 22481 -5190 6362
14758 6362 55701 90152 14808 -133942 -203651 -143001 -64792 -126937 -323265 -485322 -494451
14747 -494451 -390283 -267881 -151728 -23780 86737 167033 209481 210661 197009 214646 276133
14736 276133 289584 229369 148276 117705 182082 255050 188745 -29539 -269491 -472603 -602252
14725 -602252 -635766 -628980 -595880 -532180 -507781 -576517 -667117 -677847 -650218 -657069 -677967 -658432
14713 -658432 -553663 -399110 -254947 -142439 -14160 149934 266680 295404 266742 178770
14703 178770 45853 -48992 -67999 -44435 -12813 -2636 -30411 -98191 -176624 -220399 -199735
$$ packed form
14780G43170L9141Q1453J12789O0508l101p6763k32954l68147l58244k38693j23373
14769c64214o8057L8413J80400K27504J56436K9412n7492o8191n1730k7671J1552
14758F362M9339L4451p5344j48750o9709O0650P8209o2145j96328j62057r129
14747d94451J04168J22402J16153J27948J10517Q0296M2448J180j3652J7637O1487
14736B76133J3451o0215q1093l0571O4377P2968o6305k18284k39952k03112j29649
14725f02252l3514O786L3100O3700K4399o8736r0600j0730K7629o851k0898J9535
14713f58432J04769J54553J44163J12508J28279J64094J16746K8724k8662q7972
14703A78770j32917r4845j9007K3564L1622J0177k7775o7780p8433m3775K0664
$$ plain form
14692 -199735 -65573 212875 589279 921148 1080692 1075842 1008586 929677 813278 669033
14682 669033 562077 518036 492404 402699 261087 163085 144087 128063 42645 -35927 -29024
14671 -29024 17579 75826 158436 207560 167296 73381 2823 -13587 -12842 -32003 -66223 -104001
14659 -104001 -114257 -68411 24250 120229 154153 102133 -19286 -172548 -371693 -635813 -871948
14648 -871948 -952438 -905658 -878565 -898505 -885242 -810942 -700708 -587492 -496347 -421572 -364569
14637 -364569 -347482 -317645 -247922 -209703 -208564 -184585 -134627 -103981 -121780 -132964 -110564 -110201
14625 -110201 -153251 -169024 -91826 -22334 -71369 -196641 -330035 -436102 -478233 -486055 -533981
14614 -533981 -638537 -804989 -1004307 -1138004 -1161580 -1105910 -984767 -808204 -634249 -435289
$$ packed form
14692a99735J34162K78448L76404L31869J59544m850o7256p8909j16399j44245
14682F69033j06956m4041k5632q9705j41612r8002j8998j6024q5418p8572O903
14671b9024M6603N8247Q2610M9124m0264r3915p0558j6410P45j9161l4220l7778
14659a04001j0256M5846R2661R5979L3924n2020j21419j53262j99145k64120k36135
14648h71948q0490M6780K7093j9940J3263P4300J10234J13216R1145P4775N7003
14637c64569J7087K9837O9723L8219J139K3979M9958L0646j7799j1184K2400L63
14625a10201m3050j5773P7198O9492m9035j25272j33394j06067m2131p822m7926
14614e33981j04556j66452j99318j33697k3576N5670J21143J76563J73955J98960
$$ plain form
14604 -435289 -219863 -87412 -10256 78503 184817 288485 365402 402251 360795 236547
14594 236547 78977 -67006 -205003 -336822 -431061 -507378 -591434 -679231 -769379 -860354 -971613
14583 -971613 -1124743 -1278662 -1390993 -1467466 -1459063 -1318976 -1105274 -919556 -826053 -815047
14573 -815047 -821845 -834188 -880203 -863020 -729709 -576348 -496415 -490476 -495898 -447324 -358330 -286185
14561 -286185 -255341 -270558 -333685 -402023 -423113 -403226 -375039 -365752 -353615 -310380 -237713 -136393
14549 -136393 20552 169038 226480 180609 61052 -73215 -157523 -141960 14961 253646
14539 253646 449529 546180 515048 343320 83842 -144871 -247890 -254423 -212412 -100489
14529 -100489 65026 172750 122993 -33298 -145973 -137198 -14558 160679 286708 343408
$$ packed form
14604d35289K15426J32451P7156Q8759J06314J03668P6917L6849m1456j24248
14594B36547j57570j45983j37997j31819r4239p6317q4056q7797r0148r0975j11259
14583i71613j53130j53919j12331p6473Q403J40087K13702J85718R3503J1006
14573h15047o798j2343m6015J7183J33311J53361P9933N939n422M8574Q8994P2145
14561b86185L0844j5217o3127o8338k1090J9887K8187R287J2137M3235P2667J01320
14549a36393J56945J48486N7442m5871j19557j34267q4308J5563J56921K38685
14539B53646J95883R6651l1132j71728k59478k28713j03019o533M2011J11923
14529a00489J65515J07724m9757j56291j12675Q775J22640J75237J26029N6700
$$ plain form
14519 343408 420833 523959 513854 344848 110507 -101581 -234441 -256050 -187060 -76993
14509 -76993 19619 17176 -63922 -141186 -143865 -57584 37283 61246 15775 -36985 -51027 -6957
14497 -6957 63798 94367 92854 91255 95361 124006 204184 289879 290295 208346 141016 138482 166925
14484 166925 223318 319799 437808 530720 550301 482042 378011 303515 252782 199876 175198
14473 175198 128541 1668 -163364 -256669 -198633 -79383 -33197 -89150 -192260 -233768 -208155
14462 -208155 -239210 -380204 -580439 -756409 -851443 -881106 -869466 -815984 -709350 -569190
14452 -569190 -451924 -420007 -465104 -488367 -446596 -385290 -339913 -328964 -339869 -373939 -434463
14441 -434463 -511918 -629229 -793459 -943228 -1020009 -1018954 -945699 -841679 -698536 -474466
$$ packed form
14519C43408P7425J03126j0105j69006k34341k12088j32860k1609O8990J10067
14509g6993R6612k443q1098p7264k679Q6281R4867K3963m5471n2760j4042M4070
14497f957P0755L0569j513j599M106K8645Q0178Q5695M16q1949o7330k534K8443
14484A66925N6393R6481J18009R2912J9581o8259j04031p4496n0733n2906k4678
14473A75198m6657j26873j65032r3305N8036J19250M6186n5953j03110m1508K5613
14462b08155l1055j40994k00235j75970r5034k9663J1640N3482J06634J40160
14452e69190J17266L1917m5097k3263M1771O1306M5377J0949j0905l4070o0524
14441d34463p7455j17311j64230j49769p6781J055P3255J04020J43143K24070
$$ plain form
14431 -474466 -256817 -150204 -122898 -91983 -84605 -102673 -81384 -42192 -31441 -81688 -192763
14420 -192763 -285578 -324143 -370618 -452958 -584543 -781813 -1019829 -1227085 -1326017 -1304446 -1215463
14409 -1215463 -1100927 -956339 -840076 -829256 -896809 -989589 -1035722 -973437 -827947 -652436
14399 -652436 -490431 -358568 -292405 -284651 -265639 -262854 -310512 -389576 -506390 -678727 -842800
14388 -842800 -893622 -822754 -696566 -595854 -546237 -504832 -487644 -525849 -538253 -422763 -205244
14377 -205244 22900 149363 135488 64701 -2590 -85259 -173911 -249851 -294642 -244009 -92202
14366 -92202 38274 50051 -39042 -196205 -355177 -400287 -296479 -162456 -137358 -202930 -308218
14355 -308218 -453705 -604589 -669505 -593203 -441295 -332985 -287761 -237390 -170266 -107212 -31836
$$ packed form
14431d74466K17649J06613K7306L0915P378j8068K1289L9192J0751n0247j11075
14420a92763r2815l8565m6475q2340j31585j97270k38016k07256r8932K1571Q8983
14409a215463J14536J44588J16263J0820o7553r2780m6133O2285J45490J75511
14399f52436J62005J31863O6163P754J9012K785m7658p9064j16814j72337j64073
14388h42800n0822P0868J26188J00712M9617M1405J7188l8205j2404J15490K17519
14377b05244K28144J26463j3875p0787o7291q2669q8652p5940m4791N0633J51807
14366i2202J30476J1777q9093j57163j58972m5110J03808J34023K5098o5572j05288
14355c08218j45487j50884o4916P6302J51908J08310M5224N0371O7124O3054P5376
$$ plain form
14344 -31836 102600 283804 440055 504761 480403 418488 327704 208936 55649 -159299
14334 -159299 -400994 -559592 -563718 -466653 -322738 -140820 99033 336938 482392 480895
14324 480895 328610 107121 -134719 -369029 -529855 -613838 -678786 -729540 -736965 -727079 -722985
14313 -722985 -684457 -593919 -502452 -466061 -484055 -525833 -506459 -379499 -166211 76012 224350
14302 224350 227296 146450 44854 -23420 -5522 83519 157036 185258 181241 133540 -6336
14291 -6336 -207551 -296853 -197022 -40352 29879 19187 -3976 -42251 -98099 -97386 -9932 42195
14279 42195 -39169 -177697 -279560 -330101 -277536 -90874 179414 399412 440075 346191 245407
14268 245407 230729 303844 380016 402630 377851 329632 274559 157216 -70120 -299669 -388830
$$ packed form
14344c1836J34436J81204J56251O4706k4358o1915r0784j18768j53287k14948
14334a59299k41695j58598m126R7065J43915J81918K39853K37905J45454j497
14324D80895j52285k21489k41840k34310j60826q3983o4948n0754p425R886M094
14313g22985L8528R0538R1467L6391j7994m1778J9374J26960K13288K42223J48338
14302B24350K946q0846j01596o8274J7898Q9041P3517K8222m017m7701j39876
14291f336k01215q9302R9831J56670P0231j0692k3163l8275n5848P13Q7454N2127
14279D2195q1364j38528j01863n0541N2565J86662K70288K19998M0663r3884j00784
14268B45407j4678P3115P6172K2614k4779m8219n5073j17343k27336k29549q9161
$$ plain form
14257 -388830 -324710 -184436 -28709 108960 218360 262087 169115 -39473 -225870 -298644
14247 -298644 -281678 -232503 -204350 -169952 -95163 -29186 -38938 -149068 -316346 -470982 -568730
14236 -568730 -606390 -578922 -544180 -560276 -555314 -462974 -330848 -236841 -221977 -258113 -281768
14225 -281768 -259834 -182986 -110732 -146198 -284639 -413729 -512252 -601541 -685915 -759663 -752104
14214 -752104 -606170 -381362 -198058 -94529 4836 129215 215443 180238 7548 -205570
14204 -205570 -370366 -435558 -427843 -422768 -408170 -341691 -234068 -139497 -105043 -119855 -126238 -94092
14192 -94092 -23579 104077 280196 444824 547874 564147 530905 469456 368330 288517 236551
14181 236551 107841 -134299 -391707 -591314 -724537 -823118 -880870 -798767 -574106 -336318
$$ packed form
14257c88830O4120J40274J55727J37669J09400M3727r2972k08588j86397p2774
14247b98644J6966M9175K8153L4398P4789O5977r752j10130j67278j54636r7748
14236e68730l7660K7468L4742j6096M962R2340J32126R4007J4864l6136k3655
14225b81768K1934P6848P2254l5466j38441j29090r8523q9289q4374p3748P559
14214g52104J45934K24808J83304J03529R9365J24379Q6228l5205j72690k13118
14204b05570j64796o5192P715N075J4598O6479J07623R4571L4454j4812o383L2146
14192i4092P0513J27656J76119J64628J03050J6273l3242o1449j01126p9813n1966
14181B36551j28710k42140k57408j99607j33223r8581n7752Q2103K24661K37788
$$ plain form
14171 -336318 -181798 -123914 -143726 -196914 -249660 -261250 -226340 -178828 -150500 -192935 -257350
14160 -257350 -227105 -108744 -40450 -81523 -159397 -209470 -195332 -125705 -22487 91450 160574
14149 160574 142640 79211 70695 106441 132746 137894 165588 217923 207504 115804 -15193 -125713
14137 -125713 -174541 -171541 -159892 -159766 -186692 -213510 -197539 -192600 -244463 -289463 -289285 -262876 -187572
14124 -187572 -97364 -82888 -141249 -204347 -213329 -144538 -89959 -140016 -253067 -364290 -446942
14113 -446942 -503503 -488693 -339498 -101443 72401 141130 180789 226340 274863 316687 308270
14102 308270 241278 146076 55738 -37296 -161892 -287100 -353693 -333196 -276068 -277420 -378883
14091 -378883 -524444 -608822 -581282 -435053 -227745 -63993 7909 63754 159706 224055 239822
$$ packed form
14171c36318J54520N7884j9812n3188n2746j1590L4910M7512K8328m2435o4415
14160b57350L0245J18361O8294m1073p7874n0073J4138O9627J03218J13937O9124
14149A60574j7934o3429q516L5746K6305N148K7694N2335j0419r1700j30997j10520
14137a25713m8828L000J1649J26k6926k6818J5971M939n1863m5000J78K6409P5304
14124a87572R0208J4476n8361o3098q982O8791N4579n0057j13051j11223q2652
14113d46942n6561J4810J49195K38055J73844O8729L9659M5551M8523M1824q417
14102C08270o6992r5202r0338r3034j24596j25208o6593K0497N7128j352j01463
14091c78883j45561q4378K7540J46229K07308J63752P1902N5845R5952O4349J5767
$$ plain form
14080 239822 245772 247453 257982 300397 373968 484006 600461 662753 659231 615674 552268 526416
14068 526416 548683 538070 456866 379763 379325 421340 468181 514544 544422 502874 398551 325501
14056 325501 324877 375244 430567 413475 331664 271923 284018 341183 366222 333802 293271 329811
14044 329811 462293 651244 842960 991197 1030786 950084 841585 787686 815911 920011
14034 920011 1026393 1044056 981460 875746 726971 570264 511197 583131 655283 644623 595935
14023 595935 520317 402766 277510 153782 43891 25271 107587 216331 318432 445039
14013 445039 626270 848498 1062549 1151775 1033442 782252 532517 331252 157442 -4287
14003 -4287 -157807 -230178 -157550 -11743 99067 145408 150082 151184 167626 191455 217902 213720
$$ packed form
14080B39822N950J681J0529M2415P3571J10038J16455O2292l522m3557o3406k5852
14068E26416K2267j0613q1204p7103m38M2015M6841M6363K9878m1548j04323p3050
14056C25501o24N0367N5323j7092q1811n9741J2095N7165K5039l2420m0531L6540
14044C29811J32482J88951J91716J48237L9589q0702j08499n3899K8225J04100
14034I20011J06382J7663o2596j05714j48775j56707n9067P1934P2152j0660m8688
14023E95935p5618j17551j25256j23728j09891j8620Q2316J08744J02101J26607
14013D45039J81231K22228K14051Q9226j18333k51190k49735k01265j73810j61729
14003d287j53520p2371P2628J45807J10810M6341M674J102J6442K3829K6447m182
$$ plain form
13991 213720 173018 122014 118930 162700 198115 190839 126870 63018 55591 102673 163782 182265
13979 182265 184605 228327 294011 316581 254426 112992 -69451 -233979 -328218 -351711 -341439
13968 -341439 -307580 -277382 -348376 -513770 -658068 -737184 -745777 -649397 -462443 -272469 -109114
13957 -109114 101924 337493 461969 441911 357518 256250 169140 141376 142267 91208 3647
13946 3647 -34788 -22989 -33475 -132793 -329457 -532276 -604842 -502432 -287407 -56597 141890
13935 141890 294281 424702 546455 618939 630954 581847 469909 337557 238739 158659
13925 158659 59030 -37618 -69771 -22977 43252 113977 203646 266004 274572 255091 222164 198763
13913 198763 213030 249121 276734 307708 289426 170371 31514 -71598 -168929 -284350 -422155
$$ packed form
13991B13720m0702n1004l084M3770L5415p276o3969o3852p427M7082O1109J8483
13979A82265K340M3722O5684K2570o2155j41434j82443j64528r4239k3493J0272
13968c41439L3859L0198p0994j65394j44298p9116q593R6380J86954J89974J63355
13957a09114K11038K35569J24476k0058q4393j01268q7110k7764Q91n1059q7561
13946C647l8435J1799j0486r9318j96664k02819p2566J02410K15025K30810J98487
13935A41890J52391J30421J21753P2484J2015m9107j11938j32352r8818q0080
13925A58659r9629r6648l2153M6794O6229P0725Q9669O2358Q568j9481l2927k3401
13913A98763J4267L6091K7613L0974j8282j19055j38857j03112r7331j15421j37805
$$ plain form
13902 -422155 -566056 -697634 -741863 -640803 -465547 -314113 -219366 -122728 296 110046
13892 110046 186028 242251 275931 287405 306531 349230 395409 430056 448129 431747 347873
13881 347873 231613 174134 178633 159677 63391 -113419 -323543 -488601 -582670 -633175 -645769
13870 -645769 -628027 -594537 -525132 -363017 -140997 50927 135749 118285 94418 122934 198973
13859 198973 293516 371172 375048 306768 210719 121438 56266 -35069 -203191 -385292 -509772
13848 -509772 -561291 -565094 -553199 -561341 -611906 -705278 -804354 -855963 -838069 -755485 -657830 -573298
13836 -573298 -446506 -296902 -196856 -163678 -149264 -117044 -99234 -137473 -242439 -358962
13826 -358962 -428203 -416358 -343602 -254898 -191305 -167677 -144069 -108641 -115033 -219942 -344395
$$ packed form
13902d22155j43901j31578m4229J01060J75256J51434R4747R6638J23024J09750
13892A10046P5982N6223L3680J1474J9126M2699M6179L4647J8073j6382q3874
13881C47873j16260n7479M499j8956r6286j76810k10124j65058r4069n0505j2594
13870f45769J7742L3490O9405J62115K22020J91924Q4822j7464k3867K8516P6039
13859A98973R4543P7656L876o8280r6049q9281o5172r1335j68122j82101j24480
13848e09772n1519l803J1895q142n0565r3372r9076n1609J7894Q2584R7655Q4532
13836e73298J26792J49604J00046L3178J4414L2220J7810l8239j04966j16523
13826c58962o9241J1845P2756Q8704O3593K3628K3608L5428o392j04909j24453
$$ plain form
13815 -344395 -378114 -333933 -363508 -597291 -955225 -1222440 -1283771 -1205658 -1121227 -1091530 -1071254
13804 -1071254 -1015171 -927759 -797107 -606882 -392829 -178975 -10530 53747 -5378 -144123
13794 -144123 -302002 -400017 -382583 -298962 -237791 -216593 -202470 -200566 -230171 -246729 -229268
13783 -229268 -200175 -186583 -209849 -224544 -173836 -42211 153003 341573 411918 380167 356180
13772 356180 338082 265812 131168 -64753 -299634 -526228 -708080 -827182 -922189 -1013301
13762 -1013301 -1035091 -961759 -832848 -704454 -605221 -539900 -502848 -470855 -456425 -515811 -643165
13751 -643165 -756878 -794756 -741896 -651643 -572407 -482258 -370164 -250408 -146706 -75295 -57167
13740 -57167 -113519 -227424 -330392 -368021 -350665 -329132 -314274 -264946 -184198 -136417 -159996
$$ packed form
13815c44395l3719M4181k9575k33783l57934k67215o1331P8113Q4431K9697K0276
13804a071254N6083Q7412J30652J90225K14053K13854J68445O4277n9125j38745
13794a44123j57879r8015J7434Q3621O1171K1198J4123J904k9605j6558J7461
13783b29268K9093J3592k3266j4695N0708J31625J95214J88570P0345l1751k3987
13772C56180j8098p2270j34644j95921k34881k26594j81852j19102r5007r1112
13762a013301k1790P3332J28911J28394R9233O5321L7052L1993J4430n9386j27354
13751f43165j13713l7878N2860R0253P9236R0149J12094J19756J03702P1411J8128
13740e7167n6352j13905j02968l7629J7356K1533J4858M9328Q0748M7781k3579
$$ plain form
13729 -159996 -233707 -300408 -324360 -324788 -312831 -264448 -168059 -90244 -64767 -38000 28799 104174
13717 104174 119527 60995 -26588 -96332 -135112 -159347 -193028 -195449 -149107 -128576 -149414 -153774
13705 -153774 -113017 -42973 38236 118270 168892 189530 201991 184057 157692 228538 407308
13694 407308 551857 590670 609890 670735 752673 781993 707630 534433 328574 237189 267393
13683 267393 295005 270696 192422 115143 123297 176773 163691 52664 -102666 -211654 -223230
13672 -223230 -188397 -184263 -220877 -266860 -263578 -165022 15797 191968 283412 251131 140966
13661 140966 89783 184983 362816 515058 585640 548846 407461 221047 7446 -242322
13651 -242322 -449311 -534019 -543938 -563207 -591561 -613569 -616227 -589157 -537549 -488646 -474631 -486117
$$ packed form
13729a59996p3711o6701k3952m28J1957M8383R6389P7815K5477K6767O6799P5375
13717A04174J5353n8532q7583o9744l8780k4235l3681k421M6342K0531k0838m360
13705a53774M0757P0044Q1209Q0034N0622K0638J2461j7934k6365P0846J78770
13694D07308J44549L8813J9220O0845Q1938K9320p4363j73197k05859r1385L0204
13683B67393K7612k4309p8274p7279Q154N3476j3082j11027j55330j08988j1576
13672b23230L4833M134l6614m5983L282R8556J80819J76171R1444l2281j10165
13661A40966n1183R5200J77833J52242P0582l6794j41385j86414k13601k49768
13651b42322k06989q4708r919j9269k8354k2008k658K7070N1608M8903J4015j1486
$$ plain form
13639 -486117 -460888 -368869 -251290 -188503 -247778 -384075 -480266 -496675 -492197 -479379 -448629
13628 -448629 -432196 -453364 -525840 -599036 -558838 -396052 -211537 -71143 -53326 -256938 -649974
13617 -649974 -991512 -1153848 -1258184 -1379260 -1475573 -1494725 -1393999 -1215549 -1015981 -777198
13607 -777198 -518522 -332265 -241940 -167053 -70954 43670 160038 255115 336471 392703 363304
13596 363304 229619 51822 -103644 -207190 -279567 -317411 -305275 -249987 -211579 -254625 -364409
13585 -364409 -499631 -596737 -605095 -580221 -610732 -690060 -789801 -920084 -1046853 -1042151 -848379
13574 -848379 -550307 -305602 -206685 -189116 -196162 -241562 -330916 -383457 -333450 -207815 -95807
13563 -95807 -59897 -19445 85756 155712 103845 -20658 -55383 15098 43836 33812 46508
$$ packed form
13639d86117K5229R2019J17579O2787n9275j36297r6191j6409M478J2818L0750
13628d48629J6433k1168p2476p3196M0198J62786J84515J40394J7817k03612l93036
13617f49974l41538j62336j04336j21076r6313j9152J00726J78450J99568K38783
13607g77198K58676J86257R0325P4887R6099J14624J16368R5077Q1356N6232k9399
13596C63304j33685j77797j55466j03546p2377l7844J2136N5288L8408m3046j09784
13585c64409j35222r7106q358K4874l0511p9328r9741j30283j26769M702J93772
13574h48379K98072K44705R8917J7569p046m5400q9354n2541N0007J25635J12008
13563i5807L5910M0452J05201O9956n1867j24503l4725P0481K8738j0024J2696
$$ plain form
13552 46508 22072 -89674 -280071 -568623 -935847 -1229869 -1326873 -1231487 -1015019 -832937
13542 -832937 -787605 -790477 -765969 -774829 -799013 -751894 -659990 -589810 -552892 -573371 -665713 -765373
13530 -765373 -771346 -644030 -426667 -202852 -69694 -63359 -112865 -179974 -278337 -392996 -507193
13519 -507193 -587724 -559159 -388210 -182696 -66780 -26523 -17688 -65041 -152591 -210677 -191366
13508 -191366 -79213 77314 206488 206761 40514 -172756 -304276 -318905 -275277 -276886 -362656
13497 -362656 -490568 -596196 -607499 -525111 -413012 -304399 -198568 -110050 -16331 37626
13487 37626 -35163 -149711 -192502 -164820 -127831 -69049 91617 343366 541331 580305 510906
13476 510906 379316 223783 106389 93875 201490 330080 363833 291522 151483 3568
$$ packed form
13552D6508k4436j11746j90397k88552l67224k94022r7004R5386K16468J82082
13542h32937M5332k872K4508q860k4184M7119R1904P0180L6918k0479r2342r9660
13530g65373n973J27316K17363K23815J33158O335m9506o7109r8363j14659j14197
13519e07193q0531K8565J70949K05514J15916M0257Q835m7353q7550n8086J9311
13508a91366J12153J56527J29174K73j66247k13270j31520j4629M3628j609q5770
13497c62656j27912j05628j1303Q2388J12099J08613J05831Q8518R3719N3957
13487C7626p2789j14548m2791K7682L6989N8782J60666K51749J97965L8974o9399
13476E10906j31590j55533j17394j2514J07615J28590L3753p2311j40039j47915
$$ plain form
13466 3568 -106478 -146082 -97277 40593 215372 328669 359410 359902 400995 462488 498887
13455 498887 516471 568537 669180 788180 906614 959866 882487 716873 608155 580421
13445 580421 555090 518865 505622 528734 543571 537169 550002 604669 694151 800440 911845
13434 911845 1009348 1115407 1212074 1198744 1052972 853229 706773 663446 698936 766632 824498
13423 824498 846633 806815 690450 562897 508466 472983 366519 250865 199202 177778 147591
13412 147591 136938 185562 313424 472940 570885 589772 598349 624968 594742 450848 227418
13401 227418 5829 -158370 -251771 -269739 -229221 -172078 -91286 5035 77879 156424 267985
13390 267985 365959 422367 465641 465187 409372 372235 362453 311431 225068 164140 115262 95335
$$ packed form
13466C568j10046l9604M8805J37870J74779J13297L0741M92M1093O1493L6399
13455D98887J7584N2066J00643J19000J18434N3252p7379j65614j08718k7734
13445E80421k5331l6225j3243K3112J4837o402J2833N4667Q9482J06289J11405
13434I11845R7503J06059R6667j3330j45772j99743j46456m3327L5490O7696N7866
13423H24498K2135l9818j16365j27553n4431l5483j06464j15654n1663k1424l0187
13412A47591j0653M8624J27862J59516R7945J8887Q577K6619l0226j43894k23430
13401B27418k21589j64199r3401j7968M0518N7143Q0792R6321P2844P8545J11561
13390B67985R7974N6408M3274m54n5815l7137r782n1022q6363o0928m8878j9927
$$ plain form
13378 95335 141353 257349 451504 630641 658255 534324 361404 236701 199939 244313
13368 244313 342880 465478 533465 481547 328107 122859 -72171 -196256 -232019 -192376
13358 -192376 -115660 -53511 8813 82970 184759 268607 288578 361419 541411 715280 808522
13347 808522 810722 738167 579061 337054 149917 119056 230561 438175 652334 790154
13337 790154 828987 789117 704764 627962 567685 482780 378960 378229 577125 867220 1059338
13326 1059338 1060478 935267 862611 934430 1091392 1216736 1236334 1130588 920633 688689
13316 688689 535062 480082 482575 513201 562880 576279 527984 470369 465237 515498 563843 575507
13304 575507 553356 529839 492100 405800 317055 324260 425428 492947 474633 377318 258185
$$ packed form
13378I5335M6018J15996J94155J79137K7614j23931j72920j24703l6762M4374
13368B44313R8567J22598O7987n1918j53440k05248j95030j24085l5763L9643
13358a92376P6716O2149O2324P4157J01789Q3848J9971P2841J79992J73869R3242
13347H08522K200p2555j59106k42007j87137l0861J11505K07614K14159J37820
13337G90154L8833l9870q4353p6802o0277q4905j03820p31J98896K90095J92118
13326A059338J140j25211p2656P1819J56962J25344J9598j05746k09955k31944
13316F88689j53627n4980K493L0626M9679J3399m8295n7615n132N0261M8345J1664
13304E75507k2151k3517l7739q6300q8745P205J01168O7519j8314r7315j19133
$$ plain form
13293 258185 203024 231551 315577 375658 404868 480687 650947 895362 1136972 1333524 1476832
13282 1476832 1535952 1484979 1321687 1127215 985464 919666 888247 839321 755998 650362
13272 650362 579630 611590 712109 810713 845950 777543 596391 341927 106812 -3484
13262 -3484 47524 204431 375547 511063 640883 771849 861998 874228 815258 726783 611439
13251 611439 461982 342854 314200 367958 489597 663623 800993 837892 790445 702829
13241 702829 624017 575294 531743 484723 445709 377762 293589 268292 313982 388247 483118
13230 483118 639435 871019 1114623 1315591 1466789 1526618 1491990 1431139 1333927 1156558
13220 1156558 948025 777280 663838 618677 630448 639152 590560 479456 299034 66059
$$ packed form
13293B58185n5161K8527Q4026O0081K9210P5819J70260K44415K41610J96552J43308
13282A476832N9120n0973j63292j94472j41751o5798l1419m8926q3323j05636
13272F50362p0732L1960J00519R8604L5237o8407j81152k54464k35115j10296
13262c484N1008J56907J71116J35516J29820J30966R0149J2230n8970q8475j15344
13251F11439j49457j19128k8654N3758J21639J74026J37370L6899m7447q7616
13241G02829p8812m8723m3551m7020l9014o7947q4173k5297M5690P4265R4871
13230D83118J56317K31584K43604K00968J51198N9829l4628o0851r7212j77369
13220A156558k08533j70745j13442m5161J1771Q704m8592j11104j80422k32975
$$ plain form
13210 66059 -139769 -237434 -227039 -124576 96233 427719 755854 954158 991528 936135
13200 936135 927580 1054097 1272063 1449241 1478382 1421020 1431240 1543930 1716836 1860103
13190 1860103 1875015 1781769 1728536 1759681 1772122 1723020 1664041 1614277 1560290 1503620 1442939
13179 1442939 1406190 1375645 1302857 1225881 1207131 1202849 1179435 1154013 1077962 950614 862358
13168 862358 869790 920699 930895 912966 930342 1006592 1100119 1163563 1225830 1311228 1370027 1390912
13156 1390912 1413516 1371297 1244706 1122138 1067015 1095757 1138389 1101589 996881 924604 919571
13145 919571 930000 906793 864911 907095 1088051 1326681 1494260 1528204 1428223 1242628 1032523
13134 1032523 855655 761361 723403 704186 745139 900726 1142712 1395107 1587804 1672556
$$ packed form
13210F6059k05828r7665J0395J02463K20809L31486L28135J98304L7370n5393
13200I36135q555J26517K17966J77178K9141n7362J0220J12690J72906J43267
13190A860103J4912r3246n3233L1145J2441m9102n8979m9764n3987n6670o0681
13179A442939l6749l0545p2788p6976j8750m282k3414k5422p6051j27348q8256
13168H62358P432N0909J0196j7929J7376P6250R3527O3444O2267Q5398N8799K0885
13156A390912K2604m2219j26591j22568n5123K8742M2632l6800j04708p2277n033
13145I19571J0429k3207m1882M2184J80956K38630J67579L3944r9981j85595k10105
13134A032523j76868r4294l7958j9217M0953J55587K41986K52395J92697Q4752
$$ plain form
13124 1672556 1660519 1588348 1471987 1356265 1297055 1320646 1418945 1541872 1643171 1688311
13114 1688311 1666408 1610429 1593526 1618602 1626139 1603188 1557346 1482008 1387200 1269979 1129579
13103 1129579 1060202 1144121 1339325 1533315 1618027 1627456 1658610 1711819 1732509 1718645 1705709
13092 1705709 1708541 1710686 1690921 1671914 1710412 1813142 1947314 2086985 2183622 2209791 2202051
13081 2202051 2212113 2264637 2338334 2385883 2417843 2440161 2424429 2450608 2603718 2811917 2919406
13070 2919406 2886169 2815667 2762689 2709853 2642546 2613132 2651855 2725615 2780007 2776329 2757828
13059 2757828 2792422 2905289 3051241 3188530 3312774 3391419 3415568 3416459 3438257 3475105 3471192
13048 3471192 3400295 3272188 3152073 3141496 3212788 3290885 3364104 3463759 3661374 3958890
$$ packed form
13124A672556j2037p2171j16361j15722n9210K3591R8299J22927J01299M5140
13114A688311k1903n5979j6903K5076P537k2951m5842p5338r4808j17221j40400
13103A129579o9377Q3919J95204J93990Q4712R429L1154N3209K0690j3864j2936
13092A705709K832K145j9765j9007L8498J02730J34172J39671R6637K6169p740
13081B202051J0062N2524P3697M7549L1960K2318j5732K6179J53110K08199J07489
13070B919406l3237p0502n2978n2836o7307k9414L8723P3760N4392l678j8501
13059B757828L4594J12867J45952J37289J24244P8645K4149Q91K1798L6848l913
13048C471192p0897j28107j20115j0577P1292P8097P3219R9655J97615K97516
$$ plain form
13038 3958890 4242904 4444235 4561463 4611550 4624113 4662522 4763965 4870892 4912065 4896516
13028 4896516 4863043 4836459 4892185 5133055 5502074 5855875 6196807 6520340 6731870 6811353
13018 6811353 6837028 6874610 6932382 7026497 7218436 7500751 7812712 8103400 8360800 8621219
13008 8621219 8902973 9219550 9569625 9899434 10191893 10496269 10849342 11259604 11689877
12999 11689877 12131723 12642121 13228655 13909983 14732926 15696537 16840169 18229625 19857819
12990 19857819 21693761 23737226 25983431 28410142 31080609 34152629 37750574 41948627
12982 41948627 46830875 52545773 59331916 67466092 77241011 88875713 102597065 118890280
12974 118890280 138465840 162081239 190348726 223421665 260283909 297266778 326653572
$$ packed form
13038C958890K84014K01331J17228N0087J2563L8409J01443J06927M1173j5549
13028D896516l3473k6584N5726K40870L69019L53801L40932L23533K11530P9483
13018F811353K5675L7582N7772R4115J91939K82315L11961K90688K57400K60419
13008H621219K81754L16577L50075L29809K92459L04376L53073M10262M30273
12999A1689877M41846N10398N86534O81328Q22943R63611J143632J389456J628194
12990A9857819J835942K043465K246205K426711K670467L072020L597945M198053
12982D1948627M882248N714898O786143Q134176R774919J1634702J3721352J6293215
12974A18890280J9575560K3615399K8267487L3072939L6862244L6982869K9386794
$$ plain form
12967 326653572 338485511 327124033 296398469 256348183 216048459 180331420 150638278
12960 150638278 126621150 107278529 91642932 78968931 68689489 60347576 53517193
12953 53517193 47830199 42954209 38689399 34991949 31788860 29012872 26650864 24683667
12945 24683667 23022598 21614610 20406115 19286799 18224544 17222045 16308930 15563625
12937 15563625 14997724 14564553 14231393 13954228 13667601 13342679 13042799 12825370 12707929
12928 12707929 12657440 12554941 12330839 12075202 11935493 11939495 12001282 12062334 12156987 12299663
12918 12299663 12539354 12932517 13467259 14099291 14813183 15626972 16540558 17545269 18585918
12909 18585918 19620621 20619666 21556511 22453960 23365118 24350406 25505393 26960897 28780646
$$ packed form
12967C26653572J1831939j1361478l0725564m0050286m0299724l5717039k9693142
12960A50638278k4017128j9342621j5635597j2674001j0279442q341913o830383
12953E3517193n686994m875990m264810l697450l203089k775988k362008j967197
12945B4683667j661069j407988j208495j119316j062255j002499r13115p45305
12937A5563625n65901m33171l33160k77165k86627l24922k99880k17429j17441
12928A2707929n0489j02499k24102k55637j39709M002O1787O1052R4653J42676
12918A2299663K39691L93163N34742O32032P13892Q13789R13586J004711J040649
12909A8585918J034703R99045R36845Q97449R11158R85288J154987J455504J819749
$$ plain form
12900 28780646 30994123 33630807 36683998 40188477 44340006 49409417 55529753 62748161
12892 62748161 71207693 81174633 92962422 106983223 123835730 144268685 168983053
12885 168983053 198549943 233014930 270934153 307810862 334925354 342199934 325598824
12878 325598824 290989184 249109393 208579499 173472618 144573635 121303037 102748671
12871 102748671 87918938 75891107 66005211 57890499 51261266 45810253 41277453 37417249
12863 37417249 34055510 31113592 28533092 26304970 24419523 22863103 21600860 20425106
12855 20425106 19175608 17931003 16792184 15816815 15056995 14508681 14084544 13688027 13307714
12846 13307714 12990560 12738072 12568215 12475506 12398139 12349064 12364331 12384925 12364746 12321165
$$ packed form
12900B8780646K213477K636684L053191L504479M151529N069411O120336P218408
12892F2748161Q459532R966940J1787789J4020801J6852507K0432955K4714368
12885A68983053K9566890L4464987L7919223L6876709K7114492P274580j6601110
12878C25598824l4609640m1879791m0529894l5106881k8898983k3270598j8554366
12871A02748671j4829733j2027831r885896q114712o629233n451013m532800l860204
12863C7417249l361739k941918k580500k228122j885447j556420j262243j175754
12855B0425106j249498j244605j138819r75369p59820n48314m24137l96517l80313
12846A3307714l17154k52488j69857r2709p7367m9075J5267K0594k0179m3581
$$ plain form
12836 12321165 12347876 12455022 12485983 12401779 12322240 12340777 12461079 12634860 12864323 13165150
12826 13165150 13514833 13905156 14405820 15098829 15948053 16890922 17887598 18910986 20005474
12817 20005474 21275369 22779527 24526723 26565012 28983025 31847386 35195979 39110831
12809 39110831 43725904 49144899 55484425 62903885 71626523 81979000 94327709 109088240
12801 109088240 126812763 148131386 173665152 203875368 238580524 275858153 310339064
12794 310339064 332819523 334349778 313289565 277076877 236077879 197536280 164515295
12787 164515295 137386790 115409984 97698868 83369546 71635077 61982799 54081821
12780 54081821 47583081 42143610 37529904 33628888 30353372 27555329 25086880 22851925
$$ packed form
12836A2321165K6711J07146L0961q4204p9539J8537J20302J73781K29463L00827
12826A3165150L49683L90323N00664O93009Q49224R42869R96676J023388J094488
12817B0005474J269895J504158J747196K038289K418013K864361L348593L914852
12809C9110831M615073N418995O339526P419460Q722638J0352477J2348709J4760531
12801A09088240J7724523K1318623K5533766L0210216L4705156L7277629L4480911
12794C10339064K2480459J530255k1060213l6212688m0998998l8541599l3020985
12787A64515295k7128505k1976806j7711116j4329322j1734469r652278p900978
12780E4081821o498740n439471m613706l901016l275516k798043k468449k234955
$$ plain form
12772 22851925 20804798 18937339 17268300 15839291 14633347 13571581 12620448 11808424
12764 11808424 11171725 10710264 10374455 10054773 9645560 9136906 8558354 7946037 7392573
12755 7392573 6962248 6637681 6364014 6138440 5998005 5917137 5834584 5737071 5605094 5411040
12745 5411040 5141124 4811251 4473776 4134807 3758234 3381361 3085936 2834696 2559999
12736 2559999 2310340 2168985 2115932 2054063 1996326 2052013 2167735 2176636 2079845 1951298 1770091
12725 1770091 1536201 1344501 1270176 1323433 1468278 1650358 1826907 1915684 1845543 1683925
12715 1683925 1521446 1380374 1276842 1194428 1131048 1129290 1160220 1167086 1204779 1357783 1566377
12704 1566377 1691821 1694219 1608118 1518967 1451860 1357865 1228620 1073613 896647 734914
$$ packed form
12772B2851925k047127j867459j669039j429009j205944j061766r51133q12024
12764A1808424o36699m61461l35809l19682m09213n08654n78552o12317n53464
12755G392573m30325l24567k73667k25574j40435q0868q2553r7513j31977j94054
12745E411040k69916l29873l37475l38969l76573l76873k95425k51240k74697
12736B559999k49659j41355n3053o1869n7737N5687J15722Q901r6791j28547j81207
12725A770091k33890j91700p4325N3257J44845J82080J76549Q8777p0141j61618
12715A683925j62479j41072j03532q2414o3380j758L0930O866L7693J53004K08594
12704A566377J25444K398q6101q9151o7107r3995j29245j55007j76966j61733
$$ plain form
12694 734914 648766 610945 537345 449395 399954 379893 393454 484234 633806 758731 801099
12683 801099 766627 723826 762468 928667 1089813 1111967 1017914 911515 852479 846683 871236
12672 871236 867657 846998 816068 732630 684626 768566 899886 896520 686206 431675 342044
12661 342044 422574 569884 698702 721339 609466 447513 335419 301125 312399 356410
12651 356410 420831 466413 453462 384034 292160 227994 254105 360659 452584 502554 536631
12640 536631 550700 578657 634301 684327 711445 693335 643199 639796 710644 847160 1017548
12629 1017548 1171188 1243628 1190097 1085350 1026628 988233 908911 813209 706025 590185
12619 590185 531615 571439 673976 784378 884216 923339 850864 674173 454937 254207
$$ packed form
12694G34914q6148l7821p3600q7950m9441k0061J3561R0780J49572J24925M2368
12683H01099l4472m2801L8642J66199J61146K2154r4053j06399n9036n796K4553
12672H71236l579k0659l0930q3438m8004Q3940J31320l366k10314k54531q9631
12661C42044Q0530J47310J28818K2637j11873j61953j12094l4294J1274M4011
12651C56410O4421M5582j2951o9428r1874o4166K6111J06554R1925M9970L4077
12640E36631J4069K7957N5644N0026K7118j8110n0136l403P0848J36516J70388
12629A017548J53640P2440n3531j04747n8722l8395p9322r5702j07184j15840
12619E90185n8570L9824J02537J10402R9838L9123p2475j76691k19236k00730
$$ plain form
12609 254207 114151 84648 230158 477623 665191 769147 840888 925167 1006322 983102
12599 983102 828391 619681 423519 263887 188223 257755 409913 517519 555908 553023
12589 553023 511859 509682 601968 713749 759535 696464 560741 491590 622388 873029 1025344
12578 1025344 1007593 905545 811661 750545 694665 656959 657667 656533 616219 529250 414487
12567 414487 314620 250564 262382 382058 554934 670897 694524 665181 653300 682719 691037
12556 691037 619040 507625 393008 303344 265819 261546 264457 221605 103061 -27263 -87634
12545 -87634 -53604 39581 117447 148817 151909 138107 119015 112351 145374 181185 144677 31655
12533 31655 -100113 -186886 -234094 -221295 -142129 -95821 -116849 -91523 -857 16949 -37080
$$ packed form
12609B54207j40056k9503J45510K47465J87568J03956P1741Q4279Q1155k3220
12599I83102j54711k08710j96162j59632p5664O9532J52158J07606L8389k885
12589E53023m1164k177R2286J11781M5786o3071j35723o9151J30798K50641J52315
12578A025344j7751j02048r3884o1116n5880l7706P08j134m0314q6969j14763
12567D14487r9867o4056J1818J19676J72876J15963K3627k9343j1881K9419Q318
12556F91037p1997j11415j14617q9664l7525m273K911m2852j18544j30324o0371
12545h7634L4030R3185P7866L1370L092j3802j9092o664L3023L5811l6508j13022
12533C1655j31768q6773m7208J2799P9166M6308k1028K5326R0666J7806n4029
$$ plain form
12522 -37080 -69096 -93204 -121381 -108845 -34152 84327 219095 292337 279486 241212 213569
12511 213569 187689 182418 227470 287948 327020 366356 449306 544911 584310 577158 556735 479530
12499 479530 318124 143013 57533 95049 168346 155093 56052 -38869 -61537 -20070 14035
12488 14035 -19912 -96122 -93165 33108 183669 247228 243601 210232 125384 5548 -90670
12477 -90670 -123152 -121580 -98297 10955 186569 314959 309978 198512 62982 -28552 -86572
12466 -86572 -147844 -182911 -173805 -121790 -54256 -17633 -1955 -1244 -16252 12434 148688 308598
12454 308598 341562 251216 155408 95705 -1956 -181017 -353323 -406043 -325422 -191657 -70943
12443 -70943 71 31209 49323 87320 156322 197351 179531 141379 127077 152769 205740 269629
$$ packed form
12522c7080l2016k4108k8177J2536P4693J18479J34768P3242j2851l8274k7643
12511B13569k5880n271M5052O0478L9072L9336Q2950R5605L9399p152k0423p7205
12499D79530j61406j75111q5480L7516P3297j3253r9041r4921k2668M1467L4105
12488A4035l3947p6210K957J26273J50561O3559l627l3369q4848j19836r6218
12477i0670l2482J572K3283J09252J75614J28390m981j11466j35530r1534n8020
12466h6572o1272l5067R106N2015O7534L6623J5678P11j5008K8686J36254J59910
12454C08598L2964r0346r5808n9703r7661j79061j72306n2720Q0621J33765J20714
12443g0943P1014L1138J8114L7997O9002M1029j7820l8152j4302K5692N2971O3889
$$ plain form
12431 269629 352872 451059 477166 381162 231427 112866 92863 148063 176887 120581 620
12420 620 -96498 -112200 -74529 -3660 70397 106931 118371 142209 189603 275455 435493 699499
12408 699499 1017860 1230960 1219542 1058767 881624 743968 669142 637393 567465 419790
12398 419790 227262 64370 -69710 -236143 -378045 -396561 -313235 -190657 -67823 35058
12388 35058 140863 272814 419522 562922 679804 706763 591303 437866 380910 388500
12378 388500 361423 297124 239204 185266 99351 -26574 -98846 -56362 -18132 -99952 -240225
12367 -240225 -313399 -227842 11748 271375 431267 443438 351796 260106 209395 171083 150182
12356 150182 178694 232455 309821 433327 620400 819778 936826 962474 911216 794952
$$ packed form
12431B69629Q3243R8187K6107r6004j49735j18561k0003N5200K8824n6306j19961
12420F20r7118j5702L7671P0869P4057L6534J1440K3838M7394Q5852J60038K64006
12408F99499L18361K13100j1418j60775j77143j37656p4826l1749o9928j47675
12398D19790j92528j62892j34080j66433j41902j8516Q3326J22578J22834J02881
12388C5058J05805J31951J46708J43400J16882K6959j15460j53437n6956P590
12378C88500k7077o4299n7920n3938q5915j25925p2272M2484L8230q1820j40273
12367b40225p3174Q5557K39590K59627J59892J2171r1642r1690n0711l8312k0901
12356A50182K8512N3761P7366J23506J87073J99378J17048K5648n1258j16264
$$ plain form
12346 794952 647016 474855 296466 169475 134656 171572 239838 338907 463238 590356
12336 590356 690809 721335 703134 659893 573064 379537 42372 -297553 -489411 -522696
12326 -522696 -420558 -226214 -30957 158495 392568 610361 732376 785593 785051 718789
12316 718789 607679 510940 533952 683982 865487 1001414 1069766 1045222 874944 624112
12306 624112 415524 299034 278621 327648 403263 422872 272299 -58333 -402254 -573092
12296 -573092 -558441 -483590 -418136 -349267 -299655 -278398 -229520 -140990 -64798 -48291 -75857
12285 -75857 -107935 -120176 -101843 -86122 -34607 77547 198750 303142 354276 333634 268983
12274 268983 126845 -100397 -303836 -432568 -520747 -556030 -536760 -484318 -395373 -255508
$$ packed form
12346G94952j47936j72161j78389j26991l4819L6916O8266R9069J24331J27118
12336E90356J00453L0526j8201m3241q6829j93527l37165l39925j91858l3285
12326e22696J02138J94344J95257J89452K34073K17793J22015N3217n42o6262
12316G18789j11110r6739K3012J50030J81505J35927O8352k4544j70278k50832
12306F24112k08588j16490k0413M9027P5615J9609j50573l30632l43921j70838
12296e73092J4651P4851O5454O8869M9612K1257M8878Q8530P6192J6507k7566
12285g5857l2078j2241J8333J5721N1515J12154J21203J04392N1134k0642o4651
12274B68983j42138k27242k03439j28732q8179l5283J9270N2442Q8945J39865
$$ plain form
12264 -255508 -70795 132283 313132 426074 467020 459205 464749 484850 470255 422698 373447
12253 373447 372427 441748 531643 594768 619549 615201 627142 685839 787369 945831 1182838
12242 1182838 1446950 1689578 1912938 2095504 2188647 2206778 2233288 2330781 2504371 2727770
12232 2727770 2990990 3311524 3698223 4161784 4667576 5160190 5676795 6337738 7240353
12223 7240353 8427028 9946856 11843244 14159316 16958553 20364509 24543083 29359020
12215 29359020 33839911 35989481 34315835 29754920 24459175 19720045 15885159 12908869
12207 12908869 10552535 8583092 6941890 5639376 4643217 3899947 3328655 2908505 2679249
12198 2679249 2578771 2502869 2411649 2242646 1972891 1677648 1447136 1353918 1358194 1314549
$$ packed form
12264b55508J84713K03078J80849J12942M0946p815N544K0101j4595m7557m9251
12253C73447j020O9321Q9895O3125K4781m348J1941N8697J01530J58462K37007
12242A182838K64112K42628K23360J82566R3143J8131K6510R7493J73590K23399
12232B727770K63220L20534L86699M63561N05792M92614N16605O60943R02615
12223G240353J186675J519828J896388K316072K799237L405956M178574M815937
12215B9359020M480891K149570j673646m560915n295745m739130l834886k976290
12207A2908869k356334j969443j641202j302514r96159p43270n71292m20150k29256
12198B679249j00478p5902r1220j69003k69755k95243k30512r3218M276m3645
$$ plain form
12188 1314549 1154626 989898 914657 849597 776833 748386 726588 718652 723720 677481 548470
12177 548470 388493 295214 308959 370573 394916 383365 369663 313435 167232 -27306 -195366
12166 -195366 -290686 -280270 -161584 17751 192281 313199 443648 667077 896362 984420
12156 984420 939835 814508 642496 477911 347181 190530 -9249 -166670 -265989 -316720
12146 -316720 -290583 -203056 -104331 -17856 58705 152682 269224 338241 300816 198435 77500
12135 77500 -78066 -246644 -377082 -484672 -598763 -658415 -585369 -445927 -337722 -250784
12125 -250784 -140014 47538 331486 608364 732476 669945 503782 350779 274284 265587
12115 265587 287335 312288 343175 341666 301280 321909 455627 613781 696113 672879 601849
$$ packed form
12188A314549j59923j64728p5241o5060p2764k8447k1798p936N068m6239j29011
12177E48470j59977r3279J3745O1614K4343j1551j3702n6228j46203j94538j68060
12166a95366r5320J0416J18686J79335J74530J20918J30449K23429K29285Q8058
12156I84420m4585j25327j72012j64585j30730j56651j99779j57421r9319n0731
12146c16720K6137Q7527R8725Q6475P6561R3977J16542O9017l7425j02381j20935
12135G7500j55566j68578j30438j07590j14091n9652P3046J39442J08205Q6938
12125b50784J10770J87552K83948K76878J24112o2531j66163j53003p6495q697
12115B65587K1748K4953L0887j509m0386K0629J33718J58154Q2332k3234p1030
$$ plain form
12104 601849 556416 521771 439743 276145 47660 -130485 -181628 -159195 -123785 -86621 -22651
12093 -22651 71573 139860 141650 135463 169749 239313 337529 399126 379813 315063 228516 66644
12081 66644 -198942 -464903 -624834 -644978 -548752 -404643 -261922 -154980 -128806 -180137
12071 -180137 -249669 -266911 -226192 -196538 -246949 -364508 -445864 -413816 -285737 -141297 -60066
12060 -60066 -43731 13176 158152 303812 372830 345160 258107 187199 170725 201627 257507
12049 257507 310924 340639 308089 198973 92902 58223 56083 95354 219788 382808 497391
12038 497391 541662 518422 387257 184167 30490 1326 81003 154435 150938 125759 141692
12027 141692 173622 198404 242217 291940 305722 257978 190277 182980 267448 394968 477408
$$ packed form
12104F01849m5433l4645q2028j63598k28485j78145n1143K2433L5410L7164O3970
12093b2651R4224O8287J790o187L4286O9564R8216O1597j9313o4750q6547j61872
12081F6644k65586k65961j59931k0144R6226J44109J42721J06942K6174n1331
12071a80137o9532j7242M0719K9654n0411j17559q1356L2048J28079J44440Q1231
12060f0066J6335N6907J44976J45660O9018k7670q7053p0908j6474L0902N5880
12049B57507N3417K9715l2550j09116j06071l4679k140L9271J24434J63020J14583
12038D97391M4271k3240j31165k03090j53677k9164P9677P3432l497k5179J5933
12027A41692L1930K4782M3813M9723J3782m7744o7701p297Q4468J27520Q2440
$$ plain form
12016 477408 457244 397471 357291 286701 152104 12070 -105058 -230186 -326937 -344627 -334519
12005 -334519 -326680 -283313 -177469 -5787 138985 161648 123308 112346 105182 87041 80403
11994 80403 105916 164666 174207 144484 167402 252953 370043 468866 541580 623096 667833 599794
11982 599794 456636 361242 375841 413845 426809 452514 506686 561143 564417 499838 401904
11971 401904 319537 238600 123053 16085 -33499 -43735 -35410 -11779 33029 65637 61463
11960 61463 45440 42318 49751 57998 76278 146336 307264 553995 781271 888213 885799 835025
11948 835025 754742 635101 537654 549572 655414 739593 692138 514888 307885 157035
11938 157035 114644 193663 361557 562117 761563 931146 1058722 1174629 1266767 1291484
$$ packed form
12016D77408k0164n9773m0180p0590j34597j40034j17128j25128r6751j7690J0108
12005c34519P839M3367J05844J71682J44772K2663l8340j0962p164j8141o638
11994H0403K5513N8750R541k9723K2918Q5551J17090R8823P2714Q1516M4737o8039
11982E99794j43158r5394J4599L8004J2964K5705N4172N4457L274o4579r7934
11971D01904q2367q0937j15547j06968m9584j0236Q325K3631M4808L2608m174
11960F1463j6023l122P433Q247J8280P0058J60928K46731K27276J06942k414n0774
11948H35025q0283j19641r7447J1918J05842Q4179m7455j77250k07003j50850
11938A57035m2391P9019J67894K00560J99446J69583J27576J15907R2138K4717
$$ plain form
11928 1291484 1247590 1167584 1075774 1019686 1059498 1187864 1330075 1434819 1528475 1637655
11918 1637655 1767563 1912084 2064650 2206966 2344321 2543505 2852510 3233359 3543473
11909 3543473 3690543 3752713 3858866 4064285 4345199 4660250 4981662 5310076 5700987 6219919
11899 6219919 6841012 7485956 8078614 8539877 8762047 8607552 8051202 7233366 6330046
11890 6330046 5496689 4804838 4240623 3763347 3378089 3115966 2915631 2700898 2491373
11881 2491373 2322209 2208358 2121960 2022060 1924592 1861582 1825520 1770195 1681728 1627755 1626296
11870 1626296 1608163 1517200 1379977 1314729 1373701 1469556 1490340 1442830 1361151 1304265 1332791
11859 1332791 1372067 1343367 1298836 1276417 1243347 1146310 1009284 875430 769539 732237 763188
$$ packed form
11928A291484m3894q0006r1810n6088L9812J28366J42211J04744R3656J09180
11918A637655J29908J44521J52566J42316J37355J99184L09005L80849L10114
11909C543473J47070O2170J06153K05419K80914L15051L21412L28414L90911N18932
11899F219919O21093O44944N92658M61263K22170j54495n56350q17836r03320
11890F330046q33357o91851n64215m77276l85258k62123k00335k14733k09525
11881B491373j69164j13851q6398r9900r7468o3010l6062n5325q8467n3973j459
11870A626296j8133r0963j37223o5248N8972R5855K0784m7510q1679n6886K8526
11859A332791L9276k8700m4531k2419l3070r7037j37026j33854j05891l7302L0951
$$ plain form
11848 763188 802033 785273 738764 734586 784617 849530 936555 1079236 1261618 1421931 1511456
11837 1511456 1532045 1535769 1549480 1548227 1479053 1304342 1073072 859260 685551 613425 704894
11826 704894 883089 1054891 1225070 1411897 1570647 1655993 1675940 1634128 1584249 1576452 1575092
11815 1575092 1518639 1379304 1212318 1124827 1136805 1191236 1230493 1269469 1405085 1663692
11805 1663692 1978514 2256069 2480147 2725936 3040736 3380995 3712358 4044542 4365612
11796 4365612 4617042 4806780 5018972 5290973 5633302 6039837 6540468 7214949 8078099
11787 8078099 9062270 10095697 11183454 12462786 14093046 16030080 18166548 20451653
11779 20451653 22776355 24964796 26751514 27813867 27883019 26944682 25251743 23152481
$$ packed form
11848G63188L8845j6760m6509m178N0031O4913Q7025J42681J82382J60313Q9525
11837A511456K0589L724J3711j253o9174j74711k31270k13812j73709p2126R1469
11826G04894J78195J71802J70179J86827J58750Q5346J9947m1812m9879p797j360
11815A575092n6453j39335j66986q7491J1978N4431L9257L8976J35616K58607
11805A663692L14822K77555K24078K45789L14800L40259L31363L32184L21070
11796D365612K51430J89738K12192K72001L42329M06535N00631O74481Q63150
11787H078099R84171J033427J087757J279332J630260J937034K136468K285105
11779B0451653K324702K188441J786718J062353O9152r38337j692939k099262
$$ plain form
11771 23152481 20932563 18707489 16525002 14497169 12706319 11130448 9734958 8515489
11763 8515489 7468388 6587838 5921603 5486702 5160226 4801240 4387112 3971045 3582728
11754 3582728 3247683 2958184 2684606 2388864 2080427 1840958 1667703 1500017 1351186
11745 1351186 1183942 968169 769678 623046 574490 607901 634471 634859 610091 570599 506047
11734 506047 407707 359427 454660 686053 951293 1097376 1065771 951329 849412 765457
11724 765457 713241 698489 696436 746297 885890 1043165 1087189 1006508 856250 664698 454544
11713 454544 256172 118638 113470 234189 377769 415379 317254 141458 -37892 -169598
11703 -169598 -275961 -384718 -456559 -454612 -416502 -369153 -309831 -278553 -274355 -288482 -354646
$$ packed form
11771B3152481k219918k225074k182487k027833j790850j575871j395490j219469
11763H515489j047101q80550o66235m34901l26476l58986m14128m16067l88317
11754C582728l35045k89499k73578k95742l08437k39469j73255j67686j48831
11745A351186j67244k15773j98491j46632m8556L3411K6570L88k4768l9492o4552
11734E06047r8340m8280R5233K31393K65240J46083l1605j14442j01917q3955
11724G65457n2216j4752k053M9861J39593J57275M4024q0681j50258j91552k10154
11713D54544j98372j37534n168J20719J43580L7610r8125j75796j79350j31706
11703a69598j06363j08757p1841J947L8110M7349N9322L1278M198j4127o6164
$$ plain form
11692 -354646 -450981 -529930 -576679 -552124 -445268 -260685 10139 282165 435632 384025
11682 384025 190397 19608 -54294 -21763 119138 289158 391387 426718 437571 483704
11672 483704 549752 508768 325928 138104 63837 81428 103206 99764 68971 -53891 -250055
11661 -250055 -397178 -409483 -305970 -187570 -90861 -32088 -80380 -185620 -225523 -187956 -105897
11650 -105897 -25520 8940 -5238 -86392 -171656 -119519 51736 187160 223944 196287 161796
11639 161796 147358 139451 167186 260812 367265 391331 308640 156844 -13755 -141119 -214984
11628 -214984 -256237 -281246 -318972 -383180 -441036 -421390 -240848 80290 418309 655622 716448
11617 716448 617993 496288 455535 464583 453976 397021 279370 114642 -62776 -216918 -377650
$$ packed form
11692c54646r6335p8949m6749K4555J06856J84583K70824K72026J53467n1607
11682C84025j93628j70789p3902L2531J40901J70020J02229L5331J0853M6133
11672D83704O6048m0984j82840j87824p4267J7591K1778l442l0793j22862j96164
11661b50055j47123j2305J03513J18400R6709N8773m8292j05240l9903L7567Q2059
11650a05897Q0377L4460j4178q1154q5264N2137J71255J35424L6784k7657l4491
11639A61796j4438p907K7735R3626J06453K4066q2691j51796j70599j27364p3865
11628b14984m1253k5009l7726o4208n7856J9646J80542L21138L38019K37313O0826
11617G16448r8455j21705m0753R048j0607n6955j17651j64728j77418j54142j60732
$$ plain form
11606 -377650 -606524 -845398 -969465 -945715 -862835 -820328 -822400 -804801 -682342 -467290 -304146
11595 -304146 -322092 -482849 -648801 -774002 -879733 -941626 -927800 -842857 -720755 -621936
11585 -621936 -505226 -268577 46038 262392 285647 158838 10465 -24103 41726 88136
11575 88136 67059 26789 34179 64505 56719 8144 -87071 -213920 -316157 -383039 -434035 -475380
11563 -475380 -523152 -576750 -640329 -705434 -717700 -681771 -668013 -697853 -745738 -786805 -800930
11552 -800930 -801058 -832553 -847840 -732423 -515402 -327485 -204577 -141828 -150802 -194521 -203591
11541 -203591 -136024 -813 159898 291063 373958 418639 374182 190851 3044 -36926
11531 -36926 38186 85726 1833 -192680 -404782 -551719 -595687 -590220 -584843 -548035 -483786
$$ packed form
11606c77650k28874k38874j24067K3750Q2880M2507k072J7599J22459K15052J63144
11595c04146j7946j60757j65952j25201j05731o1893J3826Q4943J22102R8819
11585f21936J16710K36649L14615K16354K3255j26809j48373l4568O5829M6410
11575H8136k1077m0270P390L0326p786m8575r5215j26849j02237o6882n0996m1345
11563d75380m7772n3598o3579o5105j2266L5929J3758k9840m7885m1067j4125
11552h00930j28l1495j5287J15417K17021J87917J22908O2749q974m3719r070
11541b03591O7567J35211J60711J31165Q2895M4681m4457j83331j87807l9970
11531c6926P5112M7540q3893j94513k12102j46937m3968N467N377L6808O4249
$$ plain form
11520 -483786 -461066 -498938 -514903 -462888 -374279 -277624 -191073 -128447 -145798 -223782 -276863
11509 -276863 -282358 -272665 -306267 -379914 -466983 -597432 -779237 -929529 -1024864 -1092949 -1148372
11498 -1148372 -1231702 -1351694 -1412282 -1290446 -1019270 -793608 -748497 -812010 -877770 -922206
11488 -922206 -991959 -1146447 -1328148 -1385033 -1270542 -1094817 -987311 -973592 -950345 -818138
11478 -818138 -576013 -297477 -55288 102733 137091 46413 -105964 -281078 -450923 -550542
11468 -550542 -539668 -476569 -426869 -410191 -414002 -366249 -275270 -259542 -352003 -457592 -517663
11457 -517663 -540491 -508911 -386037 -234217 -147931 -135534 -148183 -179275 -198384 -135834 -33980
11446 -33980 27892 31941 -18135 -49709 -722 53736 76475 100080 110309 150757 252773 314728
$$ packed form
11520d83786K2720l7872j5965N2015Q8609R6655Q6551O2626j7351p7984n3081
11509b76863n495R693l3602p3647q7069j30449j81805j50292r5335o8085n5423
11498a148372q3330j19992o0588J21836K71176K25662M5111o3513o5760m4436
11488i22206o9753j54488j81701n6885J14491J75725J07506J3719K3247J32207
11478h18138K42125K78536K42189J58021L4358r0678j52377j75114j69845r9619
11468e50542J0874O3099M9700J6678l811M7753R0979J5728r2461j05589o0071
11457e17663k2828L1580J22874J51820Q6286J2397j2649l1092j9109O2550J01854
11446c3980O1872M049n0076l1574M8987N4458K2739K3605J0229M0448J02016O1955
$$ plain form
11434 314728 281125 196559 87370 -47852 -211120 -367652 -437326 -382637 -271746 -223150
11424 -223150 -290213 -435546 -566782 -640662 -712237 -797476 -904945 -1037156 -1115837 -1102804 -1020271
11413 -1020271 -887442 -790421 -803635 -903654 -986773 -1010029 -986240 -938513 -895675 -916221 -980863
11402 -980863 -982052 -891897 -753437 -626792 -552475 -529638 -549754 -566587 -548507 -567820 -711826
11391 -711826 -916706 -1059903 -1090064 -977075 -694467 -305865 3346 146792 209578 259890
11381 259890 266513 243373 221308 178773 86216 8687 19067 89656 203027 322672 387996
11370 387996 385066 330950 202349 -36803 -321900 -527574 -634195 -715556 -769091 -745408 -632298
11359 -632298 -426980 -159003 45440 133414 150819 101172 -27865 -229474 -506620 -764416
$$ packed form
11434C14728l3603q4566j09189j35222j63268j56532o9674N4689J10891M8596
11424b23150o7063j45333j31236p3880p1575q5239j07469j32211p8681J3033Q2533
11413a020271J32829R7021j3214j00019q3119k3256K3789M7727M2838k0546o4642
11402i80863j189R0155J38460J26645P4317K2837k0116j6833J8080j9313j44006
11391g11826k04880j43197l0161J12989K82608L88602L09211J43446O2786N0312
11381B59890O623k3140k2065m2535r2557p7529J0380P0589J13371J19645O5324
11370C87996k930n4116j28601k39152k85097k05674j06621q1361n3535K3683J13110
11359f32298K05318K67977K04443Q7974J7405m9647j29037k01609k77146k57796
$$ plain form
11349 -764416 -862169 -812276 -715365 -596761 -437532 -264403 -166617 -203758 -309206 -392214 -425329
11338 -425329 -408630 -356078 -294609 -210507 -97996 -41426 -103317 -232260 -321438 -308711 -249535
11327 -249535 -222847 -190447 -125955 -88698 -63706 34430 196621 337594 425429 486032 507775
11316 507775 479858 429755 339394 213561 116202 49183 -5009 -25724 -31473 -60366 -61165 -10186
11304 -10186 47511 109498 167762 191117 133117 -18151 -190269 -251312 -143538 63345 267536
11293 267536 439178 571143 631742 618564 557951 468079 347987 229235 128420 45143
11283 45143 -4976 12485 133284 290954 392444 478028 586199 691506 738152 691791 557593
11272 557593 345139 133394 19098 73062 312010 596592 739510 722297 656472 588241
$$ packed form
11349g64416r7753M9893R6911J18604J59229J73129R7786l7141j05448q3008l3115
11338d25329J6699N2552O1469Q4102J12511N6570o1891j28943q9178J2727N9176
11327b49535K6688L2400O4492L7257K4992R8136J62191J40973Q7835O0603K1743
11316E07775k7917n0103r0361j25833r7359o7019n4192k0715n749k8893p99N0979
11304a0186N7697O1987N8264K3355n8000j51268j72118o1043J07774K06883K04191
11293B67536J71642J31965O0599j3178o0613q9872j20092j18752j00815q3277
11283D5143n0119J7461J20799J57670J01490Q5584J08171J05307M6646m6361j34198
11272E57593k12454k11745j14296N3964K38948K84582J42918j7213o5825o8231
$$ plain form
11262 588241 486599 345517 214846 178908 218361 236608 225126 245333 252555 146028 -19560
11251 -19560 -132503 -196568 -253580 -296643 -332779 -397731 -452419 -458878 -483755 -579542 -691043
11240 -691043 -756233 -813082 -913388 -1001384 -972827 -823341 -602954 -408839 -337935 -329822 -281441
11229 -281441 -208265 -181288 -182659 -192544 -238883 -306227 -392623 -468428 -475270 -430583 -340885 -179486
11217 -179486 31203 230779 351676 387453 379212 390339 414519 384121 271492 142649 87838
11206 87838 71033 27002 -10208 -46337 -138354 -305209 -523402 -741401 -859991 -791186 -557182
11195 -557182 -266995 -11513 221518 429561 549314 598320 610065 592356 582570 585937 570678
11184 570678 505909 381310 216371 38367 -146508 -343782 -566435 -781605 -920587 -961983
$$ packed form
11262E88241j01642j41082j30671l5938L9453J8247j1482K0207P222j06527j65588
11251a9560j12943o4065n7012m3063l6136o4952n4688o459k4877r5787j11501
11240f91043o5190n6849j00306q7996K8557J49486K20387J94115P0904Q113M8381
11229b81441P3176K6977j371r885m6339o7344q6396p5805o842M4687Q9698J61399
11217a79486K10689J99576J20897L5777q241J1127K4180l0398j12629j28843n4811
11206H7838j6805m4031l7210l6129r2017j66855k18193k17999j18590O8805K34004
11195e57182K90187K55482K33031K08043J19753M9006J1745j7709r786L367j5259
11184E70678o4769j24599j64939j78004j84875j97274k22653k15170j38982m1396
$$ plain form
11174 -961983 -895652 -777403 -714279 -753456 -865513 -937231 -943367 -967088 -1007807 -968050 -800563
11163 -800563 -553187 -292802 -59121 151058 338561 438683 389128 219679 -11721 -275259
11153 -275259 -515334 -666418 -693016 -613352 -476432 -308803 -110278 97381 266764 328678
11143 328678 275759 166070 33241 -93414 -171896 -214114 -231685 -244627 -316379 -419215 -452697
11132 -452697 -377630 -238255 -77340 94221 233607 290758 296469 300007 291460 250842 212576
11121 212576 200093 212444 253601 293979 285314 214690 100513 -48333 -221096 -412432 -590240
11110 -590240 -676348 -652249 -570154 -495518 -462517 -467514 -514302 -562436 -540992 -439980 -295377
11099 -295377 -133352 57721 240233 334141 325981 215975 -19692 -305496 -432900 -321849
$$ packed form
11174i61983O6331J18249O3124l9177j12057p1718o136k3721m0719L9757J67487
11163h00563K47376K60385K33681K10179J87503J00122m9555j69449k31400k63538
11153b75259k40075j51084k6598P9664J36920J67629J98525K07659J69383O1914
11143C28678n2919j09689j32829j26655p8482m2218j7571j2942p1752j02836l3482
11132d52697P5067J39375J60915J71561J39386N7151N711L538q547m0618l8266
11121B12576j2483J2351M1157M0378q665p0624j14177j48846j72763j91336j77808
11110e90240q6108K4099Q2095P4636L3001m997m6788m8134K1444J01012J44603
11099b95377J62025J91073J82512R3908q160j10006k35667k85804j27404J11051
$$ plain form
11089 -321849 -121331 7204 35325 12409 -1058 42787 133620 251821 376640 470293 515439
11078 515439 491959 410245 306983 161677 -16517 -116213 -76092 44665 133422 95377 -29278
11067 -29278 -151306 -262673 -361264 -395801 -327828 -229805 -189824 -203421 -228405 -227446 -181051 -103048
11055 -103048 -46044 -65786 -191563 -375182 -517192 -559735 -534216 -500246 -475666 -442985 -390152
11044 -390152 -369949 -407780 -456231 -446897 -401564 -436793 -555640 -637404 -641411 -599927 -566626 -545492
11032 -545492 -507990 -470305 -425858 -348901 -241888 -130244 -43685 -25999 -56813 -57300 -33469
11021 -33469 -41253 -113844 -235180 -374298 -457086 -402088 -258459 -164713 -177465 -200835 -134337
11010 -134337 -30404 -11110 -114962 -314556 -557320 -762144 -911788 -1019748 -1047277 -1012400
$$ packed form
11089c21849K00518J28535K8121k2916j3467M3845R0833J18201J24819R3653M5146
11078E15439k3480q1714j03262j45306j78194r9696M0121J20757Q8757l8045j24655
11067b9278j22028j11367r8591l4537O7973R8023L9981j3597k4984R59M6395P8003
11055a03048N7004j9742j25777j83619j42010m2543K5519L3970K4580L2681N2833
11044c90152K0203l7831m8451R334M5333l5229j18847q1764m007M1484L3301K1134
11032e45492L7502L7685M4447P6957J07013J11644Q6559J7686l0814m87K3831
11021c3469p784p2591j21336j39118q2788N4998J43629R3746j2752k3370O6498
11010a34337J03933J9294j03852j99594k42764k04824j49644j07960k7529L4877
$$ plain form
11000 -1012400 -947083 -819457 -631377 -431998 -277672 -199935 -182115 -213105 -265676 -330137
10990 -330137 -419013 -519016 -575771 -563142 -495908 -415074 -368265 -338156 -295470 -244458 -186618
10979 -186618 -105671 -31311 -21677 -56244 -58357 -37094 -39143 -96754 -227476 -379237 -473897 -472188
10967 -472188 -400120 -282639 -120067 57215 160721 157802 120757 90719 42682 -39114 -94767
10956 -94767 -79824 -34135 16083 63026 60386 32265 54247 117228 165770 181428 174059 115335
10944 115335 6132 -130520 -270457 -356137 -347324 -300638 -306738 -384122 -490659 -612949 -778496
10933 -778496 -940782 -1022015 -1022762 -970923 -924224 -877144 -754116 -577634 -406303 -292167 -254937
10922 -254937 -227542 -142999 11332 170118 266491 325543 330324 237136 72811 -65431 -107945
$$ packed form
11000a012400O5317J27626J88080J99379J54326P7737J7820l0990n2571o4461
10990c30137q8876j00003n6755J2629O7234Q0834M6809L0109M2686N1012N7840
10979a86618Q0947P4360R634l4567k113K1263k049n7611j30722j51761r4660J709
10967d72188P2068J17481J62572J77282J03506k919l7045l0038m8037q1796n5653
10956i4767J4943M5689N0218M6943k640k8121K1982O2981M8542J5658p369n8724
10944A15335j09203j36652j39937q5680Q813M6686o100p7384j06537j22290j65547
10933g78496j62286q1233p47N1839M6699M7080J23028J76482J71331J14136L7230
10922b54937K7395Q4543J54331J58786R6373N9052M781r3188j64325j38242m2514
$$ plain form
10911 -107945 -101564 -115937 -156442 -229049 -342560 -465284 -539486 -508172 -400099 -304649 -239456
10900 -239456 -149706 -5885 174538 386559 604272 738634 753598 701892 637088 596518
10890 596518 580096 515389 343716 148424 43863 68633 175572 263008 307237 319506 317317
10879 317317 334226 347057 307620 239488 159919 22917 -141957 -233736 -249730 -238842 -207663
10868 -207663 -150482 -101197 -107494 -167633 -230925 -229620 -124187 57516 204469 253682 248240
10857 248240 214317 115486 -35731 -177034 -223744 -137531 -17357 42499 57521 49092 -26963
10846 -26963 -205412 -423673 -569234 -593711 -519939 -425701 -316293 -178714 -86875 -61789 -47460
10835 -47460 -26392 -63164 -158726 -234602 -256189 -270474 -309814 -346760 -334260 -319588 -365257 -437960
$$ packed form
10911a07945O381j4373m0505p2607j13511j22724p4202L1314J08073R5450O5193
10900b39456Q9750J43821J80423K12021K17713J34362J4964n1706o4804m0570
10890E96518j6422o4707j71673j95292j04561K4770J06939Q7436M4229J2269k189
10879C17317J6909J2831l9437o8132p9569j37002j64874r1779j5994J0888L1179
10868b07663N7181M9285o297o0139o3292J305J05433J81703J46953M9213n442
10857B48240l3923r8831j51217j41303m6710Q6213J20174N9856J5022q429p6055
10846b6963j78449k18261j45561k4477P3772R4238J09408J37579R1839K5086J4329
10835d7460K1068l6772r5562p5876k1587j4285l9340l6946J2500J4672m5669p2703
$$ plain form
10823 -437960 -486241 -527381 -634482 -783915 -882571 -895879 -853053 -793125 -749578 -746147 -787270
10812 -787270 -830007 -839482 -835358 -850691 -922069 -1010041 -1040165 -1018021 -964666 -870579 -779616 -734313
10800 -734313 -686702 -608381 -513237 -412976 -339874 -302728 -283805 -309581 -383828 -469062 -486651
10789 -486651 -357680 -163586 -64122 -98128 -182928 -218809 -172961 -115146 -118421 -139850 -129422
10778 -129422 -38709 122126 209151 97443 -135319 -322593 -411310 -399527 -338469 -312382 -297976
10767 -297976 -234220 -105664 53064 192695 250032 172427 -21911 -255589 -439141 -532425
10757 -532425 -543392 -494821 -448684 -456180 -490697 -493971 -429089 -296559 -154732 -120113 -214941
10746 -214941 -360382 -458199 -456843 -400419 -364128 -374039 -386851 -367238 -325068 -258318 -158365 -80055
$$ packed form
10823d37960m8281m1140j07101j49433r8656j3308M2826N9928M3547L431m1123
10812g87270m2737r475M124j5333p1378q7972l0124K2144N3355R4087R0963M5303
10800g34313M7611P8321R5144J00261P3102L7146J8923k5776p4247q5234j7589
10789d86651J28971J94094R9464l4006q4800l5881M5848N7815l275k1429J0428
10778a29422R0713J60835Q7025j11708k32762j87274q8717J1783O1058K6087J4406
10767b97976O3756J28556J58728J39631N7337p7605j94338k33678j83552r3284
10757e32425j0967M8571M6137p496l4517l274O4882J32530J41827L4619r4828
10746b14941j45441r7817J356N6424L6291r911j2812J9613M2170O6750R9953P8310
$$ plain form
10734 -80055 -111076 -278587 -517199 -689714 -749888 -705235 -575537 -429980 -319970 -249716
10724 -249716 -200628 -182890 -188233 -152103 -51667 103617 293244 424445 457405 473044 499211
10713 499211 458971 327044 169736 94985 173688 338901 437705 404815 311736 248380 255465
10702 255465 309256 354799 398524 449490 487044 459479 360266 277902 266933 302364 368496
10691 368496 430708 450957 404616 315565 263738 291948 329467 303835 215696 58041 -142793
10680 -142793 -331550 -444210 -432026 -317719 -156741 -16274 40173 -22850 -184711 -391627
10670 -391627 -576921 -644264 -591760 -529951 -502676 -417503 -281293 -186529 -150344 -159021 -217324
10659 -217324 -327887 -431451 -488797 -533167 -583334 -638146 -672641 -637220 -554264 -496245 -437948
$$ packed form
10734h0055l1021j67511k38612j72515o0174M4653J29698J45557J10010P0254
10724b49716M9088J7738n343L6130J00436J55284J89627J31201L2960J5639K6167
10713D99211m0240j31927j57308p4751P8703J65213R8804l2890r3079o3356P085
10702B55465N3791M5543M3725N0966L7554k7565r9213q2364j0969L5431O6132
10691C68496O2212K0249m6341q9051n1827K8210L7519k5632q8139j57655k00834
10680a42793j88757j12660J2184J14307J60978J40467N6447o3023j61861k06916
10670c91627j85294o7343N2504O1809K7275Q5173J36210R4764L6185q677n8303
10659b17324j10563j03564n7346m4370n0167n4812l4495L5421Q2956N8019N8297
$$ plain form
10648 -437948 -323971 -188467 -128279 -177516 -264720 -315324 -301416 -242387 -182025 -148063 -142162
10637 -142162 -195637 -316018 -435923 -506493 -515058 -459826 -375701 -319694 -284276 -222386 -150391
10626 -150391 -129666 -174456 -258597 -379349 -529597 -688152 -790819 -803656 -754135 -648820
10616 -648820 -543203 -467431 -354021 -172276 10548 131873 180625 167761 101556 -540
10606 -540 -104546 -151713 -132842 -109803 -126837 -204422 -319219 -380379 -337196 -251240 -246089 -370854
10594 -370854 -570580 -761969 -851656 -799046 -617816 -336238 -54826 96849 78285 -49217
10584 -49217 -186286 -257732 -252351 -244869 -287966 -342518 -352206 -350601 -418564 -578250 -761713 -883627
10572 -883627 -933970 -899926 -761231 -605808 -495239 -400410 -293593 -160192 -49593 3477
$$ packed form
10648d37948J13977J35504O0188m9237q7204n0604J3908N9029O0362L3962N901
10637a42162n3475j20381j19905p0570q565N5232Q4125N6007L5418O1890P1995
10626a50391K0725m4790q4141j20752j50248j58555j02667j2837M9521J05315
10616f48820J05617P5772J13410J81745J82824J21325M8752j2864o6205j02096
10606e40j04006m7167J8871K3039j7034p7585j14797o1160M3183Q5956N151j24765
10594c70854j99726j91389q9687N2610J81230K81578K81412J51675j8564j27502
10584d9217j37069p1446N381P482m3097n4552r688J605o7963j59686j83463j21914
10572h83627n0343L4044J38695J55423J10569R4829J06817J33401J10599N3070
$$ plain form
10562 3477 44019 73078 71307 68337 70133 44527 -25108 -134707 -228509 -247384 -195482 -158026
10550 -158026 -216665 -254133 -159837 -39934 31093 60016 54720 91996 204296 313294 339700
10539 339700 336637 410866 492880 456214 324067 185896 120901 168122 303033 462087 589266
10528 589266 619746 533270 406942 296691 179587 54623 -67922 -166577 -201930 -183689
10518 -183689 -122408 -5553 136447 235385 236133 132496 8894 -65689 -144120 -259083 -400553
10507 -400553 -536684 -595212 -588679 -562966 -516049 -473701 -442668 -389007 -304623 -208615 -133463
10496 -133463 -92050 -15180 158722 356686 476723 483086 404941 335024 341171 381543 437202
10485 437202 530630 579942 542634 508794 522571 554611 589383 625862 664662 672663 568683
$$ packed form
10562C477M0542K9059j771k970J796k5606o9635j09599r3802j8875N1902L7456
10550a58026n8639l7468R4296J19903P1027K8923n296L7276J12300J08998K6406
10539C39700l063P4229Q2014l6666j32147j38171o4995M7221J34911J59054J27179
10528E89266L0480q6476j26328j10251j17104j24964j22545r8655l5353J8241
10518a83689O1281J16855J42000R8938P48j03637j23602p4583p8431j14963j41470
10507d00553j36131n8528O533K5713M6917M2348L1033N3661Q4384R6008P5152
10496a33463M1413P6870J73902J97964J20037O363p8145o9917O147M0372N5659
10485D37202R3428M9312l7308l3840J3777L2040L4772L6479L8800Q001j03980
$$ plain form
10474 568683 373463 201563 133428 156532 173150 112548 -31355 -202621 -321361 -358232
10464 -358232 -330234 -272214 -243087 -292022 -376744 -414512 -391728 -368978 -389334 -418514 -417064 -410023
10452 -410023 -427178 -441274 -415706 -388727 -379960 -356150 -280868 -138741 43447 208150 312232
10441 312232 366991 410238 464512 514857 520738 479275 422026 396893 434681 479741 466338 435725
10429 435725 435692 504375 655285 797926 874188 916110 958678 975163 932343 816281 613442
10418 613442 362669 135058 -19388 -91704 -108188 -93372 -61458 -23366 -4902 -24681 -115554
10407 -115554 -283448 -428575 -471327 -439687 -390372 -351945 -337578 -355965 -397496 -417045 -364737
10396 -364737 -241929 -71730 101963 218316 274824 324329 377924 381772 273967 74373
$$ packed form
10474E68683j95220j71900o8135K3104J6618o0602j43903j71266j18740l6871
10464c58232K7998N8020K9127m8935q4722l7768K2784K2750k0356k9180J450P041
10452d10023j7155j4096K5568K6979Q767K3810P5282J42127J82188J64703J04082
10441C12232N4759M3247N4274N0345N881m1463n7249k5133L7788M5060j3403l0613
10429D35725l3O8683J50910J42641P6262M1922M2568J6485m2820j16062k02839
10418F13442k50773k27611j54446p2316j6484J4816L1914L8092J8464j9779r0873
10407a15554j67894j45127m2752L1640M9315L8427J4367j8387m1531j9549N2308
10396c64737J22808J70199J73693J16353N6508M9505N3595L848j07805j99594
$$ plain form
10386 74373 -121976 -219775 -137679 106354 419154 683813 752389 581969 297878 54535
10376 54535 -93548 -171306 -199694 -190793 -161658 -113587 -49555 3213 -91 -63949 -142774 -186819
10364 -186819 -207582 -233461 -270729 -286768 -270389 -268621 -328319 -431902 -534756 -618999 -657700
10353 -657700 -651403 -649053 -664703 -626111 -481838 -302990 -168159 -66194 32594 81709 47283
10342 47283 -10779 -20128 51496 184447 296750 346008 378623 425546 453566 467495 519108
10331 519108 601275 679569 702505 641037 492358 269177 46664 -85656 -90068 -24935 2485
10320 2485 -51853 -133048 -213690 -333513 -492986 -591299 -558873 -480689 -443605 -415389 -317135
10309 -317135 -168928 -47966 51378 119817 112387 52472 -31577 -114889 -160598 -159398 -180327
$$ packed form
10386G4373j96349r7799Q2096K44033L12800K64659O8576j70420k84091k43343
10376E4535j48083p7758k8388Q901K9135M8071O4032N2768l304o3858p8825m4045
10364a86819k0763k5879l7268j6039J6379J768n9698j03583j02854q4243l8701
10353f57700O297K350j5650L8592J44273J78848J34831J01965R8788M9115l4426
10342D7283n8062r349P1624J32951J12303M9258L2615M6923K8020J3929N1613
10331E19108Q2167P8294K2936o1468j48679k23181k22513j32320m412O5133K7420
10320B485n4338q1195q0642j19823j59473r8313L2426P8184L7084K8216R8254
10309c17135J48207J20962R9344O8439p430n9915q4049q3312m5709J200k0929
$$ plain form
10298 -180327 -305734 -479724 -523740 -370268 -124197 86943 240501 350148 353756 248335
10288 248335 119423 -14929 -146230 -229692 -269035 -274113 -256671 -238573 -206826 -162011 -132466
10277 -132466 -162914 -284442 -449382 -557228 -568980 -548311 -509245 -426494 -329677 -240935 -166723
10266 -166723 -122342 -107560 -105388 -134247 -178579 -199702 -233206 -292526 -323599 -350044 -412993 -479135
10254 -479135 -486355 -398914 -299861 -299380 -392204 -490396 -555213 -580267 -534117 -432774 -318987 -239915
10242 -239915 -228222 -259949 -262904 -211420 -150749 -108455 -73664 -80272 -180366 -332960 -425470
10231 -425470 -420679 -340467 -212488 -88730 -27593 -13495 -3064 4198 -16182 -80036 -149595
10220 -149595 -139346 2198 210142 351130 340923 225335 65104 -88821 -177064 -187835
$$ packed form
10298a80327j25407j73990m4016J53472K46071K11140J53558J09647L608j05421
10288B48335j28912j34352j31301q3462l9343n078J7442J8098L1747M4815K9545
10277a32466l0448j21528j64940j07846j1752K0669L9066Q2751R6817Q8742P4212
10266a66723M4381J4782K172k8859m4332k1123l3504n9320l1073k6445o2949o6142
10254d79135p220Q7441R9053M81r2824r8192o4817k5054M6150J01343J13787P9072
10242b39915J1693l1727k955N1484O0671M2294L4791o608j00094j52594r2510
10231d25470M791Q0212J27979J23758O1137J4098J0431P262k0380o3854o9559
10220a49595J0249J41544K07944J40988j0207j15588j60231j53925q8243j0771
$$ plain form
10210 -187835 -172458 -178115 -137887 -18303 91506 126516 105385 71680 69254 102150 142330
10199 142330 173900 192121 164639 83642 4272 -37181 -99841 -161452 -170314 -181704 -231312 -305550
10187 -305550 -385255 -483830 -585536 -616670 -555803 -454322 -362893 -291781 -228810 -206482 -242651
10176 -242651 -295154 -311567 -284456 -229383 -168646 -122514 -81983 -62367 -110770 -227741 -301210
10165 -301210 -261366 -172945 -106374 -129699 -271339 -489572 -712673 -857846 -886139 -855260 -842216
10154 -842216 -888474 -970231 -1017684 -973920 -820091 -596693 -411787 -305452 -234639 -170489 -77472
10143 -77472 65868 210122 304765 332743 353493 411000 461839 485406 514462 533657 509473
10132 509473 445996 392615 341471 254401 144431 41653 -21726 -54046 -57824 -22257 33812
$$ packed form
10210a87835J5377n657M0228J19584J09809L5010k1131l3705k426L2896M0180
10199A42330L1570J8221k7482q0997p9370m1453o2660o1611q862j1390m9608p4238
10187c05550p9705r8575j01706l1134O0867J01481R1429P1112O2971K2328l6169
10176b42651n2503j6413K7111N5073O0737M6132M0531J9616m8403j16971p3469
10165c01210L9844Q8421O6571k3325j41640k18233k23101j45173k8293L0879J3044
10154h42216m6258q1757m7453M3764J53829K23398J84906J06335P0813O4150R3017
10143g7472J43340J44254R4643K7978K0750N7507N0839K3567K9056J9195k4184
10132E09473o3477n3381n1144q7070j09970j02778o3379l2320l778L5567N6069
$$ plain form
10121 33812 129138 290101 460476 599382 716918 801172 795619 691381 558027 407981
10111 407981 234015 89551 -22228 -90567 -100215 -110594 -108781 -59375 3267 44020 59138
10100 59138 20693 -67375 -139758 -204040 -272819 -307134 -279306 -193724 -123508 -141995 -249693
10089 -249693 -419305 -601807 -728532 -711417 -566555 -395737 -168975 122179 380021 567611
10079 567611 669753 644342 503152 305033 98127 -26348 -54538 -95725 -156169 -173776
10069 -173776 -177885 -250235 -394341 -499787 -516023 -471129 -424136 -421335 -415636 -352946 -286045 -288450
10057 -288450 -348937 -419858 -491800 -551685 -572378 -531156 -425613 -258168 -65633 60217 68214
10046 68214 -8244 -113165 -234345 -388068 -551126 -616448 -515668 -298268 -74620 45104
$$ packed form
10121C3812R5326J60963J70375J38906J17536Q4254n553j04238j33354j50046
10111D07981j73966j44464j11779o8339r648j0379J813M9406O2642M0753J5118
10100E9138l8445q8068p2383o4282o8779l4315K7828Q5582P0216j8487j07698
10089b49693j69612j82502j26725J7115J44862J70818K26762K91154K57842J87590
10079E67611J02142k5411j41190j98119k06906j24475k8190m1187o0444j7607
10069a73776m109p2350j44106j05446j6236M4894M6993K801N699O2690O6901k405
10057b88450o0487p0921p1942n9885k0693M1222J05543J67445J92535J25850P997
10046F8214p6458j04921j21180j53723j63058o5322J00780K17400K23648J19724
$$ plain form
10036 45104 27685 -60935 -128309 -152024 -155807 -182453 -258558 -367851 -481935 -551940 -522782
10025 -522782 -384049 -235439 -172104 -167842 -123832 -37042 26702 94018 187199 326828 521459
10014 521459 708443 807479 742757 582144 464322 439787 438918 378545 243355 68980 -83914
10003 -83914 -202525 -331778 -469296 -567778 -634584 -691267 -712785 -722531 -758420 -763706 -737313
9992 -737313 -712693 -644394 -498602 -302428 -120349 -12944 23050 16972 1123 -26535 -106541
9981 -106541 -224294 -314746 -366644 -437606 -528440 -588232 -622035 -634153 -630539 -616847 -595850 -594195
9969 -594195 -652263 -789365 -953030 -1021646 -942471 -768817 -595006 -467466 -335212 -186036
9959 -186036 -32487 132048 250798 249981 132403 2284 -40016 -4832 35094 26583 -13341
$$ packed form
10036D5104j7419q8620o7374k3715l783k6646p6105j09293j14084p0005K9158
10025e22782J38733J48610O3335M262M4010Q6790O3744O7316R3181J39629J94631
10014E21459J86984R9036o4722j60613j17822k4535q69o0373j35190j74375j52894
10003h3914j18611j29253j37518r8482o6806n6683k1518r746l5889n286K6393
9992g37313K4620O8299J45792J96174J82079J07405L5994o078j5849k7658q0006
9981a06541j17753r0452n1898p0962r0834n9792l3803j2118L614J3692K0997J655
9969e94195n8068j37102j63665o8616P9175J73654J73811J27540J32254J49176
9959a86036J53549J64535J18750q17j17578j30119m2300L5184L9926q511l9924
$$ plain form
9948 -13341 -42464 -69658 -113182 -166863 -233925 -311654 -415719 -537864 -600856 -554948 -463725
$$ packed form
9948a3341k9123k7194m3524n3681o7062p7729j04065j22145o2992M5908R1223
$$ [...]
##END NTUPLES=NMR SPECTRUM
##END=
