##TITLE=C13_SR-167-R2K-AK
 D2O,22100 sc

 1.8.2023
##JCAMPDX= 6.0         $$ Bruker NMR JCAMP-DX V2.0
##DATA TYPE= NMR SPECTRUM
##DATA CLASS= NTUPLES
##ORIGIN= UXNMR, Bruker Analytische Messtechnik GmbH
##OWNER= root
$$ XWIN-NMR		Version 3.5
$$ Wed Aug  2 13:41:56 2023 Russian Standard Time (UT+4h)  she@DPX200
##.OBSERVE FREQUENCY= 50.327896
##.OBSERVE NUCLEUS= ^13C
##.ACQUISITION MODE= SIMULTANEOUS
##.ACQUISITION SCHEME= undefined
##.AVERAGES= 22101
##.DIGITISER RES= 17
##SPECTROMETER/DATA SYSTEM= spect
##.PULSE SEQUENCE= zgpg30
##.SOLVENT NAME= DMSO
##.SHIFT REFERENCE= (INTERNAL, DMSO, 0, 222.624)
##AUDIT TRAIL= $$ (NUMBER, WHEN, WHO, WHERE, WHAT)
$$ ##TITLE= Audit trail, XWIN-NMR		Version 3.5
$$ ##JCAMPDX= 5.01
$$ ##ORIGIN= Bruker BioSpin GmbH
$$ ##OWNER= she
$$ F:/spectra/data/she/nmr/c13/1/pdata/1/auditp.txt
$$ ##AUDIT TRAIL=  $$ (NUMBER, WHEN, WHO, WHERE, WHAT)
(   1,<2023-08-02 13:40:08.04 +0400>,<she>,<DPX200>,
      <created by zg, POWCHK disabled, PULCHK disabled
       terminated by command 'halt'
       configuration hash MD5:
       00 E9 B6 7A A2 85 ED C7 34 08 36 98 17 FE 4E 26
       data hash MD5: 32K
       C6 DA 7D 13 D0 C8 06 91 AD EA 5C 52 07 79 B4 EB>)
(   2,<2023-08-02 13:40:13.10 +0400>,<she>,<DPX200>,
      <Start of raw data processing
       efp BC_mod = 2 LB = 2 FT_mod = 6 PKNL = 1 PHC0 = -393.7331 PHC1 = 41.33753 SI = 32K 
       data hash MD5: 32K
       EF 1E F7 9F C8 10 C3 1C E3 6F CC 25 89 23 DA 72>)
(   3,<2023-08-02 13:40:19.95 +0400>,<she>,<DPX200>,
      <abs ABSG = 5 
       data hash MD5: 32K
       1E AD D4 B4 DF 85 6D 5B FA FE D6 AA A9 EE F0 66>)
(   4,<2023-08-02 13:41:01.43 +0400>,<she>,<DPX200>,
      <pk PHC0 = 14.77606 PHC1 = -19.4 
       data hash MD5: 32K
       5E A2 C7 6C B4 E4 6A F2 10 71 3E 54 68 17 39 33>)
(   5,<2023-08-02 13:41:04.96 +0400>,<she>,<DPX200>,
      <abs ABSG = 5 
       data hash MD5: 32K
       17 6C 2C A9 0E A6 02 EE DD FF FB 12 EE 3A E4 55>)
$$ ##END=
$$ 
$$ hash MD5
$$ C2 D8 31 01 64 26 C0 B1 BB 21 D0 21 24 17 70 43
##$RELAX= 
##$RELAX= 
##$RELAX= 
##$RELAX= 
##$RELAX= 
##$RELAX= 
##$RELAX= 
##$RELAX= 
$$ Bruker specific parameters
$$ --------------------------
##$DU= <F:/spectra>
##$EXPNO= 1
##$NAME= <c13>
##$PROCNO= 1
##$TYPE= <nmr>
##$USER= <she>
##$AMP= (0..31)
100 100 100 100 100 100 100 100 100 100 100 100 100 100 100 100 100 100 
100 100 100 100 100 100 100 100 100 100 100 100 100 100 
##$AQSEQ= 0
##$AQ_mod= 1
##$AUNM= <au_zg>
##$AUTOPOS= <>
##$BF1= 50.322709
##$BF2= 200.13
##$BF3= 50.322709
##$BF4= 500.13
##$BF5= 500.13
##$BF6= 500.13
##$BF7= 500.13
##$BF8= 500.13
##$BYTORDA= 1
##$CFDGTYP= 0
##$CFRGTYP= 5
##$CHEMSTR= <none>
##$CNST= (0..31)
1 1 145 1 1 1 1 1 1 1 1 1 1 1 1 1 1 1 1 1 1 1 1 1 1 1 1 1 1 1 1 1 
##$CPDPRG= <waltz16>
##$CPDPRG1= <>
##$CPDPRG2= <waltz16>
##$CPDPRG3= <>
##$CPDPRG4= <mlev>
##$CPDPRG5= <mlev>
##$CPDPRG6= <mlev>
##$CPDPRG7= <mlev>
##$CPDPRG8= <mlev>
##$CPDPRGB= <>
##$CPDPRGT= <>
##$D= (0..31)
$$ [...]
##$SUBNAM4= <"">
##$SUBNAM5= <"">
##$SUBNAM6= <"">
##$SUBNAM7= <"">
##$SUBNAM8= <"">
##$SUBNAM9= <"">
##$SW= 239.972175391363
##$SWIBOX= (0..15)
0 1 3 0 0 0 0 0 0 0 0 0 0 0 0 0 
##$SW_h= 12077.2946859903
##$TD= 32768
##$TD0= 1
##$TE= 0
##$TE2= 300
##$TE3= 300
##$TEG= 300
##$TL= (0..7)
120 120 120 120 120 120 120 120 
##$TP= (0..7)
150 150 150 150 150 150 150 150 
##$TP07= 0
##$TPNAME0= <>
##$TPNAME1= <>
##$TPNAME2= <>
##$TPNAME3= <>
##$TPNAME4= <>
##$TPNAME5= <>
##$TPNAME6= <>
##$TPNAME7= <>
##$TPOAL= (0..7)
0.5 0.5 0.5 0.5 0.5 0.5 0.5 0.5 
##$TPOFFS= (0..7)
0 0 0 0 0 0 0 0 
##$TUNHIN= 0
##$TUNHOUT= 0
##$TUNXOUT= 0
##$USERA1= <user>
##$USERA2= <user>
##$USERA3= <user>
##$USERA4= <user>
##$USERA5= <user>
##$V9= 5
##$VALIST= <valist>
##$VCLIST= <CCCCCCCCCCCCCCC>
##$VD= 0
##$VDLIST= <DDDDDDDDDDDDDDD>
##$VPLIST= <PPPPPPPPPPPPPPP>
##$VTLIST= <TTTTTTTTTTTTTTT>
##$WBST= 1024
##$WBSW= 4
##$XGAIN= (0..3)
0 0 0 0 
##$XL= 0
##$YL= 0
##$YMAX_a= 105358818
##$YMIN_a= -31807213
##$ZGOPTNS= <>
##$ZL1= 120
##$ZL2= 120
##$ZL3= 120
##$ZL4= 120
##$ABSF1= 222.624
##$ABSF2= -17.3728
##$ABSG= 5
##$ABSL= 3
##$ALPHA= 0
##$AQORDER= 0
##$ASSFAC= 0
##$ASSFACI= 0
##$ASSFACX= 0
##$ASSWID= 0
##$AUNMP= <proc_1d>
##$AZFE= 0.1
##$AZFW= 0.5
##$BCFW= 0
##$BC_mod= 2
##$BYTORDP= 0
##$COROFFS= 0
##$CY= -3
##$DATMOD= 1
##$DC= 0
##$DFILT= <>
##$DTYPP= 0
##$F1P= 0
##$F2P= 0
##$FCOR= 0.5
##$FTSIZE= 32768
##$FT_mod= 6
##$GAMMA= 0
##$GB= 0
##$INTBC= 1
##$INTSCL= 4.134877e-10
##$ISEN= 128
##$LB= 2
##$LEV0= 0
##$LPBIN= 0
##$MAXI= 10000
##$MC2= 0
##$MEAN= 0
##$ME_mod= 0
##$MI= 0.1934396
##$NCOEF= 0
##$NC_proc= 0
##$NLEV= 6
##$NOISF1= 120.0001
##$NOISF2= 80.00006
##$NSP= 0
##$NTH_PI= 0
##$NZP= 0
##$OFFSET= 222.624
##$PC= 1.4
##$PHC0= -378.957
##$PHC1= 21.93753
##$PH_mod= 1
##$PKNL= yes
##$PPARMOD= 0
##$PSCAL= 0
##$PSIGN= 0
##$REVERSE= no
##$SF= 50.3227315983092
##$SI= 32768
##$SIGF1= 140
##$SIGF2= 120
##$SINO= 11.81781
##$SIOLD= 32768
##$SREGLST= <13C.CDCl3>
##$SSB= 0
##$STSI= 32768
##$STSR= 0
##$SW_p= 12077.2946859903
##$SYMM= 0
##$S_DEV= 0
##$TDeff= 32768
##$TDoff= 0
##$TI= <>
##$TILT= no
##$TM1= 0
##$TM2= 0
##$TOPLEV= 0
##$USERP1= <user>
##$USERP2= <user>
##$USERP3= <user>
##$USERP4= <user>
##$USERP5= <user>
##$WDW= 1
##$XDIM= 32768
##$YMAX_p= 363549261
##$YMIN_p= -6828641
$$ End of Bruker specific parameters
$$ ---------------------------------
##NTUPLES= NMR SPECTRUM
##VAR_NAME=  FREQUENCY,     SPECTRUM/REAL,   SPECTRUM/IMAG
##SYMBOL=    X,             R,               I
##VAR_TYPE=  INDEPENDENT,   DEPENDENT,       DEPENDENT
##VAR_FORM=  AFFN,          ASDF,            ASDF
##VAR_DIM=   32768,         32768,           32768
##UNITS=     HZ,            ARBITRARY UNITS, ARBITRARY UNITS
##FACTOR=    0.368581032318806, 1,           1
##FIRST=     11203.0474430531, 0,            0
##LAST=      -874.247242937185, 0,           0
##MIN=       -874.247242937185, -6828641,    0
##MAX=       11203.0474430531, 363549261,    0
$$ Real data points
##PAGE= N=1
##DATA TABLE= (X++(R..R)), XYDATA
$$ [...]
22804A996896L061K1297k26185m19393l34469O0988L78456L13938j21619l24455
22794A348515j55145j30642l7864K53692N13539M63016R4195k37974l98947n11185
22784A201200n71268n87275n09318m17730l08637j6376K03086M1594o9345J89070
22774h44999M50076M39984N54881Q21659P90782N18769K25631q347k27152l27405
22764B393879l10065k91571l51363n42719p66811q44952m86881J11643N18996
22755e69844N12905J34379l14133n63563n79601k62407K83385P11285N96711J75713
22745A24830L7223J16305J60505K19408L20829K45297O5311k06502p00360j096024
22735g13178r08299l60779L8663J36589J03269R2662M1228n0496j36914l65447
$$ plain form
22804 1996896 1999957 2021254 1795069 1375676 1041207 1102195 1480651 1794589 1672970 1348515
22794 1348515 1193370 1062728 1024864 1278556 1792095 2255111 2349306 2111332 1712385 1201200
22784 1201200 629932 42657 -466661 -884391 -1193028 -1209404 -1006318 -964724 -1034069 -844999
22774 -844999 -394923 45061 599942 1421601 2212383 2731152 2956783 2948436 2721284 2393879
22764 2393879 2083814 1792243 1440880 898161 131350 -713602 -1200483 -1088840 -569844
22755 -569844 -56939 77440 -236693 -800256 -1379857 -1642264 -1358879 -647594 -50883 124830
22745 124830 162053 278358 438863 658271 979100 1224397 1289708 1083206 382846 -713178
22735 -713178 -1621477 -1982256 -1943593 -1807004 -1703735 -1611073 -1569845 -1620341 -1757255 -2122702
22725b122702n64497m76461k23190K30261Q94617J280867R87914M33188N4624
22716D94621k02020k88430k9773K90747K00354J7248J76084P4524l22850l42217
22706F8288j27365J0665L04355M98473J62106l10571l50268n1675J80626J79349
22696E63983q996j73894k49858l09796k49206o6665J176j29477j57892R9231M63812
22685b17582O91191O00001K33557j74920n49755o51890m92018m43188m58192l92795
22675a855591l02896k74305k25643k12563k21445k9896L69886N42189L99219J15930
22665a695115q5611j02389r7531r9296l5162K0992j72721l27842j28419L44908
22655b378186Q76742J036934P99675M71403K52258P3768k24575n47519o32272
$$ plain form
22725 -2122702 -2687199 -3163660 -3386850 -3156589 -2261972 -981105 6809 439997 494621
22716 494621 292601 4171 -25602 265145 465499 482747 658831 733355 410505 68288
22706 68288 -59077 -48412 255943 754416 916522 605951 255683 204008 384634 563983
22696 563983 554987 381093 131235 -178561 -427767 -494432 -493256 -622733 -780625 -681394 -217582
22685 -217582 473609 1073610 1307167 1132247 582492 -69398 -561416 -1004604 -1462796 -1855591
22675 -1855591 -2158487 -2432792 -2658435 -2870998 -3092443 -3122339 -2752453 -2210264 -1811045 -1695115
22665 -1695115 -1780726 -1883115 -1980646 -2079942 -2115104 -2094112 -2266833 -2594675 -2723094 -2378186
22655 -2378186 -1501444 -464510 335165 806568 1058826 1132594 908019 360500 -271772
22646b71772m63647k26760j92621k69795k77491n16925p18911l00137M38933Q55212
22636a943914Q85618R04567Q08013K93695j74734q8915M08714P35894N92921K14697
22626B636556j39659k39671k65062m55442o11625o11877m39783j80030Q1256L19766
22616I4429N17777M55605O3078k65505k98058k13275j28917o6079j87996m26447
22606d55388n11606m73024m59924k69465Q8796K06814j8557k37351p7342R6466
22596b110581j38245m89309n18928K6203P54674Q65853K71451k57980l00044q0892
22586a977798K20641M18167L33001O8872l8519J37340J83526m4933k24402k04599
22576a128704J20622N55239O47243M25382K23188K2872j37851j25955l26140n58282
$$ plain form
22646 -271772 -735419 -962179 -1154800 -1424595 -1702086 -2219011 -2937922 -3238059 -2799126 -1943914
22636 -1943914 -1058296 -153729 654284 947979 773245 684330 1093044 1828938 2421859 2636556
22626 2636556 2496897 2257226 1992164 1536722 925097 313220 -126563 -306593 -225337 94429
22616 94429 612206 1067811 1130889 865384 567326 354051 225134 159055 -28941 -455388
22606 -455388 -966994 -1440018 -1899942 -2169407 -2080611 -1873797 -1892354 -2129705 -2207047 -2110581
22596 -2110581 -2248826 -2738135 -3257063 -3230860 -2476186 -1610333 -1338882 -1596862 -1896906 -1977798
22586 -1977798 -1757157 -1338990 -1005989 -937117 -975636 -838296 -654770 -699703 -924105 -1128704
22576 -1128704 -1008082 -452843 194400 619782 842970 865842 727991 602036 275896 -282386
22566b82386l95016O1583M01518M06101M42541M55322J51392l46767p01419o94110
22556e01241m07000l04631j49021L35083N58202L15695j6234j20309j97612l03849
22546g90917j91447R5239K01145L737r9304O9077L02795N59474O59458N42767
22536A352024L83401M0667o20507j245943j267671o55101J24954N39710M21812
22527i26654O1509m85810q83933o18915J78283Q05568J013524Q50009M42291R7819
22517E33691j13517j2995L54208P60426P12602K00873l8567K12389L83797K8107
22507C021014n46272q04615p13896o34838q52847r83112p70978o31983n65775
22498c483302m40891j29869M09039Q31919O72057J31873k25924l09939j32252
$$ plain form
22566 -282386 -677402 -615819 -214301 191800 634341 1089663 1241055 894288 192869 -501241
22556 -501241 -908241 -1212872 -1361893 -1026810 -468608 -152913 -169147 -289456 -487068 -790917
22546 -790917 -982364 -887125 -685980 -682243 -781547 -712470 -409675 149799 809257 1352024
22536 1352024 1735425 1776092 1155585 -90358 -1358029 -2013130 -1888176 -1348466 -926654
22527 -926654 -865145 -1350955 -2234888 -2853803 -2675520 -1869952 -856428 -6419 435872 533691
22517 533691 420174 407179 761387 1521813 2234415 2435288 2396721 2609110 2992907 3021014
22507 3021014 2474742 1670127 956231 321393 -531454 -1514566 -2285544 -2917527 -3483302
22498 -3483302 -3924193 -4054062 -3645023 -2813104 -2141047 -2009174 -2235098 -2545037 -2677289
22489b677289L65662Q41858J025884O29061p0126n01010n78484l90064j72114
22480a526622j6337O3165J91381L90631N46189N52334L37623J44726J10894P8198
22470H72182r020j79426l88076m84333k96589J2082J82281J92791m9278l61374
22460e08760l75049q5810L47199O22176N58904N66032P52819O59189L03726j1106
22450B829320l1875J24352M8736l30809m70052j47128N2991p1816j34366m3781
22440A825572Q7334L03569M05048K08936N7488j10799k00776N2368M37872M64476
22430C531088R8145j01122O7876K37658M6112l08728m75839n45840q25421j084004
22420F39925p82336k33734M9862l1312m44727q15942p16752m22741k53875k8880
$$ plain form
22489 -2677289 -2311627 -1469769 -443885 185176 115050 -385960 -964444 -1354508 -1526622
22480 -1526622 -1542959 -1479794 -1288413 -897782 -351593 200741 538364 683090 793984 872182
22470 872182 863162 683736 295660 -188673 -485262 -473180 -290899 -98108 -147386 -508760
22460 -508760 -883809 -969619 -622420 -244 558660 1124692 1877511 2536700 2840426 2829320
22450 2829320 2797445 2921797 2970533 2639724 2169672 2022544 2075535 2003719 1869353 1825572
22440 1825572 1912906 2216475 2621523 2830459 2887947 2777148 2576372 2628740 3066612 3531088
22430 3531088 3629233 3528111 3595987 3833645 3879757 3571029 3095190 2549350 1723929 639925
22420 639925 -142411 -376145 -326283 -357595 -802322 -1618264 -2335016 -2757757 -3011632 -3040512
22410c040512K66003K95804m9488k91558m8807K58813J11326m32380q53690q98487
22400d682976o03005J19796Q94015J044786O91917N47851O68718N60943J79030
22391e78925k26923n56109n05309k16611n1566j95506m08554m63311l00263J37352
22381c365725N96700P35678N32910K89706K45650K60775J80311Q8034J98230M05997
22371A68266N65366N15991K07839k74615q03591q90300o65521o05126o35066n21215
22361b937972k18593J26296M42903O85131Q19665Q49545P96352N76107J80696
22352A320130j10685k4773M37545P99136P72299N99637K46394p4975j66197k91476
22342C507035m15504l97540m27194n95431n16689k10916K9710P1483J16575J94556
$$ plain form
22410 -3040512 -2774509 -2478705 -2528193 -2819751 -2868558 -2609745 -2498419 -2930799 -3784489 -4682976
22400 -4682976 -5285981 -5166185 -4272170 -3227384 -2535467 -1987616 -1318898 -757955 -578925
22391 -578925 -805848 -1361957 -1867266 -2083877 -2135443 -2330949 -2739503 -3202814 -3503077 -3365725
22381 -3365725 -2769025 -2033347 -1500437 -1210731 -965081 -704306 -523995 -435961 -237731 168266
22371 168266 733632 1249623 1457462 1182847 379256 -511044 -1176565 -1781691 -2416757 -2937972
22361 -2937972 -3156565 -3030269 -2587366 -1902235 -1082570 -233025 563327 1139434 1320130
22352 1320130 1209445 1184672 1622217 2421353 3193652 3793289 4039683 3964708 3798511 3507035
22342 3507035 3091531 2693991 2266797 1671366 1154677 943761 973471 1044954 1161529 1356085
22332A356085J22311J1073J17912K58492J03076r7682j70812k30604k02051M8969
22322A316769K87139K29989J0567j56667k43886l47772n71439p37941o82411l39571
22312a235223J50399L59848L15265K65679L62393M67623L12017J1853k16779k80044
22302E13031j36340N4775Q7291k4476l4689q0394l78681o04768m45691J32700
22292i17242N94623N08567L05344L33134M19620K44318j77312m94561n59599n81716
22282c24824m67847k23663j03141J7247L64675O88981O75582M56544K09619L8934
22272A332107N9951K05945J43983p6189l38670o01181o08299l05472q0129k0149
22262b88103j1795j08248j83292l6840M2442q6906j51236j43611j21954m2347
$$ plain form
22332 1356085 1478396 1489469 1607381 1865873 1968949 1871267 1700455 1469851 1267800 1316769
22322 1316769 1603908 1833897 1844464 1687797 1443911 1096139 524700 -213241 -895652 -1235223
22312 -1235223 -1084824 -724976 -409711 -144032 218361 685984 998001 1009854 793075 513031
22302 513031 376691 431466 518757 494281 459592 379198 517 -604251 -1049942 -917242
22292 -917242 -322619 185948 491292 824426 1244046 1488364 1311052 816491 256892 -324824
22282 -324824 -792671 -1016334 -1119475 -1102228 -737553 -48572 627010 1083554 1293173 1332107
22272 1332107 1392058 1598003 1741986 1665797 1327127 725946 117647 -187825 -267954 -288103
22262 -288103 -299898 -408146 -591438 -628278 -585836 -672742 -823978 -967589 -1089543 -1131890
22252a131890O9605J68537L44241M61251L47617J90662K16884K59674m2718n75489
22242C08374j048039j205331r41389l82536k0677j88972k86251J90900P44583
22233b829338P25096K74969j13046k91494k32298n4095O9678J66748J37759P2742
22223b073279J91944M10879P05808R51317Q13468L31820p1666j79423N3421L94894
22213A529183L85510K08089K43004M89390O41093M23372n76l31405n78073q84354
22203B125233r99897n71331J70890N45703L13798o5763k20918j60541o0124J5790
22193A092840j7128k21472l78518l00809k06339l60877m84482k97199p4284l605
22183a251873P8707L67041N89899K89660l90858p39853o49189l92552o9750J40724
$$ plain form
22252 -1131890 -1062285 -893748 -549507 -88256 259361 450023 666907 926581 883863 308374
22242 308374 -739665 -1944996 -2886385 -3268921 -3289598 -3478570 -3764821 -3573921 -2829338
22233 -2829338 -2104242 -1829273 -1942319 -2233813 -2466111 -2520206 -2450528 -2283780 -2146021 -2073279
22223 -2073279 -1881335 -1470456 -764648 186669 1000137 1331957 1260291 1080868 1134289 1529183
22213 1529183 1914693 2122782 2365786 2855176 3496269 3919641 3919065 3587660 3009587 2125233
22203 2125233 1125336 554005 724895 1270598 1584396 1518633 1297715 1137174 1077050 1092840
22193 1092840 1075712 854240 475722 174913 -31426 -392303 -876785 -1173984 -1248268 -1251873
22183 -1251873 -1173166 -806125 -216226 73434 -317424 -1057277 -1706466 -2099018 -2168768 -2028044
22173b028044J06775m3717j09815M3454L15047M66231M35234L73914L12907K5339
22163a02675k66620m31986n33757j12739O26844R73263R81718O99650L03039k1291
22153B115446m17910p69073p78315l61228K44306L75818K76666N51135O85568
22144A922413L24387j25330l14501l44580m37037o60009p28454l24761K89395
22135c98477O07773M28047j07478o48376r65861j040536o07485k6650J01086j20555
22125b778512l00361k42874j6309J64724K26609K40756K20704K70764N15840Q87485
22115h11174J072157R22440N59175J48744k99651n35886n72633o67048o17075
22106h00951l16084j26428j9295K11225M23803M29678L10132K53008K66500J94436
$$ plain form
22173 -2028044 -1921269 -1964986 -2074801 -2031347 -1716300 -1250069 -814835 -440921 -128014 -102675
22163 -102675 -369295 -801281 -1335038 -1447777 -820933 152330 1134048 1833698 2136737 2115446
22153 2115446 1697536 928463 150148 -211080 33226 409044 685710 1236845 1922413
22144 1922413 2246800 2121470 1806969 1462389 1025352 365343 -363111 -687872 -398477
22135 -398477 209296 637343 529865 -118511 -1084372 -2124908 -2732393 -2759043 -2657957 -2778512
22125 -2778512 -3078873 -3321747 -3338056 -3173332 -2946723 -2705967 -2485263 -2214499 -1698659 -811174
22115 -811174 260983 1183423 1742598 1891342 1591691 1055805 483172 -183876 -800951
22106 -800951 -1117035 -1243463 -1262758 -1051533 -627730 -198052 112080 365088 631588 826024
22096H26024n3549k51323k04556r7124n015k2131l07406n29159n30726m82127
22086a657092m10543l64999l91205l85700k44910Q3571L18931K29436M3891j01610
22076b880230k87979l66330r402N36249P86639O66572L85795J8775l82441o43053
22066b175405p37023o12256k76996J06552M23469O77034Q58023P33889K65298
22057g37415m53204j103584j187373r21191p90215p84660n76351j76349R7567
22048f632775K70387O28246J111714J457008J464399J358761J194523R47933Q18817
22039B619013N95735L01292m4415k99686l45973k51681N5893L27329K58112m8066
22029C167553m40032p06583o19812k36820k5165k82669n58274l38774J25727K96549
$$ plain form
22096 826024 772475 521152 316596 219472 214457 192326 -115080 -644239 -1174965 -1657092
22086 -1657092 -2067635 -2432634 -2823839 -3209539 -3454449 -3370878 -3051947 -2822511 -2778620 -2880230
22076 -2880230 -3168209 -3534539 -3543941 -3007692 -2221053 -1554481 -1168686 -1149911 -1532352 -2175405
22066 -2175405 -2912428 -3524684 -3801680 -3695128 -3271659 -2594625 -1736602 -1002713 -737415
22057 -737415 -1190619 -2294203 -3481576 -4402767 -5192982 -5977642 -6553993 -6730342 -6632775
22048 -6632775 -6362388 -5734142 -4622428 -3165420 -1701021 -342260 852263 1800196 2619013
22039 2619013 3214748 3516040 3471625 3171939 2825966 2574285 2630178 2957507 3215619 3167553
22029 3167553 2727521 2020938 1401126 1164306 1139141 856472 298198 -40576 85151 381700
22019C81700J82207L7245k6024o5165O2744M36947N19616K14897R5292J09724
22009A949183J2291k11784m05230k72447J91451N56769O32216M98317K0187o71897
21999B299056j060194q89062n08134k75189j96595j64144j04944J53774L64146
21990c81286J37385l01044n40296m61296j14040K85589L27230Q2856J7982J73688
21980g73232J81922J60735M82891P55304N29319J66617J68508N69958Q47932M90552
21970C580506j0350k04997k08872k23850k02276k20867m85933p87663p29148l30976
21960A75574m0018l593K0884O5788J25871J12199K6180o3875k38420l60910j34763
21949c15083K51509N32210O61555N14368M19366M32970K21262j13149k89324k42840
$$ plain form
22019 381700 563907 601152 575128 509963 572707 1009654 1529270 1744167 1839459 1949183
22009 1949183 1961474 1749690 1344460 1072013 1263464 1820233 2452449 2950766 2970953 2299056
21999 2299056 1238862 349800 -158334 -433523 -630118 -794262 -899206 -745432 -381286
21990 -381286 -243901 -544945 -1085241 -1546537 -1660577 -1374988 -1047758 -964902 -946920 -773232
21980 -773232 -591310 -430575 52316 807620 1336939 1503556 1672064 2242022 3089954 3580506
21970 3580506 3570156 3365159 3156287 2932437 2730161 2509294 2023361 1235698 506550 175574
21960 175574 135556 131963 152847 218635 344506 456705 482885 419010 180590 -180320 -315083
21949 -315083 -63574 468636 1130191 1644559 2063925 2496895 2718157 2605008 2315684 2072844
21939B072844j9560J66247J48896o7888k77957l38470l45718l32603k56585k72162
21929D77044k86301r8115n4002l56651n16630k66887N8206Q5344k41508o00990
21919a800490m47655J85865Q04071R99436P63193L50454p4704j93543K01011O91833
21909A479471P06189K07093l53053o20060n65055l82857k09374p6588j694P8682
21899B62754K36832L56941K14711l94831r37940r07218m67639o3979q575k15714
21889a924658m26830l59198O8226N16329P34053P58464P93438O69447J78053k20893
21879G86431m31955n96393p37889p52791n44426k61618k7681J99099L48721M05300
21869a613202M86342N46923O31333P61980P04313K89217k73843n70040m23374
$$ plain form
21939 2072844 2053284 2219531 2368427 2300539 2022582 1684112 1338394 1005791 749206 477044
21929 477044 190743 92628 38626 -318025 -834655 -1101542 -1043336 -957992 -1199500 -1800490
21919 -1800490 -2248145 -2062280 -1258209 -258773 504420 854874 780170 586627 787638 1479471
21909 1479471 2185660 2392753 2039700 1419640 854585 471728 262354 185766 184072 262754
21899 262754 499586 856527 1071238 676407 -261533 -1168751 -1636390 -1700369 -1708944 -1924658
21889 -1924658 -2351488 -2710686 -2642460 -2126131 -1392078 -633614 159824 829271 1007324 786431
21879 786431 354476 -241917 -979806 -1732597 -2277023 -2538641 -2566322 -2367223 -2018502 -1613202
21869 -1613202 -1126860 -579937 51396 813376 1517689 1806906 1533063 963023 539649
21860E39649m5889J16948r1264l04760l07387k76107j28507J95886L40389K20633
21850B59591O9587J75966M65030L86019j17054m35999k71300m648K40368N03625
21840A271185L02869l89879p91053p65110o35788n65081l89352J8029K90986L82058
21830a271136M54494L52766J88619J36762O2093p3086j60806j33581o0439l0665
21820e34979L6368N7738J41989L88943O36821O70983L62448N5716O8954J54394
21810B039375Q016k29793m38805m68926j71363K52170L93035J58381j23028l69516
21800A049546n71839l30261J67993M40117M30069L59040J89449j2272j76554l66249
21790A179039o06185q61505j090049j094919n14282L45678Q21969Q50018N89413
$$ plain form
21860 539649 493760 610708 519444 214684 -92703 -368810 -497317 -301431 38958 259591
21850 259591 329178 505144 970174 1356193 1239139 803140 531840 527192 767560 1271185
21840 1271185 1574054 1184175 393122 -371988 -1007776 -1572857 -1962209 -1944180 -1653194 -1271136
21830 -1271136 -816642 -463876 -275257 -138495 -76402 -149488 -310294 -443875 -504314 -534979
21820 -534979 -498611 -440873 -298884 90059 726880 1397863 1760311 1816027 1884981 2039375
21810 2039375 2047391 1817598 1378793 909867 738504 990674 1383709 1542090 1419062 1049546
21800 1049546 477707 147446 315439 755556 1185625 1544665 1734114 1721842 1545288 1179039
21790 1179039 572854 -288651 -1378700 -2473619 -2987901 -2642223 -1820254 -970236 -380823
21781c80823P3578m4484K51281L73804K97521J40560j05758k44443k81178o53551
21771e73493j064577r98457l76368M64808J061266R28666P8996n86312p73670
21762a839141o76123k78996K19976N73072P13034P16193N52806K14555M4190P4042
21752C13608K2446j3337q8739j75158L3380L86745N95345N27081J99053k96687
21742A503737p48055o88171k47801P6502l7235l89541m07957P097L16697K61319
21732c53408K18467K84284M30521O01649M42342j36299o11538o48554n52532o13980
21722i39048o20700m97768l29216L455L64328M58760L69694L18349M80802P68136
21712C76792J015252J014117P81623M57497m0451m91223q00266r31186p40511
$$ plain form
21781 -380823 -307245 -351729 -100448 273356 570877 711437 605679 361236 80058 -573493
21771 -573493 -1638070 -2636527 -3012895 -2548087 -1486821 -558155 -479159 -1065471 -1839141
21762 -1839141 -2515264 -2794260 -2574284 -2001212 -1288178 -571985 -19179 195376 239566 313608
21752 313608 336054 322717 233978 58820 92200 478945 1074290 1601371 1800424 1503737
21742 1503737 755682 67511 -180290 -103788 -141023 -530564 -938521 -931424 -614727 -353408
21732 -353408 -134941 149343 579864 1181513 1623855 1487556 876018 227464 -325068 -939048
21722 -939048 -1559748 -2057516 -2386732 -2383277 -2018949 -1560189 -1190495 -872146 -391344 376792
21712 376792 1392044 2406161 3187784 3645281 3604830 3113607 2313341 1382155 641644
21703F41644m88068l45876k76757l42338m17889k06582L17112O84426O67570M30610
21693F63852J53299J312K037M4920M127p3914j94017l73009n85959n05611o8937
21682i31900J74276J34568J33574K48999K89989O179m31200n98558n42359k54608
21672a771040L55716Q31680P96307M92844K35192J5401k43110l26774j31056K80661
21662E35821Q08259J054143R75473O90402K19711l08301m74697k25659j50317
21653C124835l93190o28956o54783m05772r838K09051K48758K24292J82768J02981
21643B000146m1430l10209n89263m41622K12512Q01580J076388J236310J025990
21634D970402M21871k23332n34772n07569m02149m04145l82070k61252k11815
$$ plain form
21703 641644 153576 -192300 -469057 -811395 -1229284 -1435866 -1118754 -434328 233242 663852
21693 663852 817151 818463 820500 865420 869547 795633 601616 228607 -357352 -862963 -931900
21682 -931900 -757624 -623056 -489482 -240483 49506 55685 -375515 -974073 -1516432 -1771040
21672 -1771040 -1415324 -583644 212663 705507 940699 956100 712990 386216 255160 535821
21662 535821 1344080 2398223 3373696 4064098 4283809 3975508 3500811 3275152 3124835
21653 3124835 2731645 2102689 1447906 1042134 1032296 1241347 1490105 1714397 1897165 2000146
21643 2000146 1958716 1648507 1059244 617622 830134 1631714 2708102 3944412 4970402
21634 4970402 5392273 5168941 4634169 4126600 3724451 3320306 2938236 2676984 2465169
21625B465169j61799L3222K52924L89980L67510J38062L470k8635j62331m21724
21615B875848r17135j330347j131946l36018O25570J177975J001447K54768m00050
21606A820112o07729m64286k76265j51545j1311K1698j74473m30255k84153r8847
21596f57054j54035r7300Q4604J77552L22567L76206Q9539k3049L00264O60779
21586A080073P20255N45752M87734M37848Q7563l32257m95392l88988l23549k72006
21576A547033j13945l1273l1500P0552K87774M90572N10297L81172L07375L03679
21566C721736M15384M04587L6046l18046l63658j62231J15960J65384K2458j47850
21556C889770l61964m99464l83623n5083K96521O30782R56675J054349J042174
$$ plain form
21625 2465169 2303370 2336592 2589516 2979496 3347006 3485068 3488538 3459903 3297572 2875848
21615 2875848 1958713 628366 -503580 -839598 -214028 963947 1965394 2220162 1820112
21606 1820112 1212383 748097 471832 320287 308976 330674 156201 -274054 -558207 -657054
21596 -657054 -811089 -908389 -823785 -646233 -323666 52540 142079 119030 419294 1080073
21586 1080073 1800328 2346080 2833814 3271662 3359225 3026968 2531576 2142588 1819039 1547033
21576 1547033 1433088 1401815 1370315 1440867 1728641 2219213 2729510 3110682 3418057 3721736
21566 3721736 4137120 4541707 4577753 4259707 3896049 3733818 3849778 4015162 4037620 3889770
21556 3889770 3527806 3028342 2644719 2589636 2886157 3516939 4473614 5527963 6570137
21547F570137J126761R82941O01682L93653L49151M80032O51338O86015O96549
21538A2538259J005439J482283J878698K320309K826004L321936L912317M874681
21530C4159926O379030Q374898J0823122J3771298J6253913J5408790P737382
21523A12908359m384310j2752185j4522792j2651299r657111o684882m065037
21516D8190743j873022j88948J231165K390620K190334j78486l600860n863417
21508D2298129o488195n981650m990047m113398l284812k648685k294340j958227
21500A0538775j624945j313417r12403o88275q70768j066396q46321l40689n6828
21491B818733k430p4388n0086J29378K03682J7724k36578k60737j67161j89181
$$ plain form
21547 6570137 7696898 8679839 9281521 9675174 10024325 10504357 11155695 11841710 12538259
21538 12538259 13543698 15025981 16904679 19224988 22050992 25372928 29285245 34159926
21530 34159926 40538956 48913854 59736976 73508274 89762187 105170977 112908359
21523 112908359 108524049 95771864 81249072 68597773 58940662 52255780 48190743
21516 48190743 46317721 46128773 47359938 49750558 51940892 51762406 48161546 42298129
21508 42298129 35809934 29828284 24838237 20724839 17440027 14791342 12497002 10538775
21500 10538775 8913830 7600413 6688010 5999735 5128967 4062571 3216250 2875561 2818733
21491 2818733 2816303 2741915 2691829 2821207 3024889 3042613 2806035 2545298 2378137 2188956
21481B188956k21035j17340O0921J86541p219m83215p83536n48171l1273K34851
21471D79480J20335m0131K5196L19493N76606O89568Q35261O03400j1784k99226
21461C298198r7462P0459j06438k79326j90022o0877j78118l51554m13401n16115
21451A175344p00845p83648n29982q2099L73800N91093L06913k15270m37680m89973
21441g92347n42119m67932k19748K04221M86861L83091J54982L70374R93608R33436
21431A504427K16996k22310k97735m33631n90947n04967l75446k98019L3425L89168
21421e79039L65023o6226n46071o56407m05114p8286K63724N63153N54735J36890
21411d47618k37138j68679J25711K27277m485j43211J08371L73196J79833l01817
$$ plain form
21481 2188956 1967921 1850581 1911502 2098043 2090824 1607609 824073 275902 244629 479480
21471 479480 599815 559684 584880 904373 1480979 2170547 3005808 3609208 3597424 3298198
21461 3298198 3200736 3271195 3164757 2885431 2695409 2634532 2456414 2104860 1691459 1175344
21451 1175344 474499 -309149 -839131 -921230 -547430 43663 350576 135306 -302374 -792347
21441 -792347 -1334466 -1802398 -2022146 -1817925 -1331064 -947973 -792991 -422617 570991 1504427
21431 1504427 1721423 1499113 1201378 767747 176800 -328167 -703613 -1001632 -968207 -579039
21421 -579039 -214016 -280242 -826313 -1482720 -1887834 -1966120 -1702396 -1139243 -584508 -447618
21411 -447618 -684756 -853435 -727724 -500447 -504932 -648143 -539772 -166576 13257 -288560
21401b88560p20896p70314k94168M51597R59371R22699M62765K02994K92772K64851
21391A483111K3466k64332n13783o93572p27987l79368K15974O74040Q92358P78285
21381A488192L67688j45128m04607j65939J49281K36606J02553j43931j99589
21372A285126j0678J16588K09987K22687P0455j31739m24711p10965o96096k56242
21362c25588L12111N18096J33493n07499o98830k38434K70445L02630P3075n7849
21352b18350O811K22484M07237O17155Q37612Q79930P83913N42556J43592m4603
21342D178337J80538K45731j52966n22154o13787n55665l70898j24631O9937J62953
21332B497395l762m69361r85296r80835k07164M29588L28774j53315n13212m58697
$$ plain form
21401 -288560 -1009456 -1779770 -2073938 -1622341 -662970 259729 722494 925488 1218260 1483111
21391 1483111 1506577 1242245 728462 34890 -693097 -1072465 -856491 -182451 709907 1488192
21381 1488192 1855880 1710752 1306145 1140206 1289487 1526093 1628646 1484715 1285126
21372 1285126 1274448 1391036 1601023 1823710 1894165 1762426 1337715 626750 -69346 -325588
21362 -325588 -13477 504619 638112 130613 -568217 -806651 -536206 -233576 -160501 -218350
21352 -218350 -211539 10945 418182 1035337 1872949 2752879 3536792 4079348 4222940 4178337
21342 4178337 4358875 4604606 4451640 3929486 3315699 2760034 2389136 2264505 2334442 2497395
21332 2497395 2493633 2024272 1038976 58141 -149023 280565 609339 456024 -57188 -515885
21322e15885o9175K38091K84673J91828P4728J93941N15177O06876L30417K7809
21312A878480j1790N2555o3293l90794m80270k13427M4833K22433J94075k8341
21302A204461m9641J23809o7263l81142m28646l69974l29223l74335n70209p30462
21292a972625l86163K83114N19126L2736n31721p65293o92029l11103K14606M79311
21282c130041K96187k12432p40936q45418l76136L18717O60375O16339N83957
21273b829388O44988N96464L69578J09424l0447j18100k15102k26325q4729M1112
21263a742525J3239j46100j39015K57751N37129N9826n95302n43940n3965K74914
21253b077988M69073M56611K28612J20934K26852L62451N01059N54030K36413
$$ plain form
21322 -515885 -585060 -346969 -62296 129532 204260 398201 913378 1520254 1850671 1878480
21312 1878480 1866690 1919245 1855952 1465158 984888 771461 816294 1038727 1232802 1204461
21302 1204461 1154820 1278629 1211366 830224 401578 31604 -297619 -671954 -1242163 -1972625
21292 -1972625 -2358788 -2075674 -1556548 -1523812 -2055533 -2820826 -3512855 -3823958 -3609352 -3130041
21282 -3130041 -2833854 -3046286 -3787222 -4632640 -5008776 -4690059 -4029684 -3413345 -2829388
21273 -2829388 -2184400 -1587936 -1218358 -1108934 -1139381 -1257481 -1472583 -1698908 -1783637 -1742525
21263 -1742525 -1729286 -1875386 -2014401 -1756650 -1219521 -1159695 -1754997 -2298937 -2352902 -2077988
21253 -2077988 -1608915 -1152304 -923692 -802758 -575906 -213455 287604 841634 1078047
21244A078047j45620l37798l46095l14435l30334j80920L6158N5216j66987l13028
21234i65796m76479o99428p96452o53352q7437N81127J043667J230750R02789
21225G9389K92293j33349k56231k51403l23377n87597r77586r41188k29743N47310
21215b781482O40402K42541p953K5560K4065j91591m60807m27254P6639O56908
21205b202972R12065Q59410N39860Q6589j74788l05964n00469n03877k33239n950
21195a529335m5166k27888l41864l57834k25585k8714J63878M42649P70644R33541
21185d45674R10428P15165K34473k36092m27485m97445l54815P8199K77877J43287
21175C97918R5853P6752p9211j98350k53337l70546l43640j04850R9037o0556
$$ plain form
21244 1078047 932427 594629 248534 -65901 -396235 -577155 -540997 -485781 -652768 -965796
21234 -965796 -1442275 -2141703 -2938155 -3591507 -3678944 -3097817 -2054150 -823400 79389
21225 79389 371682 238333 -17898 -269301 -592678 -1180275 -2157861 -3099049 -3328792 -2781482
21215 -2781482 -2141080 -1898539 -1906492 -1880932 -1856867 -2048458 -2509265 -2936519 -2859880 -2202972
21205 -2202972 -1290907 -431497 108363 194952 20164 -285800 -786269 -1290146 -1523385 -1529335
21195 -1529335 -1574501 -1802389 -2144253 -2502087 -2727672 -2756386 -2592508 -2149859 -1379215 -445674
21185 -445674 464754 1179919 1414392 1178300 750815 253370 -101445 -23246 254631 397918
21175 397918 493771 570523 491312 292962 39625 -330921 -674561 -779411 -680374 -740930
21165g40930n00216n35053k0378N19230N26071J53657m8153K43802O48454P13176
21155I59660P87429J132691J201369N93297l50088r66210p67477k3658M71385
21146C038398O92198P33836L35129k94987p07298p28280o23591o83685p74026
21137I87694o55419m54108l12475j49889J27370L98303M29411L03118L64937O35890
21127A674832M55397j95414n11038m67157n91600o57564l80653l0420K37786L94050
21117g1781L20088N6174j78140k95885k13342m2871k62462o41134q22878p62069
21107b914300l86269n2589M1532K95277P07678O96697L53340L4847k12274l80115
21097a816176j97768K53023M46040L81794J97620O8742K39616M68737M21479Q0127
$$ plain form
21165 -740930 -1241146 -1776199 -1796577 -1277347 -751276 -597619 -645772 -401970 246484 959660
21155 959660 1747089 2879780 4081149 4674446 4324358 3358148 2590671 2567013 3038398
21146 3038398 3730596 4464432 4799561 4504574 3797276 3068996 2445405 1761720 987694
21137 987694 332275 -121833 -434308 -584197 -456827 -58524 370887 674005 1038942 1674832
21127 1674832 2130229 1934815 1423777 956620 365020 -292544 -673197 -703617 -465831 -71781
21117 -71781 248307 304481 126341 -169544 -382886 -425757 -688219 -1329353 -2152231 -2914300
21107 -2914300 -3300569 -3353158 -3311626 -3016349 -2308671 -1611974 -1258634 -1223787 -1436061 -1816176
21097 -1816176 -2013944 -1760921 -1314881 -933087 -735467 -666725 -427109 41628 463107 543234
21087E43234m55688p91175n82888k25688m4643J87604L93245M66271N71283N92719
21077F54274N54045O72924R89024J071218N59700o6052k46273k07221j31144Q8559
21067C939054K49455m0384m77253o32570o22264m93308j43838K28641L37674J22183
21057B467390j47104j53232m5122j12120k36084j66522j47909l32567m08962l58255
21047C59513m72886p87893j135464j272489q55496n6063O90154R72981Q16270
21038a741373N75939L93614L47604M60122O55238O69695N37285L25110J2834j14178
21028B121890K4567K16186J81882o8480l42276m68858m24017l71146k57975k59843
21018C51930k25124n9712Q9735R3047n0100m64939r32919r18099k10396O44443
$$ plain form
21087 543234 87546 -703629 -1286517 -1512205 -1556848 -1369244 -975999 -509728 61555 654274
21077 654274 1208319 1881243 2870267 3941485 4501185 4435133 4188860 3981639 3850495 3939054
21067 3939054 4188509 4148125 3670872 3038302 2416038 1922730 1778892 2007533 2345207 2467390
21057 2467390 2320286 2167054 2121932 2009812 1773728 1607206 1459297 1126730 717768 359513
21047 359513 -113373 -901266 -2036730 -3309219 -4164715 -4220778 -3530624 -2557643 -1741373
21038 -1741373 -1165434 -771820 -424216 35906 691144 1360839 1898124 2223234 2236068 2121890
21028 2121890 2146457 2362643 2544525 2476045 2133769 1664911 1240894 869748 611773 351930
21018 351930 126806 67094 156829 249876 199776 -265163 -1198082 -2116181 -2326577 -1682134
21008a682134J044582J087819Q54328M45837R5605j42238m19852o83200p26871
20999a26124o51048m23675k5171L29087O48525Q34464P09292L91489J98601K42773
20989B128213K30073j14725m91160o34412m23312n1838R1975J11252J20793J3991
20979I80850k10792k73725j86966k06157m15136n34909l25003j3584Q2910q6444
20969a188956j87801O3026M40690O11296O35465M52672N8809k50367k19558m9318
20959C65958L8579q9821k23263j47415j68095l52002n24927m31201R1910N75855
20949h64422M96873J37102k7183q6632k16679l01829l42382m29715k04269K86922
20939a552214N81853M18282m0724m19403l57913K19202Q90196R31656M85153K505
$$ plain form
21008 -1682134 -637552 450267 1304595 1750432 1846037 1703799 1283947 600747 -126124
20999 -126124 -777172 -1200847 -1226018 -896931 -248406 586058 1295350 1686839 1885440 2128213
20989 2128213 2358286 2243561 1752401 1117989 694677 642839 734814 846066 966859 980850
20979 980850 770058 496333 309367 103210 -311926 -846835 -1171838 -1185422 -1102512 -1188956
20969 -1188956 -1376757 -1313731 -873041 -261745 373720 826392 885201 634834 415276 365958
20959 365958 404537 314716 91453 -55962 -224057 -576059 -1100986 -1532187 -1440277 -864422
20949 -864422 -367549 -230447 -257630 -344262 -560941 -862770 -1205152 -1634867 -1839136 -1552214
20939 -1552214 -970361 -552079 -592803 -1012206 -1370119 -1150917 -260721 670935 1156088 1158593
20929A158593l49737m03900j83120N1793O9655m7541j75945l66115m69738k83774
20919i99829N2159P5809l11678n85287n07779l03949r0056J73957M90575L83268
20909a622810k6862j47878q8268K36108O92225R09286R03623Q59986P22126L80587
20899B818123P2532j01296k26190l81101n59957m98766k78377j60506k07969l66985
20889A09508n59872o70173n15068j10969J20445M6018q8411j58051m9214K17053
20879a658734M56457M39724J86655l1781k74182m55875j81569K52006K15098j55082
20869a207283n40275q06816p13948p8132P05896J069026J146597J082815P49766
20860A407646M56386K02484k83427o51579n60544k11343M5988R6087P4267N2306
$$ plain form
20929 1158593 808856 404956 221836 273629 343284 295743 119798 -246317 -716055 -999829
20919 -999829 -947670 -871861 -1183539 -1768826 -2276605 -2580554 -2670610 -2496653 -2006078 -1622810
20909 -1622810 -1649672 -1797550 -1885818 -1649710 -957485 -48199 855424 1715410 2437536 2818123
20899 2818123 2890655 2789359 2563169 2182068 1622111 1123345 844968 684462 476493 109508
20889 109508 -450364 -1120537 -1635605 -1746574 -1626129 -1580111 -1668522 -1826573 -1875787 -1658734
20879 -1658734 -1202277 -762553 -575898 -607679 -881861 -1337736 -1519305 -1267299 -1052201 -1207283
20869 -1207283 -1747558 -2554374 -3268322 -3346454 -2640558 -1571532 -424935 657880 1407646
20860 1407646 1864032 2066516 1783089 1131510 570966 359623 405611 501698 575965 628271
20850F28271j12894k94296l27867l92553m24814l52886j86692P3860J82102R8585
20840a109184P3060J51564K60551M23083M90589K58119q8534k55119k79144l24091
20830c99106l02953j99914k965J99985L34898M50258L39956L8060j5055O6560
20820E09724J5950J9009J14138J77013K71256L60192J0188n85024q48562o41820
20810e97936j80438P3541o0960k92076l47872k15150l1361j25905m37244m56049
20800b671450j94536j125J99007L97201K96391j15486m95755o56597n67504k51274
20790d061128R4839M40301M57550P1572j70121m4975J87269L15065L03021K49219
20780b157388J69167K12148L04653J39233o262J33381J54178j33875k41384m8381
$$ plain form
20850 628271 515377 221081 -106786 -499339 -924153 -1277039 -1463731 -1389871 -1207769 -1109184
20840 -1109184 -1036124 -884560 -624009 -200926 289663 547782 459248 204129 -75015 -399106
20830 -399106 -702059 -901973 -904938 -704953 -370055 80203 420159 458219 443164 509724
20820 509724 525674 544683 658821 835834 1107090 1467282 1477470 892446 43884 -597936
20810 -597936 -778374 -704833 -765793 -1057869 -1405741 -1620891 -1652252 -1778157 -2215401 -2671450
20800 -2671450 -2865986 -2867111 -2668104 -2270903 -1974512 -2089998 -2585753 -3242350 -3809854 -4061128
20790 -4061128 -3966289 -3525988 -3068438 -2996866 -3166987 -3211962 -3024693 -2709628 -2406607 -2157388
20780 -2157388 -1988221 -1776073 -1471420 -1332187 -1338449 -1205068 -1050890 -1184765 -1426149 -1474530
20770a474530K01108K00826J12418L65003O75739R16920J100563Q21988J1917
20761B931952o20976n54949k84215k85594l75237k94114P6084L23660P9861l61495
20751F34977p27466r90899r46569n30645K8839M10825O05427Q48990Q65801N05038
20741G04318j06960o35649p60232n05469j4533L45204M26006M68333L31687k7287
20731B25418l04463m19966m39724m08096m29603m30710k55127K42054P36982Q72617
20721f10618P93150P58125N31281R2194k31451m50349m81183l04730k24167l04769
20711d32517l70615m51878m89272l88133j52246n3411q0900J83210N53160O35213
20701a047389M91646K52027k04208o30002n01659M6282L39045K28682J44315J74915
$$ plain form
20770 -1474530 -1273422 -1072596 -960178 -595175 80564 997484 2098047 2920035 2931952
20761 2931952 2310976 1756027 1471812 1186218 810981 516867 592951 916611 996472 634977
20751 634977 -92489 -1083388 -2029957 -2560602 -2531763 -2120938 -1515511 -666521 199280 704318
20741 704318 597358 -38291 -798523 -1303992 -1318525 -973321 -547315 -78982 252705 225418
20731 225418 -79045 -499011 -938735 -1346831 -1776434 -2207144 -2462271 -2220217 -1483235 -610618
20721 -610618 182532 940657 1471938 1564132 1332681 882332 401149 96419 -127748 -432517
20711 -432517 -803132 -1255010 -1744282 -2132415 -2284661 -2338072 -2418972 -2235762 -1682602 -1047389
20701 -1047389 -555743 -303716 -507924 -1137926 -1639585 -1593303 -1254258 -1025576 -881261 -706346
20691g06346J15228l3054m07867r55589j088081p55402l32276n1036J46638M41771
20681c626014N97913N91261P26999Q21015O06578M09860N63092P83796N94599
20672B069099K71137J19226j48037k93282q0361J44178J84222L3265l01957p12585
20662A284905p95744k42581M73727Q26631Q29331N83068K51265l0754m54392r04263
20652A821193j060163j003441q36241o85470n62850m86798n29935m04121j53536
20643c901362j7962K15283L73840K26561M4492j40042l37074k61145L3611K89960
20633c473838N03195O07431M53045Q9292k9531K41038N24831N25057L64616J66542
20623b8322o6657j55594O7654K81395J32737k9549J31142N18280O40940L18448
$$ plain form
20691 -706346 -591118 -624172 -1032039 -1987628 -3075709 -3831111 -4163387 -4214423 -4067785 -3626014
20681 -3626014 -3028101 -2436840 -1709841 -888826 -282248 127612 690704 1474500 2069099
20672 2069099 2340236 2459462 2311425 2018143 1937782 2081960 2266182 2299447 1997490 1284905
20662 1284905 489161 246580 720307 1546938 2376269 2959337 3210602 3179848 2725456 1821193
20652 1821193 761030 -242411 -1078652 -1764122 -2326972 -2813770 -3343705 -3747826 -3901362
20643 -3901362 -3919324 -3704041 -3330201 -3103640 -3059148 -3199190 -3536264 -3797409 -3763798 -3473838
20633 -3473838 -2970643 -2363212 -1910167 -1820875 -1850406 -1609368 -1084537 -559480 -194864 -28322
20623 -28322 -94979 -250573 -182919 98476 231213 201664 332806 851086 1492026 1810474
20613A810474r2001m10836m02191O596L10252L28198J37334q9048j50283j48785
20603A299710l8099K19986L52322K61294J81759J08019m5345j30616k36453n21196
20593A451381o10536l01978R9344R5870k23870m08635m29962k93385J655L24881
20583b95235M65604L89797K83416J43534k11990n39597o84846q02974q66331p04110
20573b822732l50436k5803J93679L14661K76774K09188L49591O12415O93854N95411
20563D6602N52792M71180J86435k22816n46233n82563m61698k42573J16350L50022
20553c32502J43049l82507q10116r25206o99034l30340j52539J36287Q48177J194167
20543a310564P95966L84462K23633n7056m12005n12447k62575R3859K67399L27739
$$ plain form
20613 1810474 1718473 1307637 905446 912042 1222294 1550492 1687826 1598778 1448495 1299710
20603 1299710 1261611 1481597 1833919 2095213 2276972 2384991 2339646 2209030 1972577 1451381
20593 1451381 840845 538867 638211 734081 510211 101576 -328386 -621771 -620116 -295235
20583 -295235 170369 560166 843582 987116 775126 235529 -449317 -1252291 -2118622 -2822732
20573 -2822732 -3173168 -3198971 -3005292 -2690631 -2413857 -2204669 -1855078 -1242663 -548809 46602
20563 46602 599394 1070574 1257009 1034193 487960 -94603 -556301 -798874 -682524 -332502
20553 -332502 -189453 -571960 -1382076 -2307282 -3006316 -3336656 -3489195 -3352908 -2504731 -1310564
20543 -1310564 -514598 -130136 93497 36441 -375564 -888011 -1150586 -1056727 -789328 -461589
20533d61589L88664L96378M49187O44250O70311L58628l04057r47113j059804
20524A34855o47023J5158K84938j9119m80842n31947j968O59203J012559J116162
20514A541976R41892M48805j13741n80466p91412p57509o49770n45251j57409
20505f62885N73295J130061J191776O97460N8135j92428j22802Q534N2116K14363
20495B947625M19938J60759k42420k74657k42676k45186j64523j30581r6453P5993
20485B207819K80687R9010m13051p46451p65876n48748l50823m02427m11475l79643
20475a430978m68312o22598p42254n55644q6047L56177P63702R80087Q30818M68664
20465e06385J63363k5641m54605r87282r17628j33635O02583P50946N34528L75853
$$ plain form
20533 -461589 -72925 323453 772640 1416890 2087201 2445829 2141772 1194659 134855
20524 134855 -512168 -497010 -212072 -231191 -712033 -1243980 -1245948 -586745 425814 1541976
20514 1541976 2483868 2932673 2818932 2238466 1447054 689545 39775 -505476 -662885
20505 -662885 -89590 1040471 2232247 2929707 2987842 2795414 2672612 2681146 2733262 2947625
20495 2947625 3367563 3528322 3285902 3011245 2768569 2523383 2358860 2228279 2131826 2207819
20485 2207819 2488506 2587516 2174465 1428014 662138 113390 -237433 -639860 -1051335 -1430978
20475 -1430978 -1899290 -2521888 -3264142 -3819786 -3905833 -3549656 -2785954 -1805867 -975049 -506385
20465 -506385 -343022 -368663 -823268 -1810550 -2728178 -2861813 -2259230 -1508284 -973756 -597903
20455e97903L50073M94200R41150J327635J250312P68566O2871o16253q64348
20446C116303n59065M1630O44736P51258M23935J67257K4183l95260r79317j212486
20436B023174r40598l04444J44869J13236j44875l26401l71072m05131m40403
20427f51645j82528K99290N52294N61567L59415p650n46474j203278j315457q17456
20417b951922l85306k14581r212K51952L61921L86688M56715M62036K79841K12602
20407a149266J84389p9299k31561K045L49373M30689L94068L67214J93308Q5348
20397E46308J32517J49724P8989o0002j49778j37624p3192M6916K32546L19967
20387A086371K51237M6186j38847l58405q13706j172813j052417n29932m5806
$$ plain form
20455 -597903 -247830 246370 1187520 2515155 3765467 4534033 4596904 3980651 3116303
20446 3116303 2557238 2598868 3243604 3994862 4418797 4586054 4610237 4214977 3235660 2023174
20436 2023174 1082576 778132 923001 1036237 891362 564961 193889 -211242 -651645
20427 -651645 -834173 -534883 17411 578978 938393 930743 384269 -819009 -2134466 -2951922
20417 -2951922 -3337228 -3551809 -3561021 -3309069 -2947148 -2560460 -2103745 -1641709 -1361868 -1149266
20407 -1149266 -964877 -1044176 -1275737 -1273692 -924319 -493630 -99562 267652 460960 546308
20397 546308 678825 828549 907538 847536 697758 560134 486942 533858 766404 1086371
20387 1086371 1337608 1383794 1244947 886542 72836 -1099977 -2152394 -2682326 -2728132
20378b728132J51515J48563K05018N19575Q75486J024274J103083J366298J302935
20369C968615N42955l06675o59436o78535p25728n84446j54789J22079J78884
20360A702924L4341l64774p83019q28692o15152m34656k16203O7642M71443Q89880
20350g6266J027991O43119j72503p88948p11864j97764J36006J68835K10957J33088
20340C72651l02205o24939n26366l80454l86938m26299m47699l65033p5611K63553
20330b899340M19924M23710J18099m34182n90673j31605N90334R53186R48982
20321f01565R42874P95575L89490M4513j14869j22399L2306O8489k09149o72632
20311E52633r78851r61097p97418n12782l59063j92503O12168J442578J416879
$$ plain form
20378 -2728132 -2576617 -2428054 -2223036 -1703461 -827975 196299 1299382 2665680 3968615
20369 3968615 4511570 4204895 3545459 2866924 2141196 1556750 1401961 1524040 1702924
20360 1702924 1737265 1372491 589472 -239220 -854372 -1289028 -1505231 -1437589 -966146 -76266
20350 -76266 951725 1594844 1422341 633393 -78471 -276235 -140229 28606 239563 372651
20340 372651 70446 -554493 -1080859 -1461313 -1848251 -2274550 -2722249 -3087282 -3162893 -2899340
20330 -2899340 -2479416 -2055706 -1937607 -2371789 -2962462 -3094067 -2503733 -1550547 -601565
20321 -601565 341309 1136884 1526374 1570887 1456018 1333619 1365925 1434414 1225265 552633
20311 552633 -426218 -1387315 -2184733 -2697515 -3056578 -3249081 -2636913 -1194335 222544
20302B22544Q07696J82102l38248n52888l00925J56122L28222K06890K1010k19159
20292E13366k23771P370J35114J94237K41285K05362J90403M23511O52982M54546
20282B794405j01916o17362q71091p75541m03185o4877Q7080r4313m17113n86485
20272a050398n63378k99954J24722O19616Q76182P37027M31574k5786n00140o00214
20262b50749l20272n5120O1595N4972n1163k26704l97626l65686j67238J49701
20252a568290O98605J000230P07235K02367j27177l87366n11455k56923L8592
20243b04182k9781j50496N3500L07627M87138N87680M42392K20833O5608L1469
20233A811788J01434K05802J72620j2780q0521L8275K9840k52338n37301n20795
$$ plain form
20302 222544 1030240 1212342 874094 321206 20281 176403 504625 711515 732525 513366
20292 513366 289595 296965 432079 626316 867601 1072963 1263366 1686877 2339859 2794405
20282 2794405 2692489 2075127 1204036 428495 25310 -39567 47513 -46800 -463913 -1050398
20272 -1050398 -1613776 -1913730 -1789008 -1169392 -293210 443817 875391 849605 349465 -250749
20262 -250749 -571021 -626141 -564546 -509574 -560737 -787441 -1185067 -1550753 -1717991 -1568290
20252 -1568290 -869685 130545 837780 1040147 912970 525604 14149 -242774 -204182
20243 -204182 -233963 -384459 -330959 -23332 463806 1051486 1493878 1714711 1780319 1811788
20233 1811788 1913222 2119024 2291644 2278864 2198343 2236618 2266458 2014120 1476819 956024
20223I56024l12158m1642L54127O43548O99128P28345O87712N11841M33455L35667
20213D996047M382j14178J62937K87499J32596r040p1892k02077l75770l21541
20203D488963j24836r1243k67559m17245m85143o49683q48422p51379m34499j66757
20193B52197o709l9454k65317m23881k90075L7834K89406L29384K31391j0983
20183A03793k17400k18905j04213M4241K18559M47598O24338M54646K66867L61465
20173A980989K84164j02059m51881n36792n00688m49445l22311j62646l246J31945
20163a31970K32734K00444J74892M01948O08111O42242N48538K89988k32505p50142
20153A984280q24741l95247J94566N72403N32373J96873K0815K46626L30332o7218
$$ plain form
20223 956024 643866 602224 956351 1599899 2299027 3027372 3715084 4226925 4660380 4996047
20213 4996047 5000429 4886251 5049188 5336687 5469283 5460243 5388351 5186274 4810504 4488963
20203 4488963 4364127 4272884 4005325 3588080 3102937 2453254 1604832 853453 418954 252197
20193 252197 245488 206034 -59283 -483164 -773239 -735405 -445999 -116615 114776 103793
20183 103793 -113607 -332512 -436725 -392484 -173925 273673 898011 1352657 1619524 1980989
20173 1980989 2265153 2163094 1711213 1174421 673733 224288 -98023 -260669 -263915 -131970
20163 -131970 100764 301208 476100 878048 1486159 2128401 2676939 2966927 2734422 1984280
20153 1984280 1159539 764292 958858 1531261 2063634 2260507 2281322 2527948 2858280 2791062
20143B791062m62843m31010l674N00731Q26063R68460J045517R49361O75813K63479
20133G122959m43448j182443j417453j208818q99580o25437m00708k27013l0914
20124F87145J03947O9813m0749r7749n4352J23379L59646N32629O05925N04409
20114B794043M33421M62049K47753J2855L52385Q45746O39392K3894l78462o60155
20104D772921p97557l55012K07717J63697k35342m97094m90380m82435l33352
20095A953163J35134L92394J32960k85469n22069n48662k91816q3384j13394l3543
20085G35314K11582M90299M35020l2973m10029l29080O6571M25386Q08057J140311
20075C540458J004791N23455J12377j47343k70352k99536k54126j2252M09053
$$ plain form
20143 2791062 2328219 1897209 1893535 2394266 3220329 4188789 5234306 6183667 6859480 7122959
20133 7122959 6679511 5497068 4079615 2870797 1971217 1345780 945072 718059 687145
20124 687145 791092 860905 820156 722407 668055 791434 1151080 1683709 2289634 2794043
20114 2794043 3227464 3689513 3937266 3950121 4302506 5148252 5787644 5811538 5433076 4772921
20104 4772921 3975364 3620352 3828069 3991766 3756424 3259330 2768950 2286515 1953163
20095 1953163 2088297 2480691 2613651 2328182 1806113 1257451 965635 882251 768857 735314
20085 735314 946896 1437195 1872215 1839242 1429213 1100133 1166704 1592090 2400147 3540458
20075 3540458 4545249 5068704 5181081 5033738 4763386 4463850 4209724 4197472 4606525
20066D606525M74582J07012j02073R4200M30253N90062M43708L68022N68464N55348
20056H136103K30677k75566p72824r79790r20897o29001l70255m01544m77135
20047C539768l08447L863L45946P58499J142963J029551N46287J15263j417K60243
20037G432519P32230J167830J099514N30762k28429p00497o56277m39422k13553
20028H724677R5754L89246N98645O39425M69879K15738J8762J16281M64559P11482
20018A2444448O97030N98594O50329Q25701R94108J107587J245239J477829J737211
20009B1778076J952962K179595K571652L300283M181558M847807N368592O146048
20001E2326573P010895P876793R442683J1909940J4897571J8648974K3438381
$$ plain form
20066 4606525 5081107 5188119 5086046 5180246 5610499 6200561 6644269 7012291 7580755 8136103
20056 8136103 8366780 8091214 7318390 6338600 5417703 4788702 4418447 4016903 3539768
20047 3539768 3231321 3235184 3581130 4339629 5482592 6512143 7058430 7173693 7172276 7432519
20037 7432519 8164749 9332579 10432093 10962855 10734426 10033929 9377652 8938230 8724677
20028 8724677 8820431 9209677 9808322 10447747 10917626 11133364 11152126 11268407 11732966 12444448
20018 12444448 13141478 13740072 14390401 15216102 16210210 17317797 18563036 20040865 21778076
20009 21778076 23731038 25910633 28482285 31782568 35964126 40811933 46180525 52326573
20001 52326573 59337468 67214261 76656944 88566884 103464455 122113429 145551810
19994A45551810K9375326L6048843M2172291M5338080M0854288K4208623k611407
19987C60937854k8645932m2555136m3899895l9242783l3373458k7691978k2195460
19980A23333212j7433918j3923405j1435626r334908p685962o698238n959087
19973E0862068n217120m612367m072759l533250l073665k520161j869211j331852
19965B4631683j042063j086032j270509j277782j019553p02073n66298m67784
19957A7199589l31046l44282l59452j61297J62897L23631K98353K51142K92947
19948A7332482K75453k27221q29810j011627j034794q81899l65938L35548R43937
19939A4536131J370461J439350J230078J080449R58155O41382L96526N05541P15103
$$ plain form
19994 145551810 174927136 210975979 253148270 298486350 339340638 363549261 360937854
19987 360937854 332291922 289736786 245836891 206594108 173220650 145528672 123333212
19980 123333212 105899294 91975889 80540263 71205355 63519393 56821155 50862068
19973 50862068 45644948 41032581 36959822 33426572 30352907 27832746 25963535 24631683
19965 24631683 23589620 22503588 21233079 19955297 18935744 18233671 17667373 17199589
19957 17199589 16868543 16524261 16164809 16003512 16166409 16490040 16788393 17039535 17332482
19948 17332482 17607935 17380714 16550904 15539277 14504483 13622584 13256646 13592194 14536131
19939 14536131 15906592 17345942 18576020 19656469 20614624 21256006 21652532 22158073 22873176
19930B2873176O55229N34691M99033N24334O97680Q35198J003112J457157J999140
19921C1078750K663401L493958M209442M707975N220172O217033P842732R532552
19913G4966015J1139376J3387558J6932142K1800218K7472718L3575808L9587417
19906B38861252M2963108L8571859K2503627k40693j8467196k8761231l4034538
19899B61396188l5066548l2536500k8344612k4101694k0379010j6989347j3834093
19892I0144384j1151730r260845q082515p315426o604361n559169m266182l232929
19884C4671227k696442k449532k285821k075884j687516j325627j214694j270773
19876A9664938j438213j491214j210720q85668p20512o38663p55341j111526j299933
$$ plain form
19930 22873176 23528405 24063096 24562129 25086463 25784143 26619341 27622453 29079610 31078750
19921 31078750 33742151 37236109 41445551 46153526 51373698 57590731 65433463 74966015
19913 74966015 86105391 99492949 116425091 138225309 165698027 199273835 238861252
19906 238861252 281824360 320396219 342899846 342659153 324191957 295430726 261396188
19899 261396188 226329640 193793140 165448528 141346834 120967824 103978477 90144384
19892 90144384 78992654 69731809 61649294 54333868 47729507 42170338 37904156 34671227
19884 34671227 31974785 29525253 27239432 25163548 23476032 22150405 20935711 19664938
19876 19664938 18226725 16735511 15524791 14639123 13918611 13279948 12524607 11413081 10113148
19867A0113148j163967r35392o12268l03965l24130n10255n81402o24614o56809
19858D400346n15903j59538J06794R1390L0585J80161M54476N19461M07264K16542
19848E731578M2504J65762M97944O29131M92380K97990J10190J78554J44949l36262
19838G954720o59188o01715m10973l59194n55291o50064m71535j85249J67162
19829D228673M46730K80693k99991p89779r28828q98163q54852n53357q1825K18561
19819G67862L24509L43846K20027m49J4609J06840J05110N1576O595O4511j6304
19808A988732j96463j34923m5329l51001p05311p70367o07990l92192j49089K81286
19798a082647O31517O14501M38283L75814K24860o4681k74651j92206M5100K1969
$$ plain form
19867 10113148 8949181 8013789 7401521 7097556 6773426 6263171 5681769 5057155 4400346
19858 4400346 3884443 3724905 3831699 3923089 3953674 4133835 4588311 5107772 5515036 5731578
19848 5731578 5774082 5939844 6437788 7066919 7559299 7857289 7967479 8146033 8290982 7954720
19838 7954720 7295532 6693817 6282844 5923650 5368359 4718295 4246760 4061511 4228673
19829 4228673 4675403 4956096 4656105 3866326 2937498 2039335 1184483 631126 549301 767862
19819 767862 1092371 1436217 1656244 1655795 1670404 1777244 1882354 1933930 1940525 2005036 1988732
19808 1988732 1792269 1657346 1612017 1261016 555705 -214662 -822652 -1214844 -1363933 -1082647
19798 -1082647 -451130 163371 601654 977468 1202328 1137647 862996 670790 715890 737859
19788G37859k77257m26232j17243L26850M53261K76841j4628k41950l48301m68207
19778i9007o25464l31693L78611O46741L35793j28067m20112n39654o58064n65852
19768b006768j04571M53633R01290J233377J570907J493653P46224j37036p11440
19759C439269p92558n98520m17599j32117M06272P70774O15665J30918m66812
19750B955292r28681r94347n95819j87644r914j51743l26218j80834J17927N20567
19740B18586P68658N36652J55491o9006l70644o36597n50736k74659j20034M8976
19730b93313L50838N12479K63850r2285l01548l12080k43352k27908j49066k0800
19720e13185O1994K25851M57535N24775M26458J69846k44238p16964r07545o29585
$$ plain form
19788 737859 460602 34370 -82873 243977 697238 974079 959451 717501 369200 -99007
19778 -99007 -724471 -1056164 -677553 -30812 304981 176914 -243198 -782852 -1440916 -2006768
19768 -2006768 -2111339 -1657706 -756416 476961 2047868 3541521 4287745 4150709 3439269
19759 3439269 2646711 2048191 1630592 1498475 1904747 2675521 3291186 3422104 2955292
19750 2955292 2026611 1032264 436445 248801 238887 87144 -239074 -419908 -301981 218586
19740 218586 987244 1523896 1679387 1610381 1239737 603140 52404 -222255 -342289 -293313
19730 -293313 57525 570004 833854 741569 440021 127941 -115411 -343319 -492385 -513185
19720 -513185 -451191 -225340 232195 756970 1183428 1353274 1109036 392072 -515473 -1145058
19710a145058R612L96905J64321j6633j6121k45875m50284n20252p40382q73260
19700c437027n49339O5626O78052J007097Q90851M96129J29869j48264j62517
19691a029523R5609K40221J11087j85212l52801k93281j59160P717J90893L64272
19681a010178M63798N72824M91881K12874L46898O68046O81150M91508J52315
19672C071116j76358j33346K50071N37689N36446L38566O550m97469p77860l32936
19662B822469N20139J120858R78284L07727l16962q35117j210086j130703n89680
19653A666929K24521P82005N53814L0255j22219N1752L39164O36908P87436P68444
19643E719009M38765K1090j60185j00754K6380K22323N33558Q15928N63278l29331
$$ plain form
19710 -1145058 -1135446 -738541 -574220 -590853 -606974 -852849 -1303133 -1823385 -2563767 -3437027
19700 -3437027 -3986366 -3920740 -3242688 -2235591 -1344740 -848611 -718742 -867006 -1029523
19691 -1029523 -933914 -693693 -582606 -767818 -1120619 -1413900 -1573060 -1565343 -1374450 -1010178
19681 -1010178 -546380 26444 518325 731199 1078097 1746143 2427293 2918801 3071116
19672 3071116 2894758 2761412 3011483 3549172 4085618 4424184 4430734 3933265 3155405 2822469
19662 2822469 3342608 4463466 5441750 5749477 5432515 4597398 3387312 2256609 1666929
19653 1666929 1891450 2673455 3227269 3257524 3135305 3187057 3526221 4163129 4950565 5719009
19643 5719009 6157774 6178864 6018679 5917925 5944305 6166628 6700186 7516114 8079392 7750061
19633G750061j169787j325207p97810J33736Q82325J254145J390191J356422J568489
19624A1042565J969894K218175K302614K361696K414626K741531L510948M561985
19616C3124034N738890O811202P468561P879766Q710070J0568228J3494642J6248832
19608A10044225J6698079J3042918N493043k485291p243404q833546r725194j1243740
19600A05747090j2384124j2206474j1182494r847531q388960p123614n947580
19593C8666313m914233m262193l641351k782169j959366j561473j525896j353228
19585A6666404r56323n92932m41610n09725o38405p26098o53739n64927o21946
19576A0960699o43197n08483m94466m91950n23510n77176m30729j75250j69266
$$ plain form
19633 7750061 6580274 5255067 4457257 4590993 5473318 6727463 8117654 9474076 11042565
19624 11042565 13012459 15230634 17533248 19894944 22309570 25051101 28562049 33124034
19616 33124034 38862924 45674126 53142687 61022453 69732523 80300751 93795393 110044225
19608 110044225 126742304 139785222 145278265 142792974 135549570 126716024 116990830 105747090
19600 105747090 93362966 81156492 69973998 60126467 51737507 44613893 38666313
19593 38666313 33752080 29489887 25848536 23066367 21107001 19545528 18019632 16666404
19585 16666404 15710081 15117149 14675539 14165814 13527409 12801311 12147572 11582645 10960699
19576 10960699 10317502 9809019 9314553 8822603 8299093 7721917 7291188 7115938 6946672
19567F946672n54393r66793j090476p72057j82801L93861O59387M98660L88546
19558E320606M39006L27868j06288n38867n45548k45485Q1994J85701M7487J7415
19548D983889J50593L52774L45608k9728k91211l46644l92815l97303m78585n39576
19538C357002m32265m29926n74346n33226k60581J06581M72218P44514P40466
19529C190437N06406R2419m35150q20889j188478j594532j484068p21259j71520
19520b626634l0324K49198M34711J89752n0188N1695L51202P04536P67854N34749
19510E76551M71700M91571K92089K50576L93520M60354M18259J05897m45187q90871
19500B124459j101461j076461p52019l51561l878K66076M89190O64622P12991
$$ plain form
19567 6946672 6392279 5425486 4335010 3562953 3380152 3774013 4433400 4932060 5320606
19558 5320606 5759612 6087480 5981192 5442325 4896777 4651292 4733286 4918987 4966474 4983889
19548 4983889 5134482 5487256 5832864 5803136 5511925 5165281 4772466 4375163 3896578 3357002
19538 3357002 2924737 2494811 1920465 1387239 1126658 1233239 1705457 2449971 3190437
19529 3190437 3696843 3789262 3354112 2533223 1344745 -249787 -1733855 -2455114 -2626634
19520 -2626634 -2656958 -2407760 -1973049 -1783297 -1833485 -1781790 -1430588 -726052 41802 576551
19510 576551 1048251 1539822 1831911 2082487 2476007 2936361 3354620 3460517 3015330 2124459
19500 2124459 1022998 -53463 -805482 -1157043 -1160921 -894845 -405655 258967 971958
19491I71958O57324N75152M32053J75282o4240l80094p05868q84475r23467p24591
19481h70966m52533m06101l81169j13322K34981N90332P78453Q14506P18667M50244
19471A363092K14363R1589q7772m24027p17974o21684k29011j7062O131k52387
19461f74742n96539p14776m98212q3190K48958L60049L26222L46535L93492L28629
19451e63574K08690K08099J88878m7685j63128K04394N21444L65476M8482j85903
19441G85173m05954l09697O1029J85458O4175j56500j76359K09044O14582O99834
19431A570785L43727r7118l50792n85866q39511p20545m04834l22341j72328J41034
19421a437789M23024M82168J10109m24044o24671l46136K09166N09730N82166
$$ plain form
19491 971958 1629282 2204434 2636487 2811769 2747529 2367435 1661567 777092 -146375 -870966
19481 -870966 -1323499 -1729600 -2110769 -2224091 -1989110 -1398778 -620325 194181 912848 1363092
19471 1363092 1577455 1669044 1581272 1157245 439271 -182413 -411424 -428486 -422355 -674742
19461 -674742 -1271281 -1986057 -2484269 -2567459 -2318501 -1958452 -1632230 -1285695 -892203 -563574
19451 -563574 -354884 -146785 42093 -5592 -168720 35674 557118 922594 971076 785173
19441 785173 379219 69522 130551 316009 380184 223684 47325 256369 870951 1570785
19431 1570785 1914512 1817394 1466602 880736 41225 -679320 -1084154 -1406495 -1578823 -1437789
19421 -1437789 -1014765 -532597 -422488 -846532 -1471203 -1817339 -1608173 -1098443 -516277
19412e16277P43468O84181J90187k62687m64665o21072o72830n58525l47845j28818
19402a954883J16532K86641K73966L0312l52489o81238p14254n10908k52178J3047
19392c745452J03933P5541K24621M44557N54899O39736M80608j47936o83247n24305
19382b577045P4230N68748Q31432R45555Q06669O03898L25324j09253m83965o59797
19372C25796n59272j78416K77704N06641L24565j39835n88025p38332n23722k98323
19362a591219k10211j08295j58707k74303j32901L55608O78415N80286M60521
19353d00806N43598P12967Q22582R45100Q69409L83149j99366l35706o94L1702
19343C371935k88459o39066r30014q96415o90195o49494q08211r67341p95576
$$ plain form
19412 -516277 227191 911372 1101559 838872 374207 -246865 -919695 -1478220 -1826065 -1954883
19402 -1954883 -1838351 -1551710 -1277744 -1247432 -1599921 -2281159 -2995413 -3506321 -3758499 -3745452
19392 -3745452 -3641519 -3565978 -3341357 -2896800 -2341901 -1702165 -1221557 -1369493 -2052740 -2577045
19382 -2577045 -2502815 -1934067 -1102635 -157080 649589 1253487 1578811 1469558 985593 325796
19372 325796 -233476 -411892 -134188 372453 697018 557183 -30842 -769174 -1292896 -1591219
19362 -1591219 -1801430 -1909725 -2068432 -2342735 -2475636 -2120028 -1441613 -861327 -400806
19353 -400806 142792 855759 1678341 2623441 3492850 3875999 3676633 3340927 3340233 3371935
19343 3371935 3083476 2444410 1514396 617981 -72214 -721708 -1529919 -2497260 -3292836
19334c292836k09655L98430O39309M18408j17482n70159n56503m1176N51267Q33462
19324a946935P18979N02289L74849K93650L68366N02931L60344Q2953n2573q5607
19314A119246q9383j08061l1429J17325r1786m36309k86106J50831K14573m7304
19304E11597j56203M0055M11677N20811K11306k3393J42609M23508N71527L99788
19294C053282j50075o26062q35539j034687j196726r96631l82667J61868K85899
19285a721338l2070m04794m54222j72129R0789J67315J82780J99525J02917L6228
19275b004999K5029J07931L76852O09257N83042J93943l22872m53230k65857j17029
19265a267933r1293j34160j31395o323J07157j5600j92333k01521o9846m1165
$$ plain form
19334 -3292836 -3502491 -3104061 -2464752 -2046344 -2163826 -2733985 -3290488 -3331664 -2780397 -1946935
19324 -1946935 -1227956 -725667 -350818 -57168 311198 814129 1174473 1257426 1204853 1119246
19314 1119246 1029863 921802 890373 1007698 915912 479603 193497 344328 558901 511597
19304 511597 355394 395449 807126 1327937 1539243 1515850 1658459 2081967 2653494 3053282
19294 3053282 2903207 2277145 1441606 406919 -789807 -1786438 -2169105 -2007237 -1721338
19285 -1721338 -1753408 -2158202 -2612424 -2784553 -2693764 -2526449 -2343669 -2144144 -2041227 -2004999
19275 -2004999 -1979970 -1872039 -1495187 -885930 -302888 -108945 -431817 -885047 -1150904 -1267933
19265 -1267933 -1359226 -1493386 -1624781 -1631104 -1523947 -1539547 -1731880 -1933401 -2003247 -2044412
19255b044412k15761l17894j53278J44866L17649M14704P04027Q31420M93889
19246A75210J29183k25941n46942n91453k71645K17252M02315K87782J10871J25041
19236a88327K09745J43518J10576r1379n66995p77370l24136L17808O25927O13196
19226G2563M52487L30735M37090N02299L9848o57098r84435q54062n05996k32803
19216a399372K9692J98228K47213J00743k79676m35756p8408M10547M90981J92923
19206e22885j35629k94038k50463p5253P0848J24395K12226L31962K53943k22187
19196e07081n99141l86541N2304K08430K45044J51520j90403k56382l0465J93888
19186a118827K51986J39615N3469m1744j78633j24859K38484N38210M24878J41329
$$ plain form
19255 -2044412 -2260173 -2578067 -2731345 -2586479 -2268830 -1854126 -1150099 -318679 175210
19246 175210 304393 78452 -468490 -1059943 -1331588 -1114336 -712021 -424239 -313368 -188327
19236 -188327 21418 164936 275512 184133 -382862 -1160232 -1484368 -1166560 -540633 72563
19226 72563 525050 855785 1292875 1795174 1835022 1177924 193489 -660573 -1166569 -1399372
19216 -1399372 -1369680 -1171452 -924239 -823496 -1103172 -1538928 -1617336 -1206789 -715808 -522885
19206 -522885 -658514 -952552 -1203015 -1278268 -1207420 -1083025 -870799 -538837 -284894 -507081
19196 -507081 -1106222 -1492763 -1440459 -1232029 -986985 -835465 -1025868 -1282250 -1312715 -1118827
19186 -1118827 -866841 -727226 -673757 -715501 -894134 -1018993 -780509 -242299 182579 323908
19176C23908K11176M67324L55632J81955K6908k29790l46176l52645k48138m9732
19166C40422p383j46680m20978n54171j11351M27115L31051k02833n87469o69742
19156a602019o90412q93608r27839n59891j71686J06644L33323M26422M81219
19147c497847O81753R17986R20249O15015L74923L45664M53432M52442J99385
19138A463002q0339j52801j17076l37755p82568r70033n63156J56688P86409J159299
19128E61670Q94022J75981k34527k41054j61848l0712n088j41889j68762J32051
19118G79844L17064J90437R2579j08972m87114p40769p74867n22127j25601K55111
19108a124415L92928J18952k36736m71490n31281l52211k72876l21380k39592
$$ plain form
19176 323908 535084 1002408 1358040 1539995 1566903 1337113 990937 638292 390154 340422
19166 340422 333039 186359 -234619 -788790 -900141 -473026 -141975 -344808 -932277 -1602019
19156 -1602019 -2292431 -3186039 -4113878 -4673769 -4845455 -4738811 -4405488 -3979066 -3497847
19147 -3497847 -2816094 -1898108 -977859 -362844 12079 357743 811175 1263617 1463002
19138 1463002 1382663 1229862 1112786 775031 -7537 -977570 -1540726 -1384038 -597629 561670
19128 561670 1455692 1631673 1397146 1156092 994244 963532 958444 816555 647793 779844
19118 779844 1096908 1287345 1379924 1270952 783838 43069 -731798 -1253925 -1379526 -1124415
19108 -1124415 -731487 -612535 -849271 -1320761 -1852042 -2204253 -2477129 -2798509 -3038101
19099c038101q2160l1063j96919l60167k91105J00028L00410m3960n10889o00075
19089d754001k67885J10891M12669N78354M35950J27299q3093j09014j9682K40285
19079c328227M80947N34570P32681R35355P71558N79627N53239J95324m44575
19070A010499o91683m01531r4743o2491j32180k48662m06593m28592J5750O64473
19060g75753P39517J28139m05456n05106l82499j93243O9995L37118N64152P63635
19050C40499Q23610P11803N04716K65681M8553r5939k25976l54719m49480m88489
19040A080259k22939K98314N26313M46293L71493L13631K13932J3568k40550n91999
19030B208315q15637o72595m39415m40979m06776j8369N16363O86037N98824O45852
$$ plain form
19099 -3038101 -3120261 -3151324 -3348243 -3708410 -3999515 -3899487 -3599077 -3643037 -4153926 -4754001
19089 -4754001 -5021886 -4910995 -4498326 -3919972 -3484022 -3356723 -3439816 -3548830 -3568512 -3328227
19079 -3328227 -2847280 -2312710 -1580029 -644674 126884 706511 1259750 1455074 1010499
19070 1010499 318816 -82715 -177458 -239949 -372129 -620791 -1027384 -1455976 -1440226 -775753
19060 -775753 -36236 91903 -313553 -818659 -1201158 -1394401 -1324406 -987288 -423136 340499
19050 340499 1164109 1875912 2380628 2646309 2694862 2598923 2372947 2018228 1568748 1080259
19040 1080259 857320 1155634 1681947 2128240 2499733 2813364 3027296 3040864 2800314 2208315
19030 2208315 1392678 720083 280668 -160311 -567087 -585456 -69093 616944 1215768 1861620
19020A861620N79169J92805l77997j011562j328582j036723n79160l46662k34161
19011b281253o1114M4367j4175P0432L41177M32396L42133L3210m18718o75444
19001b186989n25519j19355K42689L69032M97232O03466M85043K44554P3658O9144
18991b47045R9077K05198L13478L39154P1774n26207q86839p28593l73653q9623
18981a823279O2165J07993K60809M04363K88420K63977M00909L53799J18970l33955
18971A04171q62970j089647o30453J09536O02497P78000N90888K49964O5691J72307
18961H9984K98779J48960k29689o42811r33252j264120j408153r37876j61879
18952e040057M05109N84894O58946P70941P69961M98003O6209j75313k37238l18723
$$ plain form
19020 1861620 2440789 2633594 2255597 1244035 -84547 -1121270 -1700430 -2047092 -2281253
19011 -2281253 -2342367 -2298000 -2312175 -2241743 -1900566 -1468170 -1126037 -1092827 -1511545 -2186989
19001 -2186989 -2712508 -2831863 -2589174 -2220142 -1722910 -1119444 -634401 -389847 -316189 -247045
18991 -247045 -147968 57230 370708 709862 781636 255429 -631410 -1360003 -1733656 -1823279
18981 -1823279 -1761114 -1653121 -1392312 -987949 -699529 -435552 -34643 319156 438126 104171
18971 104171 -758799 -1848446 -2478899 -2369363 -1766866 -988866 -397978 -148014 -82323 89984
18961 89984 388763 537723 308034 -334777 -1268029 -2532149 -3940302 -4878178 -5040057
18952 -5040057 -4634948 -4050054 -3391108 -2620167 -1850206 -1352203 -1285994 -1461307 -1698545 -2017268
18942b017268l77884l02963J53065Q37909J252257J254900Q98525L29205k51600
18933A776146o78722o56379j87739J50431J69133L2191j57745l28147m62533m27531
18923g70895l18143j63569N4148K24393L94766N19943M32383o5705o76331r78011
18913a347021j037143o99613K2385M31413L45237K71531M19465L99055J91283
18904a003408J03485J65914K86693K29669j45988n29492o34759n41121k33741
18895b302748L24322R23473J278864J139654O04583J23526r8499k21358m45279
18886A326538o32444m84842Q383L30879K51248R2249J69324L93905M58594K03223
18876B117057k27682m96788m41143k61946k32707k52018k12675l73914p05608
$$ plain form
18942 -2017268 -2395152 -2698115 -2545050 -1707141 -454884 800016 1698541 2027746 1776146
18933 1776146 1097424 441045 253306 403737 572870 605061 447316 119169 -343364 -770895
18923 -770895 -1089038 -1252607 -1198459 -974066 -579300 -59357 373026 307321 -369010 -1347021
18913 -1347021 -2384164 -3083777 -3061392 -2629979 -2284742 -2013211 -1593746 -1194691 -1003408
18904 -1003408 -899923 -734009 -447316 -217647 -363635 -893127 -1527886 -2069007 -2302748
18895 -2302748 -1978426 -1054953 223911 1363565 1968148 2091674 1993175 1771817 1326538
18886 1326538 694094 209252 217635 548514 799762 892011 1061335 1455240 1913834 2117057
18876 2117057 1889375 1392587 951444 689498 456791 204773 -7902 -381816 -1087424
18867a087424r60362r63299n82393q2485L40289N08247M84643P27764J175145
18858d39875J470599J243806N88387J84319K39341K19034k69854q69792r41869
18849A424096m17291J32867M44858N60479O35006P39406O55448K61704k13784
18840D222789l15253j79791j23196l31862o54309q08753j032707j388437j365636
18831a977155o78364J77935O80504R25762J008073Q15630M72223J1732l72575
18822A063765m59807k76134j97711k62873r3649J88129L79613N03784M82346L3851
18812A361314p17364j169559j094209n58078J99392P23186P71668O62850L66199
18803E45399j31917m77279o07306n17498l3841K32347n8656l03072l35854l62228
$$ plain form
18867 -1087424 -2047786 -3011085 -3593478 -3675963 -3335674 -2827427 -2342784 -1615020 -439875
18858 -439875 1030724 2274530 2862917 3047236 3286577 3505611 3235757 2365965 1424096
18849 1424096 1006805 1139672 1584530 2145009 2780015 3519421 4174869 4436573 4222789
18840 4222789 3907536 3727745 3604549 3272687 2618378 1809625 776918 -611519 -1977155
18831 -1977155 -2655519 -2477584 -1797080 -871318 136755 952385 1424608 1436340 1063765
18822 1063765 603958 327824 130113 -132760 -226409 -38280 341333 845117 1327463 1361314
18812 1361314 643950 -525609 -1619818 -2177896 -1978504 -1255318 -483650 179200 545399
18803 545399 413482 -63797 -671103 -1188601 -1222442 -990095 -1048751 -1351823 -1687677 -2049905
18793b049905k69243O4052K44735O2286l1625M6472J59113K95442L20271L56650
18783h01752M07806L08787L03072L32851N0248m42810q99466r85841m61130K07892
18773a980343O76188Q40676N35726J49491p6829k21145l26470j48788K25693M46575
18763A20774L58622J99189K10190J63466O0151J2927k81546o85608o87428n21069
18753a050332n24799l40973J06416N85360R48268R82717P27320L79974p884k61705
18743A544362l37434k53924j31941m1860J39842K93802J28977m0566K88756N99887
18733B189901L85224k3382l97297p04469q50131p25856k79678J13239K57516L67650
18723C32717L06397P7094q8559j0650O4790j23226l18765j11897K35910K64274
$$ plain form
18793 -2049905 -2319148 -2255096 -2010361 -1948075 -1979700 -1933228 -1774115 -1478673 -1158402 -801752
18783 -801752 -393946 -85159 217913 550764 601012 158202 -741264 -1727105 -2188235 -1980343
18773 -1980343 -1304155 -463479 72247 221738 144909 -76236 -402706 -551494 -325801 120774
18763 120774 479396 678585 888775 1052241 1112392 1125319 843773 158165 -529263 -1050332
18753 -1050332 -1575131 -1916104 -1809688 -1224328 -276060 706657 1433977 1813951 1806067 1544362
18743 1544362 1206928 953004 821063 779203 919045 1212847 1341824 1301258 1590014 2189901
18733 2189901 2575125 2551743 2154446 1449977 599846 -126010 -405688 -292449 -34933 332717
18723 332717 639114 716208 627649 616999 681789 558563 239798 127901 363811 628085
18713F28085K81789M13601L89296J45035j00993l05109m03416k68500j83340k86920
18703C09528l63068j49949L6865p8127j62397m4955O5491P6296M8196m0373k94243
18692e96736n56102n11622j14394M18938N64453L25020K05430J27371m5145k00741
18682c83528l50711l79100j65739L1421J24142M19715O94577O17248L36802L63353
18672A308180O32874P37135M89712J5442l68914m30008k22271n6267p0915k45685
18662A789283l11572k2504L30324K27660j21980k17525L2284J95665j13577n26250
18652A261808o87687o90672m41971k31098j47539J17082K11635N9742M9005N8111
18642d41584q0955k75345m19228l71081k29358j95548k08674j34699P3116M01253
$$ plain form
18713 628085 909874 1323475 1712771 1857806 1756813 1451704 1048288 779788 596448 309528
18703 309528 -53540 -203489 -166624 -244751 -407148 -452103 -386612 -310316 -262120 -302493 -596736
18692 -596736 -1152838 -1664460 -1778854 -1359916 -795463 -470443 -265013 -137642 -182787 -383528
18682 -383528 -734239 -1113339 -1279078 -1247657 -1123515 -703800 -9223 608025 944827 1308180
18672 1308180 1941054 2678189 3167901 3183343 2814429 2384421 2162150 2105883 2034968 1789283
18662 1789283 1477711 1455207 1785531 2013191 1891211 1673686 1705970 1901635 1788058 1261808
18652 1261808 574121 -116551 -558522 -789620 -937159 -820077 -608442 -548700 -499695 -441584
18642 -441584 -522539 -797884 -1217112 -1588193 -1817551 -2013099 -2221773 -2356472 -2283356 -1882103
18632a882103O30289N60492K27012J1477J02292J55851j61397n56134n13090j80584
18622a605895q836n2385J7776K03704L18709L00565K11846j22859n19133m37288
18612a693796q9391P3067M0218l721J13911L94363N18768K64785k16466l39396
18602i37658O5480M38806N08804M52741M26755M01446K33790j05473l87301n62060
18592E35330o90484m53410o5454M3028J852M9547K15668M50154N57022L01775
18582I45028k8731Q8265N61414Q40165P48405N21275L67666K26574K1473k42727
18572D048807m60070n30528l62334j51624n1194j3255k88495q18112j209197j038642
18562h74644m78813K108L92997N49023K36454j31642j68402j04277n2883L5770
$$ plain form
18632 -1882103 -1251814 -691322 -464310 -452833 -350541 -194690 -356087 -912221 -1425311 -1605895
18622 -1605895 -1614731 -1667116 -1649340 -1445636 -1126927 -826362 -614516 -737375 -1256508 -1693796
18612 -1693796 -1783187 -1710120 -1669902 -1673623 -1559712 -1165349 -646581 -381796 -598262 -937658
18602 -937658 -872178 -433372 75432 528173 954928 1356374 1590164 1484691 1097390 535330
18592 535330 -155154 -608564 -674018 -630990 -629138 -579591 -363923 86231 643253 945028
18582 945028 916297 1004562 1565976 2406141 3154546 3675821 4043487 4270061 4291534 4048807
18572 4048807 3588737 3058209 2695875 2544251 2493057 2479802 2191307 1373195 163998 -874644
18562 -874644 -1353457 -1351349 -958352 -409329 -172875 -304517 -472919 -577196 -630079 -594309
18552e94309J9185P0930L20538L97807L7678k02971J65928M81079K95901n0368
18542I41398k95948l90562l58058l56282k07561J57231N04656N01938J20003j33045
18532D83770j57222k25036l16976k22830q9741l11347p00432q47249p06355l58538
18522c451956J49730O24699O33493K70604J6008N6711J33620j5226k52813l08104
18512b143234p1594J46215L21130N46088N85198L42615P4841O7117K54563M20914
18502E43853O70433R55041Q16454J62474m96096p21815n76086l74517m32462o48427
18492a01148m84046k47335m02723m54030j73724J20600L84418P13419J056841
18483D12272J100498O12991j3402l22241l18919k64328j74627P0096M51011P73801
$$ plain form
18552 -594309 -575124 -504194 -183656 214151 251829 48858 214786 695865 991766 941398
18542 941398 645450 254888 -103170 -459452 -667013 -509782 -5126 496812 616815 483770
18532 483770 326548 101512 -215464 -438294 -528035 -839382 -1539814 -2387063 -3093418 -3451956
18522 -3451956 -3302226 -2677527 -2044034 -1773430 -1757422 -1700711 -1567091 -1582317 -1835130 -2143234
18512 -2143234 -2214828 -2068613 -1747483 -1201395 -616197 -273582 -198741 -131624 122939 543853
18502 543853 1214286 2169327 2985781 3148255 2652159 1930344 1354258 979741 547279 -101148
18492 -101148 -585194 -832529 -1235252 -1689282 -1863006 -1742406 -1357988 -644569 412272
18483 412272 1512770 2125761 2112359 1790118 1471199 1206871 1032244 1102340 1553351 2327152
18473B327152R30439O69255M7058l20803l40758k64877j99640k13822l05265l65644
18463A963095j94719m8113p4788j86826n21122p02718l69167j9673o2681k76049
18453d92761l20571j66143O6246K73817M10797M16933K53707M2111o9027k2141
18443C92968J29632K41139K04118J04034O0741l4487k16568k35225J17463N01939
18433A265754M35758K8072l38916o47980p53604m15839J50378M76608M96110L62295
18423A058636O9373j72601o5097P6931P9261R5870L416k23013j38722K25866J59120
18412A169040k43617l84510l23690r3627K26026L51140K23555O9089O7762k0000
18402A041168l39278n37722l72987m7893K07766J19027k09767m82387o17580p65785
$$ plain form
18473 2327152 3257591 3926846 3973904 3653101 3312343 3047466 2847826 2634004 2328739 1963095
18463 1963095 1768376 1720263 1645475 1458649 937527 234809 -134358 -154031 -216712 -492761
18453 -492761 -813332 -979475 -913229 -639412 -228615 188318 442025 484136 415109 392968
18443 392968 522600 763739 967857 1071891 1132632 1098145 881577 646352 763815 1265754
18433 1265754 1701512 1729584 1390668 742688 -10916 -426755 -276377 200231 696341 1058636
18423 1058636 1128009 955408 890311 967242 1046503 1142373 1145789 922776 784054 1009920 1169040
18412 1169040 925423 540913 217223 123596 349622 700762 924317 993406 1061168 1041168
18402 1041168 701890 164168 -208819 -256712 -48946 70081 -139686 -622073 -1239653 -2005438
18392b005438o82295j72129M00057O91538O65219N47767L97397K52646J17265
18383B12027j20170p6603M60697Q09436N49074J00717k17249m88286n70561m28953
18373B30129k98669m13878m31781j57100J03090L14573O30826P64624O34707M86826
18363A863347L43771J85951o0069l64327n39228m99600l01704j80118j70758k98523
18353b1258l85756k72610m029K33601K80454K57950L49508M58670K30160k16027
18343I10663k71245J73394L43046k43029q97430q87107o28453m33317j0424N32664
18333a411238O79989K73406k00040l83334j27301K88122K94243J31449J86459
18324b68245K88083L26669L91283L24080O1586k67109l90320k11847k0404R8176
$$ plain form
18392 -2005438 -2687733 -2859862 -2459805 -1768267 -1103048 -555281 -157884 94762 212027
18383 212027 91857 15254 475951 1285387 1834461 1935178 1717929 1229643 659082 230129
18373 230129 -68540 -482418 -914199 -1071299 -968209 -653636 -22810 741814 1376521 1863347
18363 1863347 2207118 2393069 2333000 1968673 1429445 929845 628141 448023 277265 -21258
18353 -21258 -407014 -679624 -683653 -450052 -169598 88352 437860 896530 1126690 910663
18343 910663 639418 812812 1155858 912829 15399 -871708 -1500161 -1933478 -1943902 -1411238
18333 -1411238 -731249 -457843 -657883 -1041217 -1168518 -880396 -586153 -454704 -268245
18324 -268245 19838 346507 737790 1061870 1123456 856347 466027 254180 233776 331952
18314C31952K41710L73450K30498o4482k01010l79887n85048p60622r63140r63682
18304b740261l07815N29183P43998M16268l7056k69024l21115l37952j84322N7486
18294b450610K38363L00200L06355L58527M37453J94895k87483n82143n07027
18285a991470m8591L20785K30626J56681J48557J34856K13219J30974j68048m35853
18275a308264o01757n97473l57027p4264l9585j62066j77896L7318L10971M55947
18265b514096O35396O91652K00667l57479k67353J39524M57919M18331N1149o273
18255e50563J55313J47641J15289L15561M31902K35747q1733k81558k35718j81899
18245F9982l09908n73226o78247m63814j86777N5202M43436O99408N33344k6986
$$ plain form
18314 331952 573662 947112 1177610 1113128 912118 532231 -52817 -813439 -1776579 -2740261
18304 -2740261 -3048076 -2518893 -1774895 -1358627 -1395683 -1664707 -1985822 -2323774 -2508096 -2450610
18294 -2450610 -2212247 -1912047 -1605692 -1247165 -809712 -614817 -902300 -1484443 -1991470
18285 -1991470 -2040061 -1719276 -1488650 -1331969 -1183412 -1048556 -835337 -704363 -872411 -1308264
18275 -1308264 -1910021 -2507494 -2864521 -2938785 -2978370 -3140436 -3318332 -3281014 -2970043 -2514096
18265 -2514096 -1878700 -1187048 -986381 -1343860 -1611213 -1471689 -1013770 -595439 -544290 -550563
18255 -550563 -395250 -247609 -132320 183241 615143 850890 769157 487599 251881 69982
18245 69982 -239926 -813152 -1491399 -1955213 -2141990 -2086788 -1643352 -943944 -410600 -437586
18235d37586o59988q84989o09964j12151K51718N14401O15934N71386N03897L42404
18225I5062K32071J12024k10373n29543n83843l39545r0131j39846j70019M9049
18215a575094J03019k6959Q7992L67209L94843K08484K6707j93662n40450q63459
18205b011370o90783j72901K11150M07567N45835Q22397J179285J086079N24504
18196A901763p7105n57147p91905p93682o83513m71560l08900l16780l14066j33027
18186b545922P9315K24570L47986N03260N67142M79580L12793J82611O8303r7595
18176A22043k50302j64558J61087K04705N1933O3975K40397M64543M66725J99579
18166A560127r1129j67698K6069J83852J39916R7625J47289J8333l11805n03457
$$ plain form
18235 -437586 -1097574 -1982563 -2592527 -2704678 -2452960 -1938559 -1322625 -751239 -247342 95062
18225 95062 327133 439157 228784 -300759 -884602 -1224147 -1314278 -1454124 -1624143 -1575094
18215 -1575094 -1472075 -1499034 -1411042 -1043833 -648990 -440506 -413799 -607461 -1147911 -2011370
18205 -2011370 -2702153 -2875054 -2663904 -2256337 -1710502 -888105 291180 1377259 1901763
18196 1901763 1824658 1267511 475606 -318076 -1001589 -1473149 -1782049 -2098829 -2412895 -2545922
18186 -2545922 -2466607 -2242037 -1894051 -1390791 -823649 -344069 -31276 151335 219638 122043
18176 122043 -128259 -292817 -131730 72975 124908 188883 429280 893823 1360548 1560127
18166 1560127 1468998 1301300 1327369 1511221 1651137 1748762 1896051 1914384 1602579 1099122
18156A099122n70783p00989p12838l96770j42767j54095j75651l9413Q3679J38495
18146a572010K43669J99334K1683n9903q7659j18777o7329J12560K09621J23754
18136i95057p9853m46814r19783j131529o94804J92308R28427R81525M95803O7365
18126a602412J12493M47954O68287P77914O96131M09481K81453K48217J73781
18117B213299j05727o25409r23100j089287j293963j165646m31963O28255J320605
18108a472936J489685J270547O45897n616k82910n58663j008131r26042l48620
18099a196789J22139K97216Q6722r4297J63201N51245O70195N17601K03734m1153
18089A279814L6081J52643k0599l69351m11543j57288J23593K62759J3341m00183
$$ plain form
18156 1099122 528339 -172650 -885488 -1282258 -1425025 -1579120 -1754771 -1794184 -1710505 -1572010
18146 -1572010 -1328341 -1129007 -1107324 -1167227 -1254886 -1373663 -1440992 -1328432 -1118811 -995057
18136 -995057 -1074910 -1521724 -2441507 -3573036 -4267840 -4075532 -3147105 -2165580 -1669777 -1602412
18126 -1602412 -1489919 -1041965 -373678 404236 1100367 1509848 1791301 2039518 2213299
18117 2213299 2107572 1482163 559063 -530224 -1824187 -2989833 -3421796 -2793541 -1472936
18108 -1472936 16749 1287296 1933193 1927577 1644667 1086004 77873 -848169 -1196789
18099 -1196789 -1074650 -777434 -690712 -785009 -621808 -70563 599632 1117233 1320967 1279814
18089 1279814 1315895 1468538 1447939 1078588 667045 509757 633350 896109 909450 509267
18079E09267n76149m76775k61172r5597k4116l7840j59766j99457q5042O6020
18069a340627J97142K24287N5486k45245k27415l6653n0147k60101m43564l39240
18059b466077L1825K39042J94108K11723M07595N23521K11192n5074J43330M13231
18049a45584K32566n7215M522J7249j52694l38711l40182K0153K86239K56695
18039b16962j4345m57653o33134l25839O5308Q0961m7654k41553n35952n74855
18029b901678j33004N11875P80139M53062L9114L422J82158J85611J4539r5986
18019i60748M8115K82240M20659N23561N70037L97883L26812M46956K84552j54527
18009B185540m66358o55565p53841o65378m04180j30552j72404j86995O3399L28179
$$ plain form
18079 509267 -66882 -543657 -804829 -900426 -924542 -962382 -1122148 -1321605 -1406647 -1340627
18069 -1340627 -1143485 -919198 -863712 -1108957 -1336372 -1373025 -1423172 -1683273 -2126837 -2466077
18059 -2466077 -2434252 -2195210 -2001102 -1789379 -1381784 -858263 -647071 -702145 -558815 -145584
18049 -145584 86982 29767 34289 51538 -101156 -439867 -780049 -759896 -473657 -216962
18039 -216962 -231307 -688960 -1322094 -1647933 -1582625 -1501664 -1549318 -1790871 -2326823 -2901678
18029 -2901678 -3034682 -2522807 -1742668 -1289606 -1250492 -1247070 -1064912 -879301 -864762 -960748
18019 -960748 -912633 -630393 -209734 313827 883864 1281747 1608559 2055515 2340067 2185540
18009 2185540 1719182 1063617 309776 -355602 -759782 -890334 -1062738 -1249733 -1186334 -858155
17999h58155M19410N63344P23533N53426L1259l28004k04608R2770K63375K36672
17989A493022Q2647k03478n69593o92645n52413m50174j62266K80807K98529P532
17979d68032m2463L11362P11653P05965L81382L9634j53926M1999M16100L67008
17969B310682j62977o46217n15934n5474K10418L17423L76093L13956Q4596k07896
17959B024670m57381m89147k65250n4405o2792l03406n91049m36364J47008N33032
17949D4916O80556N76288j6430o57212p54505n23614m66647n02090k98816r1637
17939b009191l1791p9049k59332p6159L96963O23334N54605K94531j44015l19686
17929a049790k07228k13110j17656J69448O07199J023533J022450N37900k19565
$$ plain form
17999 -858155 -438745 124599 848132 1401558 1432817 1104813 900205 992975 1256350 1493022
17989 1493022 1575669 1372191 802598 109953 -442460 -892634 -1054900 -774093 -475564 -468032
17979 -468032 -510495 -199133 512520 1218485 1599867 1639501 1485575 1527574 1943674 2310682
17969 2310682 2147705 1501488 985554 930080 1140498 1457921 1834014 2147970 2232566 2024670
17959 2024670 1567289 1078142 812892 758487 695695 392289 -198760 -635124 -488116 44916
17949 44916 725472 1301760 1285330 628118 -126387 -650001 -1116648 -1618738 -1917554 -2009191
17939 -2009191 -2040982 -2120031 -2379363 -2455522 -2058559 -1435225 -880620 -586089 -730104 -1049790
17929 -1049790 -1257018 -1470128 -1587784 -1418336 -811137 212396 1234846 1772746 1553181
17920A553181p30345n80939j8216M61506N67948K63571k52166o06350n35294l11526
17910a88630m35035q51765j035545q02556l85680j34726K0320L01140O64067Q79539
17900a968871P31731L28956J09880K00875L76000M59151L41522L32530L46948
17891A258722K36102K92555M23401K19044l25689p33314p25190m24484J20554
17882C41701N09196K37197l39763p85857j002395j055273j188433j009302j12334
17873d405263P21799Q29950L69296l43972p07213l73823O32J81228M92945O78567
17863b555854M57531K22313K14769r8584o15654m26867K69837P30294N61311k77305
17853a518209r84344r11530m76867M9366O85316R31305N86375K69131K26112P6138
$$ plain form
17920 1553181 822836 241897 223681 685187 1253135 1516706 1264540 658190 122896 -188630
17910 -188630 -623665 -1475430 -2510975 -3313531 -3699211 -3833937 -3813617 -3512477 -2848410 -1968871
17900 -1968871 -1237140 -908184 -798304 -597429 -221429 237722 579244 911774 1258722
17891 1258722 1494824 1787379 2210780 2429824 2104135 1370821 645631 221147 341701
17882 341701 850897 1088094 748331 -37526 -1039921 -2095194 -3283627 -4292929 -4405263
17873 -4405263 -3683464 -2853514 -2484218 -2828190 -3535403 -3909226 -3908594 -3727366 -3234421 -2555854
17863 -2555854 -2098323 -1876010 -1661241 -1759825 -2375479 -2802346 -2532509 -1802215 -1240904 -1518209
17853 -1518209 -2502553 -3414083 -3890950 -3841584 -3156268 -2224963 -1638588 -1369457 -1143345 -1067207
17843a067207k57815k00001L48095P31286O17494K71940P4325J16691P9462k10000
17833E04270n38165n51991k98701r6436j3306j97765n44870o53607k96131J35781
17823b550921J93117J34267M18783R19409J001660P75219O67561M90781K91063
17814B340939K62794L56878J77858k44528m32799q9080L72250K15085k12160l69132
17804B378105k32150J00406J74437j44277n59895o95692n19638l60767m47048
17795c06519o19478p59044q80605q54139q21147p99195n47405r3926K77456N79908
17785d824094Q82033R36600P45482N08440L18651K81889L75767M29196J39436
17776b06600k84714k44647N5754K07797L42452M84558M83891L61429J04406l20271
$$ plain form
17843 -1067207 -1325022 -1525023 -1176928 -445642 171852 443792 518117 634808 714270 504270
17833 504270 -33895 -585886 -884587 -981023 -994329 -1192094 -1736964 -2390571 -2686702 -2550921
17823 -2550921 -2357804 -2223537 -1804754 -885345 116315 891534 1559095 2049876 2340939
17814 2340939 2603733 2960611 3138469 2893941 2461142 2372062 2744312 2959397 2747237 2378105
17804 2378105 2145955 2246361 2420798 2276521 1716626 1020934 501296 140529 -306519
17795 -306519 -925997 -1685041 -2565646 -3419785 -4240932 -5040127 -5587532 -5681458 -5404002 -4824094
17785 -4824094 -3942061 -3005461 -2259979 -1751539 -1432888 -1150999 -775232 -346036 -206600
17776 -206600 -491314 -735961 -680207 -472410 -129958 354600 838491 1199920 1304326 984055
17766I84055o84002p24293n17854l23267k28307k90788l65524j91409J15822K38396
17756a987171K10818L11626N76717P53934N98969K59557P8792L1762M0897R6878
17746I72779K53142M28417L40574j13642p39144j099675q75587l77944N9296L65261
17736g86523O23001P84658O97584M84451K07434n2622k14501k50313k02089q4116
17726A206964q485R446K36168O53851O85106J16209l76674k53193K33016O80177
17716C182585P23604L17948k74893n72236l26353J0292m3923n10033j043305j180096
17706B83590r75532o21137k54035k37511l46846j36324K22999M95268P04801P32539
17696a32188M76862l0394n88533q64079m58703N00961J140215R75271K97376j24968
$$ plain form
17766 984055 300053 -424240 -942094 -1265361 -1493668 -1784456 -2149980 -2341389 -2225567 -1987171
17756 -1987171 -1776353 -1464727 -888010 -134076 464893 724450 803242 835004 875901 972779
17746 972779 1225921 1654338 1994912 1881270 1142126 42451 -833136 -1211080 -1151784 -786523
17736 -786523 -163522 621136 1318720 1803171 2010605 1957983 1743482 1493169 1291080 1206964
17726 1206964 1198479 1207925 1444093 2097944 2783050 2899259 2522585 2269392 2502408 3182585
17716 3182585 3906189 4224137 3949244 3377008 3050655 3060947 3017024 2506991 1463686 283590
17706 283590 -691942 -1313079 -1567114 -1804625 -2151471 -2287795 -2064796 -1569528 -864727 -132188
17696 -132188 344674 314280 -274253 -1138332 -1597035 -1096074 44141 1019412 1316788 1191820
17686A191820r2078p429K6535J22560M8015k65067l61988k59477l27734k69403
17676a94246q8636j77726m28597k59157L63359O65472L84651k0669j57198P482
17666I4735L48847N15809L93381L18423L13488J88763n7591k23854N0212O10575
17656B552788P05334M6001p40594r74046p67268p00796q15981q23986m91043J38427
17646a871164M72398M85588N52861Q01823J010067N91249m83890j371220j393571
17637a205859p30907Q4283O85874Q08153L94367J88023M05609L77366q3644o54119
17627B69146r84466q50974n66743n40663n21926k17709Q4392J54407J88629L29335
17617b656572N50313Q18092J070512J026190O38107J44818k27316k12053K02243
$$ plain form
17686 1191820 1099742 1092313 1118848 1241408 1289423 1024356 662368 402891 75157 -194246
17676 -194246 -282882 -460608 -889205 -1148362 -785003 -119531 265120 244451 87253 94735
17666 94735 443582 959391 1352772 1671195 1984683 2173446 2115855 1892001 1942213 2552788
17656 2552788 3258122 3304123 2563529 1589483 822215 121419 -694562 -1518548 -2009591 -1871164
17646 -1871164 -1398766 -913178 -360317 441506 1451573 2042822 1558932 187712 -1205859
17637 -1205859 -1936766 -1852483 -1166609 -358456 35911 223934 629543 1006909 923265 269146
17627 269146 -715320 -1566294 -2133037 -2673700 -3195626 -3413335 -3328943 -3174536 -2985907 -2656572
17617 -2656572 -2106259 -1288167 -217655 808535 1446642 1591460 1364144 1152091 1354334
17608A354334O34283Q49677Q41752N61027K35606O1256q7083l20305n49070n79368
17598C002109l74319o3616J98365L73045N26411N04147L7701l83804k95175k30955
17588C293909m36682l20980L66618R77004J169515J115308P54770J92533l11497
17579F800498n93004n10375m34974m74433n83185p11190p05964o97566p23402
17570A366405q64569r54113m94549K13140M41739K15692J0117J18277L40687K01289
17560E94115j54549k55918j07306o4322j71039l30577k80740p2073P6857P1377
17550f94175J0336k9237k07048m91145n87445k46908K73724N79829N32585M09692
17540d49792N57867P08084O28476K28928l57449p31839q92435r42284q08299o08556
$$ plain form
17608 1354334 1988617 2838294 3680046 4241073 4476679 4537935 4450852 4130547 3581477 3002109
17598 3002109 2627790 2564174 2762539 3135584 3661995 4166142 4203843 3820039 3524864 3293909
17588 3293909 2857227 2536247 2902865 3879869 5049384 6164692 6919462 7111995 6800498
17579 6800498 6207494 5697119 5262145 4787712 4204527 3493337 2787373 2089807 1366405
17570 1366405 501836 -452277 -946826 -733686 -291947 -76255 -66138 52139 392826 594115
17560 594115 439566 183648 76342 12020 -159019 -489596 -770336 -842409 -765552 -694175
17550 -694175 -683839 -713076 -920124 -1411269 -1998714 -2245622 -1971898 -1392069 -859484 -449792
17540 -449792 108075 816159 1444635 1673563 1316114 584275 -308160 -1250444 -2058743 -2667299
17530b667299l33730P0423K97755K95327L49035M05839M24642L46721P9543R487
17520g22257J68341L21170L40907M4756k72377k59179j32743N3806N21934R81054
17510A045412R40564M60289j18722m36817k18963L32487N58307J77363l25321
17501B414599m50714m46995o51063r15591q94658o08736n4130M34463M92955L92354
17491b87516L39437L01900K49519J22848k3256L9270J80881J62670M7723N3161
17481A186637K92721M82731K19988k54017l33808N864L02642L91711J39240k61095
17471B172614n04733p26415q00174m60354o3871r8996l17954k26329J40284K89587
17461e96341K5515k82690m02577l75112k23683l8494L53632Q08614P40929K66477
$$ plain form
17530 -2667299 -3001029 -2930606 -2632851 -2337524 -1988489 -1582650 -1158008 -811287 -731744 -722257
17520 -722257 -553916 -232746 108161 152917 -119460 -378639 -511382 -457576 64358 1045412
17510 1045412 1985976 2446265 2327543 1890726 1671763 2004250 2562557 2739920 2414599
17501 2414599 1963885 1516890 865827 -49764 -944422 -1553158 -1607288 -1172825 -679870 -287516
17491 -287516 51921 353821 603340 726188 702932 742202 923083 1085753 1133476 1186637
17481 1186637 1479358 1962089 2182077 1928060 1594252 1600116 1902758 2294469 2433709 2172614
17471 2172614 1667881 941466 141292 -319062 -382933 -481929 -799883 -1026212 -885928 -596341
17461 -596341 -570826 -853516 -1256093 -1631205 -1854888 -1893382 -1539750 -731136 9793 276270
17451B76270p4640l03073o41104q46364n07042J67485O61914P03564N76823N73483
17441E87316M52616R5005j24283p0818P5088J61586M8039p5663M5474L02324N17367
17430B014051M39178K07011M3166r5296k16747k42426p2011K59516K91155j43692
17420B483905n12154o86277q16887p34932m87706k49050l8476J85012K83519K19319
17410c53727J28178J78641K84382J73312q1113k32568J3560N12258M57585k89312
17400G91196p45587m09376J15537J37003l54375o70348m93927l91690m31931j53503
17390b607001L72342P87976R23400Q34919O36984K35583l71650q42099j152345
17381a181891j273363j001462l47468L43228O93480O78641O08963O34365L71474
$$ plain form
17451 276270 201630 -101443 -742547 -1588911 -2095953 -1928468 -1266554 -562990 13833 587316
17441 587316 1039932 1134937 1010654 939836 1014924 1176510 1224549 1148886 1194360 1496684 2014051
17430 2014051 2453229 2660240 2703406 2608110 2391363 2148937 2076926 2336442 2627597 2483905
17420 2483905 1971751 1285474 468587 -266345 -754051 -1003101 -1041577 -856565 -573046 -353727
17410 -353727 -225549 -46908 237474 410786 329673 97105 110665 622923 1080508 791196
17400 791196 45609 -363767 -248230 -111227 -465602 -1135950 -1629877 -2021567 -2453498 -2607001
17390 -2607001 -2234659 -1446683 -523283 311636 948620 1184203 812553 -29546 -1181891
17381 -1181891 -2455254 -3456716 -3804184 -3460956 -2767476 -2088835 -1479872 -845507 -474033
17372d74033k31414o15862m66289L922L58431M99252N23186L50782p0134n18140
17362f40299o33539l54783O8606N81565Q25789O01014J97559k28363n21973m57256
17352e61680k28144P3227L25011L31270K60555j0747j91009O8819M22354N56310
17342A045966M36351J87563r8034j68484j33609k93551k71169Q2067M43925N12052
17332A743077K08113l95055r76517j011294m23492Q2450J74368K4049k02307m47135
17322a223743m92196j44439K63724M31621K94077j27426l66450k82508N8151M46319
17312a142870L66394j45819m93424m52275k30881j00613j13952j11733j26355
17303b551528j47451L6438K11950L67027N50071M62879K30081J52067R2118O4396
$$ plain form
17372 -474033 -705447 -1321309 -1787598 -1783676 -1425245 -925993 -402807 -52025 -122159 -640299
17362 -640299 -1273838 -1628621 -1560015 -978450 -152661 448353 645912 417549 -104424 -561680
17352 -561680 -789824 -716597 -391586 -60316 200239 189492 -1517 67302 489656 1045966
17342 1045966 1482317 1669880 1571846 1403362 1269753 976202 705033 787100 1231025 1743077
17332 1743077 1951190 1556135 579618 -431676 -855168 -772718 -598350 -574301 -776608 -1223743
17322 -1223743 -1715939 -1860378 -1596654 -1165033 -870956 -998382 -1364832 -1647340 -1589189 -1142870
17312 -1142870 -776476 -922295 -1415719 -1867994 -2098875 -2199488 -2313440 -2425173 -2551528
17303 -2551528 -2698979 -2662541 -2450591 -2083564 -1533493 -1070614 -840533 -688466 -596348 -531952
17293e31952J39303K86673O49225J042477J057198M67337l56467p81724p23601
17284A248469m65628j27492J00277J10793j21713m60377o26408n87113m65452
17275a394644k67127J18115O32414J037406J069252N98587J12155J83008K90041
17266B379207q7987m80046n43792k54360J34956L29374L31868J50537j00479l21715
17256A537563n50921p38703o30054j61607K36915M08383O83239Q93581R91407
17247B669803R22205M88282k81687r93388j029414n57636l20546m08776l54209
17238A34634j94080o475N3622k60993m96682k93634J10404M08407M00816K55117
17228A11136K02767P2769k13046k69698L1737K83413M69954O37966O82087O83097
$$ plain form
17293 -531952 -392649 -105976 543249 1585726 2642924 3110261 2753794 1972070 1248469
17284 1248469 782841 655349 755626 866419 744706 284329 -342079 -929192 -1394644
17275 -1394644 -1661771 -1543656 -911242 126164 1195416 1794003 1906158 2089166 2379207
17266 2379207 2291220 1811174 1267382 1013022 1147978 1477352 1809220 1959757 1859278 1537563
17256 1537563 986642 247939 -382115 -543722 -306807 101576 784815 1678396 2669803
17247 2669803 3592008 4080290 3798603 2805215 1775801 1218165 897619 488843 134634
17238 134634 -59446 -65921 -12299 -273292 -769974 -1063608 -953204 -544797 -143981 111136
17228 111136 313903 386672 173626 -96072 -64335 219078 689032 1326998 2009085 2692182
17218B692182L59945l81694j019680j115582o87028m12277m93692j81786N71350
17209f68262J033695R08772L21098k39448m98220n08964l41143m3313J2791k60517
17199b83511m14141m57073o41344p13296m04072O99K98989L87358J31384j00069
$$ plain form
17218 2692182 3052127 2670433 1650753 535171 -151857 -564134 -1057826 -1239612 -668262
17209 -668262 365433 1274205 1595303 1355855 857635 348671 7528 -35785 -22994 -283511
17199 -283511 -697652 -1154725 -1796069 -2509365 -2913437 -2912738 -2613749 -2226391 -2095007 -2195076
$$ [...]
##END NTUPLES=NMR SPECTRUM
##END=
