##TITLE=C13_SR-167-R23_TFA
 CDCl3, 22600 sc

 25.12.2023
##JCAMPDX= 6.0         $$ Bruker NMR JCAMP-DX V2.0
##DATA TYPE= NMR SPECTRUM
##DATA CLASS= NTUPLES
##ORIGIN= UXNMR, Bruker Analytische Messtechnik GmbH
##OWNER= root
$$ XWIN-NMR		Version 3.5
$$ Tue Dec 26 13:45:40 2023 Russian Standard Time (UT+4h)  she@DPX200
##.OBSERVE FREQUENCY= 50.327896
##.OBSERVE NUCLEUS= ^13C
##.ACQUISITION MODE= SIMULTANEOUS
##.ACQUISITION SCHEME= undefined
##.AVERAGES= 22601
##.DIGITISER RES= 17
##SPECTROMETER/DATA SYSTEM= spect
##.PULSE SEQUENCE= zgpg30
##.SOLVENT NAME= CDCl3
##.SHIFT REFERENCE= (INTERNAL, CDCl3, 0, 222.624)
##AUDIT TRAIL= $$ (NUMBER, WHEN, WHO, WHERE, WHAT)
$$ ##TITLE= Audit trail, XWIN-NMR		Version 3.5
$$ ##JCAMPDX= 5.01
$$ ##ORIGIN= Bruker BioSpin GmbH
$$ ##OWNER= she
$$ F:/spectra/data/she/nmr/c13/1/pdata/1/auditp.txt
$$ ##AUDIT TRAIL=  $$ (NUMBER, WHEN, WHO, WHERE, WHAT)
(   1,<2023-12-26 13:43:38.78 +0400>,<she>,<DPX200>,
      <created by zg, POWCHK disabled, PULCHK disabled
       terminated by command 'halt'
       configuration hash MD5:
       00 E9 B6 7A A2 85 ED C7 34 08 36 98 17 FE 4E 26
       data hash MD5: 32K
       31 C7 CA 9B 17 F9 28 3C E6 1D 7B EB 29 CA FC 8D>)
(   2,<2023-12-26 13:43:42.01 +0400>,<she>,<DPX200>,
      <Start of raw data processing
       efp BC_mod = 2 LB = 2 FT_mod = 6 PKNL = 1 PHC0 = -369.9091 PHC1 = 20.53753 SI = 32K 
       data hash MD5: 32K
       6B 06 C1 12 0B BB 3D AA 76 7E E3 B4 A0 BC CD C4>)
(   3,<2023-12-26 13:43:45.51 +0400>,<she>,<DPX200>,
      <abs ABSG = 5 
       data hash MD5: 32K
       4E 73 7C 4C A4 AE 72 46 7E E7 BC E6 29 44 D0 C1>)
(   4,<2023-12-26 13:44:09.98 +0400>,<she>,<DPX200>,
      <pk PHC0 = -3.493769 PHC1 = 5.199999 
       data hash MD5: 32K
       6B 5C 3A C6 84 1F 4B 80 14 97 CB E5 9E 3A 40 8E>)
(   5,<2023-12-26 13:44:13.20 +0400>,<she>,<DPX200>,
      <abs ABSG = 5 
       data hash MD5: 32K
       5E 85 B4 22 0A 27 84 75 D6 DC 61 DC 35 E0 80 B1>)
(   6,<2023-12-26 13:44:59.85 +0400>,<she>,<DPX200>,
      <pk PHC0 = 1.516794 PHC1 = -2.199995 
       data hash MD5: 32K
       35 8F 8B F2 C9 37 20 47 47 5F AE C6 2D 9F F3 0C>)
(   7,<2023-12-26 13:45:03.14 +0400>,<she>,<DPX200>,
      <abs ABSG = 5 
       data hash MD5: 32K
       3A E4 75 FF E7 9D 2E 31 24 50 E3 F9 8C 4D E6 C8>)
$$ ##END=
$$ 
$$ hash MD5
$$ E7 32 B6 B1 77 27 6F 50 A1 89 B7 CE 20 4A 42 7B
##$RELAX= 
##$RELAX= 
##$RELAX= 
##$RELAX= 
##$RELAX= 
##$RELAX= 
##$RELAX= 
##$RELAX= 
$$ Bruker specific parameters
$$ --------------------------
##$DU= <F:/spectra>
##$EXPNO= 1
##$NAME= <c13>
##$PROCNO= 1
##$TYPE= <nmr>
##$USER= <she>
##$AMP= (0..31)
100 100 100 100 100 100 100 100 100 100 100 100 100 100 100 100 100 100 
100 100 100 100 100 100 100 100 100 100 100 100 100 100 
##$AQSEQ= 0
##$AQ_mod= 1
##$AUNM= <au_zg>
##$AUTOPOS= <>
##$BF1= 50.322709
##$BF2= 200.13
##$BF3= 50.322709
##$BF4= 500.13
##$BF5= 500.13
##$BF6= 500.13
##$BF7= 500.13
##$BF8= 500.13
##$BYTORDA= 1
##$CFDGTYP= 0
##$CFRGTYP= 5
$$ [...]
##$SUBNAM4= <"">
##$SUBNAM5= <"">
##$SUBNAM6= <"">
##$SUBNAM7= <"">
##$SUBNAM8= <"">
##$SUBNAM9= <"">
##$SW= 239.972175391363
##$SWIBOX= (0..15)
0 1 3 0 0 0 0 0 0 0 0 0 0 0 0 0 
##$SW_h= 12077.2946859903
##$TD= 32768
##$TD0= 1
##$TE= 0
##$TE2= 300
##$TE3= 300
##$TEG= 300
##$TL= (0..7)
120 120 120 120 120 120 120 120 
##$TP= (0..7)
150 150 150 150 150 150 150 150 
##$TP07= 0
##$TPNAME0= <>
##$TPNAME1= <>
##$TPNAME2= <>
##$TPNAME3= <>
##$TPNAME4= <>
##$TPNAME5= <>
##$TPNAME6= <>
##$TPNAME7= <>
##$TPOAL= (0..7)
0.5 0.5 0.5 0.5 0.5 0.5 0.5 0.5 
##$TPOFFS= (0..7)
0 0 0 0 0 0 0 0 
##$TUNHIN= 0
##$TUNHOUT= 0
##$TUNXOUT= 0
##$USERA1= <user>
##$USERA2= <user>
##$USERA3= <user>
##$USERA4= <user>
##$USERA5= <user>
##$V9= 5
##$VALIST= <valist>
##$VCLIST= <CCCCCCCCCCCCCCC>
##$VD= 0
##$VDLIST= <DDDDDDDDDDDDDDD>
##$VPLIST= <PPPPPPPPPPPPPPP>
##$VTLIST= <TTTTTTTTTTTTTTT>
##$WBST= 1024
##$WBSW= 4
##$XGAIN= (0..3)
0 0 0 0 
##$XL= 0
##$YL= 0
##$YMAX_a= 144484489
##$YMIN_a= -104138583
##$ZGOPTNS= <>
##$ZL1= 120
##$ZL2= 120
##$ZL3= 120
##$ZL4= 120
##$ABSF1= 222.624
##$ABSF2= -17.3728
##$ABSG= 5
##$ABSL= 3
##$ALPHA= 0
##$AQORDER= 0
##$ASSFAC= 0
##$ASSFACI= 0
##$ASSFACX= 0
##$ASSWID= 0
##$AUNMP= <proc_1d>
##$AZFE= 0.1
##$AZFW= 0.5
##$BCFW= 0
##$BC_mod= 2
##$BYTORDP= 0
##$COROFFS= 0
##$CY= -3
##$DATMOD= 1
##$DC= 0
##$DFILT= <>
##$DTYPP= 0
##$F1P= 0
##$F2P= 0
##$FCOR= 0.5
##$FTSIZE= 32768
##$FT_mod= 6
##$GAMMA= 0
##$GB= 0
##$INTBC= 1
##$INTSCL= 4.134877e-10
##$ISEN= 128
##$LB= 2
##$LEV0= 0
##$LPBIN= 0
##$MAXI= 10000
##$MC2= 0
##$MEAN= 0
##$ME_mod= 0
##$MI= 0.1934396
##$NCOEF= 0
##$NC_proc= 1
##$NLEV= 6
##$NOISF1= 120.0001
##$NOISF2= 80.00006
##$NSP= 0
##$NTH_PI= 0
##$NZP= 0
##$OFFSET= 222.624
##$PC= 1.4
##$PHC0= -371.8861
##$PHC1= 23.53753
##$PH_mod= 1
##$PKNL= yes
##$PPARMOD= 0
##$PSCAL= 0
##$PSIGN= 0
##$REVERSE= no
##$SF= 50.3227315983092
##$SI= 32768
##$SIGF1= 140
##$SIGF2= 120
##$SINO= 11.81781
##$SIOLD= 32768
##$SREGLST= <13C.CDCl3>
##$SSB= 0
##$STSI= 32768
##$STSR= 0
##$SW_p= 12077.2946859903
##$SYMM= 0
##$S_DEV= 0
##$TDeff= 32768
##$TDoff= 0
##$TI= <>
##$TILT= no
##$TM1= 0
##$TM2= 0
##$TOPLEV= 0
##$USERP1= <user>
##$USERP2= <user>
##$USERP3= <user>
##$USERP4= <user>
##$USERP5= <user>
##$WDW= 1
##$XDIM= 32768
##$YMAX_p= 532012699
##$YMIN_p= -3440557
$$ End of Bruker specific parameters
$$ ---------------------------------
##NTUPLES= NMR SPECTRUM
##VAR_NAME=  FREQUENCY,     SPECTRUM/REAL,   SPECTRUM/IMAG
##SYMBOL=    X,             R,               I
##VAR_TYPE=  INDEPENDENT,   DEPENDENT,       DEPENDENT
##VAR_FORM=  AFFN,          ASDF,            ASDF
##VAR_DIM=   32768,         32768,           32768
##UNITS=     HZ,            ARBITRARY UNITS, ARBITRARY UNITS
##FACTOR=    0.368581032318806, 1,           1
##FIRST=     11203.0474430531, 0,            0
##LAST=      -874.247242937185, 0,           0
##MIN=       -874.247242937185, -3440557,    0
##MAX=       11203.0474430531, 532012699,    0
$$ Real data points
##PAGE= N=1
##DATA TABLE= (X++(R..R)), XYDATA
$$ [...]
15913C64445j02827k0006M1670J72360K26502J32534R0369P6642n5886k57010
$$ 364445 261618 241612 283282 455642 682144 814678 905047 981689 925803 668793
15903F68793l37274k85134k11885j27560p5771n0776K2548J09069J22982M8570
$$ 668793 331519 46385 -165500 -293060 -368831 -419607 -397059 -287990 -165008 -116438
15893a16438o579K6139R7392J60244J46131L2874l197M4391L1857o2384j09649
$$ -116438 -123017 -96878 514 160758 306889 339763 336566 380957 412814 350430 240781
15882B40781j22436k69137m33102n41490o04426m35630q3003K02693L52234L22626
$$ 240781 118345 -150792 -583894 -1125384 -1729810 -2165440 -2248443 -2045750 -1693516 -1370890
15872a370890J81964J3177j16695j49066j60573j53409j31720j22271r7381o0140
$$ -1370890 -1188926 -1175749 -1292444 -1441510 -1602083 -1755492 -1887212 -2009483 -2106864 -2167004
15862b167004R6857K94669L27773K26354J05871p2327k03741r6518J54560K70989
$$ -2167004 -2070147 -1775478 -1447705 -1221351 -1115480 -1187807 -1391548 -1488066 -1333506 -1062517
15852a062517J75123R7904J21150J79658K03827K03822J86939K7917k24564l39362
$$ -1062517 -887394 -789490 -668340 -488682 -284855 -81033 105906 133823 -90741 -430103
15842d30103k46499j1441J96846O5051j86120k05346j17031k3759Q7104K50142
$$ -430103 -676602 -688043 -491197 -426146 -612266 -817612 -934643 -958402 -871298 -621156
15832f21156L21088K22842J60705J67783J45106Q9400K2481L9289P1571q584k65386
$$ -621156 -300068 -77226 83479 251262 396368 485768 508249 547538 619109 610525 345139
15821C45139m45978l74001k47222r2292J04509J87029J60998J23873K8372p4247
$$ 345139 -100839 -474840 -722062 -814354 -709845 -522816 -361818 -237945 -209573 -283820
15811b83820r2214n1243j0120k8200l0385J50623L23663K01006j8527p5046q8997
$$ -283820 -376034 -427277 -437397 -465597 -495982 -345359 -21696 179310 160783 85737 -3260
15800c260n3687R1418J03509r3316k28055k09096j11744q0753j38029j38641o8935
$$ -3260 -56947 34471 137980 44664 -183391 -392487 -504231 -584984 -723013 -861654 -930589
15789i30589p4414j75039j39106J09494L81472M43351K76339O3962j11860k76699
$$ -930589 -1005003 -1180042 -1319148 -1209654 -828182 -384831 -108492 -44530 -156390 -433089
15779d33089l11635j19107Q3063J51034J43044J75454K08242J84024J18674O8339
$$ -433089 -744724 -863831 -780768 -629734 -486690 -311236 -102994 81030 199704 268043
15769B68043Q0518R1259J8312q1312q9745l6134q1075k42589l64953l15708m3749
$$ 268043 348561 439820 458132 376820 287075 250941 169866 -72723 -437676 -753384 -797133
15758g97133J75239J94628J73350K05187J40969n5191k55087l18145k28142j85925
$$ -797133 -621894 -427266 -253916 -48729 92240 37049 -218038 -536183 -764325 -950250
15748i50250k52046k94452k44402j32353j5935J23082L29263M19377L66297L32321
$$ -950250 -1202296 -1496748 -1741150 -1873503 -1889438 -1766356 -1437093 -1017716 -651419 -319098
15738c19098L01181J77140j2134j29445j10726l138N0841P0738N4499k6597j29452
$$ -319098 -17917 159223 147089 17644 -93082 -96220 -45379 25359 79858 53261 -76191
15727g6191j77076n2839J40279K51505K87312K24508N6523j46436l44106m06976
$$ -76191 -253267 -306106 -165827 85678 372990 597498 654021 507585 163479 -243497
15717b43497k89717q4640O7140O6826N976m9536o4612q850J25995K37507J61013
$$ -243497 -533214 -617854 -550714 -483888 -477912 -527448 -592060 -600910 -474915 -237408 -76395
15706g6395p3766k37627k71975k17396j24156n1749R458N5604P8204J34512J79296
$$ -76395 -150161 -387788 -659763 -877159 -1001315 -1053064 -1043606 -988002 -909798 -775286 -595990
15695e95990J93966K01046Q5240j00901j21719j5581J40917K67266J28828k41520
$$ -595990 -402024 -200978 -115738 -216639 -338358 -353939 -213022 54244 183072 -58448
15685e8448m39757k53049M5837J60953L1665k55275l66264j14129K90561M56943
$$ -58448 -498205 -751254 -705417 -544464 -512799 -768074 -1134338 -1248467 -957906 -500963
15675e00963L60656L03566L85252L90843K20025M1229o7814n846J78605L25159
$$ -500963 -140307 163259 548511 939354 1159379 1200608 1132794 1126948 1305553 1630712
15665A630712L11844J47051k433k03946m65491o02215m98961k05248K7135J10622
$$ 1630712 1942556 2089607 2087174 1883228 1417737 815522 316561 111313 138448 249070
15655B49070O427k28924k66290L1491M35054O44494N91639L67733R5816n3687
$$ 249070 255497 26573 -239717 -208226 226828 871322 1462961 1830694 1926510 1872823
15645A872823j27039k41547k53551j71441j04511j23866k87989m89651n01396
$$ 1872823 1745784 1504237 1250686 1079245 974734 850868 562879 73228 -428168
15636d28168l76511l10475l03631k08335K0538K49691L95292L32725J44378J10269
$$ -428168 -804679 -1115154 -1418785 -1627120 -1606582 -1356891 -961599 -628874 -484496 -374227
15626c74227J57340J29088J18201J04244K0562l2535l3757O0468K59584L76897
$$ -374227 -216887 -87799 30402 134646 155208 122673 88916 149384 408968 785865
15616G85865K42173n1856l18536m85092m72920l35534j68092j15082j68665p5175
$$ 785865 1028038 976182 657646 172554 -300366 -635900 -803992 -919074 -1087739 -1162914
15606a162914J48332K04176M0226j45558j98703j05175l3034l4806M4500K00907
$$ -1162914 -1014582 -810406 -770180 -915738 -1114441 -1219616 -1252650 -1287456 -1242956 -1042049
15596a042049K74237J85612P251j45957k60181k65899j35228P8425K93314L56805
$$ -1042049 -767812 -582200 -574949 -720906 -981087 -1246986 -1382214 -1303789 -1010475 -653670
15586f53670L39130L07104K17562O9498p6745o0627L2078L081l5363m2640m9955
$$ -653670 -314540 -7436 210126 279624 202879 142252 174330 177411 142048 99408 49453
15575D9453j4263J17425K38932J87911J9638j53449k78487l20159k32737r4394
$$ 49453 35190 152615 391547 579458 599096 445647 167160 -152999 -385736 -480130
15565d80130o8835r0167l3607L6974j1827j66257k92547k68204r7172J25541K13319
$$ -480130 -548965 -639132 -672739 -635765 -647592 -813849 -1106396 -1374600 -1471772 -1346231 -1132912
15554a132912J89513R3811k2053q2466m8471J6841j5800q5841j86986k82589j99519
$$ -1132912 -943399 -849588 -871641 -954107 -1002578 -985737 -1001537 -1087378 -1274364 -1556953 -1756472
15543a756472J255J13618J17042P4842R5835J78955K54212L68725L47897J03141
$$ -1756472 -1755217 -1641599 -1524557 -1449715 -1353880 -1174925 -920713 -551988 -204091 -100950
15533a00950p6266j5280Q5433L3070p0796j09152m2548J31951L12675L87599K97957
$$ -100950 -177216 -192496 -107063 -73993 -144789 -253941 -296489 -164538 148137 535736 833693
15522H33693J10417r030R688Q69j69861m27669n98348n36861l08205q1266N4250
$$ 833693 944110 935080 944768 945637 775776 348107 -250241 -787102 -1095307 -1176573 -1122323
15511a122323N0188n6132j77031k36883j62479k4483M8427Q8255K11139L30721
$$ -1122323 -1072135 -1128267 -1305298 -1542181 -1704660 -1729143 -1680716 -1592461 -1381322 -1050601
15501a050601K55179O762j38519j68365j47795j54808j12418J21519K51646J72224
$$ -1050601 -795422 -788660 -927179 -1095544 -1243339 -1398147 -1510565 -1389046 -1137400 -965176
15491i65176P7479m3182j92081k00510j40640j53318q2833J83392M07559M48528
$$ -965176 -887697 -930879 -1122960 -1323470 -1464110 -1617428 -1700261 -1516869 -1109310 -660782
15481f60782L90817L43519K87751J85212N6512j34101k45053k82227l35605l12472
$$ -660782 -269965 73554 361305 546517 603029 468928 223875 -58352 -393957 -706429
15471g06429j88431j9981N9807j0361r5751j28924j66835k11702k63188k63976
$$ -706429 -894860 -914841 -855034 -865395 -961146 -1090070 -1256905 -1468607 -1731795 -1995771
15461a995771q6800J31512K31634K74087L13969K71795K31710L02216L30221J74432
$$ -1995771 -2082571 -1951059 -1719425 -1445338 -1131369 -859574 -627864 -325648 4573 179005
15451A79005o5738k60011k47291p8543o2191k01405k47839j16291R0051K69481
$$ 179005 113267 -146744 -394035 -472578 -534769 -736174 -984013 -1100304 -1010253 -740772
15441g40772L69753K85517Q9873O8147K15464K46945Q0697j48778l20650l32227
$$ -740772 -371019 -85502 4371 72518 287982 534927 615624 466846 146196 -186031
15431a86031k94747l91547n49604n30685k82029j20516j35805p1457J03051K47000
$$ -186031 -480778 -872325 -1421929 -1952614 -2234643 -2355159 -2490964 -2562421 -2459370 -2212370
15421b212370K48089P0835k24966l56022j12456K26286K10359k9696j31280q5992
$$ -2212370 -1964281 -1893446 -2118412 -2474434 -2586890 -2360604 -2150245 -2179941 -2311221 -2397213
15411b397213k7727J06261K10730J80525J26151J62114K57412L63239L73396J72833
$$ -2397213 -2424940 -2318679 -2107949 -1927424 -1801273 -1639159 -1381747 -1018508 -645112 -472279
15401d72279M3007Q5794P4365P4016J55226J10299j1966O222J37158J64970J48169
$$ -472279 -429272 -343478 -269113 -195097 -39871 70428 58462 64684 201842 366812 514981
15390E14981K60489K48636J3251j75974j88353j66813j88256j97931k00621j43284
$$ 514981 775470 1024106 1037357 861383 673030 506217 317961 120030 -80591 -223875
15380b23875j25192k23665k36649j97624k49560k57753j73812m6222J20592K64490
$$ -223875 -349067 -572732 -809381 -1007005 -1256565 -1514318 -1688130 -1734352 -1613760 -1349270
15370a349270K88618K18392J92235J75741K9783k07802l40988k28204m0930j8792
$$ -1349270 -1060652 -842260 -650025 -474284 -444501 -652303 -993291 -1221495 -1262425 -1281217
15360a281217j14958j85591k84575l94014l37921p4502K85269N25586N66702N25199
$$ -1281217 -1396175 -1581766 -1866341 -2260355 -2598276 -2672778 -2387509 -1861923 -1295221 -770022
15350g70022M64537L72531K69149J65016M4125m7979j07457k05708k91424k26879
$$ -770022 -305485 67046 336195 501211 545336 497357 389900 184192 -107232 -334111
15340c34111q0000J5750J08080K51220K13256J1559k4647J04992J54727J82988
$$ -334111 -414111 -398361 -290281 -39061 174195 185754 161107 266099 420826 603814
15330F03814J88887J00999L8841K1679J25497K59182K63051L08959L70359J99473
$$ 603814 792701 893700 932541 954220 1079717 1338899 1601950 1910909 2281268 2480741
15320B480741j76686m50745m42647k86229j49657j50579k88372l79185l54150
$$ 2480741 2304055 1853310 1410663 1124434 974777 824198 535826 156641 -197509
15311a97509l08310k74568j99918n9203P6270J70053Q0171j52865k48598j37460
$$ -197509 -505819 -780387 -980305 -1039508 -963238 -793185 -713014 -865879 -1114477 -1251937
15301a251937j07916k03381j82012K4931J81700J34021o3823o3844K40020M86691
$$ -1251937 -1359853 -1563234 -1745246 -1720315 -1538615 -1404594 -1468417 -1532261 -1292241 -805550
15291h05550L93223R7814j94119l50616l83299l03819j42219Q9326L34464K61926
$$ -805550 -412327 -314513 -508632 -859248 -1242547 -1546366 -1688585 -1599259 -1264795 -1002869
15281a002869l7477j00932J44679L16296L40831L45822L67246K44784p8685l96361
$$ -1002869 -1040346 -1141278 -996599 -680303 -339472 6350 373596 618380 539695 143334
15271A43334n12620l93648p9286J85116K38525K07414J30067p060j08720n9113
$$ 143334 -369286 -762934 -842220 -657104 -418579 -211165 -81098 -88158 -196878 -255991
15261b55991O8898J09413O4362L9279Q9374J64727J51576J14246J69098K10475
$$ -255991 -187093 -77680 -13318 25961 115335 280062 431638 545884 714982 925457
15251I25457J33989l5681k35132m05726l97452k60323q6166R2562K36898L42681
$$ 925457 1059446 1023765 788633 382907 -14545 -274868 -361034 -268472 -31574 311107
15241C11107L53625K51391J35506k831j56744l14321l84965k48779O831K09559
$$ 311107 664732 916123 1051629 1048798 892054 577733 192768 -56011 -49180 160379
15231A60379K27655J11624K7669N118Q0513K06465K01393J11579P3409M3711n9309
$$ 160379 388034 499658 527327 532445 612958 819423 1020816 1132395 1205804 1249515 1190206
15220A190206j72707k21054k78554k99059k59192j41818J7193J07730J69305K53007
$$ 1190206 1017499 796445 517891 218832 -40360 -182178 -164985 -57255 112050 365057
15210C65057K13287Q0204K905j65594m04493m52979k95798n4430J37606J36104
$$ 365057 578344 658548 661453 495859 91366 -361613 -657411 -711841 -574235 -438131
15200d38131m0998j65736q6089p038l1692n0198r863P9435J47475J62441J85063
$$ -438131 -479129 -644865 -730954 -737992 -769684 -819882 -829745 -750310 -602835 -440394 -255331
15189b55331J62640M0074j06960j95047j75076q542J77768J70663p260j18616
$$ -255331 -92691 -52617 -159577 -354624 -529700 -538242 -360474 -189811 -197071 -315687
15179c15687p2127J6733N7931O2773N4605R1583R2664n3946j81955j41275j9580
$$ -315687 -387814 -371081 -313150 -250377 -195772 -104189 -11525 -65471 -247426 -388701 -408281
15168d08281J08403K06592K00722M1180j81333k18721k3071J01127O7090J32674
$$ -408281 -299878 -93286 107436 148616 -32717 -251438 -274509 -173382 -106292 26382
15158B6382K89563K53019J11682J42293K08117J54728k2806k46751l80681m22815
$$ 26382 315945 568964 680646 822939 1031056 1185784 1162978 916227 535546 112731
15148A12731m27124m00959l09634k31306j81584k8586J35836J93503K01835J44714
$$ 112731 -314393 -715352 -1024986 -1256292 -1437876 -1466462 -1330626 -1137123 -935288 -790574
15138g90574O6994R9412K62536M51563M23351K08156N6124p5226k32303m11452
$$ -790574 -723580 -624168 -361632 89931 513282 721438 777562 702336 470033 58581
15128E8581n46418m80376k72637j8115K43673L87505L64427L00806K26583J05001
$$ 58581 -487837 -968213 -1240850 -1258965 -1015292 -627787 -263360 37446 264029 369030
15118C69030J610m5580p8106r2217m0084q088J872M230O462l9711k14560m26813
$$ 369030 370640 325060 246954 154737 114653 106565 108437 112667 119129 79418 -135142 -561955
15106e61955m42320k50873j28546j11620q2423l3633Q5182K17807K18218P4132
$$ -561955 -1004275 -1255148 -1383694 -1495314 -1577737 -1611370 -1526188 -1308381 -1090163 -1016031
15096a016031q3914j22654j33653j69033j33886k8982L0766P433p466M407L1796
$$ -1016031 -1099945 -1222599 -1356252 -1525285 -1659171 -1688153 -1657387 -1649954 -1657420 -1653013 -1621217
15085a621217P7024J71465K25692J32441N3248M3447r1432l02312k67358m2679
$$ -1621217 -1544193 -1372728 -1147036 -1014595 -961347 -917900 -1009332 -1311644 -1579002 -1621681
15075a621681L2106o7100j51287j54987j68119j59730k2495J59786L13334M20164
$$ -1621681 -1589575 -1656675 -1807962 -1962949 -2131068 -2290798 -2313293 -2153507 -1840173 -1420009
15065a420009M32826M11530N18212O11071M19868P8370k06544l43196l44928k71935
$$ -1420009 -987183 -575653 -57441 553630 973498 1051868 845324 502128 157200 -114735
15055a14735k27805k30386j73243p7918p9529j60228j52810K0680J84870J99976
$$ -114735 -342540 -572926 -746169 -824087 -903616 -1063844 -1216654 -1195974 -1011104 -811128
15045h11128J40604Q0179M8357J6561K7262J68120K94138L82091N33591N53315
$$ -811128 -670524 -590345 -541988 -525427 -498165 -330045 -35907 346184 879775 1433090
15035A433090K86757m5691k59232l87042l86997j56447J98985L61275J66680j00139
$$ 1433090 1719847 1674156 1414924 1027882 640885 484438 683423 1044698 1211378 1111239
15025A111239j27172q5813j11979n0546J40339K54865K44898J28032k7475o7466
$$ 1111239 984067 898254 786275 735729 876068 1130933 1375831 1503863 1476388 1408922
15015A408922j8504N0300J33421P2946o6973l3899J06843J68391L4271k16268
$$ 1408922 1390418 1440718 1574139 1647085 1580112 1546213 1653056 1821447 1855718 1639450
15005A639450m20316n99940p99633p91253l95615J37753N18988O31293M99037
$$ 1639450 1219134 619194 -180439 -971692 -1367307 -1229554 -710566 -79273 419764
14996D19764K37699M5433K5238Q926j35193l44846m22693l10395j56356j01400
$$ 419764 657463 702896 728134 737060 601867 257021 -165672 -476067 -632423 -733823
14986g33823q4259k3897Q7063J99374J86569J12168J13245J44654J8946j53250
$$ -733823 -818082 -841979 -754916 -555542 -368973 -256805 -143560 1094 20040 -133210
14976a33210j43961n9514j0700j6953r9628k18001k55663j60335O8699L05539
$$ -133210 -277171 -336685 -347385 -364338 -463966 -681967 -937630 -1097965 -1029266 -723727
14966g23727M19954M03664L19630K99846K64961Q6761j0166O4462J03534K6652
$$ -723727 -303773 99891 419521 719367 984328 1071089 1060923 1125385 1228919 1255571
14956A255571o0969j17404j94251k55144k03901j41181j35367k7292J02025N8216
$$ 1255571 1194602 1077198 882947 627803 423902 282721 147354 120062 222087 280303
14946B80303n7711j67121k24420j13496Q5911K09148K27510J86267J19410j4880
$$ 280303 222592 55471 -168949 -282445 -196534 12614 240124 426391 545801 530921
14936E30921j15040l6468J9832j13276j86600r7593K2926J31333J65252P8123
$$ 530921 415881 379413 399245 285969 99369 1776 24702 156035 321287 399410
14926C99410j06012j85791j43764j00550p9560o6895j305J07750J87745L08191
$$ 399410 293398 107607 -36157 -136707 -216267 -283162 -284467 -176717 11028 319219
14916C19219L65851K37317N6642o5186l4974N1050K5755n690J9789M419p5373
$$ 319219 685070 922387 979029 913843 878869 929919 955674 949984 969773 974192 898819
14905H98819j45347j31500k3994N5882J6790o6947j16569j02555o2810O4496K71708
$$ 898819 753472 621972 597978 653860 670650 603703 487134 384579 321769 386265 657973
14894F57973K97486O1383k32381l71981k75989q4994J7334l5552j18975j46392
$$ 657973 955459 1016842 784461 412480 136491 51497 68831 33279 -85696 -232088
14884b32088r4990M713R7558K11400K81558J53963l4811k6729N3822K0937p2554
$$ -232088 -327078 -322365 -224807 -13407 268151 422114 387303 360574 414396 435333 362779
14873C62779j17583j26967j24789j55374j98757k08242k03688q6581J33417K34926
$$ 362779 245196 118229 -6560 -161934 -360691 -568933 -772621 -859202 -725785 -490859
14863d90859K05805J29441L3336N0905K23443L51989K92337J00915j43678l30531
$$ -490859 -285054 -155613 -122277 -71372 152071 504060 796397 897312 753634 423103
14853D23103k97210r3782J07869J84135J07785J9424l0665r865R0237J60814J85303
$$ 423103 125893 32111 139980 324115 431900 451324 420659 410794 501031 661845 847148
14842H47148K32147J91617N678j04597k6493O4122N7882K0047l3992j22938l06871
$$ 847148 1079295 1270912 1276590 1171993 1145500 1209622 1267504 1287551 1253559 1130621 823750
14831H23750m78541l84839j43031r4322j43811q8533O86R3148K36639L98526M21732
$$ 823750 345209 -39630 -182661 -276983 -420794 -509327 -508641 -415493 -178854 219672 641404
14820F41404K33869J6193n8519p7388j63690k30760k27121j93981k26771k75319
$$ 641404 875273 891466 832947 755559 591869 361109 133988 -59993 -286764 -562083
14810e62083k63702k27562k00438j02087N2398M4395l0667J9885P9925J9625j2184
$$ -562083 -825785 -1053347 -1253785 -1355872 -1303474 -1259079 -1289746 -1269861 -1189936 -1170311 -1182495
14799a182495N7449P3641N4565J34613J87293K13267K58710J56593k6860j55723
$$ -1182495 -1125046 -1051405 -996840 -862227 -674934 -461667 -202957 -46364 -73224 -228947
14789b28947j64600q4832J0445K9749n4597l9709P4097J41346J76022J58960O0595
$$ -228947 -393547 -478379 -467934 -438185 -492782 -532491 -458394 -317048 -141026 17934 78529
14778G8529m2386p3990m9064P282J3024l147M7214J14587J56612J27011J0377
$$ 78529 36143 -37847 -86911 -79629 -66605 -69752 -22538 92049 248661 375672 386049
14767C86049p1319j514J27391K40397K56504J36193j7565n7909n8297j68296k51952
$$ 386049 314730 313216 440607 681004 937508 1073701 1056136 998227 939930 771634 519682
14756E19682k00878l6735J48872K03972J13930M6072O8152O8079j5685m1816n5971
$$ 519682 318804 282069 430941 634913 748843 794915 863067 931146 915461 873645 817674
14745H17674j77338k77040l27898l59858l10331j44307J4220N3425P7499J25920
$$ 817674 640336 363296 35398 -324460 -634791 -779098 -764878 -711453 -633954 -508034
14735e08034Q5455p5487k91723m49115l55041q9931N3718J40473K55165K89709
$$ -508034 -422579 -498066 -789789 -1238904 -1593945 -1683876 -1630158 -1489685 -1234520 -944811
14725i44811K44625J61949O3142j3235O677J62157K63109K49295K25128J53800
$$ -944811 -700186 -538237 -475095 -488330 -481653 -319496 -56387 192908 418036 571836
14715E71836J13638J93098K43689J31645q6781k85926l67909k56885j683K21235
$$ 571836 685474 878572 1122261 1253906 1167125 881199 513290 256405 254722 475957
14705D75957L02190J81302l9289k13105k33303q7179r290j53150l25408l45196
$$ 475957 778147 959449 920160 707055 473752 386573 377283 224133 -101275 -446471
14695d46471k38654n2535J45254K86308L71148M96103O10125O06757M68575J29226
$$ -446471 -685125 -737660 -592406 -306098 65050 561153 1171278 1778035 2246610 2375836
14685B375836l28066n34558l20297j5390O0598J2869K2756J9287r0667k82285
$$ 2375836 2047770 1513212 1192915 1177525 1238123 1250992 1273748 1293035 1202368 920083
14675I20083m48825n02933l94452k22351m9720J21465J81453J81295J85304Q6396
$$ 920083 471258 -31675 -426127 -648478 -698198 -576733 -395280 -213985 -28681 57715
14665E7715n1947j33241k21145k71717k29929k20681l00872k84846j34968L570
$$ 57715 5768 -127473 -348618 -620335 -850264 -1070945 -1371817 -1656663 -1791631 -1788061
14655a788061O1199J34642L07604N20361O06386M48128K12637P6548Q4522J60097
$$ -1788061 -1726862 -1592220 -1284616 -764255 -157869 290259 502896 579444 663966 824063
14645H24063Q8204o8653j31782j89706l45764l28388M0075L60681L06114L5731
$$ 824063 912267 843614 711832 522126 176362 -152026 -111951 248730 554844 590575
14635E90575j95080k78023k11724j17101n3087j1812M4521O5376K8097O9518K36058
$$ 590575 395495 117472 -94252 -211353 -264440 -276252 -231731 -166355 -138258 -68740 167318
14624A67318M06912N31658M50745J61675j55727m04430m53976l17009j17213Q687
$$ 167318 574230 1105888 1556633 1718308 1562581 1158151 704175 387166 269953 278640
14614B78640j9451j70938k68324j77603J4956R5491N2124J724J8529J46451K84325
$$ 278640 259189 88251 -180073 -357676 -342720 -247229 -195105 -193381 -174852 -28401 255924
14603B55924K73932K10866J27304J7840p619j4419j01270k08748k98592l16574
$$ 255924 529856 740722 868026 885866 878247 863828 762558 553810 255218 -61356
14593f1356j91488P847J08613M3798l7010j05399j63962j31654j09673r8432P588
$$ -61356 -252844 -244997 -136384 -92586 -129596 -234995 -398957 -530611 -640284 -738716 -731128
14582g31128J00035Q4118m0173j44709j38308j18287l6637Q6065J68722J53469
$$ -731128 -631093 -546975 -587148 -731857 -870165 -988452 -1025089 -939024 -770302 -616833
14572f16833Q634j52419j75188P844K05288J91365R929j56073j97446o6716P7780
$$ -616833 -608199 -760618 -935806 -927962 -722674 -531309 -521380 -677453 -874899 -941615 -863835
14561h63835J27516O5115j47947k64350j40607m3797r0329r3128K9753J38102
$$ -863835 -736319 -671204 -819151 -1083501 -1224108 -1267905 -1358234 -1451362 -1421609 -1283507
14551a283507Q7567j04592k68794l20584j71107K02173N59496P26542O86603M04687
$$ -1283507 -1195940 -1300532 -1569326 -1889910 -2061017 -1858844 -1299348 -572806 113797 518484
14541E18484P6269r1148r2127q6809j29003j19380K9322K33496K35511N8236r5198
$$ 518484 594753 503605 411478 324669 195666 76286 105608 339104 574615 632851 537653
14530E37653j61017j10870O8473L01419M56895L55099m875l29035l77566k02813
$$ 537653 376636 265766 334239 635658 1092553 1447652 1442777 1113742 736176 533363
14520E33363o8175m1695m9224j40477k12409j86939j66724j58368j25410k7791
$$ 533363 465188 423493 374269 233792 21383 -165556 -332280 -490648 -616058 -643849
14510f43849Q6938J19452J09225M3250k2268N4236J26839M7842r463N9377J56970
$$ -643849 -556911 -437459 -328234 -284984 -307252 -253016 -126177 -78335 -87798 -28421 128549
14499A28549J77764L8725l9418J19823K69943K35650R5203J9265R8670K26315
$$ 128549 306313 345038 305620 425443 695386 931036 1026239 1045504 1144174 1370489
14489A370489L27583L24465R4693j14430j92895l32001m51677m26904l03402j53307
$$ 1370489 1698072 2022537 2117230 2002800 1809905 1477904 1026227 599323 295921 142614
14479A42614q0738q5068j07576q8854k0315M3754Q9137J17708R1339R6989J60122
$$ 142614 61876 -23192 -130768 -219622 -239937 -196183 -107046 10662 102001 198990 359112
14468C59112J59403K7989o2501j10960k08012j92177L8751K55987K02988p2987
$$ 359112 518515 546504 484003 373043 165031 -27146 11605 267592 470580 397593
14458C97593l79938n50172m19352j09732J22191J79983J94449K74569K88389J06234
$$ 397593 17655 -532517 -951869 -1061601 -939410 -759427 -564978 -290409 -2020 104214
14448A04214p7686j02053n1160l4936R099R3476P3844k5365m3543O1245J05448
$$ 104214 26528 -75525 -126685 -161621 -152522 -59046 14798 -10567 -54110 7135 112583
14437A12583J10329J87954J55826p0837k59151l65300m36769l15738M3308L16564
$$ 112583 222912 410866 566692 495855 236704 -128596 -565365 -881103 -837795 -521231
14427e21231L81848L35696K55493J75723L1008j02102j13657j05805j74583j70655
$$ -521231 -139383 196313 451806 627529 658537 556435 442778 336973 162390 -8265
14417h265m8275J3328O7999J44190R2905K3104k5611j58622k08766q2444K8459
$$ -8265 -56540 -43212 24787 168977 261882 284986 259375 100753 -108013 -190457 -161998
14406a61998Q422l3900l8594j26583k53002k19724n1667P2305J25547J80174J39769
$$ -161998 -153576 -187476 -226070 -352653 -605655 -825379 -877046 -804741 -679194 -499020 -359251
14395c59251K0078p6093j71372k39850k40375j51640m5578p8403j83020j63048
$$ -359251 -339173 -415266 -586638 -826488 -1066863 -1218503 -1264081 -1342484 -1525504 -1688552
14385a688552K3386K57103L72808K72473K1350j27095K1928K13855K75185K25919
$$ -1688552 -1665166 -1408063 -1035255 -762782 -741432 -868527 -846599 -632744 -357559 -131640
14375a31640J64602J99295K49412K78336L58694L77294K47776N2463j43945k77529
$$ -131640 32962 232257 481669 760005 1118699 1495993 1743769 1796232 1652287 1374758
14365A374758l43807l01061k07055j68224j42538j06222k15465l69658l22519
$$ 1374758 1030951 729890 522835 354611 212073 105851 -109614 -479272 -801791
14356h01791r9773J82409M17080M59246L35281J95280L5407j83861l52974l28315
$$ -801791 -901564 -719155 -302075 157171 492452 687732 723139 539278 186304 -142011
14346a42011k76017l62867m34577l26726j09764P7280J95773L06654L22441J90472
$$ -142011 -418028 -780895 -1215472 -1542198 -1651962 -1574682 -1378909 -1072255 -749814 -559342
14336e59342J23982J09822K1889l8140p530p12o4705j0251K05274L19864J81428
$$ -559342 -435360 -325538 -303649 -341789 -349319 -350031 -414736 -424987 -219713 100151 281579
14325B81579l4930j00746l4608p8958k06562j10620N7636J18653J67057K01598
$$ 281579 246649 145903 111295 32337 -174225 -284845 -227209 -108556 58501 260099
14315B60099J76850R5251k6191r4067j58111k26574k15051j89158j20157N0195
$$ 260099 436949 532200 506009 411942 253831 27257 -187794 -376952 -497109 -446914
14305d46914J92704J87908N0773j30388k26674j27535N3526R7406P4625O6289
$$ -446914 -254210 -66302 -15529 -145917 -372591 -500126 -446600 -349194 -274569 -208280
14295b08280j4905j19869j78405j57451l7244P8929J36189R3651k9323j24096
$$ -208280 -223185 -343054 -521459 -678910 -716154 -637225 -501036 -407385 -436708 -560804
14285e60804j03030m9588r7303j39262j23538k2238K77504N46644N15000K74288
$$ -560804 -663834 -713422 -810725 -949987 -1073525 -1095763 -818259 -271615 243385 517673
14275E17673N6744l4877j9128K3678p0065k80825m42152m77225l64636j17621
$$ 517673 574417 539540 520412 544090 474025 193200 -248952 -726177 -1090813 -1208434
14265a208434J00056P8843o2594k1145J38351K50546L13831L14942J93076p0606
$$ -1208434 -1108378 -1029535 -1092129 -1113274 -974923 -724377 -410546 -95604 97472 26866
14255B6866k74124l06235k40154j78060j19450M536R4448L9081j7417L0035P3077
$$ 26866 -247258 -553493 -793647 -971707 -1091157 -1086621 -992173 -953092 -970509 -940474 -867397
14244h67397J03902P0506J5463K6513J31486J93313K15087L10478L83893K59293
$$ -867397 -763495 -692989 -677526 -651013 -519527 -326214 -111127 199351 583244 842537
14234H42537l9724k13083o4662J19656M6085j22699k03199k12581k12739k51981
$$ 842537 802813 589730 525068 644724 690809 568110 364911 152330 -60409 -312390
14224c12390k13505o450J18934J04095J09175L5588j52260k60233j52477Q0832
$$ -312390 -525895 -532345 -413411 -309316 -200141 -164553 -316813 -577046 -729523 -648691
14214f48691l626k30458j30541J20586K38580K56212K45724J84105L0880j38914
$$ -648691 -652317 -882775 -1013316 -892730 -654150 -397938 -152214 31891 62771 -76143
14204g6143j27947q4029j44829j43894J2403K24952L41446L25016K12842Q5656
$$ -76143 -204090 -288119 -432948 -576842 -564439 -339487 1959 326975 539817 625473
14194F25473k2584j20798j91489j77744q2276M8470J76106K77747K44341Q7733
$$ 625473 602889 482091 290602 112858 30582 79052 255158 532905 777246 864979
14184H64979j4427j34685m00044n49347m21309j52518M7237L4456j88409k63993
$$ 864979 850552 715867 315823 -233524 -654833 -807351 -760114 -725658 -914067 -1178060
14174a178060l8519K47975L74739L43783K47824P9407q6942j32230j83125k94233
$$ -1178060 -1216579 -968604 -593865 -250082 -2258 77149 -9793 -142023 -325148 -619381
14164f19381l26536l05200k60551k02163j45181q6630R849J53582L13019L86614
$$ -619381 -945917 -1251117 -1511668 -1713831 -1859012 -1945642 -1935793 -1782211 -1469192 -1082578
14154a082578L37897K29136J54268J45619J22421j4684k09696l07731k58258r2319
$$ -1082578 -744681 -515545 -361277 -215658 -93237 -107921 -317617 -625348 -883606 -975925
14144i75925J15646K60066J79705K9893N8347J40624J66050J53864J18921M3387
$$ -975925 -860279 -600213 -420508 -390615 -332268 -191644 -25594 128270 247191 290578
14134B90578p6518k13701k54011k38769l04918k90369j2606L05374M17824L00017
$$ 290578 214060 359 -253652 -492421 -797339 -1087708 -1100314 -794940 -377116 -77099
14124g7099O0760j65986k11306j61665j29951l0278Q5345J28225J22581J06178
$$ -77099 -16339 -182325 -393631 -555296 -685247 -715525 -630180 -501955 -379374 -273196
14114b73196N4243o9872k23277l27349k67460p7770J12212K52020K57969R0375
$$ -273196 -218953 -288825 -512102 -839451 -1106911 -1184681 -1072469 -820449 -562480 -472105
14104d72105j18430k02764k16999k53060l04181k48192j45827j09384K6192L27788
$$ -472105 -590535 -793299 -1010298 -1263358 -1567539 -1815731 -1961558 -2070942 -2044750 -1716962
14094a716962O17134O94789N50367L22154J04875j12457l23380l43135j89284
$$ -1716962 -1099828 -405039 145328 467482 572357 459900 136520 -206615 -395899
14085c95899m7414m0048j05602j60687k56631k89881k49556j90157j10941l6414
$$ -395899 -443313 -483361 -588963 -749650 -1006281 -1296162 -1545718 -1735875 -1846816 -1883230
14075a883230J34252L69315M67587L96304K62601O3468j74437l27505l34934j49652
$$ -1883230 -1748978 -1379663 -912076 -515772 -253171 -189703 -364140 -691645 -1026579 -1176231
14065a176231J29259L18644L42295K47563J04001J7330Q009j6239j02783k11007
$$ -1176231 -1046972 -728328 -386033 -138470 -34469 -17139 -9130 -25369 -128152 -339159
14055c39159k36061k02017j50567p6254K2259J26275J74859J48575O4659K3046
$$ -339159 -575220 -777237 -927804 -1004058 -981799 -855524 -680665 -532090 -467431 -444385
14045d44385K3756r6542k13673j89314q0398P6674K17174L05802L38448L14695
$$ -444385 -420629 -517171 -730844 -920158 -1000556 -923882 -706708 -400906 -62458 252237
14035B52237K43096N7572j36742j03274L5861O1936O2746P6199O4891N4813m191
$$ 252237 495333 552905 416163 312889 348750 410686 473432 549631 614522 669335 665144
14024F65144q4521o0425k7941l5565N5347K36753L26110K11634Q1877J02529J56125
$$ 665144 580623 520198 492257 456692 512039 748792 1074902 1286536 1368413 1470942 1627067
14013A627067K7392k12935l89735m73611m86028m09067k30951L4113K19968K07769
$$ 1627067 1654459 1441524 1051789 578178 92150 -316917 -547868 -513755 -293787 -86018
14003h6018Q8332n3928j35020p8701O2493J94717J79014J5243j56533j45325Q8848
$$ -86018 2314 -51614 -186634 -265335 -202842 -8125 170889 186132 29599 -115726 -26878
13992b6878K72849K34104M4767j49685k74588l37018l24020j61495J08908K64182
$$ -26878 245971 480075 524842 375157 100569 -236449 -560469 -721964 -613056 -348874
13982c48874K59570J98470R4312o0279k34624l52863m04193l90272k21589Q4574
$$ -348874 -89304 109166 203478 143199 -91425 -444288 -848481 -1238753 -1460342 -1375768
13972a375768L23035L88759L14883J35288n8827j32210n0854P996m9710j25215
$$ -1375768 -1052733 -663974 -349091 -213803 -272630 -404840 -455694 -447698 -497408 -622623
13962f22623j75821k14751j71314j9586O8260n6398k40726j41670K06261M76446
$$ -622623 -798444 -1013195 -1184509 -1204095 -1135835 -1192233 -1432959 -1574629 -1368368 -891922
13952h91922N23767L73092Q5584j44094j80474j02845L7372J56750J47820J12415
$$ -891922 -368155 4937 90521 -53573 -234047 -336892 -299520 -142770 5050 117465
13942A17465N9971n2137j23950j11968j37647j77577n9848N8409p0002j91851
$$ 117465 177436 125299 1349 -110619 -248266 -425843 -485691 -427282 -497284 -689135
13932f89135p6191O8302J07518O4246q527j17502k44387k33809p7812J48107K83830
$$ -689135 -765326 -697024 -589506 -525260 -533787 -651289 -895676 -1129485 -1207297 -1059190 -775360
13921g75360K22295J33109J27146Q3629o6857k18838l12923k80366o9284J97553
$$ -775360 -553065 -419956 -292810 -209181 -276038 -494876 -807799 -1088165 -1157449 -959896
13911i59896L72649L40574J24604m4104m1171m3208m0603Q329m7718j24785j46878
$$ -959896 -587247 -246673 -122069 -166173 -207344 -250552 -291155 -282826 -330544 -455329 -602207
13900f02207j74672k02132j31063k0867L1236j8426j37862k36399k69055k80925
$$ -602207 -776879 -979011 -1110074 -1130941 -1099705 -1118131 -1255993 -1492392 -1761447 -2042372
13890b042372j76628J35138L62071K98557J26495Q0862Q4750L6257P7258L15366
$$ -2042372 -2219000 -2083862 -1721791 -1423234 -1296739 -1215877 -1131127 -1094870 -1017612 -702246
13880g02246M58419L59992R2818j58952k25115j01628M3114J1502j00412j30173
$$ -702246 -243827 116165 208983 50031 -175084 -276712 -233598 -222096 -322508 -452681
13870d52681j11573j02785p6714j0170N9292K7538M6737J77093L18253M04927
$$ -452681 -564254 -667039 -743753 -753923 -694631 -667093 -620356 -443263 -125010 279917
13860B79917L65547K25870J22835q379j33461j01393r3376j74816k16041k31298
$$ 279917 645464 871334 994169 985790 852329 750936 657560 482744 266703 35405
13850C5405k20470j79208k28117l14604k50314r6359P8990J76694J25398N9744
$$ 35405 -185065 -364273 -592390 -906994 -1157308 -1253667 -1174677 -997983 -872585 -812841
13840h12841O1928J42376K85173L56982K68610Q7462o8278j65971j62422j40007
$$ -812841 -750913 -608537 -323364 33618 302228 389690 321412 155441 -6981 -146988
13830a46988j68114j29852L7223J57057J42161J25017P0213k054j8451j13535
$$ -146988 -315102 -444954 -407731 -250674 -108513 16504 86717 84663 66212 -47323
13820d7323l31137l99977j72987J20727K45178K71897L74739L88879J34388k27119
$$ -47323 -378460 -778437 -951424 -830697 -585519 -313622 61117 449996 584384 357265
13810C57265m57990m22506j88036k3629K4795K3263p56l7272j30364k13927k83475
$$ 357265 -100725 -523231 -711267 -734896 -710101 -686838 -687594 -724866 -855230 -1069157 -1352632
13799a352632l35219k57285m8371J35984J69407J29550J48037J31369P1090N6689
$$ -1352632 -1687851 -1945136 -1993507 -1857523 -1688116 -1558566 -1410529 -1279160 -1208070 -1151381
13789a151381k410r1685j03857j48181k55726k72226j34399J11600K77804J48976
$$ -1151381 -1153791 -1245476 -1349333 -1497514 -1753240 -2025466 -2159865 -2048265 -1770461 -1621485
13779a621485j20514j60319N9590K01203J23601M7195M8477N7465J13520K44476
$$ -1621485 -1741999 -1902318 -1842728 -1641525 -1517924 -1470729 -1422252 -1364787 -1251267 -1006791
13769a006791M05195M76442L89743K49444J63007J17696N9151q0740k26212k63096
$$ -1006791 -601596 -125154 264589 514033 677040 794736 853887 773147 546935 283839
13759B83839k62432k83199k56208k36628k53287j75365P0936K92286K91511P4668
$$ 283839 21407 -261792 -518000 -754628 -1007915 -1183280 -1112344 -820058 -528547 -453879
13749d53879j51569j45484K0022J48356J66671L8464j04150j01301o9718j8924
$$ -453879 -605448 -750932 -730910 -582554 -415883 -377419 -481569 -582870 -652588 -671512
13739f71512k357j28099k63245l48867l07568j48736j1013Q1454R3129O7218O4502
$$ -671512 -673869 -801968 -1065213 -1414080 -1721648 -1870384 -1881397 -1799943 -1706814 -1639596 -1575094
13728a575094J08748J32638L1226n3341k8015j5125n0229n2760r404J5749M8203
$$ -1575094 -1466346 -1333708 -1302482 -1355823 -1383838 -1398963 -1449192 -1501952 -1511356 -1495607 -1447404
13717a447404J14199J76537J55258K5944o7926Q417J26012J15464J19091J79991
$$ -1447404 -1333205 -1156668 -1001410 -975466 -1043392 -1034975 -908963 -793499 -674408 -494417
13707d94417J26420J2391m7382n055J08718J93910K05891K04336J67583R4264
$$ -494417 -367997 -355606 -402988 -408043 -299325 -105415 100476 304812 472395 566659
13697E66659R6903K03712K18800J0532k99641n00138m29629k18314j1133Q4286
$$ 566659 663562 867274 1086074 1096606 796965 296827 -132802 -351116 -362249 -277963
13687b77963j046j49387k25737j71350r1508r7590m5468J26026K26742K21155
$$ -277963 -279009 -428396 -654133 -825483 -916991 -1014581 -1060049 -934023 -707281 -486126
13677d86126K53792K87454K67779K18162J80779Q4628j40535k89376k26450j47962
$$ -486126 -232334 55120 322899 541061 721840 806468 665933 376557 150107 2145
13667B145j18159p0741o2233q2129m7240N8194J36165J03257J13792K85563M48441
$$ 2145 -116014 -186755 -248988 -331117 -378357 -320163 -183998 -80741 33051 318614 767055
13656G67055M73857L98961K38658j4535k76818l53633k99692l02889l41866l42271
$$ 767055 1240912 1639873 1878531 1863996 1587178 1233545 933853 630964 289098 -53173
13646e3173l36070k94383j72503p0027m2872k4956Q63l162M1920J64777K01802
$$ -53173 -389243 -683626 -856129 -926156 -969028 -993984 -993121 -996283 -954363 -789586 -587784
13635e87784P2292l3906m236k4049j29254j13872m8118m8481o4918j65J22442
$$ -587784 -515492 -549398 -553634 -577683 -706937 -820809 -868927 -917408 -982326 -982491 -860049
13624h60049J76292J83777J67692J52208Q8102L8672L2072l2282j58925j95340
$$ -860049 -683757 -499980 -332288 -180080 -91978 -53306 -21234 -53516 -212441 -407781
13614d07781q8605j7134j05680k88694l32710j30258Q8959P5444q7503j50047
$$ -407781 -496386 -513520 -619200 -907894 -1240604 -1370862 -1281903 -1206459 -1293962 -1444009
13604a444009N1929L53256M21809K16178L7699K4424N4529K9297P3105K77841
$$ -1444009 -1392080 -1038824 -617015 -400837 -363138 -338714 -284185 -254888 -181783 96058
13594I6058M06715L40337K26056J59888J06168M2002K5196P914j5107q4070k59866
$$ 96058 502773 843110 1069166 1229054 1335222 1377224 1402420 1410334 1395227 1311157 1051291
13583A051291m53378m78180l27075j70081j18423j40089j38194n3136L5845o742
$$ 1051291 597913 119733 -207342 -377423 -495846 -635935 -774129 -827265 -791420 -798162
13573g98162p0001o0949n470Q6076K23254K98958L68065N14541N82740M53263
$$ -798162 -868163 -929112 -934582 -848506 -625252 -326294 41771 556312 1139052 1592315
13563A592315K18629o7262l08329l83562k71017R86K88857M17422L32777J09729
$$ 1592315 1810944 1743682 1435353 1051791 780774 781760 1070617 1488039 1820816 1930545
13553A930545j30135k50781k80546l11031l36942l29043l06687k56923j12477
$$ 1930545 1800410 1549629 1269083 958052 621110 292067 -14620 -271543 -384020
13544c84020J20901K62616J73209J9558m1901m5350j2732l1712j00518j01566
$$ -384020 -263119 -503 172706 192264 150363 105013 92281 60569 -39949 -141515
13534a41515m474R3760J29136M4152j63034l93241n31200l92388p6976L0399q7094
$$ -141515 -145989 -52229 76907 121059 -41975 -435216 -966416 -1358804 -1435780 -1405381 -1492475
13523a492475k07109j69045m6814k9128j07503j44250j44837k23884l22169l68295
$$ -1492475 -1699584 -1868629 -1915443 -1944571 -2052074 -2196324 -2341161 -2565045 -2887214 -3255509
13513c255509j85048J63550L19603K99846K41378J62348O8644k9653o3471O247
$$ -3255509 -3440557 -3277007 -2957404 -2657558 -2416180 -2253832 -2185188 -2214841 -2278312 -2272065
13503b272065J01246J04099M8509L8177P1414J28547K52498L84481L96799K88901
$$ -2272065 -2170819 -2066720 -2018211 -1980034 -1908620 -1780073 -1527575 -1143094 -746295 -457394
13493d57394O8708j35059j82350j71405j24581k7661r235p2263p9555O1886K74984
$$ -457394 -388686 -523745 -706095 -877500 -1002081 -1029742 -1038977 -1111240 -1190795 -1128909 -853925
13482h53925L38807J32617r2595q4097k984K0468O1180O5211q6941k14738j27507
$$ -853925 -515118 -382501 -475096 -559193 -562177 -541709 -480529 -415318 -502259 -716997 -844504
13471h44504L4102J26048J28086Q2277J3774l9503m3934L4407J56465J21912k8116
$$ -844504 -810402 -684354 -556268 -473991 -460217 -499720 -543654 -509247 -352782 -230870 -258986
13460b58986j24246j34404r9816m8808O8902J56152J09348N4825J62924M05865
$$ -258986 -383232 -517636 -617452 -666260 -597358 -441206 -331858 -277033 -114109 291756
13450B91756N46285M28308J96350L3758j04700j87262j77386j75337j99868j60242
$$ 291756 838041 1266349 1462699 1496457 1391757 1204495 1027109 851772 651904 491662
13440D91662q8536j6233R8744J66511N9385q0765q7408n0687q7724j77089k40201
$$ 491662 403126 386893 485637 652148 711533 630768 543360 492673 404949 227860 -12341
13429a2341k53832j99612j29153j19616k20355l05702k29759n3378J25715K49832
$$ -12341 -266173 -465785 -594938 -714554 -934909 -1240611 -1470370 -1523748 -1398033 -1148201
13419a148201K86285K12267K4082k6203J83253L50459L71034L20705J40330j20814
$$ -1148201 -861916 -649649 -625567 -651770 -468517 -118058 252976 573681 714011 593197
13409E93197l14978m04034l73158j29926J89457M01038M28345L77586L61783J99496
$$ 593197 278219 -125815 -498973 -628899 -439442 -38404 389941 767527 1129310 1328806
13399A328806m8545j40891j55142j66227j38561j27679o1267P7145K17347K65737
$$ 1328806 1280261 1139370 984228 818001 679440 551761 490494 567639 784986 1050723
13389A050723J98755O7735m5454p1572k5333N835m3711j41103k22045l31797m17574
$$ 1050723 1249478 1317213 1271759 1200187 1174854 1180689 1136978 995875 773830 442033 24459
13378B4459k63778R5977M52873N55629L25086N4637m7797m1420o2336r6330j50374
$$ 24459 -239319 -143342 309531 865160 1190246 1244883 1197086 1155666 1093330 997000 846626
13367H46626k79034l80598l82524l11558k58406j41255P1869K55571L39616L48600
$$ 846626 567592 186994 -195530 -507088 -765494 -906749 -834880 -579309 -239693 108907
13357A08907K86408J41153l2840j57383j89551j18836O413N0430k0630j00134
$$ 108907 395315 536468 503628 346245 156694 37858 44271 94701 74071 -26063
13347b6063m9670J98982M47880M71688K79287J02281P1140R6124K3686o9103l2789
$$ -26063 -75733 123249 571129 1042817 1322104 1424385 1495525 1591649 1615335 1546232 1513443
13336A513443P4245Q3162J31m7873o9768j03835j45899j84349j60657n7836M1061
$$ 1513443 1587688 1670850 1670981 1623108 1553340 1449505 1303606 1119257 958600 900764 941825
13325I41825O0664q5334k59966k87114j51126N6606K60059M05526L76285K10789
$$ 941825 1002489 917155 657189 370075 218949 275555 535614 941140 1317425 1528214
13315A528214o8157m16096n71262m36631k75923j57248l6639J01021K96125L25983
$$ 1528214 1460057 1043961 472699 36068 -239855 -397103 -433742 -332721 -36596 289387
13305B89387J32432q3646j98782j80793l1328O6171K1647K2149N2204l7663j22878
$$ 289387 421819 338173 139391 -41402 -72730 -6559 15088 37237 89441 51778 -71100
13294g1100j04719n8271j0849J08067J84567J65512J95775K52329K43890K14525
$$ -71100 -175819 -234090 -244939 -136872 47695 213207 408982 661311 905201 1119726
13284A119726K36366K20021J31020P3657L51j96585m24599n02651m13074k69025
$$ 1119726 1356092 1576113 1707133 1780790 1781141 1584556 1159957 657306 244232 -24793
13274b4793j78835j46799k2334K29452L34076J93619n861j6265J82954K49317
$$ -24793 -203628 -350427 -372761 -143309 190767 384386 378525 362260 545214 794531
13264G94531K39217K40997m7431m80493n98357l25729K1670J80938R3342J7827
$$ 794531 1033748 1274745 1227314 746821 148464 -177265 -155595 25343 118685 136512
13254A36512J14934J42720P8365P162p1895j48003j35364M3152K17370K10725
$$ 136512 251446 394166 472531 479693 407798 259795 124431 167583 384953 595678
13244E95678M6486j23024j22731Q1915K99700L69878L55378L53404L14388J61167
$$ 595678 642164 519140 396409 478324 778024 1147902 1503280 1856684 2171072 2332239
13234B332239l0329j18723j37752j57753k08570l01758k98689j24797K6523N7886
$$ 2332239 2301910 2183187 2045435 1887682 1679112 1377354 1078665 953868 980391 1038277
13224A038277J1756j0798R7167K88519L71137K56172K3131k28526l33955l31109
$$ 1038277 1050033 1039235 1136402 1424921 1796058 2052230 2075361 1846835 1512880 1181771
13214A181771k97529k08398r7992k731Q9111J14236N1890K0064M6988L5361k3647
$$ 1181771 884242 675844 577852 575121 664232 778468 830358 850422 897410 932771 909124
13203I09124n8690o5902l3338R3533J22171L140j3529R8603K32425L57067K97989
$$ 909124 850434 784532 751194 844727 966898 970038 956509 1055112 1287537 1644604 1942593
13192A942593J71750J80955K31684K23418J68822R0981k0328j34716k00199k24162
$$ 1942593 2114343 2295298 2526982 2750400 2919222 3010203 2989875 2855159 2654960 2430798
13182B430798l20605m90380o21677n39490k45891L9954J72297J56926J37462J89013
$$ 2430798 2110193 1619813 998136 458646 212755 252709 425006 581932 719394 908407
13172I08407L09515L86635L49228L06881K79301L18650L46239K19835K0387j52182
$$ 908407 1217922 1604557 1953785 2260666 2539967 2858617 3204856 3424691 3445078 3292896
13162C292896k38493k31084k01400j57250n8194J05743J56768l0469k40809k58237
$$ 3292896 3054403 2823319 2621919 2464669 2406475 2512218 2668986 2638517 2397708 2139471
13152B139471p6257J75547J83822m4072j90417j73704r8901r5695j85155k41818
$$ 2139471 2063214 2238761 2422583 2378511 2188094 2014390 1915489 1819794 1634639 1392821
13142A392821j93099k0224K27631L38466J60763q4709j50406j18759j45075j75956
$$ 1392821 1199722 1179498 1407129 1745595 1906358 1821649 1671243 1552484 1407409 1231453
13132A231453j34033n4270N3834K31489M33672N19031M57761K90766J01581o5350
$$ 1231453 1097420 1043150 1096984 1328473 1762145 2281176 2738937 3029703 3131284 3065934
13122C065934k62004l65438k71768p3770O7876O9569K9380l1434j03104r5539
$$ 3065934 2803930 2438492 2166724 2092954 2160830 2230399 2259779 2228345 2125241 2029702
13112B029702m5461P0668K28976K33842P0465j10936k09898j56839R822K08614
$$ 2029702 1984241 2054909 2283885 2517727 2588192 2477256 2267358 2110519 2120341 2328955
13102B328955L63705N27619O75872N97770L92603K33195J7109k38870l43483k54371
$$ 2328955 2692660 3220279 3896151 4493921 4886524 5119719 5136828 4897958 4554475 4300104
13092D300104j43506p4265m3775j22554j90005j44250j35098k34050j69406J46089
$$ 4300104 4156598 4082333 4038558 3916004 3725999 3581749 3446651 3212601 3043195 3189284
13082C189284M38604M84988L54189L18409M26858M79018L88248K54667J97871
$$ 3189284 3627888 4112876 4467065 4785474 5212332 5691350 6079598 6334265 6532136
13073F532136J67490M8877j30170k39916k02325j23946j72467k22805j17639Q8773
$$ 6532136 6699626 6748503 6618333 6378417 6176092 6052146 5879679 5656874 5539235 5628008
13063E628008J64108m057k04335k62425k31652j35900J6328J07708K08655M55521
$$ 5628008 5792116 5788059 5583724 5321299 5089647 4953747 4970075 5077783 5286438 5741959
13053E741959O81009O84746N23838L12919J80321J82249K24230K30541K46643
$$ 5741959 6422968 7107714 7631552 7944471 8124792 8307041 8531271 8761812 9008455
13044I008455K70754K36615K32971K98496K85134R3347j65848k21988j02617P5694
$$ 9008455 9279209 9515824 9748795 10047291 10332425 10425772 10259924 10037936 9935319 10011013
13034A0011013K89409N08276O28254O24738N52578N08439N12828M48150M10512
$$ 10011013 10300422 10808698 11436952 12061690 12614268 13122707 13635535 14083685 14494197
13025A4494197N29593P13018Q04568P55381O55564N49242N10142N80037O96991
$$ 14494197 15023790 15736808 16541376 17296757 17952321 18501563 19011705 19591742 20288733
13016B0288733Q71123J033830J117988J163342J191510J173661J006574P94188
$$ 20288733 21159856 22193686 23311674 24475016 25666526 26840187 27846761 28640949
13008B8640949R48513J544512K091569K225824K049268J966061K135229K510164
$$ 28640949 29589462 31133974 33225543 35451367 37500635 39466696 41601925 44112089
13000D4112089K971581L298832L485886L649280L897776M282217M817532N344817
$$ 44112089 47083670 50382502 53868388 57517668 61415444 65697661 70515193 75860010
12992G5860010N900982O554746P230920Q075444R255004J0619414J2041407J3722654
$$ 75860010 81760992 88315738 95546658 103622102 112877106 123496520 135537927 149260581
12984A49260581J5784715J8175611K1108215K4842448K9306767L4542668M0653985
$$ 149260581 165045296 183220907 204329122 229171570 258478337 293021005 333674990
12977C33674990M6752256N0636901M8604214L6003038J1190930j9574788m4762250
$$ 333674990 380427246 431064147 479668361 515671399 526862329 507287541 462525291
12970D62525291n7263553n8275111n2724658m4836601l7010202l0208754k4643026
$$ 462525291 405261738 346986627 294261969 249425368 212415166 182206412 157563386
12963A57563386k0233685j6620068j3482570j0968940r211364q002086p061527
$$ 157563386 137329701 120709633 107227063 96258123 87046759 79044673 71983146
12956G1983146o249974n483087m669704l817022l064341k544978k233096k018819
$$ 71983146 65733172 60250085 55580381 51763359 48699018 46154040 43920944 41902125
12948D1902125j849141j640143j390096j087593o77020l91035n27957q96830j075381
$$ 41902125 40052984 38412841 37022745 35935152 35258132 34867097 34339140 33442310 32366929
12939C2366929r22298o44853l92191r9011J47427L01005L08687K83497L24654
$$ 32366929 31444631 30799778 30407587 30308576 30456003 30757008 31065695 31349192 31673846
12930C1673846L21046L24188N53839R04280J167184J253388J299778J359418J482034
$$ 31673846 31994892 32319080 32872919 33777199 34944383 36197771 37497549 38856967 40339001
12921D0339001J957163K720469L196771L192127L157059L294460L335059K937041
$$ 40339001 42296164 45016633 48213404 51405531 54562590 57857050 61192109 64129150
12913F4129150K057187J292898J189859J694851K541230L440245M268909N036252
$$ 64129150 66186337 67479235 68669094 70363945 72905175 76345420 80614329 85650581
12905H5650581N722174O336009O937295P754985R052251J0704503J2375110J4062020
$$ 85650581 91372755 97708764 104646059 112401044 121453295 132157798 144532908 158594928
12897A58594928J6025827J8598683K1849300K5721262L0431616L6092859M2530886
$$ 158594928 174620755 193219438 215068738 240790000 271221616 307314475 349845361
12890C49845361M8782143N2117996M7775750L1083181K408268k9296518n2039160
$$ 349845361 398627504 450745500 498521250 529604431 532012699 502716181 450677021
12883D50677021o0706085n8453973n1081100m2726447l5013076k8376239k3087505
$$ 450677021 389970936 331516963 280435863 237709416 202696340 174320101 151232596
12876A51232596j9034225j5921489j3441513j1251126r341585p851456o723449
$$ 151232596 132198371 116276882 102835369 91584243 82242658 74391202 67667753
12869F7667753n764337m842566m006397l358614k814656k308589j970613j819891
$$ 67667753 61903416 57060850 53054453 49695839 46881183 44572594 42601981 40782090
12861D0782090j649974j382429j141658j009145r98496r93128q90722q10938r23928
$$ 40782090 39132116 37749687 36608029 35598884 34600388 33607260 32716538 31905600 30981672
12852C0981672j061609r61089p35606m74484j22324J85118L03296K43130P4684
$$ 30981672 29920063 28958974 28223368 27748884 27626560 27811678 28114974 28358104 28432788
12843B8432788J0775J12257L42410N74375P22349Q33711Q80163Q76260R46704
$$ 28432788 28443563 28555820 28898230 29472605 30194954 31028665 31908828 32785088 33731792
12834C3731792J222539J470511J504841J463708J533990J797615K093228K366776
$$ 33731792 34954331 36424842 37929683 39393391 40927381 42724996 44818224 47185000
12826D7185000K602358K836150L250625L817890M298969M612234M949873N452592
$$ 47185000 49787358 52623508 55874133 59692023 63990992 68603226 73553099 79005691
12818G9005691O074664O864411P736124Q604758R657302J1144917J3015237J5079065
$$ 79005691 85080355 91944766 99680890 108285648 117942950 129087867 142103104 157182169
12810A57182169J7352715K0001310K3127547K7038024L1994586L7797814M3875855
$$ 157182169 174534884 194536194 217663741 244701765 276696351 314494165 358370020
12803C58370020M8888185M9875394M2312642K2593726o812357l5763866n4103475
$$ 358370020 407258205 457133599 499446241 522039967 515227610 479463744 425360269
12796D25360269n9474812n5890809m8320498m0078032l2745062k6716054k1898913
$$ 425360269 365885457 309994648 261674150 221596118 188851056 162135002 140236089
12789A40236089j8107742j5127746j2747855j0709958q930655p472584o369329
$$ 140236089 122128347 107000601 94252746 83542788 74612133 67139549 60770220
12782F0770220n523424m798776m180714l690599l283982k927148k699887k618644
$$ 60770220 55246796 50448020 46267306 42576707 39292725 36365577 33665690 31047046
12774C1047046k546222k308758j943783j599971j346268j169939j031180r08266
$$ 31047046 28500824 26192066 24248283 22648312 21302044 20132105 19100925 18192659
12766A8192659p66669p03395p55216q51366r54677r11122p21846n48181m28066
$$ 18192659 17425990 16722595 15967379 15116013 14161336 13250214 12528368 11980187 11552121
12757A1552121l53748l63187m10381m95932n80582m98995k76504j04047q5768
$$ 11552121 11198373 10835186 10424805 9928873 9348291 8849296 8572792 8468745 8382977
12748H382977j52013k23010k90411l10172k86888j86515l2787K0182r99p0631
$$ 8382977 8230964 8007954 7717543 7407371 7120483 6933968 6901181 6921363 6920364 6849733
12738F849733j42898q9985J1028m5349j43427j48270j23654j70198k84582l13396
$$ 6849733 6706835 6616850 6627878 6582529 6439102 6290832 6167178 5996980 5712398 5399002
12728E399002k06724q2521L679n3757k09241k92538k42590o5341Q0139J15634
$$ 5399002 5192278 5109757 5113436 5059679 4850438 4557900 4315310 4249969 4330108 4445742
12718D445742J10599N1229J7471J3787j9600M5057J91832K15555N2067j59122
$$ 4445742 4556341 4607570 4625041 4638828 4619228 4664285 4856117 5071672 5123739 4964617
12708D964617k72893l96569n06331l93234j01904J03929P2763o0117j33538j39387
$$ 4964617 4691724 4295155 3788824 3395590 3293686 3397615 3470378 3410261 3276723 3137336
12698C137336n8256Q7237J48807J12591p1168k49415j57223K5155Q7966J1434
$$ 3137336 3079080 3166317 3315124 3427715 3356547 3107132 2949909 2975064 3063030 3074464
12688C074464j27437k36136j97858j03078q1364q3143o6709j12058j41792q8217
$$ 3074464 2947027 2710891 2513033 2409955 2328591 2245448 2178739 2066681 1924889 1836672
12678A836672r7461j16334o0886j7100j64551m11508m11039j43006N2331M0820
$$ 1836672 1739211 1622877 1561991 1544891 1380340 968832 557793 414787 467118 507938
12668E07938l78R6967K57455L53871M11351L84083J84418k3455j53400k02244
$$ 507938 507560 604527 861982 1215853 1627204 2011287 2195705 2172250 2018850 1816606
12658A816606j98608k19675j94219j21279j36839k42245k95649k31887p6212P4768
$$ 1816606 1617998 1398323 1204104 1082825 945986 703741 408092 176205 99993 174761
12648A74761J92443K89758K49501J50564J59397J66449N6025j32169k76949k66073
$$ 174761 367204 656962 906463 1057027 1216424 1382873 1438898 1306729 1029780 763707
12638G63707k57087k89443k48800j53882o7241N5504K20612L79221M10972K43219
$$ 763707 506620 217177 -31623 -185505 -252746 -197242 23370 402591 813563 1056782
12628A056782l209j81468k72362k75130q6863K40482L77536K14376J29346J97734
$$ 1056782 1053573 872105 599743 324613 237750 478232 855768 1070144 1199490 1397224
12618A397224K53390K84272K45893J15574l2097k01672l53633l46671k47981r6806
$$ 1397224 1650614 1934886 2180779 2296353 2264256 2062584 1708951 1362280 1114299 1017493
12608A017493P2656J70043J90960J21227M8421O1281K3230l9068q828J1340q747
$$ 1017493 1090149 1260192 1451152 1572379 1620800 1682081 1705311 1666243 1657415 1668755 1660008
12597A660008r291R763l1711j25803j90028o7128J52988K30846J74349J160j81066
$$ 1660008 1650717 1660480 1628769 1502966 1312938 1245810 1398798 1629644 1803993 1805153 1624087
12586A624087k31967l22034m19183l87168k78452j49418r9938j68754k65436l18531
$$ 1624087 1392120 1070086 650903 263735 -14717 -164135 -264073 -432827 -698263 -1016794
12576a016794k67862q1702J05357J20766Q6713J81676L16110M16666M32977K22159
$$ -1016794 -1284656 -1366358 -1261001 -1140235 -1053522 -871846 -555736 -139070 293907 516066
12566E16066q8809k86082l19140l00307k94086k77979k15622n4809Q1427J39233
$$ 516066 427257 141175 -177965 -478272 -772358 -1050337 -1265959 -1320768 -1239341 -1100108
12556a100108K16646J60293l63n0562l7566o1721p9148K4202J56765J10752j31585
$$ -1100108 -883462 -723169 -723532 -774094 -811660 -873381 -952529 -928327 -771562 -660810 -792395
12545g92395k81011r7553J70216K36410J42808P0657K9142R591L7376N4308L5331
$$ -792395 -1073406 -1170959 -1000743 -764333 -621525 -550868 -521726 -512135 -474759 -420451 -385120
12534c85120L1451Q9911J50528J61849N4078j00981j33934p6409k8172N2128R2036
$$ -385120 -353669 -263758 -113230 48619 102697 1716 -132218 -208627 -236799 -184671 -92635
12523i2635P073j23302q4997J04965K17700J63741K7420j68507l03985l23373
$$ -92635 -85562 -208864 -293861 -188896 28804 192545 219965 51458 -252527 -575900
12513e75900k47108J6909L06666L62361Q0232k97774m28235k31353j4421M7551
$$ -575900 -823008 -806099 -499433 -137072 -56840 -354614 -782849 -1014202 -1028623 -981072
12503i81072J55113K96790K95363J24183j10029k61152k97481k28924r8769m5884
$$ -981072 -825959 -529169 -233806 -109623 -219652 -480804 -778285 -1007209 -1105978 -1151862
12493a151862M9850K63560M26209L82530J54243k2321q785k8232j08482j63694
$$ -1151862 -1102012 -838452 -412243 -29713 124530 102209 93424 65192 -43290 -206984
12483b06984k57788l14562k26052o8713L5179M6957K5752J3046L5720J65853M08765
$$ -206984 -464772 -779334 -1005386 -1074099 -1038920 -991963 -966211 -953165 -917445 -751592 -342827
12472c42827N89146M51576J60328J30507K97645K99226N2889k47817l28282k13761
$$ -342827 246319 697895 858223 988730 1286375 1585601 1638490 1390673 1062391 848630
12462H48630j48167j64512j25396n0551j8287L4329k214j58968k74228k50467
$$ 848630 700463 535951 410555 360004 341717 376046 373832 214864 -59364 -309831
12452c09831q4607Q6874J35263J74437L53108M44790K68026m9439l42391m60924
$$ -309831 -394438 -307564 -172301 2136 355244 800034 1068060 1018621 676230 215306
12442B15306l49144j94810r2103P639R923o5472j14200j31431j23353j94201l07487
$$ 215306 -133838 -328648 -420751 -413112 -403189 -468661 -582861 -714292 -837645 -1031846 -1339333
12431a339333l15319k22276N893L31247O27532P41184O52767L83058N3879j14958
$$ -1339333 -1654652 -1876928 -1871035 -1539788 -912256 -171072 481695 864753 918632 803674
12421H03674l6963J44727J93060J91711J85446R4484n0632j95141j92201p1989
$$ 803674 766711 911438 1104498 1296209 1481655 1576139 1525507 1330366 1138165 1066176
12411A066176l5104p2804n3375O8989K43659J82985j05078k26762k10527j55547
$$ 1066176 1031072 958268 904893 973882 1217541 1400526 1295448 1068686 858159 702612
12401G02612p1174o9405n5656J00397K80414K96071J51264k8764j31004j52705
$$ 702612 631438 562033 506377 606774 887188 1183259 1334523 1305759 1174755 1022050
12391A022050j91983l14202m52984m60293l03662o0299M9869l4000j96562k76158
$$ 1022050 830067 515865 62881 -397412 -701074 -761373 -711504 -745504 -942066 -1218224
12381a218224k41353q7248J06014J63696K19237M16901N30916M02196J39956p3627
$$ -1218224 -1459577 -1546825 -1440811 -1277115 -1057878 -640977 -110061 292135 432091 358464
12371C58464j43804o7205J28534K59953K32316Q1317K3551N7655m1893j97710
$$ 358464 214660 147455 275989 535942 768258 849575 873126 930781 888888 691178
12361F91178k48195k52659k67016k56459k42881j65417j28056k17489k35592j34603
$$ 691178 442983 190324 -76692 -333151 -576032 -741449 -869505 -1086994 -1322586 -1457189
12351a457189k8951P6112K28080M23987N33776L80676J72600J25631J38150P9855
$$ -1457189 -1486140 -1410028 -1181948 -757961 -224185 156491 329091 454722 592872 672727
12341F72727m1040k32159l90361l75063k75439j42045L4490P8741l5847q3901
$$ 672727 631687 399528 9167 -365896 -641335 -783380 -748890 -670149 -705996 -789897
12331g89897k7638P3274J76685K13408K29045L44594L15120k421k84070k60609
$$ -789897 -817535 -744261 -567576 -354168 -125123 219471 534591 532170 248100 -12509
12321a2509o7793K7911J2264p715o291N7881J60742K63278L16719K07259j8989
$$ -12509 -80302 -52391 -40127 -47842 -54133 3748 164490 427768 744487 951746 932757
12310I32757j40542j49659k18071l47544m21774m10588k31055J25194L76751M69433
$$ 932757 792215 642556 424485 76941 -344833 -755421 -986476 -861282 -484531 -15098
12300a5098N35186M39131K00020M7088r4318k39424k49030k04366j83740j87241
$$ -15098 520088 959219 1159239 1206327 1112009 872585 623555 419189 235449 48208
12290D8208k40581k75766k13037o7971M4789M5573j7957o3124L451J46502K68020
$$ 48208 -192373 -468139 -681176 -749147 -704358 -658785 -676742 -739866 -736415 -589913 -321893
12279c21893K55722Q0887n4260j01655r3644j8859M4088M3726J9926J9746L7600
$$ -321893 -66171 14716 -39544 -141199 -234843 -253702 -209614 -165888 -145962 -126216 -88616
12268h8616P7428J39281J79579J42536k408j66253j47572M9701K09111K29243
$$ -88616 -11188 128093 307672 450208 447800 281547 133975 183676 392787 622030
12258F22030J82145J7248j45150q1008J3269j6365j20154j72932j47544j88597
$$ 622030 804175 821423 676273 595265 608534 592169 472015 299083 151539 -37058
12248c7058k22012j48247q6466q3223k4697L9371J0027j14659j67469k1072J81087
$$ -37058 -259070 -407317 -493783 -577006 -601703 -562332 -552305 -666964 -834433 -855505 -674418
12237f74418K84419K92233K28214J40800L5043o4167j16584k21005l44233l32145
$$ -674418 -389999 -97766 130448 271248 306291 242124 125540 -95465 -439698 -771843
12227g71843j61344J83095N12722N44423L39470O6128j91048l93057n32606n27388
$$ -771843 -933187 -750092 -237370 307053 646523 712651 521603 128546 -404060 -931448
12217i31448l67942k12921p5461P4844K14463M35085N10204K70811M8097j2435
$$ -931448 -1299390 -1512311 -1587772 -1512928 -1298465 -863380 -353176 -82365 -34268 -46703
12207d6703j9144k538J25697K68682K05667n340k20846k67421r5039P8451K30171
$$ -46703 -65847 -68385 57312 325994 531661 526321 305475 38054 -56985 21466 251637
12196B51637L34486K45550k9987k78708l82026l15897j74501o3636k7576q6022
$$ 251637 586123 831673 801686 522978 140952 -174945 -349446 -413082 -440658 -526680
12186e26680j20361j17451j25774j10988K7000J82392J54280M0004L9423J88002
$$ -526680 -647041 -764492 -890266 -1001254 -974254 -791862 -637582 -597578 -558155 -370153
12176c70153L39441K61517l4728l02835m58237m67215l21799j39212J2988R1450
$$ -370153 -30712 230805 196077 -106758 -564995 -1032210 -1354009 -1493221 -1480233 -1388783
12166a388783L1948j10890j58482j48908j91224k65980l70654l11458k1527J95958
$$ -1388783 -1356835 -1467725 -1626207 -1775115 -1966339 -2232319 -2602973 -2914431 -2935958 -2740000
12156b740000K33592K34312K60512K72909L52158N11818M99494K57435Q7927J19730
$$ -2740000 -2506408 -2272096 -2011584 -1738675 -1386517 -874699 -375205 -117770 -29843 89887
12146H9887J43588M0483j54518l30442l26851j45260L5782R7790J12965J84715
$$ 89887 233475 273958 119440 -211002 -537853 -683113 -647331 -549541 -436576 -251861
12136b51861K41704K07119J05098R3048K14454K73877J88747j1172k53177l65264
$$ -251861 -10157 196962 302060 395108 609562 883439 1072186 1061014 807837 442573
12126D42573k43729J4979J14478N1334L4516M29n1412p891N3600P3823M6016j869
$$ 442573 198844 213823 328301 379635 414151 414580 363168 355277 408877 482700 528716 526847
12114E26847K7604N8030k2742k30708m03785l56423q8081J22398J33823J66658
$$ 526847 554451 612481 589739 359031 -44754 -401177 -489258 -366860 -233037 -66379
12104f6379K85781L01132R1495j59151k55879k18519k00624k92695k84824K5596
$$ -66379 219402 520534 612029 452878 196999 -21520 -222144 -514839 -799663 -774067
12094g74067K88663K06308M0818M1551Q6562J06149J94583K77616J35999m0485
$$ -774067 -485404 -279096 -238278 -196727 -110165 -4016 190567 468183 604182 563697
12084E63697j1268M5223l8897j86595l04408l10535j57026J00118K71184K90883
$$ 563697 552429 597652 558755 372160 67752 -242783 -399809 -299691 -28507 262376
12074B62376J94308L8600p0385j01053o9279J6149R8333K9688j36095k12685k07599
$$ 262376 456684 495284 424899 323846 254567 270716 369049 398737 262642 49957 -157642
12063a57642j95497j17632N16Q8447J49822J77301J84031J64770J06747L0109
$$ -157642 -353139 -470771 -470255 -381808 -231986 -54685 129346 294116 400863 430972
12053D30972l1696q792P9525J24654P9792N2100N1592p180j46934k12261j28855
$$ 430972 399276 390484 470009 594663 674455 726555 778147 770967 624033 411772 282917
12042B82917o4810P606J14577J7043k70059l39162j51657l3460K841L2891L1304
$$ 282917 218107 225713 340290 357333 87274 -251888 -403545 -437005 -434164 -401273 -369969
12031c69969j6767j03030j68625j75403k18403l22229k89407k4471K11442K53228
$$ -369969 -386736 -489766 -658391 -833794 -1052197 -1374426 -1663833 -1688304 -1476862 -1223634
12021a223634J81746J14254O1120L0145L576q3992k18335k74089j78648j119J11683
$$ -1223634 -1041888 -927634 -866514 -836369 -832793 -916785 -1135120 -1409209 -1587857 -1588976 -1477293
12010a477293K08762K68887K33380K21383J59142N7764M1210M0149O7703J18635
$$ -1477293 -1268531 -999644 -766264 -544881 -385739 -327975 -286765 -246616 -178913 -60278
12000f0278J00453j4599j95848k64159j65813J1813J60300J33921r624p0317n952
$$ -60278 40175 25576 -170272 -434431 -600244 -588431 -428131 -294210 -303834 -374151 -380103
11989c80103N1910N337r0800j14858o5715r658m9772j67489j26462P0916K51294
$$ -380103 -328193 -322856 -413656 -528514 -594229 -603887 -653659 -821148 -947610 -876694 -625400
11978f25400L74181M14287K87813Q7682o7532j53942k11437j66631q3837j61321
$$ -625400 -251219 163068 450881 538563 471031 317089 105652 -60979 -144816 -306137
11968c06137k79011k48693j36848l4955O6214J82406K16013N9701k5545J54798
$$ -306137 -585148 -833841 -970689 -1005644 -939430 -757024 -541011 -481310 -506855 -352057
11958c52057K55553Q0878p8184p046M8411j3277J2834N5353P225k9646l1813k3143
$$ -352057 -96504 -15626 -93810 -100856 -52445 -65722 -52888 2465 9690 -19956 -51769 -74912
11946g4912o0637j99166l79255m22971k83474j47842j2098J71007L35582M09541
$$ -74912 -135549 -334715 -713970 -1136941 -1420415 -1568257 -1580355 -1409348 -1073766 -664225
11936f64225L33086J84241P0287N7391J09285n090l32407o34395o41927l11246
$$ -664225 -331139 -146898 -76611 -19220 90065 84975 -247432 -881827 -1523754 -1835000
11926a835000J39942M28338M90778N11282M82023K98887O4195J1118J19138J98431
$$ -1835000 -1695058 -1266720 -775942 -264660 217363 516250 580445 591563 710701 909132
11916I09132J35512l6924k34691l67504l59894k30950r0725O0402J59486J16722
$$ 909132 1044644 1007720 773029 405525 45631 -185319 -276044 -215642 -56156 60566
11906F0566J21292K05221K60950K52616K38530K14884J10758J6624n5571j26404
$$ 60566 181858 387079 648029 900645 1139175 1354059 1464817 1481441 1425870 1299466
11896A299466j43152j29312M983L07815N64107N42849K80850L1097j09779k58233
$$ 1299466 1156314 1027002 1031985 1339800 1903907 2446756 2727606 2758703 2648924 2390691
11886B390691l82239m21195k89328r4443n8502j69111k31722j63129p5547l0093
$$ 2390691 2008452 1587257 1297929 1203486 1144984 975873 744151 581022 505475 475382
11876D75382m1244j19718j56469j55128j72323j20514k8377L6788Q1515J21917
$$ 475382 434138 314420 157951 2823 -169500 -290014 -318391 -281603 -200088 -78171
11866g8171J69666K84012L08885R6998j00891j90814k98454l38687k08565p3099
$$ -78171 91495 375507 684392 781390 680499 489685 191231 -147456 -356021 -429120
11856d29120J4065J25777J70690J00547K9058L6640L9421j5157j60112k94584
$$ -429120 -415055 -289278 -118588 -18041 11017 47657 87078 71921 -88191 -382775
11846c82775k55559n5811K41132M54416L77732J16579r1058q7717M7271R5767
$$ -382775 -638334 -694145 -453013 1403 379135 495714 404656 316939 364210 459977
11836D59977J1920j56263k69473k30321p2420O8292O1713o626l2164L8495O8934
$$ 459977 471897 315634 46161 -184160 -256580 -188288 -126575 -133201 -165365 -126870 -57936
11825e7936j4998k6945O475k2446j4514l927J256P0665J64733K36079J98493O2262
$$ -57936 -72934 -99879 -93404 -115850 -130364 -134291 -133035 -62370 102363 338442 536935 599197
11813E99197k1741J6486M6207Q9694K85951N10294M89225J97054r8955q9862R7519
$$ 599197 577456 593942 640149 729843 1015794 1526088 2015313 2212367 2113412 2023550 2121069
11802B121069M0435j44569j63811j42583j49953r1295K4756J59895K37924K45447
$$ 2121069 2161504 2016935 1853124 1710541 1560588 1469293 1494049 1653944 1891868 2137315
11792B137315K63764L07389K55604J55931J20443J11513J02827J76348L93824
$$ 2137315 2401079 2708468 2964072 3120003 3240446 3351959 3454786 3631134 4024958
11783D024958O01065P22421P53917O75497N80363N62649O40188Q31677J027708
$$ 4024958 4626023 5348444 6102361 6777858 7358221 7920870 8561058 9392735 10420443
11774A0420443J288902J726891K109596K275702K352114K372013K161070J612291
$$ 10420443 11709345 13436236 15545832 17821534 20173648 22545661 24706731 26319022
11766B6319022Q31933O6144n17908q73921j004875r94944r02172p62640q29850
$$ 26319022 27150955 27217099 26699191 25825270 24820395 23825451 22923279 22160639 21330789
11757B1330789j316686j921042k212133k099161j852677j666710j487577j290280
$$ 21330789 20014103 18093061 15880928 13781767 11929090 10262380 8774803 7484523
11749G484523j060992p90765n27445l18752k17545j79701q0258m073q6736k27504
$$ 7484523 6423531 5632766 5105321 4786569 4569024 4389323 4309065 4304992 4218256 3990752
11739C990752l27212l37678k74113j92525j02438L510N2331p1909k69918k67020
$$ 3990752 3663540 3325862 3051749 2859224 2756786 2760296 2812627 2740718 2470800 2203780
11729B203780o5715Q5289Q2554j9379j4969J26342L22901M98924N83777M75341
$$ 2203780 2138065 2223354 2305908 2286529 2271560 2397902 2720803 3219727 3803504 4278845
11719D278845J83599k5746p0823l9205l7003j62301l36245l53910j71881k593
$$ 4278845 4462444 4436698 4365875 4326670 4289667 4127366 3791121 3437211 3265330 3262737
11709C262737j5108j29891k77080l53235k94033j10542J53696M66911P74593R95431
$$ 3262737 3247629 3117738 2840658 2487423 2193390 2082848 2236544 2703455 3478048 4473479
11699D473479J038007P88481L11568j25163j99403J43288N78047Q36334R30252
$$ 4473479 5511486 6299967 6611535 6486372 6286969 6430257 7008304 7844638 8774890
11690H774890Q48577O80039P75983J216223J716994J979254K143659K635242L402288
$$ 8774890 9623467 10303506 11079489 12295712 14012706 15991960 18135619 20770861 24173149
11681B4173149L916707L600372K219220K75293r47788r06976j21955Q84354J853289
$$ 24173149 28089856 31690228 33909448 34184741 33236953 32329977 32208022 33092376 34945665
11672C4945665K665625L426498M212200M969767N531226N506005M751788L294194
$$ 34945665 37611290 41037788 45249988 50219755 55750981 61256986 66008774 69302968
11664F9302968J233055r20679k539808l469926m072711m713515n415776n920369
$$ 69302968 70536023 69615344 67075536 63605610 59532899 54819384 49403608 43483239
11656D3483239n952870n427044m690522m046331l294682k399997j715569j304537
$$ 43483239 37530369 32103325 27412803 23366472 20071790 17671793 15956224 14651687
11648A4651687j062705j017929j074912j128236j175460j029306o59958l50442
$$ 14651687 13588982 12571053 11496141 10367905 9192445 8163139 7503181 7152739
11640G152739k92553m25597n83536p29694q12084q16456p12805m93836k79609
$$ 7152739 6860186 6434589 5851053 5121359 4309275 3492819 2780014 2286178 2006569
11631B006569j54652j49041k11869j82074P817J91519K07592N1447k26673m20585
$$ 2006569 1851917 1702876 1491007 1308933 1316750 1508269 1715861 1767308 1540635 1120050
11621A120050l20229K6044K94917K67164J14763M3022N6045R1348J4093p7882
$$ 1120050 799821 825865 1120782 1387946 1502709 1545731 1601776 1693124 1707217 1629335
11611A629335q7291j83132l75646m53346k99556k5889K24385L19673K79866J88444
$$ 1629335 1542044 1358912 983266 529920 230364 204475 428860 748533 1028399 1216843
11601A216843N7779m1188M4696K03829K35133J54778Q73j23588j39563j01522
$$ 1216843 1274622 1233434 1278130 1481959 1717092 1871870 1872743 1749155 1609592 1508070
11591A508070j6239M4582L399J9084J08035N4733j15579k60552k67371j91981
$$ 1508070 1491831 1536413 1539812 1558896 1666931 1721664 1606085 1345533 1078162 886181
11581H86181j23788j03645o9774N8939J79308J52331J5598n6961p251P6428K5643
$$ 886181 762393 658748 588974 647913 827221 979552 995150 938189 930938 1007366 1033009
11570A033009j43619j90907j32980k15076k74078j08161K332j1746K0567J7572
$$ 1033009 889390 698483 565503 350427 76349 -31812 -29480 -41226 -20659 -3087
11560c087m1738j34851k06134l05720m30607l40686l1707K73031L38278K93434
$$ -3087 -44825 -179676 -385810 -691530 -1122137 -1462823 -1494530 -1221499 -883221 -589787
11550e89787K82314K24835R0573k4133J1468J27502J60668J36307J03454J7351
$$ -589787 -307473 -82638 7935 -16198 -4730 122772 283440 419747 523201 540552
11540E40552j24667j83496m7539J02669Q8163k9913j96339l75804l77158k26937
$$ 540552 415885 232389 184850 287519 375682 345769 149430 -226374 -603532 -830469
11530h30469o0428N6975J79075K84728L00604K51708J67288J42521J74420K19464
$$ -830469 -890897 -833922 -654847 -370119 -69515 182193 349481 492002 666422 885886
11520H85886K31412J78508K30708K63826J15073j01594k25879j95344j31626j07400
$$ 885886 1117298 1295806 1526514 1790340 1905413 1803819 1577940 1382596 1250970 1143570
11510A143570j20991j88337k44273k56776k42949k84487l13098k64182j89277
$$ 1143570 1022579 834242 589969 333193 90244 -194243 -507341 -771523 -960800
11501i60800o9132R3270K50442L52501L32734J13839j98014m16119l98635j51472
$$ -960800 -1029932 -936662 -686220 -333719 -985 112854 -85160 -501279 -899914 -1051386
11491a051386M9479M2293j9817p932R5941K62590L70573K02354j54655l60454
$$ -1051386 -1001907 -959614 -979431 -987363 -891422 -628832 -258259 -55905 -210560 -571014
11481e71014l72031k20393N6778K24293J50272n2369k07627k24003o8212J82437
$$ -571014 -943045 -1163438 -1106660 -882367 -732095 -784464 -992091 -1216094 -1284306 -1101869
11471a101869L62561M33756L48514J40610j51777m53834o41211p43245n11577
$$ -1101869 -739308 -305552 42962 183572 31795 -422039 -1063250 -1806495 -2318072
11462b318072O4518N30030P03329P10698O06760M13562L00353K34596R7486r0413
$$ -2318072 -2253554 -1723524 -1020195 -309497 297263 710825 1011178 1245774 1343260 1252847
11452A252847j62311j59003j82206j13897k6452n1623j66745k14994m7102J55369
$$ 1252847 1090536 931533 749327 635430 608978 557355 390610 175616 128514 283883
11442B83883J34577K8924p2561k15380k65904r2623K51659N06370L99265J43464
$$ 283883 418460 447384 374823 159443 -106461 -199084 52575 558945 958210 1101674
11432A101674j3251j63144k99272l03314k32529j35543P265J26673J98544K19968
$$ 1101674 1088423 925279 626007 322693 90164 -45379 -38114 88559 287103 507071
11422E07071K26490K21694J95458Q5281m1198r4390j33520j07367k1894J48563
$$ 507071 733561 955255 1150713 1235994 1194796 1100406 966886 859519 837625 986188
11412I86188K75530J98604K2836j46005k90755l61556k81421j49493q513J05818
$$ 986188 1261718 1460322 1483158 1337153 1046398 684842 403421 253928 245415 351233
11402C51233J47636J55508J33049J10078N9495J8424M7597P1104N4325K4435o8668
$$ 351233 498869 654377 787426 897504 956999 975423 1023020 1094124 1148449 1172884 1104216
11391A104216j06287j55L0462q0345j17041k4492L8888N6640J07786J36117J5519
$$ 1104216 997929 997774 1028236 947891 830850 806358 845246 901886 1009672 1145789 1161308
11380A161308j03358j15868j62701j85938j36463j05281k0694J67705L52397L69592
$$ 1161308 1057950 942082 779381 593443 456980 351699 331005 498710 851107 1220699
11370A220699K08093L6638j09037k48037k94819k47476k80651k99150j95203o4935
$$ 1220699 1428792 1465430 1356393 1108356 813537 566061 285410 -13740 -208943 -273878
11360b73878L6636J21785J99484K00770J52699R7647k1806j78635j99185j168
$$ -273878 -237242 -115457 84027 284797 437496 535143 513337 334702 135517 134349
11350A34349J70366R6372m4837j10643j23932j3783R3817M7972o4441j47299j37026
$$ 134349 304715 401087 356250 245607 121675 107892 201709 249681 185240 37941 -99085
11339i9085J8050K13401K31920Q2283j3402k7648r0898k00478k59575q8501K40955
$$ -99085 -81035 132366 364286 446569 433167 405519 314621 114143 -145432 -233933 7022
11328G022L95639L35087K27669J89637J63587R2806K348k0957n0528k35049l84953
$$ 7022 402661 737748 965417 1155054 1318641 1411447 1413795 1392838 1342310 1107261 722308
11317G22308l08681q5311J14830K14003J95059K7493o5796O357P4340N2176J842
$$ 722308 413627 328316 443146 657149 852208 879701 813905 820262 894602 946778 948620
11306I48620k997k8631j88577k84687j83105r1407j06311m6118K02627M75863
$$ 948620 945623 916992 728415 443728 260623 169216 62905 16787 219414 695277
11296F95277N38448L98228L09034K84406K0149m73216q38626r31150p44762m11908
$$ 695277 1233725 1631953 1940987 2225393 2245542 1772326 933700 2550 -742212 -1154120
11286a154120r9626J52418K60669K96015K99177J71751K3308r7363k27066k15255
$$ -1154120 -1253746 -1101328 -840659 -544644 -245467 -73716 -50408 -147771 -374837 -590092
11276e90092m5996J23229J48700n212r8860m7333N5295R2220l5852r3227K156
$$ -590092 -636088 -512859 -364159 -369371 -468231 -515564 -460269 -368049 -403901 -497128 -494972
11265d94972O6082Q8399R1405n806j52822j30829J44586M42322M84552K38956
$$ -494972 -428890 -340491 -249086 -254892 -407714 -538543 -393957 48365 532917 771873
11255G71873n7489j29666o9073l2616m9554l889J27487J37727l1320j85593j86445
$$ 771873 714384 584718 515645 483029 433475 429586 557073 694800 663480 477887 291442
11244B91442j36525k04996k54672j12431O4035L4804r2758j32214l7637J00910
$$ 291442 154917 -50079 -304751 -417182 -353147 -318343 -411101 -543315 -580952 -480042
11234d80042J48698J27655J26981J78935K78201L03853J79910N366q8773j32475
$$ -480042 -331344 -203689 -76708 102227 380428 684281 864191 869557 780784 648309
11224F48309j78712k05986j00309Q3976J60304R9400K7535O3148R6128L0907p0872
$$ 648309 469597 263611 163302 247278 407582 506982 534517 597665 693793 724700 653828
11213F53828k00509k99349j64516J69163L14419J14793j37399k77230l56150m25364
$$ 653828 453319 153970 -10546 158617 473036 587829 450430 173200 -182950 -608314
11203f08314m06611k71809n5915L30106O61422N70090K22037m947p4697p2703
$$ -608314 -1014925 -1286734 -1342649 -1012543 -351121 218969 441006 436059 361362 288659
11193B88659r3386q4034j0288Q0607J68805K37072J44567j55997l65170k64940
$$ 288659 195273 111239 100951 181558 350363 587435 732002 576005 210835 -54105
11183e4105j07481p2757J8710J41564J74338J11617K0809K731J0373o8713j29281
$$ -54105 -161586 -234343 -215633 -74069 100269 211886 232695 235426 245799 177086 47805
11172D7805N341K24243K46833N3510j06803n6794J3199j0942R9080L44021M41074
$$ 47805 53146 277389 524222 577732 470929 414135 427334 416392 515472 859493 1300567
11161A300567K77178r454j62722j19965o4243j25485k12477j79387j11241j66370
$$ 1300567 1577745 1568291 1405569 1285604 1221361 1095876 883399 704012 592771 426401
11151D26401j58456M9871K56117K64565J20575r3197k95962l50193l44899k97136
$$ 426401 267945 317816 573933 838498 959073 865876 569914 219721 -125178 -422314
11141d22314j29133J02663J88038O4844l8004J3034J05100J43449J12637m5305
$$ -422314 -551447 -448784 -260746 -195902 -233906 -220872 -115772 27677 140314 95009
11131I5009k80751l98476l00717j17511p844P520o9848j06401r5455j68586j58483
$$ 95009 -185742 -584218 -884935 -1002446 -1010290 -1002770 -1072618 -1179019 -1274474 -1443060 -1601543
11120a601543P7522L23437K76660K7911o9512M4595K49576M00441L34431J31916
$$ -1601543 -1524021 -1200584 -923924 -896013 -965525 -920930 -671354 -270913 63518 195434
11110A95434n5346j61286j23830L0731J34652P4363j49928l07590k97281j26223
$$ 195434 140088 -21198 -145028 -114297 20355 94718 -55210 -362800 -660081 -786304
11100g86304R3097K37565L10128K67082J19541N0940O4471Q0287J05279J86381
$$ -786304 -693207 -455642 -145514 121568 241109 292049 356520 436807 542086 728467
11090G28467L05577K32414n5625k50734k49252k99958l57832k19183L9904K71961
$$ 728467 1034044 1266458 1210833 960099 710847 410889 53057 -166126 -126222 145739
11080A45739L44540K75730K02008J15139o4094k19354j91679j08126j16816j28667
$$ 145739 490279 766009 968017 1083156 1019062 799708 608029 499903 383087 254420
11070B54420m716J93637K70768J23185j09888k84399k93472j40926l2939n9680
$$ 254420 249704 443341 714109 837294 727406 443007 149535 8609 -24330 -84010
11060h4010l0693J41821K99609K50017m8101l42288l57598j89098j7825M7556
$$ -84010 -114703 27118 326727 576744 528643 186355 -171243 -360341 -378166 -330610
11050c30610q2004l32809m34095k88493o2970R0539J53718J39287R6174J37691
$$ -330610 -412614 -745423 -1179518 -1468011 -1530981 -1440442 -1286724 -1147437 -1051263 -913572
11040i13572K85145M46204N37787N06056L44704J86543M7830l2914n0164J8P2018
$$ -913572 -628427 -182223 355564 861620 1206324 1392867 1440697 1407783 1357619 1357637 1429655
11029A429655M0612m1892n7078j09366k77586m32650m35769k61366o9040M5876
$$ 1429655 1470267 1428375 1371297 1261931 984345 551695 115926 -145440 -214480 -168604
11019a68604J38035K27630K86684L44474L55038K65445N8660k46962m57820m48742
$$ -168604 -30569 197061 483745 828219 1183257 1448702 1507362 1260400 802580 353838
11009C53838l03126j06006J16296K12220J52565k890j98032l08397k90907k19257
$$ 353838 50712 -55294 61002 273222 425787 422897 224865 -83532 -374439 -593696
10999e93696p5555J14346K93296M06240L65684K27525J26427j939j93287k84827
$$ -593696 -669251 -554905 -261609 144631 510315 737840 864267 862328 669041 384214
10989C84214k21709j28883j69538j95244p9095m9397j06600r1668m5720n5387
$$ 384214 162505 33622 -135916 -331160 -410255 -459652 -566252 -657920 -703640 -759027
10979g59027r5556l4544R3456K30545L50509L91537J97802j21416j85640P1212
$$ -759027 -854583 -889127 -795671 -565126 -214617 176920 374722 253306 67666 138878
10969A38878K79801J72156j25544l08469k10947j1234P8580O2458k4224j18830
$$ 138878 418679 590835 465291 156822 -54125 -65359 13221 75679 51455 -67375
10959f7375j13855j24119j87076j88561j04224K0555J41005K50005L31226K74708
$$ -67375 -181230 -305349 -492425 -680986 -785210 -764655 -623650 -373645 -42419 232289
10949B32289P5656j20148j58545p2906R2340K52508K24994L1490j11703j36726
$$ 232289 307945 187797 29252 -43654 48686 301194 526188 557678 445975 309249
10939C09249j81863k92320l86137l63735j84606m065K7886l593n9854j69615j93305
$$ 309249 127386 -164934 -551071 -914806 -1099412 -1103477 -1075591 -1079184 -1139038 -1308653 -1501958
10928a501958j45273j39315L9233M39305O88915N76676K81509Q0289q5150k62128
$$ -1501958 -1647231 -1786546 -1747313 -1308008 -619093 -42417 239092 319381 234231 -27897
10918b7897k95310j22133R4983J76492J39392j9691k12118k63955j27194K5791
$$ -27897 -323207 -445340 -350357 -173865 -34473 -54164 -266282 -530237 -657431 -631640
10908f31640J09315J35144J06562J56966K84980L30122K67738J65918K603o7631
$$ -631640 -522325 -387181 -280619 -123653 161327 491449 759187 925105 927708 860077
10898H60077K4926J10328M8756j35885l01567l85654l94486m19276l47516j03272
$$ 860077 885003 995331 1044087 908202 606635 220981 -173505 -592781 -940297 -1043569
10888a043569Q2089J64947J71431J37686K12794L43970L19259J78405R5120K4578
$$ -1043569 -961480 -796533 -625102 -487416 -274622 69348 388607 567012 662132 686710
10878F86710j1256K0392O5215R8345M6920j37001k45183k59429l62228m78866
$$ 686710 675454 695846 761061 859406 906326 769325 524142 264713 -97515 -576381
10868e76381m45898k28414J42452L81317K63095k2886k47668j96567J20905K80537
$$ -576381 -1022279 -1250693 -1108241 -726924 -463829 -486715 -734383 -930950 -810045 -529508
10858e29508K06555O2278Q153P0535J21663J54409J27690M5683j3973o104j4444
$$ -529508 -322953 -260675 -252522 -181987 -60324 94085 221775 267458 253485 247381 232937
10847B32937m9051j15020j82318j28430N6614K57424K76320J61687r137k23761
$$ 232937 183886 68866 -113452 -241882 -185268 72156 348476 510163 501026 277265
10837B77265l84023l37025j28802k0792j6084J05679L38052M91447L60417k292
$$ 277265 -106758 -443783 -572585 -593377 -609461 -503782 -165730 325717 686134 683842
10827F83842k60997k40508q1290J7831M6430N9475j02228l73798m95986l39707
$$ 683842 422845 182337 101047 118878 165308 224783 122555 -251243 -747229 -1086936
10817a086936n3135J10334J29759J62367K32970J92357R9916K9971l5647r2201
$$ -1086936 -1140071 -1029737 -899978 -737611 -504641 -312284 -212368 -182397 -218044 -310245
10807c10245j13464o2029m7209o7525j71287l26064k81883o9404J00192Q3102
$$ -310245 -423709 -485738 -532947 -600472 -771759 -1097823 -1379706 -1449110 -1348918 -1265816
10797a265816o1725p6093K8760O4380J03751J86908K52442K98028L18001K97021
$$ -1265816 -1327541 -1403634 -1374874 -1310494 -1206743 -1019835 -767393 -469365 -151364 145657
10787A45657K27481R5970j0743k5309j4889q2021q3569O9276K18063K74577K48078
$$ 145657 373138 469108 458365 433056 418167 336146 252577 321853 539916 814493 1062571
10776A062571R2568j03665j65148j16378j55759k67458k30083n9921L2797J14074
$$ 1062571 1155139 1051474 886326 769948 614189 346731 116648 56727 89524 203598
10766B03598K25709K74854J58276r3331k03732j64922j66233j81817k14028k11339
$$ 203598 429307 704161 862437 769106 565374 400452 234219 52402 -161626 -372965
10756c72965j01882q4525j36097o1847K4100L4901K1920P5567R9742N088j30111
$$ -372965 -474847 -559372 -695469 -757316 -733216 -698315 -676395 -600828 -501086 -495998 -626109
10745f26109j14673N3160J96654K30562J66219J17993R1417l527j29422k01502
$$ -626109 -740782 -687622 -490968 -260406 -94187 23806 115223 111696 -17726 -219228
10735b19228j58335k234J16068Q1373k4836j2812J31900K33900J25425n0191n4789
$$ -219228 -377563 -379797 -263729 -182356 -207192 -220004 -88104 145796 271221 221030 166241
10724A66241M9989P3202o9370l60484n87085n41303k08456J86237L11739J12616
$$ 166241 216230 289432 220062 -140422 -727507 -1268810 -1477266 -1291029 -979290 -866674
10714h66674j31855j59701j4857N8504j115r4512q9017Q2566K53064K02625O0597
$$ -866674 -998529 -1158230 -1173087 -1114583 -1115698 -1210210 -1299227 -1216661 -963597 -760972 -700375
10703g00375M532l5505j28417p4182J32272J48406k8089j21636p5942m089L0957
$$ -700375 -695843 -731348 -859765 -933947 -801675 -653269 -681358 -802994 -878936 -883025 -852068
10692h52068M2228N7056Q7761J64958K39183L49042N28901N58939M07834J78629
$$ -852068 -809840 -752784 -665023 -500065 -260882 88160 617061 1176000 1583834 1762463
10682A762463j16015l35246l44992l18742k95814j13026J35080J76005M8384m0466
$$ 1762463 1646448 1311202 966210 647468 351654 238628 373708 549713 598097 557631
10672E57631n2613o2569j68116l00100l08830j43751L7469M1380J2526P4532R6147
$$ 557631 505018 442449 274333 -25767 -334597 -478348 -440879 -399499 -386973 -312441 -216294
10661b16294o6668l54527m21307j97316J9416J28664J58466Q7157r2235l38253
$$ -216294 -282962 -637489 -1058796 -1256112 -1236696 -1108032 -949566 -862409 -954644 -1292897
10651a292897l55682j06153J78306L63150L08726J59174R7430O0107P6490J46123
$$ -1292897 -1648579 -1754732 -1576426 -1213276 -904550 -745376 -647946 -587839 -511349 -365226
10641c65226J47322J08648J66671L11074M25579L33689P3489k27649m51195m23334
$$ -365226 -217904 -109256 57415 368489 794068 1127757 1201246 973597 522402 99068
10631I9068k27016J9017K80797M21532L15922R0899l9047k4862J26777K61808
$$ 99068 -127948 -108931 171866 593398 909320 1000219 961172 936310 1063087 1324895
10621A324895J74171n3124l04809m68853m51480l69367l68520l94865l10073j75684
$$ 1324895 1499066 1445942 1141133 672280 220800 -148567 -517087 -911952 -1222025 -1397709
10611a397709j16344n4188M5723L1956K1295J32552J84739J05128L8889J01760
$$ -1397709 -1514053 -1568241 -1522518 -1490562 -1469267 -1336715 -1151976 -1046848 -1007959 -906199
10601i06199J98636J32469r6567k33095j38206L3952J76801K18099J45031J378
$$ -906199 -707563 -575094 -671661 -904756 -1042962 -1009010 -832209 -614110 -469079 -467701
10591d67701l1195O9861J85385K02558J00665R1700K10290K45580J87105R0136
$$ -467701 -498896 -429035 -243650 -41092 59573 151273 361563 607143 794248 884384
10581H84384l8191p8147N1779R5291j14377k89240k29924L2415K00778N084m03818
$$ 884384 846193 768046 819825 915116 800739 511499 281575 313990 514768 519852 116034
10570A16034o05484l86859j9282J54473J39740J9097q6606j25420j05419o5804
$$ 116034 -489450 -876309 -895591 -741118 -601378 -582281 -668887 -794307 -899726 -965530
10560i65530j23237k22434k74389k05009k3126K30979M91847N45587L24850l6547
$$ -965530 -1088767 -1311201 -1585590 -1790599 -1813725 -1582746 -1090899 -545312 -220462 -257009
10550b57009k71968k77717j27588R3108K01126J26306r119o2949k6070R0808J36351
$$ -257009 -528977 -806694 -934282 -841174 -640048 -513742 -522861 -585810 -611880 -521072 -384721
10539c84721N787q3679Q039J39539J53910l168j93448j75034J2354Q9382j50847
$$ -384721 -378934 -462613 -454574 -315035 -161125 -164293 -357741 -532775 -520421 -431039 -581886
10528e81886m45808m31147j83157N9248K03547K33473J44179P8575J15035J73098
$$ -581886 -1027694 -1458841 -1641998 -1582750 -1379203 -1145730 -1001551 -922976 -807941 -634843
10518f34843J72336R6141n7305k32605k86834j37891K8013M7321K990J9458J78256
$$ -634843 -462507 -366366 -423671 -656276 -943110 -1081001 -1052988 -1005667 -1002677 -983219 -804963
10507h04963L86572M68522L44071R2412l4903l7104j38920k83972l13287k37702
$$ -804963 -418391 50131 394202 486614 451711 414607 275687 -8285 -321572 -559274
10497e59274j09577L6993J00890N0894J1756m069l0110j31964j74198K358K18667
$$ -559274 -668851 -631858 -530968 -480074 -468318 -472387 -502497 -634461 -808659 -806301 -587634
10486e87634K18899L5688q7854j30392j03798j626J54089K71983K03127j7264
$$ -587634 -368735 -333047 -420901 -551293 -655091 -656717 -502628 -230645 -27518 -44782
10476d4782k29441l56122l07313r2308R7359J52709J31255J54224J91006O5467
$$ -44782 -274223 -630345 -937658 -1029966 -932607 -779898 -648643 -494419 -303413 -237946
10466b37946j22363j89904j16519J6044J45267J58334O5741N448J5745J1453p6863
$$ -237946 -360309 -550213 -666732 -650688 -505421 -347087 -281346 -275898 -260153 -248700 -325563
10455c25563k21389k94041k36592j32915l4127Q3294J86016K94049L92851L82471
$$ -325563 -546952 -840993 -1077585 -1210500 -1244627 -1161333 -975317 -681268 -288417 94054
10445I4054J80844j01499k33943j62162p1107o519K9230m2571j34433j75043k16281
$$ 94054 274898 173399 -60544 -222706 -293813 -300332 -271102 -313673 -448106 -623149 -839430
10434h39430k87167k64859p6490Q1169j9042k23704k54153p0013K06401M10507
$$ -839430 -1126597 -1391456 -1467946 -1386777 -1405819 -1629523 -1883676 -1953689 -1747288 -1336781
10424a336781M58724M44044L92270L20728K87559K45945J30187L0036J0636k1164
$$ -1336781 -878057 -434013 -41743 278985 566544 812489 942676 972712 983348 962184
10414I62184r6012j55329j84083j16692O8601J88793J41766J07641N6189p0031
$$ 962184 866172 710843 526760 410068 478669 667462 809228 916869 973058 903027
10404I03027j60090k90228m19513m08545k14506k4117J7058R685J990m0070q2967
$$ 903027 742937 452709 33196 -375349 -589855 -613972 -596914 -587229 -585239 -625309 -708276
10393g08276q5600R245K13457L79255L93637K92806J74930M3725q8438j10760
$$ -708276 -793876 -784631 -571174 -191919 201718 494524 669454 713179 624741 513981
10383E13981m3854j5413l4988r8742j84257k02009k13983j22889J86889L92353
$$ 513981 470127 454714 419726 320984 136727 -65282 -279265 -402154 -215265 177088
10373A77088K61900L3255r765N587j37085k64003j94029j04532r6376j00890m4146
$$ 177088 438988 472243 462478 468065 330980 66977 -127052 -231584 -327960 -428850 -472996
10362d72996Q1002J49013J83131K26052J92214J38275J11334P4473K3340m1821
$$ -472996 -391994 -242981 -59850 166202 358416 496691 608025 682498 705838 664017
10352F64017l6066J793l8641j04830j76432k45135k71736k44885j73515o6540
$$ 664017 627951 629744 591103 486273 309841 64706 -207030 -451915 -625430 -691970
10342f91970R4712K53518K94831K11634J66131K25484J72448N135q5367j5446
$$ -691970 -597258 -343740 -48909 162725 328856 554340 726788 731923 646556 631110
10332F31110J40678K12510M1191k29055l18280k05145m8970M1066J9377k4928
$$ 631110 771788 984298 1025489 796434 478154 273009 224039 265105 284482 259554
10322B59554L541M0975P4752J78237K75109K46208J23782o0847j96779k14460
$$ 259554 263095 304070 378822 557059 832168 1078376 1202158 1141311 944532 730072
10312G30072j21633l1726o3188j33010j32946j86826k10708J7251K93944L66447
$$ 730072 608439 576713 513525 380515 247569 60743 -149965 -132714 161230 527677
10302E27677K50606J47816J21120N2617m2692p3846o2263j3795l3835p9085n0747
$$ 527677 778283 926099 1047219 1099836 1057144 983298 921035 907240 873405 794320 743573
10291G43573m3017q9874r0455J7139J64375K95449M01127L22629N683k33291j89573
$$ 743573 700556 610682 520227 537366 701741 997190 1398317 1720946 1726629 1493338 1303765
10280A303765j13457k03199k98145l46947m34852l73597r2815Q4394M4227n5899
$$ 1303765 1190308 987109 688964 342017 -92835 -466432 -559247 -474853 -430626 -486525
10270d86525j04911q9808r8323j47476j39954j0169J50427J99623Q3311n3194
$$ -486525 -591436 -681244 -779567 -927043 -1066997 -1077166 -926739 -727116 -643805 -696999
10260f96999o7050M989Q8437R5674K2585j7238R313J11051K29932K86374K21978
$$ -696999 -764049 -759060 -670623 -574949 -552364 -569602 -560289 -449238 -219306 67068 289046
10249B89046J60667K40700K16801J09874L8046n1626k06002l73511l34196q1473
$$ 289046 449713 690413 907214 1017088 1055134 1003508 797506 423995 89799 8326
10239H326J34375J53374K206j58722k92427l67112k42180L2745J32854l2493j61145
$$ 8326 142701 296075 298281 139559 -152868 -519980 -762160 -729415 -596561 -629054 -790199
10228g90199j35711j07433r1142q6308j58152k33097j31973J06392K96191L87115
$$ -790199 -925910 -1033343 -1124485 -1210793 -1368945 -1602042 -1734015 -1627623 -1331432 -944317
10218i44317M38143L71480J34515r6045k23059l23830k94430j74877j14759r922
$$ -944317 -506174 -134694 -179 -96224 -319283 -643113 -937543 -1112420 -1227179 -1237101
10208a237101J90171K39856J71067K26700L17384J94170K7912K9871L3821K504
$$ -1237101 -1046930 -807074 -636007 -409307 -91923 102247 130159 160030 193851 196355
10198A96355q0556j57557j97296j89694j63575j49180j22051l8514J20666L12764
$$ 196355 115799 -41758 -239054 -428748 -592323 -741503 -863554 -902068 -781402 -468638
10188d68638M41383L32558J1241k20930j98765R874K10219K76090K76794K27951
$$ -468638 -27255 305303 316544 95614 -103151 -93277 116942 393032 669826 897777
10178H97777J30079O7250M8012R1916K34399L71343M05081L60405K29374j6226
$$ 897777 1027856 1095106 1143118 1235034 1469433 1840776 2245857 2606262 2835636 2819410
10168B819410k57430k31552J8389J65111J08133n999j22145k00080j76944j8951
$$ 2819410 2561980 2330428 2348817 2513928 2622061 2616062 2493917 2293837 2116893 2097942
10158B097942K22661M28369N27760N14424L97128J95403J3117n3187r1090j61857
$$ 2097942 2320603 2748972 3276732 3791156 4188284 4383687 4396804 4343617 4252527 4090670
10148D090670k18269j95296j61528j05702j9826q5492k09362j44932K128p9624
$$ 4090670 3872401 3677105 3515577 3409875 3390049 3304557 3095195 2950263 2952391 2872767
10138B872767k74982l27748k15366k0840N5646j8436o2398k1084J19659K39204
$$ 2872767 2597785 2270037 2054671 2033831 2089477 2071041 2008643 1987559 2107218 2346422
10128B346422O6811k77581l93085k09907r425K7906l5638j21040k53151l66460
$$ 2346422 2413233 2135652 1742567 1532660 1523235 1551141 1515503 1394463 1141312 774852
10118G74852k94423j30282K624M4557k60K2754J02235J24053J36167J71825K35971
$$ 774852 480429 350147 352771 397328 397068 419822 522057 646110 782277 954102 1190073
10107A190073K64553K50842J58040j17000n14443p00039n37656k32826J6725N0098
$$ 1190073 1454626 1705468 1863508 1746508 1232065 532026 -5630 -238456 -221731 -171633
10097a71633p1578j86358j28121K7409J10822J29480J22799R3582O3140L7464
$$ -171633 -243211 -429569 -557690 -530281 -419459 -289979 -167180 -73598 -10458 27006
10087B7006M273m1776j21974j40947q9019m0070q7972j81548k53755k00693q656
$$ 27006 31279 -10497 -132471 -273418 -362437 -402507 -490479 -672027 -925782 -1126475 -1135131
10076a135131J73270L12142L81521L58731K78809K43575K50262J93460J18497
$$ -1135131 -961861 -649719 -268198 90533 369342 612917 863179 1056639 1175136
$$ [...]
##END NTUPLES=NMR SPECTRUM
##END=
