##TITLE=C13_SR-157-K3-TFAA4
 CDCl3,22200 sc

 6.7.2023
##JCAMPDX= 6.0         $$ Bruker NMR JCAMP-DX V2.0
##DATA TYPE= NMR SPECTRUM
##DATA CLASS= NTUPLES
##ORIGIN= UXNMR, Bruker Analytische Messtechnik GmbH
##OWNER= root
$$ XWIN-NMR		Version 3.5
$$ Fri Jul  7 13:40:46 2023 Russian Standard Time (UT+4h)  she@DPX200
##.OBSERVE FREQUENCY= 50.327896
##.OBSERVE NUCLEUS= ^13C
##.ACQUISITION MODE= SIMULTANEOUS
##.ACQUISITION SCHEME= undefined
##.AVERAGES= 22201
##.DIGITISER RES= 17
##SPECTROMETER/DATA SYSTEM= spect
##.PULSE SEQUENCE= zgpg30
##.SOLVENT NAME= DMSO
##.SHIFT REFERENCE= (INTERNAL, DMSO, 0, 222.624)
##AUDIT TRAIL= $$ (NUMBER, WHEN, WHO, WHERE, WHAT)
$$ ##TITLE= Audit trail, XWIN-NMR		Version 3.5
$$ ##JCAMPDX= 5.01
$$ ##ORIGIN= Bruker BioSpin GmbH
$$ ##OWNER= she
$$ F:/spectra/data/she/nmr/c13/1/pdata/1/auditp.txt
$$ ##AUDIT TRAIL=  $$ (NUMBER, WHEN, WHO, WHERE, WHAT)
(   1,<2023-07-07 13:39:12.90 +0400>,<she>,<DPX200>,
      <created by zg, POWCHK disabled, PULCHK disabled
       terminated by command 'halt'
       configuration hash MD5:
       00 E9 B6 7A A2 85 ED C7 34 08 36 98 17 FE 4E 26
       data hash MD5: 32K
       68 43 7A B3 A6 51 B5 F5 4B F2 C9 A4 0C BE 7F 1F>)
(   2,<2023-07-07 13:39:18.28 +0400>,<she>,<DPX200>,
      <Start of raw data processing
       efp BC_mod = 2 LB = 2 FT_mod = 6 PKNL = 1 PHC0 = -387.7991 PHC1 = 24.73318 SI = 32K 
       data hash MD5: 32K
       F3 7F 80 47 A4 02 95 D8 03 70 F3 B5 ED F6 71 3C>)
(   3,<2023-07-07 13:39:20.90 +0400>,<she>,<DPX200>,
      <abs ABSG = 5 
       data hash MD5: 32K
       6F 81 D0 7D EC E6 85 EE 86 4C 81 1E BC 38 4E FC>)
(   4,<2023-07-07 13:39:48.71 +0400>,<she>,<DPX200>,
      <pk PHC0 = 5.064978 PHC1 = -2.4 
       data hash MD5: 32K
       1C 6E FC 98 EE 01 F1 0E ED 5F CD 26 A2 40 D6 DE>)
(   5,<2023-07-07 13:39:52.03 +0400>,<she>,<DPX200>,
      <abs ABSG = 5 
       data hash MD5: 32K
       97 76 A4 80 C2 B7 4B 6E 36 8E 98 17 58 8B 70 81>)
$$ ##END=
$$ 
$$ hash MD5
$$ 71 AE 82 E3 0E 9F 8C 61 F7 20 62 76 E6 BF 6D 6A
##$RELAX= 
##$RELAX= 
##$RELAX= 
##$RELAX= 
##$RELAX= 
##$RELAX= 
##$RELAX= 
##$RELAX= 
$$ Bruker specific parameters
$$ --------------------------
##$DU= <F:/spectra>
##$EXPNO= 1
##$NAME= <c13>
##$PROCNO= 1
##$TYPE= <nmr>
##$USER= <she>
##$AMP= (0..31)
100 100 100 100 100 100 100 100 100 100 100 100 100 100 100 100 100 100 
100 100 100 100 100 100 100 100 100 100 100 100 100 100 
##$AQSEQ= 0
##$AQ_mod= 1
##$AUNM= <au_zg>
##$AUTOPOS= <>
##$BF1= 50.322709
##$BF2= 200.13
##$BF3= 50.322709
##$BF4= 500.13
##$BF5= 500.13
##$BF6= 500.13
##$BF7= 500.13
##$BF8= 500.13
##$BYTORDA= 1
##$CFDGTYP= 0
##$CFRGTYP= 5
##$CHEMSTR= <none>
##$CNST= (0..31)
1 1 145 1 1 1 1 1 1 1 1 1 1 1 1 1 1 1 1 1 1 1 1 1 1 1 1 1 1 1 1 1 
##$CPDPRG= <waltz16>
##$CPDPRG1= <>
##$CPDPRG2= <waltz16>
##$CPDPRG3= <>
##$CPDPRG4= <mlev>
##$CPDPRG5= <mlev>
##$CPDPRG6= <mlev>
##$CPDPRG7= <mlev>
##$CPDPRG8= <mlev>
##$CPDPRGB= <>
##$CPDPRGT= <>
##$D= (0..31)
$$ [...]
##$SUBNAM4= <"">
##$SUBNAM5= <"">
##$SUBNAM6= <"">
##$SUBNAM7= <"">
##$SUBNAM8= <"">
##$SUBNAM9= <"">
##$SW= 239.972175391363
##$SWIBOX= (0..15)
0 1 3 0 0 0 0 0 0 0 0 0 0 0 0 0 
##$SW_h= 12077.2946859903
##$TD= 32768
##$TD0= 1
##$TE= 0
##$TE2= 300
##$TE3= 300
##$TEG= 300
##$TL= (0..7)
120 120 120 120 120 120 120 120 
##$TP= (0..7)
150 150 150 150 150 150 150 150 
##$TP07= 0
##$TPNAME0= <>
##$TPNAME1= <>
##$TPNAME2= <>
##$TPNAME3= <>
##$TPNAME4= <>
##$TPNAME5= <>
##$TPNAME6= <>
##$TPNAME7= <>
##$TPOAL= (0..7)
0.5 0.5 0.5 0.5 0.5 0.5 0.5 0.5 
##$TPOFFS= (0..7)
0 0 0 0 0 0 0 0 
##$TUNHIN= 0
##$TUNHOUT= 0
##$TUNXOUT= 0
##$USERA1= <user>
##$USERA2= <user>
##$USERA3= <user>
##$USERA4= <user>
##$USERA5= <user>
##$V9= 5
##$VALIST= <valist>
##$VCLIST= <CCCCCCCCCCCCCCC>
##$VD= 0
##$VDLIST= <DDDDDDDDDDDDDDD>
##$VPLIST= <PPPPPPPPPPPPPPP>
##$VTLIST= <TTTTTTTTTTTTTTT>
##$WBST= 1024
##$WBSW= 4
##$XGAIN= (0..3)
0 0 0 0 
##$XL= 0
##$YL= 0
##$YMAX_a= 159484289
##$YMIN_a= -54827268
##$ZGOPTNS= <>
##$ZL1= 120
##$ZL2= 120
##$ZL3= 120
##$ZL4= 120
##$ABSF1= 222.624
##$ABSF2= -17.3728
##$ABSG= 5
##$ABSL= 3
##$ALPHA= 0
##$AQORDER= 0
##$ASSFAC= 0
##$ASSFACI= 0
##$ASSFACX= 0
##$ASSWID= 0
##$AUNMP= <proc_1d>
##$AZFE= 0.1
##$AZFW= 0.5
##$BCFW= 0
##$BC_mod= 2
##$BYTORDP= 0
##$COROFFS= 0
##$CY= -3
##$DATMOD= 1
##$DC= 0
##$DFILT= <>
##$DTYPP= 0
##$F1P= 0
##$F2P= 0
##$FCOR= 0.5
##$FTSIZE= 32768
##$FT_mod= 6
##$GAMMA= 0
##$GB= 0
##$INTBC= 1
##$INTSCL= 4.134877e-10
##$ISEN= 128
##$LB= 2
##$LEV0= 0
##$LPBIN= 0
##$MAXI= 10000
##$MC2= 0
##$MEAN= 0
##$ME_mod= 0
##$MI= 0.1934396
##$NCOEF= 0
##$NC_proc= 2
##$NLEV= 6
##$NOISF1= 120.0001
##$NOISF2= 80.00006
##$NSP= 0
##$NTH_PI= 0
##$NZP= 0
##$OFFSET= 222.624
##$PC= 1.4
##$PHC0= -382.7341
##$PHC1= 22.33318
##$PH_mod= 1
##$PKNL= yes
##$PPARMOD= 0
##$PSCAL= 0
##$PSIGN= 0
##$REVERSE= no
##$SF= 50.3227315983092
##$SI= 32768
##$SIGF1= 140
##$SIGF2= 120
##$SINO= 11.81781
##$SIOLD= 32768
##$SREGLST= <13C.CDCl3>
##$SSB= 0
##$STSI= 32768
##$STSR= 0
##$SW_p= 12077.2946859903
##$SYMM= 0
##$S_DEV= 0
##$TDeff= 32768
##$TDoff= 0
##$TI= <>
##$TILT= no
##$TM1= 0
##$TM2= 0
##$TOPLEV= 0
##$USERP1= <user>
##$USERP2= <user>
##$USERP3= <user>
##$USERP4= <user>
##$USERP5= <user>
##$WDW= 1
##$XDIM= 32768
##$YMAX_p= 338084266
##$YMIN_p= -1762299
$$ End of Bruker specific parameters
$$ ---------------------------------
##NTUPLES= NMR SPECTRUM
##VAR_NAME=  FREQUENCY,     SPECTRUM/REAL,   SPECTRUM/IMAG
##SYMBOL=    X,             R,               I
##VAR_TYPE=  INDEPENDENT,   DEPENDENT,       DEPENDENT
##VAR_FORM=  AFFN,          ASDF,            ASDF
##VAR_DIM=   32768,         32768,           32768
##UNITS=     HZ,            ARBITRARY UNITS, ARBITRARY UNITS
##FACTOR=    0.368581032318806, 1,           1
##FIRST=     11203.0474430531, 0,            0
##LAST=      -874.247242937185, 0,           0
##MIN=       -874.247242937185, -1762299,    0
##MAX=       11203.0474430531, 338084266,    0
$$ Real data points
##PAGE= N=1
##DATA TABLE= (X++(R..R)), XYDATA
$$ [...]
15840b1522j98448k11610k20757j94456j11876m8644J2968O9394Q9672J35975
15830f99304J83795J24131J4372J1958N3421L2450k9316j24482j49358q0837l3526
15819f96696k274K8324J5743j1687J2353O6859J11990P6122p17R15L9783M8776
15807c10509M9809N8957M0521k3396j09667j26764m5030J7619P496K2587J29128
15796b89249K20676J92781J08335K9218k5243l4783j9081k5859m0169k7224J2632
15785A02034Q7851J30599Q8609k1652j44810j92510j45558l9644N9514J08869
15775C3302Q7538R551o9382p3265l1970M90J1694n4523j72029k25513j90102j43751
15763h17960j01809j7209N8458N6348j0799j04914j42619q6877K4114J13301J15816
$$ y = [-21522, -219970, -431580, -652337, -846793, -958669, -1007313, -994345, -924951, -835279, -699304, -515509, -391378, -377006, -365048, -311627, -279177, -308493, -432975, -582333, -663170, -696696, -698970, -670646, -654903, -666590, -654237, -587378, -475388, -399266, -399983, -399068, -359285, -310509, -260700, -201743, -161222, -184618, -294285, -421049, -466079, -448460, -440964, -418377, -289249, -68573, 124208, 232543, 261761, 236518, 201735, 182654, 156795, 116626, 89402, 102034, 189885, 320484, 409093, 387441, 242631, 50121, -95437, -135081, -75567, 33302, 120840, 130391, 61009, -12256, -44226, -43736, -32042, -86565, -258594, -484107, -674209, -817960, -919769, -936978, -878520, -822172, -832971, -937885, -1080504, -1167381, -1143267, -1029966, -914150]
15752i14150O6405N60q1273q0767L93M7190O2725P0383N9260M7764M8115K4048
15740f49347P689L4244O2158M6497r583m7215P163J15105J81920J35495R972n6981
15728a62883k4530m538l6187l3046J4697O7948J07906J24714J17074P6253L9121
15717B86529L7222J08800J82962J18350j613m2331k7509N200J80l9044p4610j08324
15705D45812q2189o135L7794N4089N7446J4874l5979p3035q5832p0705m3895L118
15693B15363P8646J03623L7999p3166j91597k43548j77905p2818l0697n7653l6709
15682d48462Q2011J58556Q6280q628J5093M6233Q357j6322n475k8812o7352n9203
15670b37724P703P8151Q9704O9374P0199N8964J407n4604n8985k422O1004L7921
$$ y = [-914150, -847745, -847185, -928458, -1009225, -1008832, -961642, -898917, -828534, -769274, -721510, -673395, -649347, -641658, -607414, -545256, -498759, -508342, -555557, -548394, -433289, -251369, -115874, -105902, -162883, -187413, -191951, -228138, -261184, -246487, -178539, -70633, 54081, 171155, 247408, 286529, 323751, 432551, 615513, 733863, 732250, 689919, 662410, 667610, 667790, 628746, 554136, 445812, 363623, 357488, 395282, 449371, 506817, 521691, 485712, 412677, 326845, 256140, 212245, 215363, 294009, 397632, 435631, 362465, 170868, -72680, -250585, -323403, -354100, -411753, -448462, -366451, -207895, -121615, -130243, -115150, -68917, -60560, -76882, -82357, -111169, -178521, -237724, -230021, -151870, -62166, 7208, 77407, 136371, 137778, 83174, 24189, 21767, 82771, 120692]
15658A20692l1244m9366m5130o8230n2058K3881N7681K5442l6587r0585j41643
15647b87147j43684k0953J36168J88316J33253O6008N2137J2807n5224k7318N0673
15636A05036K9098n3574q1328m0035J4212K7848j1146m7443l1744k5790m1062
15625a55928n2206p6704p8726l1916j536k163m2512r9624p3697q569M5656J08616
15613d69309J45111J35839J16200J20623J02114K6386o0797r1957o2140r111J8461
15602b8580R491K0820J13938K55515K91187J63128k065n3780J0365O3518K5878
15591H69415o0375j52660j93932j33105o7300q5460j40870j57553j01423n4213
15581b77476m7436J3203R9012J40423J47054J41254R4300K7772l0897j13688k03553
$$ y = [120692, 89448, 40082, -5048, -73278, -125336, -101455, -43774, -18332, -54919, -145504, -287147, -430831, -451784, -315616, -127300, 5953, 71961, 124098, 136905, 81681, 54363, 105036, 134134, 80560, -768, -40803, -26591, 1257, -9889, -57332, -89076, -114866, -155928, -208134, -284838, -363564, -395480, -397016, -399179, -441691, -541315, -615012, -623581, -577925, -469309, -324198, -188359, -72159, 48464, 150578, 176964, 116167, 24210, -37930, -47041, -28580, -19089, 1731, 115669, 371184, 662371, 825499, 823434, 769654, 780019, 843537, 869415, 809040, 656380, 462448, 329343, 262043, 176583, 35713, -121840, -223263, -277476, -324912, -311709, -212697, -72274, 74780, 216034, 310334, 338106, 307209, 193521, -10032]
15570a0032k06681j59103j38928j18486q4702m1970L06J3497j873j3953l0340
15559g92265m1198j8500K4729O4258J28417J80118J27777L9684l0150r0738q9177
15548d97045o0936o6211m8691L6942J33912J73356J44061M8161l396M7787J06365
15537A4305R5015K0370o8493j09699o7752M993K1707K8036N2729L8768o856m3395
15525b0272o2405m1674K3893J14989J44353N2724m5915q6473j04193r6630k7735
15514a49338N5306J00914Q9548L3618m2643r8024q5300q649M6005P0588Q7370
15503I9395O4280r175j14698j97767k14473j96995j28750l2587K8407M4738J9184
15492f38441j05l2758j17819j46133p3294R524O9865O7266K8440N2057J09420
$$ y = [-10032, -216713, -375816, -514744, -633230, -717932, -759902, -759596, -746099, -747972, -761925, -792265, -833463, -851963, -827234, -762976, -634559, -454441, -326664, -286980, -317130, -407868, -497045, -557981, -624192, -672883, -635941, -502029, -328673, -184612, -136451, -139847, -92060, 14305, 109320, 129690, 61197, -48502, -116254, -111261, -89554, -61518, -8789, 29979, 23123, -20272, -82677, -124351, -100458, 14531, 158884, 211608, 165693, 79220, -24973, -121603, -149338, -94032, 6882, 96430, 130048, 87405, -10619, -95919, -104568, -58563, 12025, 99395, 163675, 154500, 39802, -157965, -372438, -569433, -698183, -730770, -702363, -657625, -638441, -638546, -671304, -789123, -935256, -1008550, -999026, -929161, -861895, -833455, -781398, -671978]
15481f71978J23701J02310Q5380Q6673R9465J37090J69502J11036l2691j74079
15471C6409k24158k05309k02473j99032j39058m0409O3999J46052J47443J18590
15461d97946J10462Q0121L1436L5904Q4145R3626J15415J63877J45367J11026
15451D73433P3084K673m3830o7972p5665j6277J11077J81109J03402n7176j90694
15440D93164k41491j99687j07900j8578L5739O3203Q0996N3282j7997K013J52178
15429B94922K67273K17508N4520j11809k05294k45614k87626k88357k24651r1024
15419f20152Q4597J84928J65675J08371P8885O2054O6443Q1939Q8647J06571R9506
15408E07464Q644p1023j30241j64662j05754P123J32654J80018P4186l5123l80
$$ y = [-671978, -548277, -445967, -360587, -273914, -174449, -37359, 132143, 243179, 210488, 36409, -187749, -393058, -595531, -794563, -933621, -974030, -910031, -763979, -616536, -497946, -387484, -307363, -275927, -240023, -155878, -62252, 53163, 217040, 362407, 473433, 546517, 549190, 505360, 437388, 361723, 345446, 456523, 637632, 741034, 683858, 493164, 251673, 51986, -55914, -74492, -38753, 24450, 105446, 158728, 140731, 142744, 294922, 562195, 779703, 834223, 722414, 517120, 271506, -16120, -304477, -529128, -620152, -535555, -350627, -184952, -76581, 2304, 64358, 130801, 212740, 301387, 407958, 507464, 516108, 445085, 314844, 150182, 44428, 51551, 184205, 364223, 438409, 403286, 402906]
15397D02906O0330M6754K5009O8906J28575Q9489N99o3973j41681k21079k49178
15386A46657k65938k63909j91643p1392j1582j3003M277J1975P387L2714M2621
15375e71836L8746R2814R4419k4537j14454j26631q3461L8120J80185K41326J84380
15364e0929L0604j34451k01132j74263j20898o3919J0057J16193J51135K8648
15354d08955j24035j44509o4735k3185P89M3826R8312K04437K44556J54853N0810
15343C2164m3909j20784j30109p8935r4215j60103j43705p0612k6175j5887j1298
15332h63568K4387Q3208J04914P5698K5931k6703p0808q3718j7158Q2628J58283
15321e06906J90281J75432J62409J63338J31185N6090k6762k8087M7927J32668
$$ y = [402906, 463236, 509990, 534999, 603905, 732480, 821969, 822568, 758595, 616914, 395835, 146657, -119281, -383190, -574833, -646225, -657807, -670810, -666533, -654558, -647171, -614457, -571836, -533090, -440276, -345857, -370394, -484848, -611479, -694940, -656820, -476635, -235309, -50929, -20325, -154776, -355908, -530171, -651069, -714988, -704931, -588738, -437603, -408955, -532990, -677499, -742234, -765419, -764630, -720804, -622492, -418055, -173499, -18646, 32164, -11745, -132529, -262638, -341573, -435788, -595891, -739596, -810208, -836383, -852270, -863568, -839181, -755973, -651059, -575361, -549430, -576133, -646941, -730659, -747817, -665189, -506906, -316625, -141193, 21216, 184554, 315739, 371829, 345067, 316980, 364907, 497575]
15311D97575J72446R8918j2896o9544q7137j33037j68435j06432k952K9463K1483
15300B39452K7090L7903L1517n342l8795r5865j53227j29294r4297p3898m7194
15289c01950k6787m1671p2835l4781N544m4877j01212n2849N6157J32823J16746
15278c65692N7190J9305K8999O8157J05794R8489M578j23024j58464p3152Q6602
15267b51218J90070J61832J04069M9139l4999j12043j41072j02463k2847O4473
15257i5059J29079J68965J52801P7198N09p4715j50235j77458j50747q6590K8009
15246a78243J75876K44736J82695N8401n8675j51585j96394j51753l9707O5627
15236d9022J19903Q7587K2635K7039K5211n8501j33131j17191r9676j34325j21176
$$ y = [497575, 670021, 768939, 756043, 686499, 599362, 466325, 297890, 191458, 188506, 217969, 239452, 266542, 304445, 335962, 330620, 291825, 195960, 42733, -86561, -180858, -254756, -301950, -328737, -370408, -443243, -478024, -472480, -517357, -618569, -671418, -615261, -482438, -365692, -308502, -289197, -260198, -192041, -86247, 12242, 16820, -106204, -264668, -337820, -251218, -61148, 100684, 204753, 253892, 218893, 106850, -34222, -136685, -159532, -95059, 34020, 202985, 355786, 432984, 433493, 358778, 208543, 31085, -119662, -206252, -178243, -2367, 242369, 425064, 483465, 424790, 273205, 76811, -74942, -114649, -49022, 70881, 158468, 181103, 208142, 233353, 174852, 41721, -75470, -175146, -309471, -430647]
15225d30647k4732N1250O4768Q8582J40323J32676K8637o9010j10107j45689j22642
15214c96591l2997K7816j4085r7167j29132j12629o6409l8511o5935m6008L4232
15203i37416O6980M2511R596k9026l1458J1045O6251J20787J36222J26588Q4924
15192c32996m7598j88846j82939p4092K6328R2231Q7337N0041O2224J01415P4311
15181c32584m98m2200j2332N5480P1572J293k4348K3606n861j06825j46727j01401
15169f20825o0897p9288j11979j21438p8142j8934L8013R4056R9193M9598M3998
15158g66645R9430R1268K6337m2723j19579j59357j19294n8329l2586m2753m7162
15147a171393l627J06217K26372L01622K40066R4593J1607j0951j6727m2764p7066
$$ y = [-430647, -455379, -404129, -339361, -250779, -110456, 22220, 50857, -18153, -128260, -273949, -396591, -429588, -401772, -415857, -513024, -642156, -754785, -821194, -859705, -925640, -971648, -937416, -870436, -827925, -818329, -847355, -878813, -867768, -801517, -680730, -544508, -417920, -332996, -380594, -569440, -752379, -826471, -800143, -707912, -620575, -570534, -508310, -406895, -332584, -333082, -375282, -387614, -332134, -260562, -259269, -283617, -260011, -265872, -372697, -519424, -620825, -681722, -761010, -872989, -994427, -1072569, -1091503, -1053490, -959434, -860241, -810643, -766645, -667215, -575947, -549610, -592333, -711912, -871269, -990563, -1048892, -1081478, -1124231, -1171393, -1175020, -1068803, -842431, -540809, -300743, -206150, -194543, -205494, -222221, -264985, -342051]
15136c42051j36007k36937k46481j15190O1005K00319K76737L11441K82673J86511
15126B42020P6169j1806p2450m6691N1469Q8657L5178p944p273k0947m2551j8767
15114B65064K8469K8353l3796m7792L5009R1923P2025K7681o865m4050j39511
15103B76510k18101j90547j05581J267J10540J34929L0362q6297j27905j33028
15093c07851j26813q1404l4729M478P17m3957q7756j39652j05535O1509K25044
15082f35949K51572J57716M2846k7234j00969j56773q4325O8379J98023K69264
15072a7450K53892J58534M8569k2297o7693q9998p6704q2299j57639k05665j31112
15061c89862k8011O875R260R002J9463M4614M9440K7236J2556K0980k4055j14965
$$ y = [-342051, -478058, -714995, -961476, -1076666, -1015661, -815342, -538605, -227164, 55509, 242020, 318189, 306383, 233933, 187242, 238711, 327368, 362546, 354602, 347329, 326382, 283831, 265064, 293533, 321886, 288090, 240298, 275307, 367230, 439255, 466936, 460071, 416021, 276510, 58409, -132138, -237719, -236452, -125912, 9017, 39379, -46918, -174823, -307851, -434664, -516068, -550797, -546319, -545602, -589559, -677315, -816967, -922502, -860993, -635949, -384377, -226661, -183815, -211049, -312018, -468791, -553116, -484737, -286714, -17450, 236442, 394976, 443545, 421248, 353555, 263557, 186853, 104554, -53085, -258750, -389862, -417873, -410998, -401738, -392736, -373273, -328659, -279219, -251983, -239427, -218447, -242502, -357467]
15049c57467o7679J02984J83435J14607L0631L4687O9703L9982j5304k7040l2131
15038G6408p1984j41229j65128n6173J13451J46051L2465j6720L8844P7761N0702
15027H4448j8825j14036j65756j28003r2780j18813k00309k50427j87915o5166
15017a257582J7401N0246O8453N4005K961J964N2186M9801M86R545P1215R4217
15005g85102M7477K9148Q2994Q8419L1636K9699P5362P8600M4531O3458J47474
14994f6304J85497O1160j42474k27141j75297o1939M0314M8868p513l9431k8071
14983d12331J7292Q1747R3269n279q2095m1695K1228K9415N4805J11463J18427
14972a3754R1778P7874N9019O1438J04415J27153M7535q6605j70365j63248j29630
$$ y = [-357467, -425146, -322162, -138727, -24120, 6511, 41198, 110901, 150883, 135579, 108539, 76408, 4424, -136805, -301933, -358106, -244655, -98604, -66139, -82859, -44015, 33746, 84448, 65623, -48413, -214169, -342172, -434952, -553765, -754074, -1004501, -1192416, -1257582, -1240181, -1189935, -1121482, -1067477, -1064516, -1062552, -1010366, -960565, -960079, -950534, -879319, -785102, -737625, -708477, -625483, -537064, -505428, -475729, -400367, -321767, -277236, -213778, -66304, 119193, 180353, 37879, -189262, -364559, -426498, -386184, -337316, -344829, -384260, -412331, -395039, -313292, -220023, -225302, -307397, -349092, -327864, -298449, -243644, -132181, -13754, 78024, 155898, 214917, 276355, 380770, 507923, 555458, 468853, 298488, 135240, 5610]
14961E610r4299m6925r057J3557K5549J8933m5616j06842q1153l7670m1057m0158
14949d39128j031L2920K9675J3437J4564K8179M855o5648j19143r4525k5538J0021
14937f11362j0782k897Q4037J52774J56595J31741J00227N9298K4987L6916M1274
14926A62808j0531j02963j71018k18020k04505r7115j7778n9232j63957j79207
14916a061518n1363N0148J2590q320J03316K09230J83984J36477J38751J18129
14906a68576N0985J640K1607Q2439R5971L7454J9360N5114L7368l5419j42900
14895E5043k24455j85004r1619o4089n2797j333N6266R2189N2168j9428o0950
14884d44009q8620p4969P049P2953O2997J55q7910j50793j30852o1860q781K2835
$$ y = [5610, -88689, -135614, -144671, -131114, -105565, -86632, -132248, -239090, -320243, -357913, -398970, -439128, -440159, -407239, -377564, -364127, -349563, -321384, -316529, -382177, -501320, -595845, -621383, -611362, -622144, -625041, -541004, -388230, -231635, -99894, 333, 59631, 84618, 121534, 162808, 152277, 49314, -121704, -339724, -544229, -641344, -659122, -718354, -882311, -1061518, -1112881, -1062733, -1050143, -1058463, -955147, -745917, -561933, -425456, -286705, -168576, -117591, -115951, -94344, -11905, 84066, 121520, 140880, 195994, 233362, 197943, 55043, -169412, -354416, -446035, -510124, -562921, -564254, -507988, -415799, -363631, -383059, -444009, -532629, -607598, -600549, -527596, -464599, -464444, -552354, -703147, -833999, -895859, -904640, -881805]
14872h81805O3450J26937J93586J82690R5704O045p6224j20624j64373k28676
14862h03290k08125j12215k6192M8787P1289K6766K0849M6761N6534J02242K06684
14851e69910K83505K85663K65741J86478O6067k2718r3849j52133j75127j96878
14841a23161j88502j57960j49901j06792k9775O9725J53703J48045R2694N2754
14831b39170j7025j05857j24395o7368J3235N8389L6978k2483o8668m8671L5426
14820e49609Q7045O3626N232p1754j34750r2865N9718J88417K46232K86111K35658
14809C23061R1152l3288j32078j63734p8168J6962K5128J517l2994o4145m0982
14798h7569J2113O1850P1686J5320p4364j20535n8217P2541J19804O0156p318
$$ y = [-881805, -818355, -691418, -497832, -315142, -219438, -213393, -289617, -410241, -574614, -803290, -1011415, -1123630, -1149822, -1101035, -1029746, -1002980, -982131, -935370, -878836, -776594, -569910, -286405, -742, 264999, 451477, 517544, 494826, 400977, 248844, 73717, -123161, -311663, -469623, -619524, -726316, -756091, -686366, -532663, -384618, -291924, -239170, -256195, -362052, -486447, -553815, -540580, -482191, -445213, -467696, -536364, -585035, -549609, -462564, -398938, -393706, -465460, -600210, -693075, -633357, -444940, -198708, 87403, 323061, 414213, 380925, 248847, 85113, 6945, 23907, 49035, 50552, 17558, -46587, -87569, -75456, -13606, 58080, 73400, -964, -121499, -179716, -107175, 12629, 72785, 65467]
14787F5467l3749l210L6505M047j1015O2215J21221Q3829j6527j26250j72576
14776I957j26951q6363p9590p6192r3288r4497l9630p313P5J6822K9749N0680
14764d96541R0769J20749J17554Q4011K5098l5686l7290K811M4362O0591P648
14753a5924q3259j31922j14182q0488n4594J063O0514K8122n0482l5040Q5616
14742c90576J31186K8642n6856l4385J6948J7700k266L0595M1025j1683l2880
14731b62550o290k6063r3318j07851o3873p4644j25710q5264l580K4491L9611
14720g85041P1283J09860J33221J17715J18851J52888J20901K7601n1908r2749
14710g7378o0236N0121J41776J44483N4031j06587j94111j42065n6763j2528J1348
$$ y = [65467, 31718, 28508, 65013, 69060, 58045, 120260, 241481, 325310, 308783, 182533, 9957, -116994, -203357, -282947, -359139, -452427, -546924, -586554, -593867, -593792, -576970, -547221, -496541, -405772, -285023, -167469, -83458, -58360, -94046, -131336, -128525, -84163, -23572, -15924, -99183, -231105, -345287, -425775, -480369, -479306, -418792, -390670, -441152, -476192, -390576, -259390, -230748, -287604, -321989, -305041, -287341, -289607, -259012, -217987, -229670, -262550, -268840, -294903, -388221, -496072, -559945, -634589, -760299, -845563, -849143, -824652, -785041, -713758, -603898, -470677, -352962, -234111, -81223, 39678, 67279, 15371, -77378, -137614, -87493, 54283, 198766, 252797, 146210, -47901, -189966, -246729, -259257, -247909]
14699b47909J2932l8918r0303r4536p8735p3920o2901k1735O1190J59040K31359
14688b44436K50140J96524J05101L2610o4131j79025j92307j12500l7828j4199
14678b60051R261M5601M7245j288n6039p9538o6098j3677M0787O0160P8880Q3088
14666a11669J553j13752j44718r4355o5793p5980o1658j5812P0563J76606K12212
14655b22803J20314j5092j08875j51905j06203j4369k2515q2883j04435n0287
14645g59053R6034J96290K01842J95033J89568J59269J01122J7199l9216p7028
14635B81060k02179l25137k75684j18012K3451J11746J42266J40417Q6620L937
14625a31515j2596J5021J8842j881J8288O0652N4121n0070k01915k70187k33598
$$ y = [-247909, -234977, -273895, -364198, -458734, -537469, -611389, -674290, -696025, -634835, -475795, -244436, 5704, 202228, 307329, 339939, 275808, 96783, -95524, -208024, -245852, -260051, -250790, -205189, -157944, -159232, -215271, -294809, -360907, -374584, -333797, -273637, -194757, -111669, -110116, -223868, -368586, -462941, -528734, -604714, -666372, -682184, -611621, -435015, -222803, -102489, -117581, -226456, -378361, -484564, -498933, -521448, -604331, -708766, -759053, -663019, -466729, -264887, -69854, 119714, 278983, 380105, 397304, 358088, 281060, 78881, -246256, -521940, -639952, -616501, -504755, -362489, -222072, -135452, -131515, -144111, -129090, -110248, -112129, -93841, -33189, 20932, -29138, -231053, -501240, -734838]
14614g34838j85541j22188k347R2074J03423N1662l2829j40269k00799j56313
14604a327965o1101O9622K29870L01352K19753R5292N5898Q0112J18183J44770
14594g4214J11046R2233J10861J02289K5109j05862j94380j52064m9250L2798
14584a01434N3344N2271P4696M9191l0267p2505k4078K3652n127m2193J22M3063
14572B0735M4503L3151k4887j01498r8638n562P7608R8757P1170k195j14295j35728
14560a36879r1735j23472j94595j36518L4629R8291M4448Q021l4642o4178l1268
14549f27898j3199M0350J53862K03762J58479Q3072P305m2097k1276L0902M9123
14538B2385N5057N0144O2518Q9845O0281m6201j35652j10129k1042N1007N0185
$$ y = [-734838, -920379, -1042567, -1044914, -952840, -849417, -797755, -830584, -970853, -1171652, -1327965, -1389066, -1319444, -1089574, -788222, -568469, -473177, -417279, -337167, -218984, -74214, 36832, 129065, 239926, 342215, 367324, 261462, 67082, -84982, -134232, -101434, -48090, 4181, 78877, 128068, 97801, 25296, 1218, 24870, 19743, -22450, -22328, 20735, 65238, 98389, 73502, -27996, -126634, -132196, -54588, 44169, 115339, 113144, -1151, -136879, -228614, -352086, -546681, -683199, -648570, -550279, -505831, -497810, -532452, -596630, -627898, -641097, -600747, -446885, -243123, -84644, -1572, 5733, -36364, -57640, -26738, 22385, 77442, 127586, 190104, 279949, 340230, 294029, 158377, 48248, 27206, 78213, 128398]
14527A28398p4186j87665j73463j13926o7155l6232m4732l6619M5378J14496Q8284
14516c57422M7637L9480J0398l0633k9843m85j6099p8630j06151m2823O6525J61488
14504c36558J99623J27100o588m4733j6534J6712Q4444J58576J75516J20059J6828
14493D94445p7944j23759j26044q3663L607J31172K19334K04819J16285j5790
14483G42462j22808j06411l6574n903k4940j9300P7863J62139J48714Q1988r932
14472H87298j04557k00963k43696j65353p4934m1528m5955q8912q5514J3821J38826
14461a1467J61177J15536J25428J41248L1251j30748k03247j92674j65087j22982
14451b51565q2162p6547j02461j16783o5211N066Q187j9523l1563j0410O1400
$$ y = [128398, 54212, -133453, -306916, -420842, -487997, -524229, -568961, -605580, -560202, -445706, -357422, -309785, -270305, -259907, -290540, -320383, -320868, -336967, -415597, -521748, -564571, -498046, -336558, -136935, -9835, -16423, -61156, -77690, -60978, 23466, 182042, 357558, 477617, 494445, 416501, 292742, 166698, 83035, 86642, 217814, 437148, 641967, 758252, 742462, 619654, 513243, 476669, 470766, 445826, 426526, 504389, 666528, 815242, 897230, 887298, 782741, 581778, 338082, 172729, 97795, 56267, 10312, -78600, -164114, -150293, -11467, 149710, 265246, 390674, 531922, 563173, 432425, 229178, 36504, -128583, -251565, -333727, -410274, -512735, -629518, -694729, -689663, -681476, -700999, -732562, -742972, -681572]
14440f81572J30315J12327j4881j65761k29489j97994j42042l6973J55465K90291
14430g80314K59549J68682J52941J24988K4314n0109r0269q5643m6214k2985l70
14419c45430K5459L7723M5572L8264K2673J6357L5720L3757K6686Q7115J50737
14408A74633J27103K2233j07376k02865k48006k45588k14631j34363j1554R9901
14398g40513J82424J86293R7419o93n1193j9417N3796Q3745N3903K5768N0445
14387g8023Q9511R8800Q4913O6814M2111P246j2466m957j1308m0958n4724o6589
14375A20370q0677q6662p3907r9882j91948k69411k47342j94525j61440j04178
14365a389602n2553o2389j00801l3250Q7520J35821J32195J37202J05100L5236
$$ y = [-681572, -551257, -438930, -453811, -619572, -849061, -1047055, -1189097, -1226070, -1070605, -780314, -520765, -352083, -199142, -74154, -49840, -99949, -190218, -275861, -322075, -345060, -345430, -319971, -282248, -236676, -198412, -175739, -159382, -123662, -89905, -63219, 23896, 174633, 301736, 323969, 216593, 13728, -234278, -479866, -694497, -828860, -840414, -740513, -558089, -371796, -274377, -275070, -326263, -345680, -291884, -208139, -154236, -128468, -78023, 11488, 110288, 195201, 262015, 304126, 311372, 298906, 293949, 282641, 241683, 186959, 120370, 39693, -46969, -120876, -220758, -412706, -682117, -929459, -1123984, -1285424, -1389602, -1442155, -1504544, -1605345, -1638595, -1551075, -1415254, -1283059, -1145857, -1040757, -1005521]
14355a005521k7791j8046P4536J61113J51481N9806m216K043N5018J09324J29810
14344c12443J16098P6643K0025o9446j44701j63077j01948K3861P5026K1147l8856
14333d97671r7945j12001m4200N9729J31841Q5140k2586m4242j091j2144p6191
14322f31361j22350r9007k4181M2977Q9274Q1970M1007P9831J84480K36005J91057
14311F9702Q0081o4364j97563k54549k13685k01818k02166j33634O843J26122
14301i85031J39931J05728Q0807P7838O0295L2388K3140K8225O3278J07785J01800
14290a63816L1332k6124p5796j81598k36574j23708J06135K62436K39364J36939
14280c1410M3420n3841j48055j88367j39511n8242n502K9906K5901j1814o83L3773
$$ y = [-1005521, -1033312, -1051358, -976822, -815709, -664228, -604422, -608638, -606595, -551577, -442253, -312443, -196345, -119702, -99677, -169123, -313824, -476901, -578849, -554988, -479962, -458815, -497671, -595616, -707617, -751817, -692088, -560247, -475107, -497693, -541935, -543026, -555170, -631361, -753711, -852718, -876899, -833922, -744648, -662678, -621671, -541840, -357360, -121355, 69702, 149783, 85419, -112144, -366693, -580378, -782196, -984362, -1117996, -1111153, -985031, -845100, -739372, -658565, -580727, -520432, -488044, -464904, -436679, -373401, -265616, -163816, -132484, -158608, -234404, -416002, -652576, -776284, -670149, -407713, -168349, -31410, 12010, -41831, -189886, -378253, -517764, -576006, -581508, -551602, -525701, -537515, -538198, -504425]
14268e04425K7984J7015M3805R0245J23448J31706J00577O7038L7421j7438o0743
14257E6633k6383O266k9879o9420q7033p5579k3418K5334J4371o5583q6754K9667
14245c31778J48664K11296J74958J3661j13397q9450m5746r3316j15938m2095
14235b83141J8200K3723L0265L6029K4240J838J498J1531Q885L9061R2805P3778
14223G8712j7051p9209n2617L3658Q1717L8676n9534j55349k44157k94697k28052
14212h97903j00066m614L2201O7899J24206J77875K41486K70189K13629J08409
14202B33311K4534k3554n7475q3029o6443k7355o673L3579O9780O4658P7714J16389
14190C55436P1649p8059k15705k18336q8242L8741P6546J11053J42603J27348
$$ y = [-504425, -476441, -459426, -415621, -325376, -201928, -70222, 30355, 97393, 134814, 117376, 56633, 30250, 36516, 6637, -62783, -149816, -225395, -248813, -223479, -209108, -274691, -361445, -331778, -183114, 28182, 203140, 216801, 103404, 13954, -31792, -125108, -241046, -283141, -264941, -241218, -210953, -174924, -150684, -148846, -147348, -135817, -126932, -87871, 4934, 78712, 61661, -17548, -70165, -36507, 45210, 83886, 24352, -130997, -375154, -669851, -897903, -997969, -1002583, -970382, -902483, -778277, -600402, -358916, -88727, 124902, 233311, 257845, 234291, 176816, 93787, 27344, -11, -6684, 26895, 96675, 161333, 239047, 355436, 427085, 349026, 133321, -85015, -173257, -134516, -57970, 53083, 195686, 323034]
14180C23034J22601J26585Q0829K0898l1517j36136k02624j77786j39740j13548
14170a27404j7934O7105J6469m9395l4476P970J9469j3140n8594o3493m681L8554
14158b19550N191l9611k4112q393l4815k1513M7947J25526J78933J47556O7232
14147B24391K9053N4822M0129j08773k55945k91788k52794k06485k01200j82058
14137a150648p7821L6501J19945J83635K01913J83094J49103J15869R4501P4923
14127f8985L4649K9590M7499N3245N6495Q1261J11180J06702N0982o7957j48268
14116B86393q1719L2878O3676L5981K3722L4713O1564P6196J1539q7586j51681
14105C05676k14677k40822j57274j7221J07793J78664J95380J55089R9251J0893
$$ y = [323034, 445635, 572220, 653049, 673947, 642430, 506294, 303670, 125884, -13856, -127404, -145338, -78233, -61764, -111159, -145635, -137665, -118196, -131336, -189930, -253423, -258104, -219550, -214359, -253970, -278082, -286475, -321290, -342803, -294856, -169330, 9603, 157159, 224391, 253444, 308266, 348395, 239622, -16323, -308111, -560905, -767390, -968590, -1150648, -1228469, -1191968, -1072023, -888388, -686475, -503381, -354278, -238409, -143908, -68985, -34336, -4746, 42753, 95998, 152493, 233754, 344934, 451636, 502618, 434661, 286393, 204674, 237552, 301228, 337209, 360931, 395644, 457208, 533404, 544943, 457357, 305676, 90999, -149823, -307097, -324318, -216525, -37861, 157519, 312608, 411859, 422752]
14095D22752j19393j87739j14114l7445q0596j33421p7923N3156J25580Q1678
14085f7465M8221N9305L4673j1868m9359q2685j18054j66315j96085j76627j47732
14074h73991j31338j11087l5305M7311M0574j0653N569Q1518J00262L1023J1570
14063h44547J14665K10162J77090K6410j34881j71427p3816K3376N0298P6316
14053e46354J30921J68663J47794Q5381O5482N6998j1501p5380l2536P8610J14351
14042A82429j8990j94984k58967k12781j28146o2336k1648J5339M5981Q694o4520
14031g09929r0350j5256J11164J97927J94734J20681M9545L8238L6425m356m7559
14020a18736k4739L6675P5822N5324L1501R4122J96604K36316J78314M4044j22614
$$ y = [422752, 303359, 115620, 1506, -35939, -116535, -249956, -327879, -274723, -149143, -67465, -19244, 40061, 74734, 62866, 13507, -69178, -187232, -353547, -549632, -726259, -873991, -1005329, -1116416, -1151721, -1104410, -1063836, -1074489, -1068920, -987402, -887140, -856117, -844547, -729882, -519720, -342630, -316220, -451101, -622528, -696344, -672968, -622670, -546354, -415433, -246770, -98976, -13595, 51887, 108885, 97384, 22004, -10532, 68078, 182429, 163439, -31545, -290512, -503293, -631439, -693775, -715423, -700084, -654103, -645409, -709929, -800279, -815535, -704371, -506444, -311710, -191029, -141484, -103246, -66821, -71177, -118736, -143475, -106800, -30978, 24346, 55847, 149969, 346573, 582889, 761203, 805247, 682633]
14009F82633k27556k05801j15997p7568q0596n1437j1379J0510J5236m815m9369
13998a16139p4960n8529l4420m725J0942k9958n9761m1230k7718l5942o4482o8114
13986f05036j2165N5434Q9908R0568P7887N4290P2659J22138J20504J10586J29318
13975C06091J29866R9996Q0283M9780k3670o2509l6877m8943j00428q4134l5405
13964B74050k9328n7781p2579n7301m9790o6594j11285j44217r7245l4493o1062
13953e07625q8280P215P8693L2216k8653P229J67681L02649K11524k8034j86296
13942c1681j66845l235J84597K47249J44640p241j03097j43486j29460j11368
13932a19927j58886k11657k08436j32913m8389j8021k1608q369K5995J4395l2818
$$ y = [682633, 455077, 249276, 133279, 55711, -24885, -76322, -87701, -77191, -61955, -66770, -116139, -191099, -249628, -284048, -288773, -277831, -307789, -367550, -408780, -436498, -472440, -536922, -605036, -617201, -561767, -471859, -381291, -303404, -249114, -176455, -54317, 66187, 176773, 306091, 435957, 535953, 616236, 666016, 642346, 579837, 542960, 494017, 393589, 309455, 274050, 244722, 186941, 114362, 57061, 7271, -59323, -170608, -314825, -412070, -446563, -507625, -595905, -588690, -509997, -477781, -506434, -499205, -331524, -28875, 182649, 154615, -31681, -198526, -201761, -17164, 230085, 374725, 367484, 264387, 120901, -8559, -119927, -278813, -490470, -698906, -831819, -880208, -898229, -919837, -928206, -902211, -887816, -920634]
13921i20634n3750k3881N1917J31084J28808J7721p8030o2880k7691n6173n1129
13910i44638L0855J09302Q9004k7139j05376o5363N1183J50955J87234J64760
13900c59223P0154k5338j7463P9237J81440K25382J68187M7276o2575j03634q1767
13889A21676k1237M2521M3672j4358o1254j08330j61320j93541j82929j26299
13879f61399m6438n451n540K025J368j5781m658O4544J88646K52865J59724K0758
13867d9337j8127L1562O0650M9166q407l7533m124J2560l1791r6434r8441K367
13855a87889J25002J39135M804j51267j69087q1556J4885O3402P1422Q3177J02870
13844A4898Q2266N749m8513j896P4596M9836o9593j33047m1284J05741J85328
$$ y = [-920634, -974384, -998265, -946348, -815264, -686456, -668735, -746765, -809645, -837336, -893509, -944638, -913783, -804481, -715477, -742616, -847992, -913355, -862172, -711217, -523983, -359223, -289069, -314407, -331870, -252633, -71193, 154189, 322376, 369652, 307077, 203443, 121676, 100439, 142960, 186632, 172274, 111020, 2690, -158630, -352171, -535100, -661399, -707837, -713288, -718828, -716803, -715435, -731216, -735874, -671330, -482684, -229819, -70095, -49337, -67464, -35902, 24748, 73914, 65507, 27974, 23850, 36410, 4619, -91815, -190256, -187889, -62887, 76248, 81052, -70215, -239302, -320858, -305973, -242571, -171149, -87972, 14898, 97164, 102913, 54400, 52504, 127100, 176936, 107343, -25704, -66988, 38753, 224081]
13833B24081J53819M0787m9896p0603n0660O147P7557R3246K6411n7663j18993
13822B74233j57173j27727n882J14563J08962P018n9927q0010q8063p7219o1478
13811a52703q4847k00166k51670j31915N5344J97926K22131J15798l8328j31371
13801c99801j16381j1973J32186J75695K7534j43571q8052J07041K60836K97517
13791B41031K33145J16577q632j04961j28674n9965p1O328j3336l621J3475j1444
13779B79852k1174L8103P1924K003j07148j27061p1901o4577j02915r5523n7445
13768b55862j03872j79452o7840R1239J13402R8007R4741Q7256O9207M9791M8817
13757D5434P7573Q6682O978q5527j04902q0923j00379k10624l18960k98795j57565
$$ y = [224081, 377900, 418687, 368791, 298188, 247528, 253675, 331232, 424478, 450889, 393226, 274233, 117060, -10667, -16549, 98014, 206976, 213994, 154067, 74057, -14006, -91225, -152703, -237550, -437716, -689386, -821301, -765957, -568031, -345900, -230102, -268430, -399801, -516182, -528155, -395969, -220274, -192740, -336311, -424363, -317322, -56486, 241031, 474176, 590753, 582121, 477160, 348486, 288521, 288450, 294778, 281442, 277821, 291296, 279852, 258678, 296781, 368705, 370708, 263560, 136499, 64598, 21, -102894, -198417, -255862, -359734, -539186, -607026, -515787, -402385, -304378, -209637, -122381, -53174, -3383, 45434, 123007, 209689, 216667, 131140, 26238, -54685, -155064, -365688, -684648, -983443, -1141008]
13746a141008j8319K4719n4744j43514p7155Q4869K05919K51584K07586J29200
13736e30863R3332P9941O6405J8549k0821o22m289m3636k6805M7244J20989J32379
13724f8197P9825L7918J2585j250L813l0420r1316j50483j82329j60896j35599
13713f86349r3461N236Q7569Q8331P3448R3506J17525R6163M491j25783j96960
13702e36284k16910k20715j21184N4536J77551K34213K35784J96956J48660N0815
13692C422r7087j79550j63431j64388j60499q9375N989O0008L1615k0343J2343
13681g61296Q2770N4414j5864k6020r66K0524N6353J29796J98417K41748K30886
13670B10762J03711j2777P8458K68677K84103P7918j77321l05632k27310k8137
$$ y = [-1141008, -1159327, -1134608, -1189352, -1332866, -1410021, -1325152, -1119233, -867649, -660063, -530863, -437531, -357590, -291185, -272636, -293457, -294079, -298368, -342004, -368809, -321565, -200576, -68197, 11628, 49546, 62131, 60881, 64694, 34274, -57042, -207525, -389854, -550750, -686349, -779810, -774574, -687005, -598674, -525226, -431720, -314195, -218032, -213541, -339324, -536284, -753194, -973909, -1095093, -1040557, -863006, -628793, -393009, -196053, -47393, 3422, -93665, -273215, -436646, -601034, -761533, -850908, -844919, -784911, -753296, -773639, -761296, -678526, -624112, -639976, -665996, -666962, -646438, -590085, -460289, -261872, -20124, 210762, 314473, 301696, 380154, 648831, 932934, 1010852, 833531, 527899, 300589, 272452]
13660B72452P2814o823j48898j95358j17631m3541l9825o8893r9342j31952j41100
13649f48097j02199p3063r4438j06114q9863m3930P2680J95090K27195J63638
13639d99101P5570M7515R7295J00155O9276R1762R9772P6690N0205J1060r835
13628B10364m7537j18023j61348j69211j45663q7970o0059r6024j48880j06284
13618i30635J4748R2017J00691L5493q7239j73523j38865l2957P4845J77311K33832
13607f34282L07372L21463J77131O3894J05303J29221K3180p9303j06418j36865
13597A70696k12123k14931j39099o3296J7987M0057n3190j69581j81079j18514
13587i23073n5287K689N5196K4978o8128p4100k5561K2253P7377J32121J65734
$$ y = [272452, 345266, 338443, 189545, -5813, -123444, -166985, -206810, -275703, -375045, -506997, -648097, -750296, -823359, -917797, -1023911, -1113774, -1157704, -1085024, -889934, -662739, -499101, -423531, -376016, -278721, -178566, -109290, -17528, 82244, 158934, 209139, 220199, 210364, 162827, 44804, -116544, -285755, -431418, -519388, -579447, -675471, -824351, -930635, -915887, -823870, -723179, -687686, -774925, -948448, -1087313, -1120270, -1045425, -868114, -634282, -326910, -5447, 171684, 235578, 340881, 470102, 493282, 413979, 307561, 170696, -41427, -256358, -395457, -458753, -440766, -400709, -453899, -623480, -804559, -923073, -978360, -975671, -920475, -895497, -963625, -1037725, -1063286, -1041033, -963656, -831535, -665801]
13576f65801J66796J33827N6218m2898j36593j81714j33148j19727j49438j08187
13566a180665o8326r7039j09116m9656R6882L04773M51247M42617L02935J25424
13556B19076j9767j24343j11742l8741n2837j11280j07160k7012P7654J23734
13546a72418P3370J2722j4767j8876L633K9645O9791J17081J45244J45102J30649
13535E21176O7021n2075r5033o9489p0757r1059j21702j31456r5951r9078j67087
13524d05490k13907j36845J1998L3865l0704k3044O2440J43927J44317J06181
13514c07262R0549Q1701N9825N3938R4425J13641R5127P4155j7663j16234j23113
13503I9089j04293r2288m7987J7772P1012J20582J41371J15632J08828Q8964P367
$$ y = [-665801, -499005, -365178, -308960, -351858, -488451, -670165, -803313, -923040, -1072478, -1180665, -1248991, -1346030, -1455146, -1504802, -1407920, -1103147, -651900, -209283, 93652, 219076, 199309, 74966, -36776, -75517, -128354, -239634, -346794, -373806, -296152, -172418, -99048, -86326, -101093, -119969, -116336, -86691, -16900, 100181, 245425, 390527, 521176, 588197, 536122, 441089, 371600, 300843, 209784, 88082, -43374, -139325, -238403, -405490, -619397, -756242, -744244, -710379, -741083, -764127, -701687, -557760, -413443, -307262, -216713, -135012, -75187, -21249, 73176, 186817, 281944, 356099, 338436, 222202, 99089, -5204, -97492, -145479, -127707, -56695, 63887, 205258, 320890, 429718, 518682, 526049]
13492E26049n5696n2222k4111l4188q0226r7898r6400n2327l1540o1599o5713
13481a25871n7095l2218N180L7661M0188l9999j13949q1706j097K8992J7408Q125
13469c14381K3755N2857O8135P7007Q3787J17181J40698J03189K8741l7375m0170
13458C03424R393O3579J07378R3803J1712j01497j78517j61457j19787j39843
13448a11812j73976j71729q0675K2169j588p6161p9818j6823M0101P5883P0998
13437e03431j0915o3311n791O2660P4192P1883P3772P7074O2737J5962j7560J2869
13425a49859N3117P0008O7548K9556J0639M0732Q6250P4578j944o3968r8076j44761
13413b6180j71764j50815r6063m7763q331R123P449K3485N7489R5218K9678o2414
$$ y = [526049, 470353, 418131, 394020, 359832, 279606, 181708, 85308, 32981, 1441, -60158, -125871, -182966, -215184, -210004, -172343, -132155, -172154, -286103, -367809, -368906, -339914, -322506, -314381, -290626, -237769, -169634, -92627, -8840, 108341, 249039, 352228, 380969, 343594, 303424, 312817, 376396, 483774, 577577, 589289, 487792, 309275, 147818, 28031, -111812, -285788, -457517, -538192, -516023, -517611, -593772, -673590, -690413, -650312, -574429, -503431, -514346, -577657, -583448, -520788, -446596, -374713, -300941, -223867, -161130, -145168, -162728, -149859, -96742, -26734, 40814, 70370, 81009, 121741, 207991, 282569, 280625, 216657, 118581, -26180, -197944, -348759, -444822, -492585, -500916, -491793, -484344, -460859, -403370, -308152, -278474, -340888]
13401c40888k9031Q0313J77291K08449J73495R5152L8362O4308R0731P4606L5287
13390F68075L550j5564n9812r4784r1181r7382j03441o5148k809M6953P5574J15828
13378C79859J66078J70285J49324J54541J57561J00210n749j20853k35954l43393
13368E71909l68972k33129M986J71331J82330Q1445l4525j26936k13178k80100
13358b44839k48928n4644J76061K34267J09575n964k317N0376P2455Q7312P6243
13347B49597J7877j8523P134Q5403J60546J88083J14818l1133j26045j55787j84464
13336C07506j93249j24439k8696J0039j0512Q712P5017N5058O808N8021J32367
13325B96632J20626Q5498R8731J19660J12387R0048K8635o8632j02798o5402m0424
$$ y = [-340888, -369919, -289606, -112315, 96134, 269629, 364781, 403143, 467451, 558182, 632788, 668075, 671625, 656061, 596249, 501465, 410284, 312902, 209461, 144313, 141504, 188457, 264031, 379859, 545937, 716222, 865546, 1020087, 1177648, 1277858, 1272109, 1151256, 915302, 571909, 202937, -30192, -25206, 146125, 328455, 409900, 375375, 248439, 35261, -244839, -493767, -548411, -372350, -138083, -28508, -34472, -36789, 13587, 86042, 173354, 249597, 267474, 248951, 256085, 341488, 502034, 690117, 804935, 773802, 647757, 491970, 307506, 114257, -10182, -38878, -28839, -39351, -30639, 44378, 99436, 106244, 164265, 296632, 417258, 502756, 601487, 721147, 833534, 923582, 952217, 883585, 780787, 715385, 674961]
13314F74961j9119K6469N1901N0643O8821Q6568M3021l0819r3731j08618q5081
13303F65016q7509r7171o5770r414P4160J94224K58019K31464J82358J11480L1655
13292A488512m6755j33859k24018k21547j50996j00339p2264q1182m3381Q1150
13282D95321J58936J94136K46640K79777K44454J25693j8804r6316j28100j44452
13272A357285j23336q7867q6358j06213j43500j20041K9521J36482J04461L5585
13262I96019m2967j18093j34937p0342Q6795J88027J55577Q8059K1925l3955m5649
13251A090459n4151n2139m139L7011J6444k6979p0382q7306q8082p0848j0340
13240F79548N7352J02208O8803r052j5468l759q578R119J3254l7213r9847j36110
$$ y = [674961, 655842, 682311, 734212, 784855, 853676, 940244, 983265, 952446, 858715, 750097, 665016, 577507, 480336, 414566, 405152, 479312, 673536, 931555, 1163019, 1345377, 1456857, 1488512, 1441757, 1307898, 1083880, 862333, 711337, 610998, 538734, 457552, 414171, 495321, 654257, 848393, 1095033, 1374810, 1619264, 1744957, 1726153, 1629837, 1501737, 1357285, 1233949, 1146082, 1059724, 953511, 810011, 689970, 719491, 855973, 960434, 996019, 953052, 834959, 700022, 629680, 716475, 904502, 1060079, 1148138, 1170063, 1136108, 1090459, 1036308, 984169, 980030, 1017041, 1033485, 1006506, 936124, 848818, 760736, 689888, 679548, 736900, 839108, 907911, 898859, 883391, 879632, 871054, 880173, 893427, 856214, 756367, 620257]
13228F20257j40368r2001p131L0692J130o3135j39044k05833k03112j19032n0562
13217c68139k3292O2648J92033K03146Q8153K9638P3271J17629J01464N3158M9826
13206E79535O8331M4476P3039J89884K79737K65974J41488O115M028Q2332J33808
13195A868747J35818Q4249N458o4763j08050j14660j20171j03569n2075o8456
13185A462528j71496k29534j47406m5360J0173L7352M2740M2432j0867l4212N2162
13174A008512J42746J38528M4540j7484J661L5446L3824M3575M7793J5866k1708
13163A473299q6679j18985n9557j3510k353R00J1585K3581K7977j6155p8294m3923
13151A117886L9915Q9402J26953J58612J22080M4323N707j578k7343o9304p4555
$$ y = [620257, 479889, 387888, 380757, 411449, 412579, 349444, 210400, 4567, -198545, -317577, -368139, -391431, -328783, -136750, 66396, 154549, 184187, 257458, 375087, 476551, 529709, 579535, 647866, 692342, 765381, 955265, 1235002, 1500976, 1642464, 1648579, 1652607, 1734939, 1868747, 2004565, 2088814, 2094272, 2029509, 1921459, 1806799, 1686628, 1583059, 1530984, 1462528, 1291032, 1061498, 914092, 868732, 878905, 916257, 958997, 1001429, 990562, 956350, 1008512, 1151258, 1289786, 1334326, 1316842, 1318503, 1353949, 1387773, 1431348, 1479141, 1495007, 1473299, 1386620, 1267635, 1208078, 1194568, 1192215, 1193115, 1204700, 1228281, 1256258, 1240103, 1161809, 1117886, 1157801, 1247203, 1374156, 1532768, 1654848, 1699171, 1704878, 1703300, 1675957, 1606653, 1532098]
13140A532098p7919n1189m3623o0048k2563M0828M4311k7572m5871p557j5107
13129A265788n5649r2760j46865j98712k01382j67988j01564k6925k941j9934
13119B51068p155M6285R2054J04343O7233q021R642J61963K78077K72369K20814
13108A488672J67562J45977J84597K31629K04788R5068l4145j06134q8080j0422
13098B279512M8532L1185l3327p6555q4506r1705o3776L5520J58047J84399Q7680
13087B475006o4816j74817j46369o0076n6491o5813j0788J3067q665K6463J00435
13076B027136J04904Q1128J04193J09026R3748P3357N5383R6787J50256J14545
13066C010463K203o1100q7595j61230k33567k33060j58034m0854R8576K33502
$$ y = [1532098, 1454179, 1402990, 1359367, 1299319, 1276756, 1317584, 1361895, 1334323, 1288452, 1280895, 1265788, 1210139, 1117379, 970514, 771802, 570420, 402432, 300868, 273943, 271002, 251068, 243913, 290198, 382252, 486595, 553828, 545807, 555449, 717412, 995489, 1267858, 1488672, 1656234, 1802211, 1986808, 2218437, 2423225, 2518293, 2484148, 2378014, 2289934, 2279512, 2328044, 2359229, 2325902, 2249347, 2164841, 2073136, 2009360, 2044880, 2202927, 2387326, 2475006, 2410190, 2235373, 2089004, 2028928, 1972437, 1906624, 1895836, 1908903, 1900238, 1926701, 2027136, 2132040, 2213168, 2317361, 2426387, 2520135, 2593492, 2648875, 2745662, 2895918, 3010463, 3012666, 2951566, 2863971, 2702741, 2469174, 2236114, 2078080, 2037226, 2135802, 2369304]
13056B369304K89785K36600J64147J17935L8394n6907p2271k70J01163J41711
13046C329591O5101l4425p9796o7918K8639J15897R0045j4865q8777j7204J15133
13035C441421J64030J09909O5054J51244K52171K22154J66358J74316J67313J42574
13025E056544J41417J41121J52588K08710K55589K03988Q7232j2425o0431p9470
13015F094863o1162K8119J64881K52923K35368K05972K45672K86031K61084J94581
13005G908332J57910J81608J85805J87489K81427M19708N10688N25845M58878
12996A0817690L48725K72809L07081M08336N30690O66365Q17253J004368J175772
12987A6349089J324281J488278J604223J628383J685451J923187K320541K729534
$$ y = [2369304, 2659089, 2895689, 3059836, 3177771, 3216165, 3159258, 3086987, 3086717, 3187880, 3329591, 3394692, 3360267, 3280471, 3212553, 3241192, 3357089, 3447134, 3432269, 3343492, 3326288, 3441421, 3605451, 3715360, 3780414, 3931658, 4183829, 4405983, 4572341, 4746657, 4913970, 5056544, 5197961, 5339082, 5491670, 5700380, 5955969, 6159957, 6247189, 6234764, 6174333, 6094863, 6033701, 6061820, 6226701, 6479624, 6714992, 6920964, 7166636, 7452667, 7713751, 7908332, 8066242, 8247850, 8433655, 8621144, 8902571, 9322279, 9832967, 10358812, 10817690, 11166415, 11439224, 11746305, 12154641, 12685331, 13351696, 14168949, 15173317, 16349089, 17673370, 19161648, 20765871, 22394254, 24079705, 26002892, 28323433, 31052967]
12979C1052967L109905L582581M214889M949282N797903O863790Q155217R578304
12971G7304838J1218198J3303105J5936469J9161856K3002970K7368619L1892140
12964B19188195L5475155L5776410K9233482J3551787p943055k6856363l6947721
12957B61477890l8365136l4752856k9449117k4218748j9705036j6037971j3121326
12950H5827700j0735990q794807p320276o214222n282439m465629l778042l190255
12942C6046040k783635k557598k328322j985759j652445j442911j308255j156848
12934B0830267r15068o95906n89096n27434m99783n42071o39383p28103p39420
12925A4954003o24396m24973k46588j34544j20928j66433j34525M9816K06910
$$ y = [31052967, 34162872, 37745453, 41960342, 46909624, 52707527, 59571317, 67726534, 77304838, 88523036, 101826141, 117762610, 136924466, 159927436, 187296055, 219188195, 254663350, 290439760, 319673242, 333225029, 325281974, 298425611, 261477890, 223112754, 188359898, 158910781, 134692033, 114986997, 98949026, 85827700, 75091710, 66296903, 58976627, 52762405, 47479966, 43014337, 39236295, 36046040, 33262405, 30704807, 28376485, 26390726, 24738281, 23295370, 21987115, 20830267, 19915199, 19219293, 18630197, 18102763, 17602980, 17060909, 16421526, 15693423, 14954003, 14329607, 13904634, 13658046, 13523502, 13402574, 13236141, 13101616, 13151432, 13358342]
12916A3358342K25236K40005L19404L92408M28315M28983M36321N20644O54185
12907A7003843P42093P77366Q89296J067188J171551J137368R34317O95154N94545
12898B5012721O88653R36766J266386J655600K093128K551706L012281L526375
12890D0743616M152661M860337N711218O791102Q118790R716075J1598158J3849218
12882A05541175J6642305K0073678K4092864K8583509L3194169L6632995L6040045
12875C00800740K7589861R693665j2858210l0916079l9127590l8914779l4443193
12868A81824415k8880876k3633669j9170673j5541897j2602489j0258112q420329
12861F3316370p028396n957280n046882m264816l624893l104998k682698k392670
$$ y = [13358342, 13583578, 13823583, 14142987, 14535395, 14963710, 15392693, 15829014, 16349658, 17003843, 17745936, 18523302, 19412598, 20479786, 21651337, 22788705, 23723022, 24418176, 25012721, 25701374, 26638140, 27904526, 29560126, 31653254, 34204960, 37217241, 40743616, 44896277, 49756614, 55467832, 62258934, 70377724, 80093799, 91691957, 105541175, 122183480, 142257158, 166350022, 194933531, 228127700, 264760695, 300800740, 328390601, 338084266, 325226056, 294309977, 255182387, 216267608, 181824415, 152943539, 129309870, 110139197, 94597300, 81994811, 71736699, 63316370, 56287974, 50330694, 45283812, 41018996, 37394103, 34289105, 31606407, 29213737]
12853B9213737k212701k041215j781547j480986j223909j011836q60086p36520
12845A7864937o49419o34966o46607o03019n29872m86950m50627m22838l58164
12836A3082475k54226k08384k27269j76662N4489L25263L80104K92510J75766
12827A3444066O1607K5542M4547J12081K09794L00220L97880M62197N44108O64740
12817A6266782P17240P31384P53946P53145Q05003R54616J187465J451935J732729
12808B5354245K056001K401922K749944L148387L690258M376247N198787O144223
12800E5120014P259393Q613725J0214044J2104959J4388187J7213563K0650870
12793A45564755K4699417K9203575L3462232L5902519L3665171K3309172M417882
$$ y = [29213737, 27001036, 24959821, 23178274, 21697288, 20473379, 19461543, 18601457, 17864937, 17215518, 16580552, 15933945, 15330926, 14801054, 14314104, 13863477, 13440639, 13082475, 12828249, 12619865, 12392596, 12215934, 12270423, 12595686, 12975790, 13268300, 13444066, 13505673, 13531215, 13575762, 13687843, 13897637, 14197857, 14595737, 15057934, 15602042, 16266782, 16984022, 17715406, 18469352, 19222497, 20027500, 20982116, 22169581, 23621516, 25354245, 27410246, 29812168, 32562112, 35710499, 39400757, 43777004, 48975791, 55120014, 62379407, 70993132, 81207176, 93312135, 107700322, 124913885, 145564755, 170264172, 199467747, 232929979, 268832498, 302497669, 325806841, 330224723]
12786C30224723j7094650l2713900l8721230l7419989l2763357k7353815k2349737
12779A21808045j8105154j4662535j1944730r816156q115735o751786n705714
12772D6706235m905647m240102l625026l081198k619621k255549k029382j911238
12764B2038472j809652j637551j399481j216774j091665r55983q17686p26008
12756A2383672p12233p62594q08313p73985o40618m16384k11987j38000j71754
12747G747804k61569l59396l39368k52158k26569j80947r9840j51949l10867l84192
12737E180949l37474k92920k94995l08674k79586j96141j11377j05571j49084
12728C105127j28449n8181j1046L2897J2238n0140m4538n0349j59694k88730l43888
$$ y = [330224723, 313130073, 280416173, 241694943, 204274954, 171511597, 144157782, 121808045, 103702891, 89040356, 77095626, 67279470, 59163735, 52411949, 46706235, 41800588, 37560486, 33935460, 30854262, 28234641, 25979092, 23949710, 22038472, 20228820, 18591269, 17191788, 15975014, 14883349, 13927366, 13109680, 12383672, 11671439, 10908845, 10100532, 9326547, 8685929, 8269545, 8057558, 7919558, 7747804, 7486235, 7126839, 6787471, 6535313, 6308744, 6127797, 6027957, 5876008, 5565141, 5180949, 4843475, 4550555, 4255560, 3946886, 3667300, 3471159, 3359782, 3254211, 3105127, 2976678, 2918497, 2907451, 2940348, 2952586, 2902446, 2857908, 2807559, 2647865, 2359135, 2015247]
12717B015247k55519j00495k321L3943P5756J51442J61825O2212n7148j39369
12707A945573j85176j80128j42238j42019j59190j47953q1314O3955J85686J77796
12697A334992R6070M0933K0724k01n889J1229K0144o858k3730j8678p844K2601
12685A483493K0420k1668o6629p1319m9584m0748m4388m4132j5899o05n5673j27457
12673I65811j04718p482P9721P5601N2830Q3967O8018k023o5936r2976q2877q8569
12661H81367j73405k70415k53795j19343j1507k5565m5439J1690R0158Q8968J01780
12650B74494K03798K71617K91933K81083K19279J09127n3627k23190k80488k07731
12640H86295j31099j13061j23913j09541k0211O4021K0495r1380j65966j35113
$$ y = [2015247, 1759728, 1659233, 1656912, 1690855, 1766611, 1918053, 2079878, 2142090, 2084942, 1945573, 1760397, 1580269, 1438031, 1296012, 1136822, 988869, 907555, 971510, 1157196, 1334992, 1431062, 1471995, 1492719, 1492518, 1486629, 1497858, 1518002, 1511144, 1487414, 1468736, 1460892, 1483493, 1503913, 1482245, 1415616, 1344297, 1294713, 1253965, 1209577, 1165445, 1149546, 1148941, 1093268, 965811, 861093, 853611, 933332, 1008933, 1061763, 1145730, 1213748, 1211725, 1145789, 1052813, 969936, 881367, 707962, 437547, 183752, 64409, 52902, 27337, -18102, -6412, 83746, 172714, 274494, 478292, 749909, 1041842, 1322925, 1542204, 1651331, 1597704, 1374514, 1094026, 886295, 755196, 642135, 518222, 408681, 388470, 452491, 472986, 381606, 215640, 80527]
12630H0527l2095O2399J10455O8815m0297j08575j01521n4989k0911J4605M7166
12619B5579M7760K7330j5129o1902o2114j2751j1346m4278l6924R780Q7820J66257
12607A20082J82582J18782L1673m0335n9479Q912N1280M9041K2967n1628j33103
12596C00774j80421j41948o0535o402O4763J38103J38881L9343o6690j01636q4294
12585C9938k5760N1447R9059J05433J08495J16281J50327J95688J60156N1685
12575A052749r123p953n7076j19071r0547l1164l7691l6967M7537J52384K11707
12564A074785J86477Q0519k8207p9121p0621r9918j61035j56214r3715o8339p4029
12553E10582n2368j6537l6654j05485j59782j21755q641L5865n083L7361J48627
$$ y = [80527, 48432, 110831, 221286, 290101, 249804, 141229, 39708, -15281, -36192, -21587, 25579, 73339, 100669, 85540, 23638, -38476, -51227, -62573, -106851, -143775, -133995, -46175, 120082, 302664, 421446, 453119, 412784, 353305, 362217, 413497, 462538, 485505, 433877, 300774, 120353, -21595, -82130, -88532, -23769, 114334, 253215, 292558, 225868, 124232, 39938, 14178, 65625, 164684, 270117, 378612, 494893, 645220, 840908, 1001064, 1052749, 1043626, 1035673, 978597, 859526, 768979, 737815, 700124, 663157, 710694, 863078, 1074785, 1261262, 1341781, 1313574, 1234453, 1163832, 1063914, 902879, 746665, 652950, 584611, 510582, 458214, 441677, 405023, 299538, 139756, 18001, 9360, 45225, 40142, 77503, 226130]
12542B26130J64739O4135l5609m7201j1828L1270J05020J82442J89061J10597
12532I78756l740q0762j03807r8669n4693N870K3969j0508o6159q5008j9139L2745
12520E18855M3610P4409M8652o0047j36124j28292p2897j0649K7137N1570Q4135
12509D40359Q6802O8166N4229O5856J19314J41803J07636O2522J889p3875j44945
12498I29756j51742j17120j17995j62220j55911o2794J978J6739N969j4036l3750
12487A38874l7586k5420m2884q2257n7599J6462O2387M5965p94n1913o7768p606
12475a10139N5823M8164k1259j00714j45660j00756l886N0641N5164M3020K3249
12464b06353L729P1925K34253L28496K08339j5682j86726k38440j91777p8749
$$ y = [226130, 390869, 455004, 419395, 372194, 360366, 391636, 496656, 679098, 868159, 978756, 975016, 894254, 790447, 691778, 637085, 642955, 666924, 656416, 590257, 505249, 486110, 518855, 562465, 636874, 685526, 625479, 489355, 361063, 288166, 277517, 304654, 356224, 440359, 527161, 595327, 649556, 715412, 834726, 976529, 1084165, 1146687, 1148576, 1074701, 929756, 778014, 660894, 542899, 380679, 224768, 161974, 163952, 180691, 186660, 172624, 138874, 101288, 75868, 32984, -49273, -106872, -90410, -28023, 17942, 17148, -34765, -102533, -110139, -54316, -6152, -27411, -128125, -273785, -374541, -378427, -327786, -272622, -229602, -206353, -202624, -130699, 103554, 432050, 640389, 624707, 437981, 199541, 7764, -70985]
12454g0985L3227O2904L6270r129m8816o6631j00957j40206j28800q5313o0607
12443e79043J4732J61176K30213J75342Q5387M424l4275k7950k1268k8729j0228
12432c0219J6895j2885o3568j4561Q4811J14835J27129J34371Q1684n7393j92454
12421A88645k07414q3664N3291J59709K04178K09348J56011k6815j81868j56437
12411C14984j4040R9086J75661J91495J53860R5081O961p5802j27826j51302j66990
12400E01168j24478k5416M8970N1519j9966q9272n9269L2435Q2432Q6120P5316
12389E59559j4467j56402k39946k13628r3912Q817J4773k5100l1007K4497J44290
12378b2526K22174J82205R0134L2937k2840p8050n7896R447K8393J3298r797o0323
$$ y = [-70985, -37758, 25146, 61416, 52287, 3471, -63160, -164117, -304323, -433123, -518436, -579043, -564311, -403135, -172922, 2420, 87807, 92231, 57956, 30006, 8738, -19991, -30219, -13324, -26209, -89777, -104338, -19527, 95308, 222437, 356808, 438492, 381099, 188645, -18769, -102433, -49142, 110567, 314745, 524093, 680104, 653289, 471421, 314984, 300944, 400030, 575691, 767186, 921046, 1016127, 1023088, 947286, 819460, 668158, 501168, 376690, 351274, 400244, 451763, 431797, 342525, 283256, 315691, 398123, 484243, 559559, 545092, 388690, 148744, -64884, -158796, -149979, -135206, -160306, -191313, -166816, -22526, 199648, 381853, 471987, 504924, 482084, 404034, 346138, 355585, 383978, 397276, 387479, 327156]
12366C27156n7657K9109R3658R2665O0289J2089k9545l5655m5866j15180j20946
12355B10117O597J47053J24225l5841j22814j35819j36037j18672j22260j74191
12345c57642j95073j65041j44501j11411l8164K7127J14035J93063J81435J28790
12335c67382P2168M9605O5796R6674J17496Q8659M0295N4401J05500J15332N0583
12324D89127m4464j11313j29654p9295l9569n5348j08601j58997r8743K3529O7025
12313b46303J9146j2086K2543M4063P820n7531o9160o6887p3156n296J17915J49144
12301a69788N4113Q245j18o4500j29983j07227m6628J4037K2045l6466o0712n984
12289e22966K6779j2343j8901M1513P4624N3082L37p2852j02833n0803L3578P6817
$$ y = [327156, 269499, 298608, 392266, 484931, 545220, 557309, 527764, 492109, 446243, 331063, 210117, 216714, 363767, 487992, 452151, 329337, 193518, 57481, -61191, -183451, -357642, -552715, -717756, -862257, -973668, -1011832, -984705, -870670, -677607, -496172, -367382, -295214, -245609, -179813, -83139, 34357, 123016, 163311, 217712, 323212, 438544, 489127, 444663, 333350, 203696, 124401, 84832, 29484, -79117, -238114, -336857, -313328, -246303, -227157, -239243, -216700, -172637, -164817, -222348, -291508, -358395, -431551, -436847, -318932, -169788, -115675, -107430, -107548, -172048, -302031, -409258, -455886, -441849, -419804, -456270, -516982, -522966, -496187, -508530, -527431, -485918, -411294, -358212, -357875, -430727, -533560, -584363, -550785, -473968]
12277d73968Q9666Q7367K2876r7681j33583l5224R2538J65191J85420J35232N8681
12266I6515M1360R0942J46201R7033k4277r3593o2062k6340n7676n9916n8677
12255H9510r1932j24824j30797r4888n4869k7932L81M0464P5230J30714K04464
12244A5521K01676J07203J4240j530M7258Q2767N3961K5436P1438J16020N1369
12233G85359j00504k20036k57420k15454j54798j00557K994R6338J46499J01160
12223H3581l0281j11371q3265M394R6717J66793J71765J29273J08869J48036J69084
12212H53595R5766j2989n2206M8539K03989L31064M49718N25205N00383L31529
12202C274593N8414j63166k52485k86008k85159k18198r5661N1430J50836K10951
$$ y = [-473968, -384302, -296935, -274059, -371740, -505323, -540547, -448009, -282818, -97398, 37834, 96515, 137875, 228817, 375018, 472051, 447774, 354181, 292119, 265779, 208103, 148187, 89510, -2422, -127246, -258043, -352931, -407800, -435732, -435351, -394887, -319657, -188943, 15521, 217197, 324400, 338640, 337110, 384368, 467135, 521096, 546532, 617970, 733990, 785359, 684855, 464819, 207399, -8055, -162853, -263410, -260416, -164078, -17579, 83581, 53300, -58071, -141336, -136942, -40225, 126568, 298333, 427606, 536475, 684511, 853595, 949361, 936372, 884166, 932705, 1136694, 1467758, 1917476, 2442681, 2943064, 3274593, 3333007, 3169841, 2917356, 2631348, 2346189, 2127991, 2032330, 2083760, 2234596, 2445547]
12192B445547K77455K61372J14046n4570j79450k58373j95564m2903K1355p0917
12182B317998k44643l54492l96167l98846l21942j97281r2762l2881k7386p1357
12172A80241j25175j01454k5944L794r919J2462R2303J75412J71320Q5872K1112
12161D80024P815J0537k139k7074j2488K8379J5101k7423k9942j544j717m5665
12149C93864o8661j7794N9050Q2355P8396O5939r196j22270j77040j59629r5702
12138B9312k3620K0638N2504P6297J36422K18248K09473J13528P1438J24773J69501
12127A198514J36047P9614R0883J19561N2181p3314j46198j56288j56552j16438
12117A028010m1457J251J4493K9667P1526R2089N1524N0413P9710N6088j0146
$$ y = [2445547, 2723002, 2984374, 3098420, 3043850, 2864400, 2606027, 2410463, 2367560, 2388915, 2317998, 2073355, 1718863, 1322696, 923850, 601908, 404627, 311865, 278984, 251598, 180241, 55066, -46388, -72332, -68538, -78457, -65995, 26308, 201720, 373040, 458912, 480024, 487839, 498376, 496237, 469163, 456675, 485054, 500155, 472732, 442790, 441246, 439529, 393864, 325203, 307409, 366459, 448814, 527210, 593149, 583953, 461683, 284643, 125014, 29312, 5692, 26330, 78834, 155131, 291553, 509801, 719274, 832802, 904240, 1029013, 1198514, 1334561, 1414175, 1505058, 1624619, 1676800, 1603486, 1457288, 1301000, 1144448, 1028010, 986553, 987804, 1002297, 1031964, 1103490, 1195579, 1247103, 1297516, 1377226, 1433314, 1423168]
12106A423168q1107j45486j79690j22803o3009l9200n7183j27509j85793j44616
12096B76772n9667j7630q340j4831R283M0202M9408N8134N1398K9750N0978Q7944
12084E53401M2354q9073j98087k11849k26302k65027j90432l2594L4992M697o0311
12073f38231j07872p9689K3002J47811K12403J62288J28210J54077J03285L6543
12063A41827K4993L7910M9902L6691P394q764j5278l0682r737K0757n391o7011
12051A82611j02940p9547j8593O7648J32077J37219O6353O331J0006M0980P207
12040D49352o7732m0700L0645M6600k420p9063j07702l5952Q8853K29734L19483
12029H31098K70387J69931Q7771K9328J5111o636M024Q2801J61894K07207K84276
$$ y = [1423168, 1342061, 1196575, 1016885, 894082, 831073, 791873, 734690, 607181, 421388, 276772, 217105, 199475, 191135, 176304, 185587, 225789, 275197, 333331, 384729, 414479, 465457, 553401, 595755, 506682, 308595, 96746, -129556, -394583, -585015, -617609, -582617, -577920, -638231, -746103, -825792, -802790, -654979, -442576, -280288, -152078, 1999, 105284, 141827, 166820, 204730, 254632, 291323, 298717, 289953, 274675, 243993, 234256, 255013, 249622, 182611, 79671, 124, -18469, 49179, 181256, 318475, 384828, 391159, 401165, 442145, 449352, 381620, 340920, 371565, 418165, 415745, 336682, 228980, 193028, 281881, 511615, 831098, 1101485, 1271416, 1359187, 1388515, 1403626, 1396990, 1401014, 1483815, 1645709, 1852916, 2137192]
12018B137192K90505J19475j05126k45930k79070k35279j87594j73047j86066
12009A135060k21510k46714k11426j08139M557R9870J54743J84056J73088J00658
11999A064243l227j05988j36942j10820j01293r6239r0505m4550L1397L7002j5220
11988D27858m3126n0124p2512j22722j18843m0075K3550K2121n6649j23464j18824
11977b72810o6055j5746j7913m3060o2410o9043n6744p8361o6232J8858Q2426
11966f47090P1310M553j1555j725n5972j17305l6399J54268K74837K52948J14387
11955B257J7590K9515K5537m5729j23308j91287j99747q0874O1457J58083K31488
11944a15018K33449J47670J7420p6250p8778j00995j23793m0128J00683J87257
$$ y = [2137192, 2427697, 2547172, 2442046, 2196116, 1917046, 1681767, 1494173, 1321126, 1135060, 913550, 666836, 455410, 347271, 351828, 451698, 606441, 790497, 963585, 1064243, 1061016, 955028, 818086, 707266, 605973, 509734, 419229, 374679, 406076, 443078, 427858, 384732, 334608, 262096, 139374, 20531, -19544, 4006, 26127, -30522, -153986, -272810, -338865, -354611, -372524, -415584, -477994, -547037, -603781, -682142, -748374, -729516, -647090, -575780, -571227, -582782, -584507, -640479, -757784, -794183, -639915, -365078, -112130, 2257, 19847, 49362, 74899, 29170, -94138, -285425, -485172, -566046, -504589, -346506, -115018, 118431, 266101, 283521, 207271, 128493, 27498, -96295, -136423, -35740, 151517]
11934A51517J88049J73553K05179K27618J87189R0596O334n270L6829M4045J7100
11923A322739J6661L7517L0117j9192p4768j13954j41328q9948L5446J45114J97111
11912A345515J86965J32204J19440J70120K28820K70466L13625L51748L54569
11903C473472L08000K50045K67792L79360M92758M95547M09531L06908J82662
11894F566075P4621M7042P8826J01526R6585R4318J29089K02591K87082L40355
11884H018110L75404M33422M96636M98103M99351N42922M92793L42208K06576
11875A1905525J66512J83703J19459m0886j75743k41649l03705l66670l74384
11866A0872162l21986k58627k18729k37589l23370m34748n28264n98878o30416
$$ y = [151517, 339566, 513119, 718298, 945916, 1133105, 1223701, 1230035, 1224765, 1261594, 1305639, 1322739, 1339400, 1376917, 1407034, 1387842, 1313074, 1199120, 1057792, 967844, 1003290, 1148404, 1345515, 1532480, 1664684, 1784124, 1954244, 2183064, 2453530, 2767155, 3118903, 3473472, 3781472, 4031517, 4299309, 4678669, 5171427, 5666974, 6076505, 6383413, 6566075, 6640696, 6687738, 6766564, 6868090, 6964675, 7058993, 7188082, 7390673, 7677755, 8018110, 8393514, 8826936, 9323572, 9821675, 10321026, 10863948, 11356741, 11698949, 11905525, 12072037, 12255740, 12375199, 12334313, 12158570, 11916921, 11613216, 11246546, 10872162, 10550176, 10291549, 10072820, 9835231, 9511861, 9077113, 8548849, 7949971, 7319555]
11857G319555o35318o13848n25440m47400l71326k15819r0541j07134j75263j91530
11847C945936j35031q0500j11061j76185j75580j17283p8317r7101j21610q4616
11837B768652p6772j58505k50577l09023k87428j72916q5371o8865l5630L0507
11827A354072P9974J04509J09761P6120L4343Q076j4240m5814q7745j47197j96141
11816A275718j56915l6077M3872M1046k75j0087L0962Q6490Q9047N2183M1585
11805A457549L3803L1715J8075K1434N6653P7640K3008n8675p6735p7268l6106
11794A471093M2236P3807Q5341J30885J41960M5056r1612j14267j4372P1760P6412
11783A918299L0739J798J3894L5300N9468P0334L8173j5870n8454m9164j5150
$$ y = [7319555, 6684237, 6070389, 5544949, 5097549, 4726223, 4510404, 4419863, 4312729, 4137466, 3945936, 3810905, 3730405, 3619344, 3443159, 3267579, 3150296, 3071979, 2974878, 2853268, 2768652, 2691880, 2533375, 2282798, 1973775, 1686347, 1513431, 1428060, 1359195, 1323565, 1354072, 1434046, 1538555, 1648316, 1724436, 1758779, 1766855, 1752615, 1706801, 1619056, 1471859, 1275718, 1118803, 1082726, 1126598, 1167644, 1167369, 1157282, 1188244, 1274734, 1363781, 1415964, 1457549, 1491352, 1523067, 1541142, 1562576, 1619229, 1696869, 1719877, 1661202, 1584467, 1507199, 1471093, 1513329, 1587136, 1672477, 1803362, 1945322, 1990378, 1898766, 1784499, 1770127, 1841887, 1918299, 1949038, 1950836, 1964730, 2000030, 2059498, 2129832, 2168005, 2152135, 2093681, 2044517, 2029367]
11772B029367P2420K48412L60079L23681K35668J43302M2883J8537J77624M85949
11762D137922O43330N48530L99915L45690L18209K78863K95844L84237M81508
11753G834048N53851O20672O92073P50591Q07771Q86890R14098R70828J188561
11744A5219383J547833J978139K418739K840795L263773L727973M237647M739790
11736C9974072N264928N734298N789817N185296L905038K130661K21436j506167
11728F6699379k894440l924293m605181m982290n123928n028122m733334m337687
11720C1070104l845409l295308k796259k389538k071927j825182j614917j412085
11712A1819479j181427r29256p14850n55742m42068l75150l28842k52022k23320
$$ y = [2029367, 2101787, 2350199, 2710278, 3033959, 3269627, 3412929, 3455812, 3474349, 3651973, 4137922, 4781252, 5329782, 5729697, 6075387, 6393596, 6672459, 6968303, 7352540, 7834048, 8387899, 9008571, 9700644, 10451235, 11259006, 12145896, 13059994, 14030822, 15219383, 16767216, 18745355, 21164094, 24004889, 27268662, 30996635, 35234282, 39974072, 45239000, 50973298, 56763115, 61948411, 65853449, 67984110, 68205546, 66699379, 63804939, 59880646, 55275465, 50293175, 45169247, 40141125, 35407791, 31070104, 27224695, 23929387, 21133128, 18743590, 16671663, 14846481, 13231564, 11819479, 10638052, 9708796, 8993946, 8438204, 7996136, 7620986, 7292144, 7040122, 6816802]
11703F816802k83186l29455k76525k14999k51666l37051l23439k22818j71262
11694D406401j82414j69328j25372j22007j57321j66337j49897j61455j85224
11685B987046k00293j90654j65916j02669m920Q0507J13921M9973n9292j26509
11675B381194j52041j26342O97R0167L7410j2662P466M7874N4184L2140m1638
11664B318449j72515k00456j51462j39364j75180j83368j57914j73711j74110
11655G90369j28976p4253l6256j0959K4530P6163J31908J16842K0470o9442q4631
11644G55765k6647O7305J14789R7144O7543K6518o4145j27084j02009r9478j59734
11633E49967k13095k12337j49439m4752M4087N7034J003k9907J7274J11452J21678
$$ y = [6816802, 6533616, 6204161, 5927636, 5712637, 5460971, 5123920, 4800481, 4577663, 4406401, 4223987, 4054659, 3929287, 3807280, 3649959, 3483622, 3333725, 3172270, 2987046, 2786753, 2596099, 2430183, 2327514, 2322594, 2403101, 2517022, 2566995, 2507703, 2381194, 2229153, 2102811, 2103508, 2193675, 2231085, 2218423, 2225889, 2273763, 2327947, 2360087, 2318449, 2145934, 1945478, 1794016, 1654652, 1479472, 1296104, 1138190, 964479, 790369, 661393, 587140, 550884, 539925, 564455, 640618, 772526, 889368, 909838, 840396, 755765, 729118, 796423, 911212, 1008356, 1075899, 1102417, 1038272, 911188, 809179, 709701, 549967, 336872, 124535, -24904, -69656, -25569, 31465, 32468, 2561, 19835, 131287, 252965]
11622B52965P697j12140j48489o1965M1039J8600m5928k2082L3350P6587R0301
11611A29935L8393J3483L8794J6052k1195K70L0655L5777M6518M4943k915m8783
11599C21927q5998q0990o682N3714O4071M3002M506n8463j45214j41689o2693
11588i4509o377L9839N1193J4781l1634o7654m4172K4721P4420N3743j0972k1828
11576a8449m0442j06232j31772q6190p5671j06355q9419o3925m9638k0395K7798
11565g60690O0437N7558K0675j6042k9675n0091o4393m9695J7498J17679J35387
11554e61352N4240K9283N8138L0234J3334N6876J15610J61907J70088J04767l8218
11543A94907j33619j54755r7562L1096P1932P259m5191p0314l0650O4709J30774
$$ y = [252965, 260662, 148522, 33, -61932, -20893, -2293, -48221, -70303, -36953, 39634, 129935, 168328, 181811, 220605, 236657, 215462, 215732, 246387, 282164, 328682, 373625, 370710, 321927, 235929, 154939, 148257, 201971, 266042, 309044, 313550, 255087, 109873, -31816, -94509, -100886, -61047, -9854, 4927, -26707, -94361, -138533, -113812, -39392, 14351, 3379, -18449, -58891, -165123, -296895, -383085, -458756, -565111, -654530, -718455, -768093, -788488, -760690, -700253, -642695, -622020, -638062, -667737, -717828, -782221, -831916, -814418, -696739, -561352, -507112, -477829, -419691, -389457, -376123, -319247, -203637, -41730, 128358, 233125, 194907, 61288, -93467, -191029, -159933, -88001, -80742, -125933, -196247, -226897, -162188, -31414]
11532c1414J15378J9761j9322K1368l107j07231j54360j04749j9708P2645J31599
11521g9140J27432J15772J01362P6766R3796J38127R8151l3677j35586j13219
11511C89784o0839o0101j07230j43377j13035p2428p2069q7651q2049j08155j52385
11500f69535j24607l0084O6339J45461J97539J68467P1102L2129O4110L5429j8819
11489f2469l4433k7934J9281J15178J70211J25290O7422L2482m657l8795j6671
11478C44905M5810N0943O9463Q7489J3821n0150j5237O4078R7226P4502n539j46413
11466F30898k09645j46926q2468q5547j44841j95840j83365j03873k7430P6J4032
11455e34929K4687N0426J13517J41265J03076O1167N3472N9643M6508l246n2569
$$ y = [-31414, 83964, 103725, 84403, 105771, 102664, -4567, -158927, -263676, -283384, -210739, -79140, 48292, 164064, 265426, 342192, 435988, 574115, 672266, 638589, 503003, 389784, 328945, 268844, 161614, 18237, -94798, -167226, -239295, -326946, -408995, -517150, -669535, -794142, -824226, -757887, -612426, -414887, -246420, -175318, -143189, -79079, -43650, -62469, -96902, -124836, -105555, 9623, 179834, 305124, 372546, 405028, 400371, 361576, 344905, 390715, 441658, 511121, 598610, 612431, 562281, 547044, 611122, 708348, 782850, 777311, 630898, 421253, 274327, 191859, 106312, -38529, -234369, -417734, -521607, -549037, -548961, -534929, -510242, -459816, -346299, -205034, -101958, -40791, 12681, 72324, 118832, 115586, 63017]
11444F3017m9064j3512K8732Q6761J23807J18039J17077J42849J69162J70757
11434I57625R8818K995m2972p3177j00532j32843j92466k29817k15355j70732
11424i8456j15188n3192M7766J52346K03220J67038J06965Q9871O2258M0149N5798
11413F58575Q4516J03851Q2145M8957N0012J09981J65478J38261M0076m3460p1550
11402A366842q9141j09132j20352r3960r2013j67592j94555r3588M3356J27944
11392E77809J43012R7370K9440o5117j94446k62065k14894j39922o4193K4802
11382f8204R8496R9849O7123N5375M7247J8025l6890j24614j96665j88013j02985
11371c31256J4813Q6283J07042J26819J35703Q6384J2040J3141O7140O4983M575
$$ y = [63017, 13953, 441, 29173, 115934, 239741, 357780, 474857, 617706, 786868, 957625, 1056443, 1059438, 1016466, 943289, 842757, 709914, 517448, 287631, 72276, -98456, -213644, -266836, -219070, -66724, 136496, 303534, 410499, 500370, 562628, 602777, 658575, 743091, 846942, 929087, 978044, 1028056, 1138037, 1303515, 1441776, 1481852, 1438392, 1366842, 1277701, 1168569, 1048217, 954257, 862244, 694652, 500097, 406509, 449865, 577809, 720821, 818191, 847631, 782514, 588068, 326003, 111109, -28813, -93006, -68204, 30292, 130141, 197264, 252639, 299886, 317911, 281021, 156407, -40258, -228271, -331256, -316443, -230160, -123118, 3701, 139404, 225788, 237828, 250969, 318109, 383092, 387667]
11360C87667j2106N9300Q3750l9592j53886j34517o6664l9762n6105n1584m9774
11349g3273j20373k06623j90947l1349J23720J23676N4234m1951j39346j35005
11339f37237o1546j2029l360n5033j22075r4681L1273J24910J07162P9911J15726
11328e26979J51102J10685L114l3363N2979J44829J36791Q6218L2786o1622j75143
11317g8603k44154k63652k34337j89607j58173q3701j1277N337O0847K05096K92390
11306f99834K67046J48797J1450q6427j76760j66914k1607J13919J59248J94820
11296b56262K42074K28974J39593J4018o7335r0978o0384j9008l6792n9049j7066
11285A7785p853m6277m3008j9239m1984q2249r5824n1273L5785O5951M0390M8865
$$ y = [387667, 375561, 434861, 518611, 479019, 325133, 190616, 123952, 84190, 28085, -23499, -73273, -193646, -400269, -591216, -622565, -498845, -375169, -320935, -362886, -502232, -637237, -698783, -710812, -714172, -769205, -891280, -985961, -954688, -829778, -722616, -642705, -526979, -375877, -265192, -262078, -295441, -242462, -97633, 39158, 125376, 158162, 96540, -78603, -322757, -586409, -820746, -1010353, -1168526, -1252227, -1263504, -1258167, -1197320, -992224, -699834, -432788, -283991, -272541, -358968, -535728, -702642, -724249, -610330, -451082, -256262, -14188, 214786, 354379, 368397, 301062, 210084, 149700, 130692, 93900, 34851, 17785, 9932, -36345, -79353, -98592, -140576, -222825, -318649, -369922, -334137, -268186, -227796, -178931]
11273a78931J25685J86806J51865Q0795M4453K5757j8105o0753p8191q3968p4903
11262A20510j1436R8613J73806J49084Q1275L8580j6754r2108j62667j62743j10330
11251A05830n8820N914N8791P4628P3161N3828J6639J5298M2202J3950j03074
11240B98347k44334k65634j81337j17910r0360n2484M07M6913Q6091J11044Q7280
11229c21977N6723O6495O5736M073n5072l8108j1378m6422n9392J0807P8575N9291
11217a90649R38M176M9898k6588j64488j60736p0503N551R3500J50141J55787
11206a52973J09450M854o8104m1928M6673R6135O6951K498q3374j41120j23254
11195b84192q9266p7687n8408m6413m1341l0616m1124p9162n3741O3700J52590
$$ y = [-178931, -53246, 133560, 285425, 366220, 410673, 436430, 418325, 357572, 279381, 195413, 120510, 109074, 207687, 381493, 530577, 611852, 650432, 633678, 541570, 378903, 216160, 105830, 47010, 52924, 111715, 186343, 259504, 313332, 329971, 345269, 387471, 401421, 298347, 54013, -211621, -392958, -510868, -601228, -653712, -653305, -606392, -520301, -409257, -321977, -265254, -198759, -133023, -128950, -184022, -222130, -233508, -279930, -339322, -328515, -249940, -190649, -189711, -185535, -135637, -162225, -326713, -487449, -557952, -552401, -458901, -308760, -152973, -43523, -38669, -106773, -148701, -102028, -5893, 61058, 63556, -19818, -160938, -284192, -373458, -451145, -509553, -555966, -597307, -627923, -669047, -748209, -801950, -738250, -585660]
11184e85660J39486R6399N2427l4345j13514j14598p7867l2906K1195j5605j36899
11173h01887j88359r7856K8166J09017J69513K59124L29012K32193N1409n1965
11163C8367k3362Q6358J21109Q9116M4677J170N0628J29010J03459j5032j45318
11152D80182k50255l13347l13296k47660p5050J18708J82502J31544R1266J30996
11142f4410J89382J96878J29785L6605k1708l0680n3542r5793j24725j31773n9191
11131b9172N1289J20788J27225O6958o2884j58643j01323J8590M0138k9123q3007
11120c9164l3295J05498J79359J87964K11158K10917J27820K1046l9819j02440
11110H29044j58768j79366j64516j45216j57240j71682j19614k7848M4337N7134
$$ y = [-585660, -446174, -349775, -297348, -331693, -445207, -559805, -637672, -670578, -649383, -664988, -801887, -990246, -1088102, -1059936, -950919, -781406, -522282, -193270, 38923, 90332, 38367, 15005, 101363, 222472, 311588, 356265, 357435, 408063, 537073, 640532, 625500, 480182, 229927, -83420, -396716, -644376, -719426, -600718, -418216, -286672, -195406, -64410, 124972, 321850, 451635, 488240, 466532, 435852, 382310, 286517, 161792, 30019, -29172, 22117, 142905, 270130, 337088, 274204, 115561, 14238, 32828, 72966, 43843, -39164, -72459, 33039, 212398, 400362, 611520, 822437, 950257, 971303, 931484, 829044, 670276, 490910, 326394, 181178, 23938, -147744, -267358, -295206, -250869, -193735]
11100a93735j4764j12497j32796m0499J23453K57004K59607J65735O0089m334
11090C67263l6244k4771L3438N5822J6239l8102n4053k9517J6141L4285j4812
11079C25689p2420p4541n0202k9810j1499L659j49o332L0428J21218J88370K06716
11067F31127J76702Q2583Q998k5231r7231k01374k76669k56629j56845n4131k8790
11056a97490m3899j4799L7523R9467J34449J06980M1027j2895l3080k724K3000
11045A37559K7609M2732J0813o7398j33480j77120j78702j22528j08076j24352
11035f92943n5062M8189J08921J44676J68778J53714J64497K08833K21058K13988
11025F84649K03447K12885J48022K0518j5695N899n3214j84637k59627k62953
$$ y = [-193735, -208499, -320996, -453792, -494291, -370838, -113834, 145773, 311508, 371597, 367263, 331019, 306248, 339686, 395508, 411747, 373645, 319592, 290075, 306216, 340501, 325689, 253269, 178728, 128526, 98716, 87217, 90876, 90727, 84395, 114823, 236041, 424411, 631127, 807829, 890412, 899410, 874179, 776948, 575574, 298905, 42276, -114569, -168700, -197490, -241389, -256188, -218665, -119198, 15251, 122231, 163258, 150363, 117283, 114559, 137559, 165168, 207900, 218713, 151315, 17835, -159285, -337987, -460515, -568591, -692943, -748005, -699816, -590895, -446219, -277441, -123727, 40770, 249603, 470661, 684649, 888096, 1100981, 1249003, 1269521, 1253826, 1259725, 1206511, 1021874, 762247, 499294]
11015D99294k71116k30363r1444N6848J28069J05742L9076r904L0467J32430J92156
11004E81255J98476K21330K44333K18383J17807n7860j65945j59351j33937q4536
10994I79955l9359r9164j68359j30383q9007j21781j28674l9368P5603J33138
10984C72601J40168J61363J47667Q5607N1375M5540K2962l9208o7584m7868q3251
10973G89372j36106j15446k0571P3537Q6601K6625n5502r3633m7814Q5303J91823
10962G84189J55147N8512M7999J36565K38452K14586M0633j43058k33747k36171
10952A063107j88156j31403r7627o6444n317O6692P5725j3342q5053n3853k6791
10941E37538q8322j56955j39084n3226J0665r072q0175j53263k01150j60010n7972
$$ y = [499294, 228178, -2185, -93629, -36781, 91288, 197030, 236106, 226202, 256669, 389099, 581255, 779731, 1001061, 1245394, 1463777, 1581584, 1523724, 1357779, 1198428, 1064491, 979955, 940596, 841432, 673073, 542690, 453683, 331902, 203228, 163860, 239463, 372601, 512769, 674132, 821799, 907406, 958781, 1004321, 1027283, 988075, 920491, 872623, 789372, 653266, 537820, 517249, 590786, 677387, 704012, 648510, 554877, 507063, 592366, 784189, 939336, 997848, 1045847, 1182412, 1420864, 1635450, 1676083, 1533025, 1299278, 1063107, 874951, 743548, 645921, 579477, 574160, 640852, 716577, 703235, 618182, 564329, 537538, 449216, 292261, 153177, 99951, 110616, 101544, 21369, -131894, -333044, -493054, -551026]
10930e51026M46N86k8071m6220n215Q1615J03243O1944O9538N9102j9726n6100
10918c29884k7966N8385J62909J84598P3249n7276p5700o9894j28411j26054K6657
10907c09387J97504K28879J29138L2022O123n938j0194K7973Q2966Q8386M0146
10896E07618j6683q6212j07125p5393n4578k7365K1850N7053P5494O8677K0802
10885C84138J3389P4732J27294J76117K34405K06933M7677j32659j89313j08392
10875H34321K7118J23698J42948J00043L9548l7480j18508j58292j64035j41341
10865F48020m6814N6097J19112J48368J06145M3047J3843j4221o2291j28885j96819
10854F85602k39483k23131j35366q5085o3906O64K2886j1824j4657J2529M7752
$$ y = [-551026, -550580, -549994, -578065, -624285, -629500, -547885, -444642, -382698, -313160, -254058, -273784, -329884, -357850, -299465, -136556, 48042, 121291, 64015, -11685, -81579, -209990, -336044, -309387, -111883, 116996, 246134, 278156, 284279, 278341, 268147, 296120, 379086, 467472, 507618, 490935, 404723, 297598, 222205, 167627, 140262, 162112, 219165, 294659, 363336, 384138, 397527, 472259, 599553, 775670, 1010075, 1217008, 1264685, 1132026, 942713, 834321, 861439, 985137, 1128085, 1228128, 1267676, 1230196, 1111688, 953396, 789361, 648020, 601206, 657303, 776415, 924783, 1030928, 1073975, 1087818, 1073597, 1011306, 882421, 685602, 446119, 222988, 87622, 2537, -61369, -60705, -37819, -49643, -64300, -51771, -4019]
10843d019Q7017J04539P1183o188j03690j57955j46177j11000o4720j1207p753
10832c49970j9971k3141n4330p4271n9409l3704k6592k5166R28K2788M3279P3782
10820e25777R9699J07629O8254M8895Q1171Q7537N7122L5709J4483j7936k4254
10809C2532J1267L9015o130j05249j37997o4861L6535J26415J56913J05129K5764
10798B19333n5625q0037m6799o0588j12866j51220j32231q6412n467O0506K7852
10787d23554k0290J7453R3953R6798O6000N0657M7242P1366O4802m6907j78165
10776a60645j99200j18573l6703J1310J8852m9500j15701j13352n5886L048o674
10765h23024r675P4368J54631J43900Q2495N8116R8891J49171J32011P7338M2561
$$ y = [-4019, 82998, 187537, 258720, 252532, 148842, -9113, -155290, -266290, -331010, -342217, -349970, -369941, -393082, -447412, -521683, -581092, -614796, -641388, -666554, -665626, -642838, -599559, -525777, -426078, -318449, -250195, -201300, -120129, -32592, 24530, 60239, 74722, 56786, 32532, 43799, 82814, 76684, -28565, -166562, -231423, -194888, -68473, 88440, 193569, 219333, 163708, 83671, 36872, -23716, -136582, -287802, -420033, -506445, -511912, -451406, -423554, -443844, -426391, -332438, -235640, -169640, -118983, -71741, -375, 64427, 17520, -160645, -359845, -478418, -515121, -503811, -484959, -534459, -650160, -763512, -819398, -816350, -823024, -832699, -758331, -603700, -459800, -377305, -319189, -220298, -71127, 60884, 138222, 180783]
10754A80783K6461J9672m0447j45812j82840j14818k3621N09j3198J1895P0089
10743b11327J09023R9782O8791K7546m3046j01725r0655k2031L9351P1305P0092
10732A7106M0337m4724j84300k61259j84111m7332L2679K1141K061M0481J17272
10721d50649K02590K12979J43653Q3727N8158K7985m5336j40921j72207j16163
10711a96184o1474r5234j78994k08992j46048p4322l5919r644O0141J89256L07051
10700d50363K68058R6394m2325n6962m4507o9183p6494p3399q2692j13910o8125
10689g13508J36773L56304M00932K66659Q3976m4974q4482l7139r165p3580j57027
10678A24769j67935r9117l1613J2847P2798J48600J60415J22710J03409N3228
$$ y = [180783, 207244, 226916, 186469, 40657, -142183, -257001, -280622, -280113, -293311, -281416, -211327, -102304, -2522, 66269, 93815, 50769, -50956, -141611, -163642, -124291, -52986, 17106, 57443, 12719, -171581, -432840, -616951, -664283, -631604, -610463, -608402, -567921, -450649, -248059, -35080, 108573, 192300, 250458, 278443, 233107, 92186, -80021, -196184, -257658, -352892, -531886, -740878, -886926, -961248, -997167, -1006811, -946670, -757414, -450363, -182305, -85911, -128236, -185198, -229705, -298888, -375382, -448781, -531473, -645383, -713508, -576735, -220431, 180501, 447160, 531136, 486162, 401680, 364541, 355376, 281796, 124769, -43166, -142283, -173896, -161049, -88251, 60349, 220764, 343474, 446883, 500111]
10668E00111k8632r8422j46615j56989j30239j06616r2226j18972j42970q0850
10658f02420J5196R0420J19249J10872N5826l9646j33991j40498l5438M2657J4972
10647e02801l6337n0015q511P2646J42876J48823J04044M7347J1080L6363P3254
10636C8769L4892r1894j66782q0526Q8158J61305J15835K7671m9170n6739n287
10625A6232M9698M9432J269p9230j34236j49880j90521j76737n5750L1771N6620
10614e81332Q5691J35045J93144K06054J38611N4480L8708K1136l1781o1134q4117
10603A14505j57057k38859k05286n9353J00471J75828J81505J86400J43920K0611
10593B62685j13487j85861j84309q6277P2969J53280J28516Q8575N4437K7716
$$ y = [500111, 471479, 373057, 226442, 69453, -60786, -167402, -259628, -378600, -521570, -602420, -587224, -496804, -377555, -266683, -210857, -250503, -384494, -524992, -560430, -517773, -502801, -539138, -589153, -597664, -525018, -382142, -233319, -129275, -81928, -70848, -34485, 38769, 73661, -18233, -185015, -265541, -177383, -16078, 99757, 127428, 78258, 21519, 16232, 65930, 115362, 116631, 37401, -96835, -246715, -437236, -613973, -669723, -637952, -581332, -495641, -360596, -167452, 38602, 177213, 231693, 270401, 291537, 259756, 198622, 114505, -42552, -281411, -486697, -546050, -445579, -269751, -88246, 98154, 242074, 262685, 149198, -36663, -220972, -307249, -234280, -81000, 47516, 136091, 190528, 218244]
10583B18244L5510L6810L1547N7985N9042K0893k7967p1227k5722Q6830R7320
10572E19265k0656j20140j43069j34633j17355n3631K6909M3895J1134j2496k8830
10561b9607n2639n7304k523J17012K26018K32755J85887J85459J26006m1775j67256
10550G22033j49326m1105O5517J11276O4652o1616j84436k28263k27748k34162
10540a63178j98337o7908Q8701J40108J02434P8858J25612J82649J43365K0484
10530D52788j37887k15384j75001o4572J6159M7428Q5923P9481J4050j7854Q2084
10519A67215K58212L83789L63848J82741o1451k28142k52387j96402j16035n4190
10509D47198l6292p2702j03215m4207Q8314J98517K04660J02152l9884j51953
$$ y = [218244, 253754, 290564, 322111, 380096, 439138, 460031, 432064, 360837, 335115, 421945, 519265, 498609, 378469, 235400, 100767, -16588, -70219, -43310, 585, 11719, -777, -29607, -82246, -139550, -142073, -25061, 200957, 433712, 619599, 805058, 931064, 889289, 722033, 572707, 531602, 597119, 708395, 773047, 711431, 526995, 298732, 70984, -163178, -361515, -429423, -340722, -200614, -98180, -19322, 106290, 288939, 432304, 452788, 314901, 99517, -75484, -140056, -123897, -76469, 9454, 88935, 102985, 85131, 167215, 425427, 809216, 1173064, 1355805, 1294354, 1066212, 813825, 617423, 501388, 447198, 410906, 338204, 234989, 190782, 279096, 477613, 682273, 784425, 744541, 592588]
10499E92588j48672m7662O214q106O507L2353K4832Q391K85j1299l5855m1515
10487C78061K001J4669n1447j01038r7014l2954L4701J5853p861j0885r235L8480
10475A73331M4047j2285m4040p3185j32209j45338j14317j45218k01127j45352
10465g95693m9810l1729o2330l2448O2906J38301J55605J15536j684j05000o9666
10454f76012K9956M6378L5468J07350J59341J14216L6685Q736O1046J40274J81438
10443B44876J70471J12371N710p7120j22413j74894j95897j32729n7378m9353
10433b76356q7632r2124n4199q793P543K2137Q7050J38018R1484l3862j53838
10422c60572j82018j12432m8198m7928o4794m9809K42P7425J40584J05121L04
$$ y = [592588, 443916, 396254, 402468, 394362, 400869, 433222, 458054, 466445, 466730, 455431, 419576, 378061, 380062, 394731, 343284, 242246, 145232, 112278, 146979, 162832, 154971, 144086, 134851, 173331, 217378, 205093, 161053, 87868, -44341, -189679, -303996, -449214, -650341, -795693, -845503, -877232, -939562, -972010, -909104, -770803, -615198, -499662, -501346, -606346, -676012, -646056, -599678, -564210, -456860, -297519, -183303, -146618, -137882, -76836, 63438, 244876, 415347, 527718, 533428, 456308, 333895, 159001, -36896, -169625, -227003, -276356, -363988, -456112, -510311, -519104, -511561, -489424, -402374, -264356, -172872, -206734, -360572, -542590, -655022, -703220, -751148, -815942, -865751, -865509, -788084, -647500, -542379, -542075]
10411e42075n1264k3608K8713P8829Q2005J5919m3789m5697J008R6249J94533
10400b09177K47260K57188K35760J74377L0536j52115k42970j50735M4360J82586
10390D17070J77513Q2001j1195j4373J8225K2631L1863O37j28949k71878k85599
10379C7946j80442p2759j7203J3208k5132j21411k18077k08428o8880P6552J15645
10368f68981R9138J40604J75429J31296J12869J79886K34944J64594L2132n6065
10358E45846p0194n9664n1200m8261o8153j02143j14820n2452O1333J26964J10577
10347B77833K1107p9613k4432J64330K96038K71687J63509K0323j62490k52919
10337F95373j99705j53165j96924k36242j72733m6352O9712J04775O3242R453
$$ y = [-542075, -593339, -616947, -588234, -509405, -427400, -411481, -455270, -500967, -499959, -403710, -209177, 38083, 295271, 531031, 705408, 735944, 583829, 340859, 190124, 234484, 417070, 594583, 676584, 665389, 651016, 669241, 691872, 723735, 724372, 595423, 323545, 37946, -142496, -215255, -232458, -219250, -244382, -365793, -583870, -792298, -861178, -784626, -668981, -569843, -429239, -253810, -122514, -9645, 170241, 405185, 569779, 601911, 545846, 475652, 415988, 364788, 316527, 248374, 146231, 31411, -21041, 40292, 167256, 277833, 298940, 219327, 194895, 359225, 655263, 926950, 1090459, 1110782, 948292, 695373, 495668, 342503, 145579, -90663, -263396, -309748, -240036, -135261, -72019, -62566]
10327f2566j9695k4417j2243N1536J64480K20131J67178P2523k3027p0601p4352
10316C88947j12593j11164k9971O3449J29149J22063L1074p4903r5395n9278j6268
10305B35110J7448L5238O1261J00040J40190J33337m198j92751k68513k37906
10295A9256j19609M6280J11314K0049o2285j1992N6458Q5019J22298J33826P0372
10284D70986j125P279P2024J41810J65731J02612q115r2594j67227j98864j34704
10273C57813j950J13506J36289P5963o747o7325j35468j66195r0705j0433J5908
10262B20656O3020Q4469J5984p7345j31852j22763q7071m3826N482K9030M5207
10251I91M4559Q093k040L4726L9299M7157J56109J98624P6383o1533j24580j07106
$$ y = [-62566, -82261, -106678, -118921, -67385, 97095, 317226, 484404, 556927, 533900, 463299, 388947, 276354, 165190, 135219, 198668, 327817, 449880, 480954, 406051, 310656, 251378, 235110, 252558, 287796, 349057, 449097, 589287, 722624, 718426, 525675, 257162, 19256, -100353, -54073, 57241, 77290, 15005, 3013, 59471, 144490, 266788, 400614, 470986, 469861, 477140, 549164, 690974, 856705, 959317, 951202, 858608, 691381, 492517, 357813, 355863, 469369, 605658, 681621, 674874, 607549, 472081, 305886, 215181, 204748, 220656, 283676, 368145, 384129, 306784, 174932, 52169, -34902, -78728, -73246, -44216, 991, 45550, 53643, 51603, 86329, 125628, 172785, 328894, 527518, 603901, 542368, 417788, 310682]
10239C10682l7832K4759L2710M3432P9455P3431N3225M0276j3399l8473M1607
10228F09873J13876J13973O5748j0491o1159o2126l2984M1496J18577J39015J10282
10217A146080R6394J09469O9257j1829o1227j8726R8860K33134L19559L57910
10207B338881M51987N57968N81687M85585L38296L13058M01853M29799K79322
10198F178436N9173r4717j78433k34541l63463n65284o89403o58041m98603k76103
10188B679021q2581J4292J1245m7902q1152o2927j4647R0608K06667K28070J30526
10177C071220L4571O270K9698O1652M4477l4276j07998j39675j15601o7031n2259
10166B731048o3187q4223j12161j15459j00433r8346q0092n0372m8715p7697j03808
$$ y = [310682, 272850, 297609, 330319, 373751, 453206, 526637, 579862, 620138, 606739, 568266, 609873, 723749, 837722, 903470, 892979, 831820, 769694, 736710, 778206, 896783, 1035798, 1146080, 1242474, 1351943, 1421200, 1409371, 1348144, 1329418, 1428278, 1661412, 1980971, 2338881, 2790868, 3348836, 3930523, 4416108, 4754404, 5067462, 5469315, 5899114, 6178436, 6237609, 6142892, 5964459, 5729918, 5366455, 4801171, 4111768, 3453727, 2955124, 2679021, 2596440, 2610732, 2621977, 2574075, 2492923, 2429996, 2415349, 2505957, 2712624, 2940694, 3071220, 3105791, 3112061, 3141759, 3203411, 3247888, 3213612, 3105614, 2965939, 2850338, 2783307, 2731048, 2667861, 2583638, 2471477, 2356018, 2255585, 2157239, 2077147, 2026775, 1978060, 1900363, 1796555]
10155A796555o9591J6975M7465j2384r0115j10647p1406R421Q1963Q5592K5949
10144A709777q1369j76803j75106r3289L214J09895J87376J88785J63027J80294
10134B015801J97124J84947K56392M64294P06573Q06494P31654O44471O67883
10125F675633P75553Q42625O52953J44957m29166q41558j058618j066431q64034
10116D831914n66971l71302l66511m13634l86415l40158l30927k87044k15807
10107A553145j89077j90711j43171j448J12945K5238j96917l29286k83023j42496
10097B15199m6984N069P2370R7984L5736o007N526J0117n458J4324J35860K93776
10085H27512L26800K11108N8205l5368m2418k9789p4322j71976k36634j99661
$$ y = [1796555, 1726964, 1743939, 1791404, 1779020, 1688905, 1578258, 1506852, 1516273, 1598236, 1683828, 1709777, 1628408, 1451605, 1276499, 1183210, 1186424, 1296319, 1483695, 1672480, 1835507, 2015801, 2212925, 2397872, 2654264, 3118558, 3825131, 4631625, 5363279, 6007750, 6675633, 7451186, 8293811, 8946764, 9091721, 8662555, 7820997, 6762379, 5695948, 4831914, 4264943, 3893641, 3527130, 3113496, 2727081, 2386923, 2055996, 1768952, 1553145, 1364068, 1173357, 1030186, 1028738, 1141683, 1166921, 970004, 640718, 357695, 215199, 168215, 173284, 245654, 343638, 379374, 373367, 378893, 389010, 383552, 397876, 533736, 827512, 1154312, 1365420, 1423625, 1388257, 1345839, 1316050, 1241728, 1069752, 833118, 633457]
10075F33457q0389J3845J7745k5595o6468p7409q0960j00102p9345k8767J8141
10064A44153L8165M7597L8519r743n4411q6545j17032j19126n0316L1643L4160
10053a02936k6241k26J19312K05358J76623J15286J29355J52560R3238k7595j30749
10042G03985j74608j59475r6536j1965L1269N6744R9698J05656P3598L3056N0269
10031G11691J32142J70606J39674Q6033K5050m1400p9457p7512m5097J5145N1816
10020A088691P9227J39614K29158L48093N06812O46481O80645N92777M58615L41255
10010E111368K05718K2223j85272l44605l98082l74575l27858l03993l46428l83559
10000B674937l57564l47612l61288l25820k85695k58788j47341M0226J37800R9179
$$ y = [633457, 553068, 566913, 584658, 559063, 492595, 415186, 334226, 234124, 154779, 126012, 144153, 182318, 229915, 268434, 258691, 204280, 117735, 703, -118423, -168739, -137096, -102936, -129177, -129403, -10091, 195267, 371890, 487176, 616531, 769091, 862329, 834734, 703985, 529377, 369902, 273366, 261401, 292670, 349414, 449112, 554768, 628366, 661422, 711691, 843833, 1014439, 1154113, 1240146, 1265196, 1223796, 1144339, 1066827, 1021730, 1036875, 1088691, 1167918, 1307532, 1536690, 1884783, 2391595, 3038076, 3718721, 4311498, 4770113, 5111368, 5317086, 5339309, 5154037, 4809432, 4411350, 4036775, 3708917, 3404924, 3058496, 2674937, 2317373, 1969761, 1608473, 1282653, 996958, 738170, 590829, 631055, 768855, 868034]
9990H68034L3396k1683n1303l5663l0425o1332q8363j13163j65885k02775j55099
9979b4261o9637p1855j38663j49008q1761J3715J10134J18496O0286M9674J09544
9968g3336J79939J76973J21476K3746q8081j01770l4153P5796J48986J05706M4865
9957E80147o791p3089r8573l6382R4092K15069K89089K75582J93632J72311J57283
9946A762370L0993j14013j42368j26959j34673j02361m7228k4376l274L4442P0869
9935A203422N9489k6407p3403n5745n5688m4912J2334J9405r424P9410K94150
9924A402631M55521N23285N56081N81207N92574N65894N19451M84043M09478K65492
9914F355657J24113j4503j46293k29398k97668m05796m51122l28668j14066O1586
$$ y = [868034, 901430, 879747, 828444, 792781, 762356, 701024, 612661, 499498, 333613, 130838, -24261, -93898, -165753, -304416, -453424, -535185, -521470, -411336, -292840, -232554, -182880, -73336, 106603, 283576, 405052, 428798, 340717, 238947, 204794, 280590, 429576, 535282, 580147, 573356, 500267, 401694, 365312, 459404, 674473, 963562, 1239144, 1432776, 1605087, 1762370, 1793363, 1679350, 1536982, 1410023, 1275350, 1172989, 1125761, 1101385, 1098111, 1132553, 1203422, 1262911, 1236504, 1163101, 1107356, 1051668, 1006756, 1019090, 1038495, 1029071, 1108481, 1402631, 1858152, 2381437, 2937518, 3518725, 4111299, 4677193, 5196644, 5680687, 6090165, 6355657, 6479770, 6465267, 6318974, 6089576, 5791908, 5386112, 4934990, 4606322, 4492256, 4553842]
9904D553842J06194K2303o1436j00753j52234j82471j50993q1837N5157J98076
9894D205848K11517R7114j6575o5965r5597j62190k12385j93522j63941j20737
9884C483567k9320P5982J46468K12933K17729J19234O4990J12808J83322J91899
9874D779612J33739Q3143O3879P0264Q2312J02954J80644K86215L67358L49325
9864F499445K37024J63852K00241K76176L61098M43343N05797O07592O91374O05847
9854A0591789L39539m0327m37719p19627p78505o34416m66370m01083l62582k93638
9844F797061j72483M8119K89347M49727N45880O54458Q11229R48220R71149Q51268
9834A2193975N96333K41608j94030o89666j080486j206083j167221j098324r92234
$$ y = [4553842, 4660036, 4682339, 4620903, 4520150, 4367916, 4185445, 4034452, 3952615, 4007772, 4205848, 4417365, 4514479, 4497904, 4431939, 4336342, 4174152, 3961767, 3768245, 3604304, 3483567, 3454247, 3530229, 3676697, 3889630, 4107359, 4226593, 4291583, 4404391, 4587713, 4779612, 4913351, 4996494, 5060373, 5130637, 5212949, 5315903, 5496547, 5782762, 6150120, 6499445, 6736469, 6900321, 7100562, 7376738, 7737836, 8181179, 8686976, 9294568, 9985942, 10591789, 10931328, 10891001, 10453282, 9733655, 8955150, 8320734, 7854364, 7453281, 7090699, 6797061, 6624578, 6672697, 6962044, 7411771, 7957651, 8612109, 9423338, 10371558, 11342707, 12193975, 12790308, 13031916, 12837886, 12148220, 11067734, 9861651, 8694430, 7596106, 6603872]
9825F603872q53399p36926o31036n02115m18845l76697l22290k60087k41687k59443
9815B001347k79806k64362k00562j65370j65992j15039l312N7481L56p2890p7510
9804G14341k0990L0514J9629m8506j21717j05842m0524k3328p1908j04902l2553
9793A94214O8939P8972O1743O1684N6642N6551P9740J05414J19090J31331J37052
9782A151372J19049L5350q1118j34968j29533p9904J3698P2227N1865n076l7252
9771I75710l8181k2055k3021k1040M6424J19693J02822J194q0050j09303j04902
9760H47291j19466j64754j53006o9724J6300Q9012J49500J67422J55344J03179
9750A021098K4632j0840J9152P5561J24128J37038J51489J96678J84458J07851
$$ y = [6603872, 5750473, 5013547, 4382511, 3880396, 3461551, 3084854, 2762564, 2502477, 2260790, 2001347, 1721541, 1457179, 1256617, 1091247, 925255, 810216, 806904, 864385, 864741, 791851, 714341, 693351, 723865, 743494, 694988, 573271, 467429, 426905, 403577, 331669, 226767, 194214, 263153, 342125, 403868, 465552, 522194, 578745, 658485, 763899, 882989, 1014320, 1151372, 1270421, 1305771, 1224653, 1089685, 960152, 880248, 893946, 966173, 1018038, 1012962, 975710, 937529, 915474, 892453, 871413, 917837, 1037530, 1140352, 1141546, 1061496, 952193, 847291, 727825, 563071, 410065, 340341, 356641, 445653, 595153, 762575, 917919, 1021098, 1045730, 1034890, 1054042, 1129603, 1253731, 1390769, 1542258, 1738936, 1923394, 2031245]
9740B031245Q1507J01245R3990P9909R4149J20019J46113J95693K97407M20639
9730C661916M77795M61385M09039L62896L38026K70082J25774m3073k33580m06743
$$ y = [2031245, 2112752, 2213997, 2307987, 2387896, 2482045, 2602064, 2748177, 2943870, 3241277, 3661916, 4139711, 4601096, 5010135, 5373031, 5711057, 5981139, 6106913, 6063840, 5830260, 5423517]
$$ [...]
##END NTUPLES=NMR SPECTRUM
##END=
