##TITLE=C13_PhDiP0609
 CDCl3, 1600 sc

 8.9.2023
##JCAMPDX= 6.0         $$ Bruker NMR JCAMP-DX V2.0
##DATA TYPE= NMR SPECTRUM
##DATA CLASS= NTUPLES
##ORIGIN= UXNMR, Bruker Analytische Messtechnik GmbH
##OWNER= root
$$ XWIN-NMR		Version 3.5
$$ Fri Sep  8 16:01:29 2023 Russian Standard Time (UT+4h)  she@DPX200
##.OBSERVE FREQUENCY= 50.327896
##.OBSERVE NUCLEUS= ^13C
##.ACQUISITION MODE= SIMULTANEOUS
##.ACQUISITION SCHEME= undefined
##.AVERAGES= 1601
##.DIGITISER RES= 17
##SPECTROMETER/DATA SYSTEM= spect
##.PULSE SEQUENCE= zgpg30
##.SOLVENT NAME= DMSO
##.SHIFT REFERENCE= (INTERNAL, DMSO, 0, 222.624)
##AUDIT TRAIL= $$ (NUMBER, WHEN, WHO, WHERE, WHAT)
$$ ##TITLE= Audit trail, XWIN-NMR		Version 3.5
$$ ##JCAMPDX= 5.01
$$ ##ORIGIN= Bruker BioSpin GmbH
$$ ##OWNER= she
$$ F:/spectra/data/she/nmr/c13/1/pdata/1/auditp.txt
$$ ##AUDIT TRAIL=  $$ (NUMBER, WHEN, WHO, WHERE, WHAT)
(   1,<2023-09-08 15:59:58.42 +0400>,<she>,<DPX200>,
      <created by zg, POWCHK disabled, PULCHK disabled
       terminated by command 'halt'
       configuration hash MD5:
       00 E9 B6 7A A2 85 ED C7 34 08 36 98 17 FE 4E 26
       data hash MD5: 32K
       C1 95 1F 41 E6 7D 0F 30 FD FB E6 00 D9 E9 FD 1C>)
(   2,<2023-09-08 16:00:09.23 +0400>,<she>,<DPX200>,
      <Start of raw data processing
       efp BC_mod = 2 LB = 2 FT_mod = 6 PKNL = 1 PHC0 = -374.6252 PHC1 = 35.13753 SI = 32K 
       data hash MD5: 32K
       31 73 47 5F 12 25 4B 1D CA C0 B3 6B 38 E6 22 E2>)
(   3,<2023-09-08 16:00:12.37 +0400>,<she>,<DPX200>,
      <abs ABSG = 5 
       data hash MD5: 32K
       BB DE 89 C8 16 F1 D6 A9 42 4E 95 D5 28 16 F6 36>)
(   4,<2023-09-08 16:00:31.78 +0400>,<she>,<DPX200>,
      <pk PHC0 = 5.822293 PHC1 = -10 
       data hash MD5: 32K
       FA C8 33 5E 35 41 9D DF 56 BE 06 ED 44 37 79 BB>)
(   5,<2023-09-08 16:00:35.17 +0400>,<she>,<DPX200>,
      <abs ABSG = 5 
       data hash MD5: 32K
       DE D7 3D DC B3 29 F7 0E D3 69 28 44 F8 8A 94 4A>)
$$ ##END=
$$ 
$$ hash MD5
$$ 99 EC 05 A7 25 BE B1 58 1C 27 5B A4 3D BC 7A D1
##$RELAX= 
##$RELAX= 
##$RELAX= 
##$RELAX= 
##$RELAX= 
##$RELAX= 
##$RELAX= 
##$RELAX= 
$$ Bruker specific parameters
$$ --------------------------
##$DU= <F:/spectra>
##$EXPNO= 1
##$NAME= <c13>
##$PROCNO= 1
##$TYPE= <nmr>
##$USER= <she>
##$AMP= (0..31)
100 100 100 100 100 100 100 100 100 100 100 100 100 100 100 100 100 100 
100 100 100 100 100 100 100 100 100 100 100 100 100 100 
##$AQSEQ= 0
##$AQ_mod= 1
##$AUNM= <au_zg>
##$AUTOPOS= <>
##$BF1= 50.322709
##$BF2= 200.13
##$BF3= 50.322709
##$BF4= 500.13
##$BF5= 500.13
##$BF6= 500.13
##$BF7= 500.13
##$BF8= 500.13
##$BYTORDA= 1
##$CFDGTYP= 0
##$CFRGTYP= 5
##$CHEMSTR= <none>
##$CNST= (0..31)
1 1 145 1 1 1 1 1 1 1 1 1 1 1 1 1 1 1 1 1 1 1 1 1 1 1 1 1 1 1 1 1 
##$CPDPRG= <waltz16>
##$CPDPRG1= <>
##$CPDPRG2= <waltz16>
##$CPDPRG3= <>
##$CPDPRG4= <mlev>
##$CPDPRG5= <mlev>
##$CPDPRG6= <mlev>
##$CPDPRG7= <mlev>
##$CPDPRG8= <mlev>
##$CPDPRGB= <>
##$CPDPRGT= <>
##$D= (0..31)
$$ [...]
##$SUBNAM4= <"">
##$SUBNAM5= <"">
##$SUBNAM6= <"">
##$SUBNAM7= <"">
##$SUBNAM8= <"">
##$SUBNAM9= <"">
##$SW= 239.972175391363
##$SWIBOX= (0..15)
0 1 3 0 0 0 0 0 0 0 0 0 0 0 0 0 
##$SW_h= 12077.2946859903
##$TD= 32768
##$TD0= 1
##$TE= 0
##$TE2= 300
##$TE3= 300
##$TEG= 300
##$TL= (0..7)
120 120 120 120 120 120 120 120 
##$TP= (0..7)
150 150 150 150 150 150 150 150 
##$TP07= 0
##$TPNAME0= <>
##$TPNAME1= <>
##$TPNAME2= <>
##$TPNAME3= <>
##$TPNAME4= <>
##$TPNAME5= <>
##$TPNAME6= <>
##$TPNAME7= <>
##$TPOAL= (0..7)
0.5 0.5 0.5 0.5 0.5 0.5 0.5 0.5 
##$TPOFFS= (0..7)
0 0 0 0 0 0 0 0 
##$TUNHIN= 0
##$TUNHOUT= 0
##$TUNXOUT= 0
##$USERA1= <user>
##$USERA2= <user>
##$USERA3= <user>
##$USERA4= <user>
##$USERA5= <user>
##$V9= 5
##$VALIST= <valist>
##$VCLIST= <CCCCCCCCCCCCCCC>
##$VD= 0
##$VDLIST= <DDDDDDDDDDDDDDD>
##$VPLIST= <PPPPPPPPPPPPPPP>
##$VTLIST= <TTTTTTTTTTTTTTT>
##$WBST= 1024
##$WBSW= 4
##$XGAIN= (0..3)
0 0 0 0 
##$XL= 0
##$YL= 0
##$YMAX_a= 9041482
##$YMIN_a= -7019507
##$ZGOPTNS= <>
##$ZL1= 120
##$ZL2= 120
##$ZL3= 120
##$ZL4= 120
##$ABSF1= 222.624
##$ABSF2= -17.3728
##$ABSG= 5
##$ABSL= 3
##$ALPHA= 0
##$AQORDER= 0
##$ASSFAC= 0
##$ASSFACI= 0
##$ASSFACX= 0
##$ASSWID= 0
##$AUNMP= <proc_1d>
##$AZFE= 0.1
##$AZFW= 0.5
##$BCFW= 0
##$BC_mod= 2
##$BYTORDP= 0
##$COROFFS= 0
##$CY= -3
##$DATMOD= 1
##$DC= 0
##$DFILT= <>
##$DTYPP= 0
##$F1P= 0
##$F2P= 0
##$FCOR= 0.5
##$FTSIZE= 32768
##$FT_mod= 6
##$GAMMA= 0
##$GB= 0
##$INTBC= 1
##$INTSCL= 4.134877e-10
##$ISEN= 128
##$LB= 2
##$LEV0= 0
##$LPBIN= 0
##$MAXI= 10000
##$MC2= 0
##$MEAN= 0
##$ME_mod= 0
##$MI= 0.1934396
##$NCOEF= 0
##$NC_proc= -1
##$NLEV= 6
##$NOISF1= 120.0001
##$NOISF2= 80.00006
##$NSP= 0
##$NTH_PI= 0
##$NZP= 0
##$OFFSET= 222.624
##$PC= 1.4
##$PHC0= -368.8029
##$PHC1= 25.13753
##$PH_mod= 1
##$PKNL= yes
##$PPARMOD= 0
##$PSCAL= 0
##$PSIGN= 0
##$REVERSE= no
##$SF= 50.3227315983092
##$SI= 32768
##$SIGF1= 140
##$SIGF2= 120
##$SINO= 11.81781
##$SIOLD= 32768
##$SREGLST= <13C.CDCl3>
##$SSB= 0
##$STSI= 32768
##$STSR= 0
##$SW_p= 12077.2946859903
##$SYMM= 0
##$S_DEV= 0
##$TDeff= 32768
##$TDoff= 0
##$TI= <>
##$TILT= no
##$TM1= 0
##$TM2= 0
##$TOPLEV= 0
##$USERP1= <user>
##$USERP2= <user>
##$USERP3= <user>
##$USERP4= <user>
##$USERP5= <user>
##$WDW= 1
##$XDIM= 32768
##$YMAX_p= 357799080
##$YMIN_p= -3783027
$$ End of Bruker specific parameters
$$ ---------------------------------
##NTUPLES= NMR SPECTRUM
##VAR_NAME=  FREQUENCY,     SPECTRUM/REAL,   SPECTRUM/IMAG
##SYMBOL=    X,             R,               I
##VAR_TYPE=  INDEPENDENT,   DEPENDENT,       DEPENDENT
##VAR_FORM=  AFFN,          ASDF,            ASDF
##VAR_DIM=   32768,         32768,           32768
##UNITS=     HZ,            ARBITRARY UNITS, ARBITRARY UNITS
##FACTOR=    0.368581032318806, 1,           1
##FIRST=     11203.0474430531, 0,            0
##LAST=      -874.247242937185, 0,           0
##MIN=       -874.247242937185, -3783027,    0
##MAX=       11203.0474430531, 357799080,    0
$$ Real data points
##PAGE= N=1
##DATA TABLE= (X++(R..R)), XYDATA
$$ [...]
$$ plain form
22816 111518 21861 -211574 -309290 -101196 184235 383839 512313 609845 747214 959142
22806 959142 1077043 924118 513845 -32468 -525505 -757215 -626199 -202266 318324 770358
22796 770358 1046854 1165738 1188938 1131735 1131420 1321164 1671366 1968177 2049350 1853170 1429415
22785 1429415 860194 278193 -163118 -411323 -474495 -368668 -202493 -223978 -568405 -1082044
22775 -1082044 -1498516 -1679045 -1577449 -1153043 -567642 -161664 -71197 -178790 -298102 -271703
22765 -271703 -127950 -118693 -469598 -1038095 -1509807 -1811417 -1972856 -1942389 -1671619 -1277704
22755 -1277704 -898437 -600225 -390064 -145057 196345 550845 773302 700803 347058 -78738
22745 -78738 -359828 -495994 -595172 -619902 -481085 -161105 335079 978866 1538500 1725885
$$ packed form
22816A11518q9657k33435r7716K08094K85431J99604J28474R7532J37369K11928
22806I59142J17901j52925m10273n46313m93037k31710J31016M23933N20590M52034
22796G70358K76496J18884K3200n7203l15J89744L50202K96811Q1173j96180m23755
22785A429415n69221n82001m41311k48205o3172J05827J66175k1485l44427n13639
22775a082044m16472j80529J01596M24406N85401M05978R0467j07593j19312K6399
22765b71703J43753R257l50905n68497m71712l01610j61439L0467K70770L93915
22755a277704L79267K98212K10161K45007L41402L54500K22457p2499l53745m25796
22745g8738k81090j36166r9178k4730J38817L19980M96184O43787N59634J87385
$$ plain form
22735 1725885 1442526 828428 215787 -118940 -138939 90214 443501 708863 740106 574922
22725 574922 309639 144114 281553 726929 1241471 1503626 1492899 1362737 1146580 842760
22715 842760 496779 53947 -499655 -996573 -1271175 -1290059 -971878 -399387 52282 131204
22705 131204 -60300 -190544 -72921 141253 256355 283884 246284 77748 -233304 -529374
22695 -529374 -644025 -619551 -570126 -509348 -513936 -662659 -950190 -1319520 -1724813 -2098455
22685 -2098455 -2313410 -2240294 -1878861 -1396453 -1055143 -1088688 -1430326 -1905084 -2329807 -2484128
22675 -2484128 -2277910 -1837542 -1447548 -1215976 -1162756 -1243662 -1296178 -1076886 -550392 13924
22665 13924 350828 414034 364702 390630 541919 850165 1293488 1713249 1990506 2046710
$$ packed form
22735A725885k83359o14098o12641l34727j9999K29153L53287K65362L1243j65184
22725E74922k65283j65525J37439M45376N14542K62155j0727j30162k16157l03820
22715H42760l45981m42832n53602m96918k74602j8884L18181N72491M51669P8922
22705A31204j91504j30244J17623K14174J15102K7529l7600j68536l11052k96070
22695e29374j14651K4474M9425O0778m588j48723k87531l69330m05293l73642
22685b098455k14955P3116L61433M82408L41310l3545l41638m74758m24723j54321
22675b484128K06218M40368L89994K31572N3220q0906n2516K19292N26494N64316
22665A3924L36904O3206m9332K5928J51289L08246M43323M19761K77257N6204
$$ plain form
22655 2046710 1863349 1487162 1052035 743924 642453 648103 663086 676863 769592 1059189
22645 1059189 1474119 1792654 1793095 1375026 737334 212755 -80225 -201009 -145480 105613
22635 105613 468042 863421 1193455 1272741 1119940 955101 839699 669046 287553 -251689
22625 -251689 -769209 -1190476 -1468214 -1558201 -1552836 -1609649 -1686367 -1708478 -1771249 -1892309 -1907902
22614 -1907902 -1749298 -1480313 -1193566 -862112 -497860 -302228 -422099 -838452 -1280752
22605 -1280752 -1361642 -1037327 -515916 -19731 324869 554355 691714 756746 814038 887036
22595 887036 985564 1126351 1209073 1137237 913787 520364 44787 -329562 -437044 -296248
22585 -296248 -75553 143501 313248 388529 481093 659745 789940 720848 495012 158106
$$ packed form
22655B046710j83361l76187m35127l08111j01471N650J4983J3777R2729K89597
22645A059189M14930L18535M41m18069o37692n24579k92980j20784N5529K51093
22635A05613L62429L95379L30034P9286j52801j64839j15402j70653l81493n39242
22625b51689n17520m21267k77738q9987N365n6813p6718k2111o2771j21060j5593
22614a907902J58604K68985K86747L31454L64252J95632j19871m16353m42300
22605a280752q0890L24315N21411M96185L44600K29486J37359O5032N7292P2998
22595H87036R8528J40787Q2722p1836k23450l93423m75577l74349j07482J40796
22585b96248K20695K19054J69747P5281R2564J78652J30195o9092k25836l36906
$$ plain form
22575 158106 -287319 -739860 -1001474 -987280 -801977 -564196 -300422 -70861 -7394 -175012
22565 -175012 -426101 -556921 -429376 -82003 354351 786083 1160273 1417073 1473895 1380015
22555 1380015 1190838 948109 739738 531096 168148 -310125 -609177 -609461 -435765 -125483
22545 -125483 184081 313537 296196 235359 219386 313091 430962 422900 282074 69517 -187937
22534 -187937 -375388 -366078 -244306 -109205 105676 474681 866950 1069429 1020869 865081
22524 865081 729772 586247 490904 585377 849714 1068168 1126996 1090274 1001229 885951
22514 885951 790016 695725 541909 371333 280931 269104 320451 406566 356690 8707 -484382
22503 -484382 -811732 -760337 -334329 200045 628407 886381 976546 892852 569046 190245
$$ packed form
22575A58106m45425m52541k61614J4194J85303K37781K63774K29561O3467j67618
22565a75012k51089j30820J27545L47373M36354M31732L74190K56800N6822r3880
22555A380015j89177k42729k08371k08642l62948m78273k99052k84J73696L10282
22545a25483L09564J29456j7341o0837j5973R3705J17871q062j40826k12557k57454
22534a87937j87451R310J21772J35101K14881L69005L92269K02479m8560j55788
22524H65081j35309j43525r5343R4473K64337K18454N8828l6722q9045j15278
22514H85951r5935r4291j53816j70576r0402j1827N1347Q6115m9876l47983m93089
22503d84382l27350N1395M26008N34374M28362K57974R0165q3694l23806l78801
$$ plain form
22493 190245 22669 32008 -105327 -510609 -970482 -1296040 -1515549 -1667034 -1578651 -1222472
22483 -1222472 -823328 -550536 -457302 -480859 -463161 -246479 166274 630969 949094 1049662
22473 1049662 1062775 1044712 883222 611628 469190 474927 427131 167305 -327971 -850825
22463 -850825 -1137324 -1107792 -869371 -599604 -463165 -491638 -577219 -682546 -779614 -841343
22453 -841343 -861756 -731874 -355090 162600 627519 961903 1141723 1141375 908546 384273
22443 384273 -315971 -928035 -1294649 -1421574 -1418842 -1362446 -1257958 -978164 -408277 276646
22433 276646 701827 717195 426405 33199 -165736 -98519 45861 120337 -33505 -425947
22423 -425947 -773770 -800649 -506488 -70238 353009 632981 666398 514838 324539 95606
$$ packed form
22493A90245j67576R339j37335m05282m59873l25558k19509j51485Q8383L56179
22483a222472L99144K72792R3234k3557J7698K16682M12753M64695L18125J00568
22473A049662J3113j8063j61490k71594j42438N737m7796k59826m95276n22854
22463h50825k86499K9532K38421K69767J36439k8473q5581j05327r7068o1729
22453h41343k0413J29882L76784N17690M64919L34384J79820l48k32829n24273
22443C84273p00244o12064l66614j26925K732N6396J04488K79794N69887O84923
22433B76646M25181J5368k90790l93206j98935O7217J44380P4476j53842l92442
22423d25947l47823k6879K94161M36250M23247K79972L3417j51560j90299k28933
$$ plain form
22413 95606 -114144 -216846 -391529 -798718 -1301307 -1699811 -1885663 -1872724 -1668874 -1216185
22403 -1216185 -545053 154068 671939 935787 1005673 954193 822444 686272 578984 484175
22393 484175 516035 763891 1105453 1369425 1499166 1529280 1461140 1278984 1121806 1156538
22383 1156538 1375967 1609835 1746136 1792412 1772012 1698818 1530810 1233983 892121 591042
22373 591042 364893 241476 129022 -9503 -92976 -121030 -187084 -342467 -572072 -735326
22363 -735326 -804044 -1001096 -1365926 -1639287 -1613728 -1321530 -907127 -510929 -316490 -395202
22353 -395202 -618510 -833307 -994116 -1086102 -1037797 -905874 -773876 -594044 -309730 -33357
22343 -33357 -25776 -375838 -971588 -1581392 -1922751 -2001949 -1986670 -2042829 -2226577 -2449692 -2606062
$$ packed form
22413I5606k09750j02702j74683m07189n02589l98504j85852J2939K03850M52689
22403a216185O71132O99121N17871K63848O9886n1480j31749j36172j07288r4809
22393D84175L1860K47856L41562K63972J29741L0114o8140j82156j57178L4732
22383A156538K19429K33868J36301M6276k0400p3194j68008k96827l41862l01079
22373E91042k26149j23417j12454j38525q3473k8054o6054j55383k29605j63254
22363g35326o8718j97052l64830k73361K5559K92198M14403L96198J94439p8712
22353c95202k23308k14797j60809r1986M8305J31923J31998J79832K84314K76373
22343c3357P581l50062n95750o09804l41359p9198J5279n6159j83748k23115j56370
$$ plain form
22332 -2606062 -2639716 -2518530 -2213944 -1845302 -1558493 -1314909 -957768 -574757 -428915 -534821
22322 -534821 -759456 -982773 -1047887 -912194 -644465 -355433 -123856 32599 38863 -136365
22312 -136365 -467338 -840210 -999570 -801602 -454485 -253462 -303499 -496018 -725423 -966423
22302 -966423 -1126131 -1146657 -1115219 -1013809 -785991 -534235 -363796 -259440 -198510 -207490
22292 -207490 -331547 -524868 -642529 -678716 -894063 -1319089 -1742924 -2075085 -2113225 -1688973
22282 -1688973 -1068668 -624441 -537037 -765138 -1011605 -952361 -643484 -401673 -377191 -415443
22272 -415443 -328265 -171840 -108937 -138890 -118686 5996 159606 316599 494580 527982
22262 527982 249139 -199389 -567317 -841650 -1085105 -1201546 -1020103 -656283 -382968 -387575
$$ packed form
22332b606062l3654J21186L04586L68642K86809K43584L57141L83011J45842j05906
22322e34821k24635k23317o5114J35693K67729K89032K31577J56455O264j75228
22312a36365l30973l72872j59360J97968L47117K01023n0037j92519k29405k41000
22302i66423j59708k0526L1438J01410K27818K51756J70439J04356O0930q980
22292b07490j24057j93321j17661l6187k15347m25026m23835l32161l8140M24252
22282a688973O20305M44227Q7404k28101k46467N9244L08877K41811K4482l8252
22272d15443Q7178J56425O2903k9953K0204J24682J53610J56993J77981L3402
22262E27982k78843m48528l67928k74333k43455j16441J81443L63820K73315m607
$$ plain form
22252 -387575 -582772 -715492 -760389 -780776 -742826 -571835 -258760 104744 470159 762209
22242 762209 967706 1094215 1149163 1180387 1206819 1246266 1328365 1389853 1310739 1110990 924785
22231 924785 739378 468836 166594 -112238 -350886 -465402 -410092 -254314 -108702 -39438
22221 -39438 -24458 -18750 75872 319170 516663 448146 165785 -237191 -737249 -1168294 -1309551
22210 -1309551 -1161581 -987777 -995616 -1158880 -1391404 -1544431 -1495054 -1204810 -679052 13869
22200 13869 680657 1098091 1171018 892807 439865 52925 -197076 -233571 16232 352868
22190 352868 518769 492244 356687 184549 9453 5583 236364 482969 588068 571178
22180 571178 485489 452549 530200 549037 305535 -96041 -329905 -380746 -439602 -553564 -719360
$$ packed form
22252c87575j95197j32720m4897k0387L7950J70991L13075L63504L65415K92050
22242G62209K05497J26509N4948L1224K6432L9447Q2099O1488p9114j99749j86205
22231I24785j85407k70542l02242k78832k38648j14516N5310J55778J45612O9264
22221c9438J4980N708R4622K43298J97493o8517k82361m02976n00058m31045j41257
22210a309551J47970J73804p839j63264k32524j53027M9377K90244N25758O92921
22200A3869O66788M17434P2927k78211m52942l86940k50001l6495K49803L36636
22190C52868J65901k6525j35557j72138j75096l870K30781K46605J05099j6890
22180E71178q5689l2940P7651J8837k43502m01576k33864n0841n8856j13962j65796
$$ plain form
22169 -719360 -905419 -1028380 -1050929 -1077078 -1143277 -1106429 -951229 -726298 -334105 199641
22159 199641 663365 922880 1051083 1258544 1565005 1779480 1769403 1580251 1251450 875507
22149 875507 557832 276782 36856 -45251 53333 135524 49645 -121572 -290587 -441702
22139 -441702 -515005 -447990 -359805 -410980 -593528 -752422 -791039 -699647 -485108 -210385 -43578
22128 -43578 -100557 -282117 -469796 -644725 -806250 -932892 -983920 -874476 -644772 -501599
22118 -501599 -563008 -656720 -662042 -683289 -810663 -1037845 -1222553 -1228295 -1046029 -748196 -434097
22107 -434097 -185536 -73711 -44576 -98965 -361837 -770536 -1035682 -1019771 -903868 -803427
22097 -803427 -696627 -584982 -473983 -502222 -790635 -1165827 -1463917 -1649330 -1803349 -2005774
$$ packed form
22169g19360j86059j22961k2549k6149o6199L6848J55200K24931L92193N33746
22159A99641M63724K59515J28203K07461L06461K14475j0077j89152l28801l75943
22149H75507l17675k81050k39926q2107R8584Q2191q5879j71217j69015j51115
22139d41702p3303O7015Q8185n1175j82548j58894l8617R1392K14539K74723J66807
22128d3578n6979j81560j87679j74929j61525j26642n1028J09444K29704J43173
22118e01599o1409r3712n322k1247j27374k27182j84708n742J82266K97833L14099
22107d34097K48561J11825K9135n4389k62872m08699k65146J5911J15903J00441
22097h03427J06800J11645J10999k8239k88413l75192k98090j85413j54019k02425
$$ plain form
22087 -2005774 -2238492 -2317186 -2079341 -1680455 -1469405 -1535082 -1645707 -1638986 -1553829 -1390403
22077 -1390403 -1111567 -811585 -611072 -519446 -464759 -466015 -675582 -1098241 -1544122 -1894798
22067 -1894798 -2008668 -1815744 -1380306 -775296 -71991 557254 1083933 1444729 1564692
22058 1564692 1562239 1580357 1627668 1613846 1520489 1469568 1493778 1465548 1288199 893536 371052
22047 371052 -3547 25403 414398 842683 1167210 1420252 1570016 1538737 1398959 1318722
22037 1318722 1209295 792475 149080 -420479 -875634 -1224459 -1398847 -1295940 -969882
22028 -969882 -518769 -16936 265616 170141 -247740 -821410 -1355371 -1715376 -1863581 -1842017
22018 -1842017 -1674493 -1481262 -1407466 -1432870 -1510829 -1676203 -1900566 -2048411 -1940595 -1593792
$$ packed form
22087b005774k32718p8694K37845L98886K11050o5677j10625O721Q5157J63426
22077a390403K78836K99982K00513R1626N4687j256k09567m22659m45881l50676
22067a894798j13870J92924M35438O05010P03305O29245N26679L60796J19963
22058A564692k453J8118M7311j3822r3357n0921K4210k8230j77349l94663n22484
22047C71052l74599K8950L88995M28285L24527K53042J49764l1279j39778q0237
22037A318722j09427m16820o43395n69559m55155l48825j74388J02907L26058
22028i69882M51113N01833K82552r5475m17881n73670n33961l60005j48205K1564
22018a842017J67524J93231P3796k5404p7959j65374k24363j47845J07816L46803
$$ plain form
22008 -1593792 -1209868 -972659 -908627 -931431 -1010323 -1026710 -881985 -653212 -449942 -245287
21998 -245287 112965 683785 1319700 1809013 2151701 2427300 2636801 2807452 2828203 2649490
21988 2649490 2295405 1785162 1306440 920269 483873 -50978 -516012 -718160 -650670 -573337
21978 -573337 -586725 -488329 -187098 59145 36599 -103342 -140973 -130952 -307890 -713167
21968 -713167 -1164486 -1477143 -1531887 -1304038 -993089 -838136 -763069 -540936 -272358 -182323
21958 -182323 -265971 -407310 -586394 -806864 -1033766 -1245363 -1396796 -1453771 -1439259 -1381926
21948 -1381926 -1389381 -1493340 -1537564 -1423892 -1197479 -838919 -309861 171120 327347 152412
21938 152412 -66958 -185839 -335930 -576156 -796573 -946325 -1041571 -1107405 -1140571 -1030438
$$ packed form
22008a593792L83924K37209O4032k2804p8892j6387J44725K28773K03270K04655
21998b45287L58252N70820O35915M89313L42688K75599K09501J70651K0751j78713
21988B649490l54085n10243m78722l86171m36396n34851m65034k02148O7490P7333
21978e73337j3388R8396L01231K46243k2546j39941l7631J0021j76938m05277
21968g13167m51319l12657n4744K27849L10949J54953P5067K22133K68578R0035
21958a82323q3648j41339j79084k20470k26902k11597j51433n6975J4512N7333
21948a381926p455j03959m4224J13672K26413L58560N29058M80981J56227j74935
21938A52412k19370j18881j50091k40226k20417j49752r5246o5834l3166J10133
$$ plain form
21928 -1030438 -699662 -278557 -42003 -77677 -219177 -288847 -231235 -132936 -80505 -41846
21918 -41846 54122 174404 325585 568657 924201 1306624 1481974 1385995 1272961 1272819 1319322
21907 1319322 1307940 1220225 994261 579591 50686 -453037 -765769 -821511 -655584 -486673
21897 -486673 -536780 -722359 -829138 -767409 -543498 -186474 192160 417203 485588 488198
21887 488198 489264 496308 511440 597576 744070 900934 1013555 1001699 781241 397706 14577
21876 14577 -242703 -266768 -91000 178011 498968 752687 879487 982970 1142943 1276706
21866 1276706 1175869 859814 541512 320421 122521 -102287 -249511 -255974 -170857 -37226
21856 -37226 182927 461332 660284 697453 592513 501547 611208 913452 1190755 1331376
$$ packed form
21928a030438L30776M21105K36554l5674j41500o9670N7612R8299N2431L8659
21918d1846R5968J20282J51181K43072L55544L82423J75350r5979j13034j42M6503
21907A319322j1382q7715k25964m14670n28905n03723l12732n5742J65927J68911
21897d86673n0107j85579j06779O1729K23911L57024L78634K25043O8385K610
21887D88198J066P044J5132Q6136J46494J56864J12621j1856k20458l83535l83129
21876A4577k57280k4065J75768K69011L20957K53719J26800J03483J59973J33763
21866A276706j00837l16055l18302k21091j97900k24808j47224o463Q5117J33631
21856c7226K20153K78405J98952L7169j04940r0966J09661L02244K77303J40621
$$ plain form
21846 1331376 1403468 1334857 1024242 584684 193519 -142179 -468431 -679423 -728950 -721170
21836 -721170 -749322 -839211 -916545 -966941 -969413 -987162 -1094419 -1181365 -1152646 -1111570 -1233182
21825 -1233182 -1484286 -1663036 -1651530 -1591206 -1675385 -1851434 -1861603 -1598523 -1183961 -759771
21815 -759771 -475612 -365185 -313515 -221419 -18214 289295 547889 584920 386805 11406
21805 11406 -396687 -583713 -389901 39853 491816 843844 1002442 988480 897311 837152
21795 837152 791567 678794 497754 312250 126507 -80570 -276176 -380819 -370024 -381124
21785 -381124 -510775 -688349 -739529 -555924 -176983 227066 459928 492999 431769 328859
21775 328859 261480 265453 324740 355120 276435 157216 152275 376920 735631 1005850 1154631
$$ packed form
21846A331376P2092o8611l10615m39558l91165l35698l26252k10992m9527P780
21836g21170k8152q9889p7334n0396k472j7749j07257q6946K8719M1076j21612
21825a233182k51104j78750J1506O0324q4179j76049j0169K63080M14562M24190
21815g59771K84159J10427N1670R2096K03205L07509K58594L7031j98115l75399
21805A1406m08093j87026J93812M29754M51963L52028J58598j3962r1169o0159
21795H37152m5585j12773j81040j85504j85743k07077j95606j04643J0795j1100
21785c81124j29651j77574n1180J83605L78941M04049K32862L3071o1230j02910
21775C28859o7379L973N9287L0380p8685j19219m941K24645L58711K70219J48781
$$ plain form
21764 1154631 1213120 1126400 900859 742118 664780 412903 -111913 -662245 -942055 -945319
21754 -945319 -876203 -847771 -765454 -550009 -264498 -16232 190041 328821 276923 7594
21744 7594 -355020 -679024 -826053 -614073 -140875 252990 443899 472761 415078 489367
21734 489367 765226 1037597 1255083 1523003 1824100 2123353 2285865 2212988 2013482 1852207
21724 1852207 1750892 1511011 1095341 698321 393862 76292 -214081 -357866 -341021 -170330
21714 -170330 54179 143151 -52767 -464795 -875978 -1185144 -1364632 -1361614 -1208373 -992153
21704 -992153 -774288 -652103 -606860 -491363 -273979 -176261 -331869 -468743 -262406 115457
21694 115457 359390 556566 878919 1211274 1268190 1005535 637657 255013 -82545 -235387
$$ packed form
21764A154631N8489q6720k25541j58741p7338k51877n24816n50332k79810l264
21754i45319O9116K8432Q2317K15445K85511K48266K06273J38780n1898k69329
21744G594l62614l24004j47029K11980M73198L93865J90909K8862n7683P4289
21734D89367K75859K72371K17486K67920L01097K99253J62512p2877j99506j61275
21724A852207j01315k39881m15670l97020l04459l17570k90373j43785J6845J70691
21714a70330K24509Q8972j95918m12028m11183l09166j79488L018J53241K16220
21704i92153K17865J22185M5243J15497K17384R7718j55608j36874K06337L77863
21694A15457K43933J97176L22353L32355N6916k62655l67878l82644l37558j52842
$$ plain form
21684 -235387 -191910 -163398 -400578 -933461 -1592805 -2144191 -2295748 -1952258 -1361561 -763083
21674 -763083 -236146 245749 583484 579207 265624 -99761 -261701 -132316 39706 49340
21664 49340 -28170 -167258 -456245 -874451 -1268366 -1407035 -1204340 -948406 -922749 -1076787
21654 -1076787 -1273600 -1401615 -1303256 -908506 -338289 153719 394173 384933 205422 -67669
21644 -67669 -320501 -521060 -643634 -677430 -706091 -773996 -842422 -924565 -1005946 -970141 -788008
21633 -788008 -605472 -596401 -740853 -915056 -1123917 -1350643 -1500791 -1399145 -1022561 -593441
21623 -593441 -281563 -116187 -12576 51706 40339 -31391 -39553 84996 181694 115303 93948
21612 93948 391672 937918 1377030 1520836 1340683 832441 192307 -205361 -132378 249733
$$ packed form
21684b35387M3477K8512k37180n32883o59344n51386j51557L43490N90697N98478
21674g63083N26937M81895L37735m277l13583l65385j61940J29385J72022R634
21664D9340p7510j39088k88987m18206l93915j38669K02695K55934K5657j54038
21654a076787j96813j28015R8359L94750N70217M92008K40454r240j79511k73091
21644f7669k52832k00559j22574l3796k8661o7905o8426q2143q1381L5805J82133
21633g88008J82536R071j44452j74203k08861k26726j50148J01646L76584M29120
21623e93441L11878J65376J03611O4282j1367p1730q162J24549R6698o6391k1355
21612I3948K97724N46246M39112J43806j80153n08242o40134l97668P2983L82111
$$ plain form
21602 249733 617719 804132 719831 451678 150245 -203593 -582943 -856921 -913396 -820280
21592 -820280 -790524 -988191 -1302738 -1513157 -1535250 -1391169 -1168450 -875241 -461680 -1257
21582 -1257 311126 360107 196557 -46834 -215896 -292466 -415589 -614634 -765043 -791958
21572 -791958 -711133 -547479 -367705 -202410 141 210131 436280 711992 1014106 1279472
21562 1279472 1347594 1156862 895437 648287 376578 189379 182111 186437 65824 -97461
21552 -97461 -131430 70507 382993 557299 522790 462790 488626 570048 710695 854223 800619
21541 800619 557141 232788 -137143 -433637 -574283 -533773 -331015 -35789 276519 437668
21531 437668 351539 109683 -169947 -449696 -692604 -811335 -679254 -235814 399041 941364
$$ packed form
21602B49733L67986J86413q4301k68153l01433l53838l79350k73978n6475R3116
21592h20280K9756j97667l14547k10419k2093J44081K22719K93209M13561M60423
21582a257L12383M8981j63550k43391j69062p6570j23123j99045j50409k6915
21572g91958Q0825J63654J79774J65295K02551K09990K26149K75712L02114K65366
21562A279472O8122j90732k61425k47150k71709j87199p268M326j20613j63285
21552i7461l3969K01937L12486J74306l4509o0000K5836Q1422J40647J43528n3604
21541H00619k43478l24353l69931k96494j40646M0510K02758K95226L12308J61149
21531D37668q6129k41856k79630k79749k42908j18731J32081M43440O34855N42323
$$ plain form
21521 941364 1156506 1115831 1012862 872538 629244 417296 374566 442617 511151 519336 515258
21510 515258 609893 836293 1140550 1436756 1538191 1391937 1119794 895986 924791 1031187
21500 1031187 910864 611615 355476 269246 290484 338905 377756 414946 489183 644208
21490 644208 927295 1278830 1585679 1889192 2285059 2589806 2567682 2295633 2024809 1781168
21480 1781168 1461054 961326 248985 -373636 -587102 -409727 -99685 191115 382840
21471 382840 373631 235220 113169 59551 -6686 -155227 -433453 -843718 -1286846 -1596111
21461 -1596111 -1761299 -1919747 -1968595 -1817692 -1604825 -1357101 -1048196 -777212 -586272 -453054
21451 -453054 -382437 -287193 -115868 -12856 -38386 -105970 -124361 -149438 -290017 -549677 -881169
$$ packed form
21521I41364K15142m0675j02969j40324k43294k11948m2730O8051O8534Q185m078
21510E15258R4635K26400L04257K96206J01435j46254k72143k23808K8805J06396
21500A031187j20323k99249k56139q6230K1238M8421L8851L7190P4237J55025
21490F44208K83087L51535L06849L03513L95867L04747k2124k72049k70824k43641
21480A781168l20114m99728p12341o22621k13466J77375L10042K90800J91725
21471C82840r209j38411j22051n3618o6237j48541k78226m10265m43128l09265
21461a596111j65188j58448m8848J50903K12867K47724L08905K70984J90940J33218
21451d53054P0617R5244J71325J03012k5530o7584j8391k5077j40579k59660l31492
$$ plain form
21440 -881169 -1090497 -1199095 -1365993 -1413498 -1110119 -536743 65244 462964 624759 635841
21430 635841 545153 422193 368948 401246 486603 590193 718871 882298 1017950 1029480
21420 1029480 1013537 1205113 1582129 1853510 1746155 1261458 692637 276827 -19080 -167287
21410 -167287 -82606 105253 231577 316375 403779 412714 208300 -166026 -488506 -607627
21400 -607627 -604146 -547773 -455700 -358000 -289795 -334064 -457512 -479683 -335658 -86781 149758
21389 149758 333700 550428 823569 1043052 1144414 1200704 1175940 1005857 763281 581831
21379 581831 499520 474202 397401 270997 261122 436407 715278 947477 1060677 1061668 882568
21368 882568 642896 657013 904086 1046479 943525 714306 399190 -34854 -524337 -874224
$$ packed form
21440h81169k09328j08598j66898m7505L03379N73376O01987L97720J61795J1082
21430F35841r0688j22960n3245L2298Q5357J03590J28678J63427J35652J1530
21420A029480j5943J91576L77016K71381j07355m84697n68821m15810k95907j48207
21410a67287Q4681J87859J26324Q4798Q7404Q935k04414l74326l22480j19121
21400f07627L481N6373R2073R7700O8205m4269j23448k2171J44025K48877K36539
21389A49758J83942K16728K73141K19483J01362N6290k4764j70083k42576j81450
21379E81831q2311k5318p6801j26404r875J75285K78871K32199J13200R91j79100
21368H82568k39672J4117K47073J42393j02954k29219l15116m34044m89483l49887
$$ plain form
21358 -874224 -997245 -1001482 -987050 -927111 -674972 -239510 209808 629568 1048733 1439544
21348 1439544 1649607 1450597 791543 -10551 -530643 -703086 -779862 -979154 -1218109 -1313612
21338 -1313612 -1226279 -1060640 -985327 -980061 -929289 -739952 -439431 -130634 148888 414512
21328 414512 594114 559367 465416 584700 985042 1534604 2045567 2362556 2285013 1751944
21318 1751944 988823 277794 -176314 -255207 -36439 375541 857171 1174699 1176633 1022371
21308 1022371 851129 608880 354855 161706 12822 -204347 -548499 -763888 -752649 -739205
21298 -739205 -920120 -1246613 -1441741 -1322727 -984238 -523368 -27080 385197 581631 508583
21288 508583 277374 -54331 -480051 -872823 -1081527 -1189035 -1322728 -1491492 -1549488 -1310918
$$ packed form
21358h74224j23021m237J4432N9939K52139M35462M49318M19760M19165L90811
21348A439544K10063j99010o59054q02094n20092j72443p6776j99292k38955r5503
21338a313612Q7333J65639P5313N266N0772J89337L00521L08797K79522K65624
21328D14512J79602l4747r3951J19284M00342N49562N10963L16989p7543n33069
21318A751944p63121p11029m54108p8893K18768M11980M81630L17528J934j54262
21308A022371j71242k42249k54025j93149j48884k17169l44152k15389J1239J3444
21298g39205j80915l26493j95128J19014L38489M60870M96288M12277J96434p3048
21288E08583k31209l31705m25720l92772k08704j07508j33693j68764n7996K38570
$$ plain form
21278 -1310918 -889954 -620328 -606359 -663236 -563567 -126486 608459 1303435 1737574 1977928
21268 1977928 2012052 1799535 1414591 919112 457732 192340 192432 406105 680594 786663
21258 786663 726021 735937 838654 912136 1020905 1182173 1246309 1213792 1226052 1234857 999026
21247 999026 461614 -113511 -467663 -646285 -708488 -604493 -494820 -586430 -732767 -787413
21237 -787413 -825786 -827668 -759289 -565318 -197223 171114 356276 336981 257452 232369 206775
21226 206775 145694 137493 290598 581458 901466 1130663 1156158 943721 585836 203343
21216 203343 -70915 -191826 -290777 -507946 -823154 -1160180 -1554067 -1879659 -1874359 -1521441
21206 -1521441 -1055519 -645121 -376184 -210676 -7716 193241 227446 136567 -16490 -306930
$$ packed form
21278a310918M20964K69626J3969n6877R9669M37081P34945O94976M34139K40354
21268A977928L4124k12517l84944m95479m61380k65392R2K13673K74489J06069
21258G86663o0642R916J02717P3482J08769J61268O4136l2517J2260Q805k35831
21247I99026n37412n75125l54152j78622o2203J03995J09673r1610j46337n4646
21237g87413l8373j882O8379J93971L68095L68337J85162j9295p9529k5083k5594
21226B06775o1081q201J53105K90860L20008K29197K5495k12437l57885l82493
21216B03343k74258j20911r8951k17169l15208l37026l93887l25592N300L52918
21206a521441M65922M10398K68937J65508K02960K00957L4205r0879j53057k90440
$$ plain form
21196 -306930 -675985 -970693 -1138157 -1182787 -1086635 -925647 -838178 -942860 -1181159 -1299350
21186 -1299350 -1191005 -1039932 -994094 -927643 -757202 -552734 -448069 -536591 -764420 -1002630
21176 -1002630 -1109678 -1031663 -945343 -972832 -964212 -777401 -518445 -470405 -624122 -762942
21166 -762942 -837000 -926349 -990209 -944249 -782790 -651872 -731835 -906270 -923551 -719069 -429312
21155 -429312 -177218 -33384 -21176 -165189 -422671 -609798 -641414 -658760 -810207 -1096025
21145 -1096025 -1353776 -1365409 -1061218 -596929 -106596 428313 930296 1324374 1655941 1933014
21135 1933014 2119744 2160249 1876804 1244742 535980 -93570 -667466 -1165765 -1457951 -1428591
21125 -1428591 -1209816 -1017368 -990021 -1174743 -1467771 -1684314 -1819860 -2006305 -2253652 -2527508
$$ packed form
21196c06930l69055k94708j67464m4630R6152J60988Q7469j04682k38299j18191
21186a299350J08345J51073M5838O6451J70441K04468J04665q8522k27829k38210
21176a002630j07048P8015Q6320k7489Q620J86811K58956M8040j53717j38820
21166g62942p4058q9349o3860M5960J61459J30918p9963j74435j7281K04482K89757
21155d29312K52094J43834J2208j44013k57482j87127l1616j7346j51447k85818
21145a096025k57751j1633L04191M64289M90333N34909N01983L94078L31567K77073
21135A933014J86730M0505k83445o32062p08762o29550n73896m98299k92186K9360
21125a428591K18775J92448K7347j84722k93028k16543j35546j86445k47347k73856
$$ plain form
21115 -2527508 -2689534 -2467814 -1828762 -1083520 -532917 -276244 -273119 -330980 -270929 -98857
21105 -98857 121642 423627 904640 1439959 1745326 1740386 1566734 1376180 1136112 767844
21095 767844 378816 87101 -105770 -210528 -201870 -131895 -65234 -40630 -109397 -330696 -674404
21084 -674404 -1138131 -1731086 -2351753 -2820645 -3031173 -3085210 -3153807 -3117441 -2944725 -2814092
21074 -2814092 -2692306 -2540052 -2346957 -2081634 -1770018 -1541730 -1478086 -1488072 -1502381 -1463517
21064 -1463517 -1277673 -965291 -599265 -280925 -140945 -176147 -177456 -37586 66306 11272
21054 11272 -144040 -307021 -476278 -627264 -578110 -292639 53180 356760 556596 606374
21044 606374 518142 369196 155695 -61473 -73780 249748 868876 1512464 1948090 1984175
$$ packed form
21115b527508j62026K21720O39052P45242N50603K56673L125n7861O0051J72072
21105i8857K20499L01985M81013N35319L05367m940j73652j90554k40068l68268
21095G67844l89028k91715j92871j04758Q658O9975O6661K4604o8767k21299l43708
21084f74404m63727n92955o20667m68892k10528n4037o8597L6366J72716J30633
21074b814092J21786J52254J93095K65323L11616K28288O3644r986j4309L8864
21064a463517J85844L12382L66026L18340J39980l5202j309J39870J03892n5034
21054A1272j55312j62981j69257j50986M9154K85471L45819L03580J99836M9778
21044F06374q8232j48946k13501k17168j2307L23528O19128O43588M35626L6085
$$ plain form
21034 1984175 1670022 1327703 1154442 1067817 954470 826751 740834 704370 553927 150341
21024 150341 -307688 -607170 -722604 -689808 -535675 -250879 74989 339677 537839 736367
21014 736367 1000143 1339583 1731093 2059414 2230321 2321560 2385913 2313263 1995646 1442065
21004 1442065 916496 731758 747387 669804 541929 584578 836382 1201011 1538535 1732277
20994 1732277 1815357 1798336 1672076 1390984 1028819 830749 911908 1083323 1124420 1017853
20984 1017853 889546 823345 832283 908521 1029970 1150745 1280187 1377233 1341529 1170227
20974 1170227 883433 486648 149968 95141 158476 98325 -73318 -251933 -360587 -419625
20964 -419625 -382176 -132774 170747 351606 502797 635101 707011 753071 997188 1599487
$$ packed form
21034A984175l14153l42319j73261q6625j13347j27719q5917l6464j50443m03586
21024A50341m58029k99482j15434L2796J54133K84796L25868K64688J98162J98528
21014G36367K63776L39440L91510L28321J70907R1239O4353p2650l17617n53581
21004A442065n25569j84738J5629p7583j27875M2649K51804L64629L37524J93742
20994A732277Q3080j7021j26260k81092l62165j98070Q1159J71415M1097j06567
20984A017853j28307o6201Q938P6238J21449J20775J29442R7046l5704j71302
20974A170227k86794l96785l36680n4827O3335o0151j71643j78615j08654n9038
20964d19625L7449K49402L03521J80859J51191J32304P1910M6060K44117O02299
$$ plain form
20954 1599487 2233216 2552042 2563342 2399292 2151880 1857713 1532265 1223162 1026116 1196822
20944 1196822 1913335 2855799 3574855 3961265 4133970 4276702 4553387 4958025 5331931
20935 5331931 5577661 5756033 6089529 6657102 7330837 8090703 9091513 10590807 12654738
20926 12654738 15098893 17793655 20854075 24549328 29089909 34752958 41983947 51347403
20918 51347403 63495912 79218969 99257401 122312496 141377201 145583342 131739954
20911 131739954 108436738 85476662 66911109 52940213 42613521 34859799 28867795
20904 28867795 24146228 20400476 17530407 15526697 14145536 12956649 11632618 10303497
20896 10303497 9400287 8956836 8662786 8294122 7724832 6979317 6214972 5569350 5020133
$$ packed form
20954A599487O33729L18826J1300j64050k47412k94167l25448l09103j97046J70706
20944A196822P16513R42464P19056L86410J72705J42732K76685M04638L73906
20935E331931K45730J78372L33496N67573O73735P59866J000810J499294K063931
20926A2654738K444155K694762L060420L695253M540581N663049P230989R363456
20918E1347403J2148509J5723057K0038432K3055095J9064705M206141j3843388
20911A31739954k3303216k2960076j8565553j3970896j0326692p753722n992004
20904B8867795m721567l745752k870069k003710j381161j188887j324031j329121
20896A0303497r03210m43451k94050l68664n69290p45515p64345o45622n49217
$$ plain form
20887 5020133 4447557 3872096 3446134 3164854 2892369 2553494 2105181 1650248 1410967
20878 1410967 1584319 2067912 2542739 2786488 2636133 2145677 1499062 895881 605267
20869 605267 724652 978543 1127202 1199094 1227155 1247418 1236885 1091043 939685 901697
20859 901697 824337 695990 653540 649538 673438 779271 860047 870016 850510 691473 408610
20848 408610 364020 792090 1528031 2223820 2667368 2864704 2838891 2692551 2563337 2460571
20838 2460571 2363553 2315422 2214858 1876116 1378158 953871 661055 408277 7769 -583421
20828 -583421 -1053766 -1237245 -1274500 -1302512 -1331794 -1251835 -1064311 -1002475 -1239962 -1656482
20818 -1656482 -1923118 -1824254 -1471050 -1097045 -813071 -604626 -338256 106214 673031 1087099
$$ packed form
20887E020133n72576n75461m25962k81280k72485l38875m48313m54933k39281
20878A410967J73352M83593M74827K43749j50355m90456o46615o03181k90614
20869F05267J19385K53891J48659P1892K8061K0263j0533j45842j51358l7988
20859I01697p7360j28347m2450m002K3900J05833Q0776R969j9506j59037k82863
20848D08610m4590M28070P35941O95789M43548J97336k5813j46340j29214j02766
20838B460571r7018m8131j00564l38742m97958m24287k92816k52778m00508n91190
20828e83421m70345j83479l7255k8012k9282P9959J87524O1836k37487m16520
20818a656482k66636R8864L53204L74005K83974K08445K66370M44470N66817M14068
$$ plain form
20808 1087099 1208181 1183833 1219953 1400150 1688891 1914936 1877080 1660267 1485156 1275004
20798 1275004 842299 265291 -224662 -550131 -739512 -795500 -723792 -647649 -712856 -873477
20788 -873477 -975036 -1012459 -999177 -864273 -584704 -285338 -200982 -487604 -1097009 -1758615
20778 -1758615 -2296351 -2565071 -2406099 -1959283 -1508448 -1132213 -787849 -393877 37686
20769 37686 439965 816439 1084310 1079474 845493 633661 592840 639873 653906 590363 531418
20758 531418 507665 399801 217713 125308 214186 371628 487876 548531 509008 296029
20748 296029 6014 -136474 5019 442436 944321 1173421 1111632 962544 887535 1060338
20738 1060338 1412891 1691267 1801603 1816340 1769340 1579828 1127847 471299 -113445 -386506
$$ packed form
20808A087099J21082k4348L6120J80197K88741K26045l7856k16813j75111k10152
20798A275004m32705n77008m89953l25469j89381n5988P1708P6143o5207j60621
20788h73477j01559l7423J3282J34904K79569K99366Q4356k86622o09405o61606
20778a758615n37736k68720J58972M46816M50835L76235L44364L93972M31563
20769C7686M02279L76474K67871m836k33981k11832m0821M7033J4033o3543n8945
20758E31418k3753j07864j82088r2405Q8878J57442J16248O0655l9523k12979
20748B96029k90015j42488J41493M37417N01885K29100o1789j49088p5009J72803
20738A060338L52553K78376J10336J4737m7000j89512m51981o56548n84744k73061
$$ plain form
20728 -386506 -367883 -232510 -146270 -156377 -198638 -203482 -139388 -67359 26405 216261 409530
20717 409530 597787 905832 1303860 1587349 1648881 1518959 1290105 1036399 831445 681489
20707 681489 636556 773354 954212 918820 598903 134151 -324441 -621555 -709758 -678891
20697 -678891 -628013 -526688 -402388 -340076 -299120 -254044 -264350 -398535 -622537 -829656
20687 -829656 -900471 -727204 -340802 103521 356433 304855 43849 -312361 -649664 -935701
20677 -935701 -1129948 -1081369 -818445 -590351 -524460 -604483 -729512 -770858 -708354 -691527 -874265
20666 -874265 -1194310 -1452857 -1459961 -1239170 -964879 -809046 -841401 -958532 -1023907 -969899
20656 -969899 -763834 -510592 -404386 -500906 -654826 -720064 -653139 -615230 -801631 -1096365
$$ packed form
20728c86506J8623J35373Q6240j0107m2261m844O4094P2029R3764J89856J93269
20717D09530J88257L08045L98028K83489O1532j29922k28854k53706k04954j49956
20707F81489m4933J36798J80858l5392l19917m64752m58592k97114q8203L0867
20697f78891N0878J01325J24300O2312M0956M5076j0306j34185k24002k07119
20687h29656p0815J73267L86402M44323K52912n1578k61006l56210l37303k86037
20677i35701j94247M8579K62924K28094O5891q0023j25029m1346O2504J6827j82738
20666h74265l20045k58547p104K20791K74291J55833l2355j17131o5375N4008
20656i69899K06065K53242J06206r6520j53920o5238O6925L7909j86401k94734
$$ plain form
20646 -1096365 -1306305 -1277681 -893432 -292742 191358 316397 159038 -74696 -265672 -296564
20636 -296564 -138737 1307 -17661 -87620 -145262 -246099 -410149 -644879 -860386 -942046
20626 -942046 -904056 -869097 -913624 -972252 -1005262 -1013836 -966141 -839273 -619886 -398408 -247618
20615 -247618 -112686 -51921 -134581 -295980 -516248 -739735 -945482 -1179031 -1425684 -1668713
20605 -1668713 -1888439 -2003854 -1950167 -1737005 -1443641 -1204277 -1100273 -1065014 -1071837 -1029349
20595 -1029349 -762923 -385281 -126466 -79266 -186625 -352175 -444056 -390835 -365156 -444221
20585 -444221 -481145 -408716 -269969 -258212 -458633 -677326 -770452 -730854 -619128 -500637
20575 -500637 -447957 -429727 -397338 -413256 -461275 -509469 -664730 -944976 -1169013 -1138200 -812931
$$ packed form
20646a096365k09940K8624L84249O00690M84100J25039j57359k33734j90976l0892
20636b96564J57827J40044j8968o9959n7642j00837j64050k34730k15507q1660
20626i42046L7990L4959m4527n8628l3010q574M7695J26868K19387K21478J50790
20615b47618J34932O0765q2660j61399k20268k23487k05747k33549k46653k43029
20605a668713k19726j15415N3687K13162K93364K39364J04004L5259o823M2488
20595a029349K66426L77642K58815M7200j07359j65550r1881N3221K5679p9065
20585d44221l6924P2429J38747J1757k00421k18693r3126L9598J11726J18491
20575e00637N2680J8230L2389j5918m8019m8194j55261k80246k24037L0813L25269
$$ plain form
20564 -812931 -396545 -208780 -259464 -372057 -398450 -233576 97951 559756 1034301 1194465
20554 1194465 1049116 873805 725804 575730 335842 -33292 -448548 -778436 -883981
20545 -883981 -840915 -890123 -1109987 -1333319 -1401039 -1352548 -1243027 -1094525 -947261 -759673
20535 -759673 -467907 -102317 166171 161595 -208093 -789381 -1205050 -1199680 -888049 -639686
20525 -639686 -727743 -1083996 -1397754 -1521737 -1402297 -1258711 -1253869 -1210189 -1123142 -976497
20515 -976497 -634036 -177227 158484 332994 424978 537650 785137 1103647 1304941 1300240
20505 1300240 1172676 899997 397972 -239520 -794901 -1099874 -1205262 -1318299 -1513118
20496 -1513118 -1648249 -1651533 -1624443 -1614932 -1587664 -1405361 -1007521 -571617 -324253 -379606 -681750
$$ packed form
20564h12931M16386J87765n0684j12593k6393J64874L31527M61805M74545J60164
20554A194465j45349j75311j48001j50074k39888l69134m15256l29888j05545
20545h83981M3066m9208k19864k23332o7720M8491J09521J48502J47264J87588
20535g59673K91766L65590K68488m576l69688n81288m15669N370L11631K48363
20525f39686q8057l56253l13758j23983J19440J43586M842M3680Q7047J46645
20515i76497L42461M56809L35711J74510R1984J12672K47487L18510K01294m701
20505A300240j27564k72679n02025o37492n55381l04973j05388j13037j94819
20496a513118j35131l284K7090R511K7268J82303L97840M35904K47364n5353l02144
$$ plain form
20485 -681750 -1021803 -1239306 -1177458 -724347 -53219 480698 698740 606843 335984 123876
20475 123876 160506 421900 654738 635843 330238 -185522 -730050 -1108460 -1313876 -1430218
20465 -1430218 -1473474 -1521423 -1646254 -1823349 -1916887 -1794686 -1521896 -1262423 -1125155 -1039432
20455 -1039432 -895201 -768170 -730882 -576133 -112837 478924 833241 871481 737655 531061
20445 531061 353524 302493 319148 243653 67778 -67650 -42964 53430 29121 -243481 -527859
20434 -527859 -529051 -357424 -207236 -96984 16867 31407 -180602 -517896 -640756 -474622
20424 -474622 -229253 -85426 -132770 -307890 -414776 -238821 104550 310970 213251 -122323
20414 -122323 -422539 -513905 -414766 -234869 -80518 144106 501928 781209 918699 1045909
$$ packed form
20485f81750l40053k17503O1848M53111O71128N33917K18042r1897k70859k12108
20475A23876L6630K61394K32838j8895l05605n15760n44528l78410k05416j16342
20465a430218m3256m7949j24831j77095r3538J22201K72790K59473J37268Q5723
20455a039432J44231J27031L7288J54749M63296N91761L54317L8240j33826k06594
20445E31061j77537n1031J6655p5495j75875j35428K4686R6394k4309k72602k84378
20434e27859j192J71627J50188J10252J13851J4540k12009l37294j22860J66134
20424d74622K45369J43827m7344j75120j06886J75955L43371K06420r7719l35574
20414a22323l00216r1366R9139J79897J54351K24624L57822K79281J37490J27210
$$ plain form
20404 1045909 1140854 1076243 905526 730429 561510 489860 493458 579534 805495 980167
20394 980167 917949 701201 508506 383460 165646 -248679 -644111 -782613 -714887 -563129
20384 -563129 -385541 -297142 -302260 -223131 -32559 232661 560151 793259 869318 861902 762322
20373 762322 507331 205360 107973 265263 540812 738841 764260 794416 970861 1154953
20363 1154953 1288915 1391237 1364528 1146832 790510 485629 333376 425147 762847 1111386
20353 1111386 1263696 1191529 1057593 1010572 989023 868342 649553 334228 -66859 -460922
20343 -460922 -819065 -1145335 -1285132 -1066410 -671666 -454818 -457248 -546406 -602674 -513265
20333 -513265 -340652 -256479 -315921 -458137 -584195 -629108 -611476 -618844 -696033 -891734 -1112659
$$ packed form
20404A045909R4945o4611j70717j75097j68919p1650L598Q6076K25961J74672
20394I80167o2218k16748j92695j25046k17814m14325l95432j38502O7726J51758
20384e63129J77588Q8399n118P9129J90572K65220L27490K33108P6059p416r9580
20373G62322k54991l01971r7387J57290K75549J98029K5419L0156J76445J84092
20363A154953J33962J02322k6709k17696l56322l04881j52253R1771L37700L48539
20353A111386J52310p2167j33936m7021k1549j20681k18789l15325m01087l94063
20343d60922l58143l26270j39797K18722L94744K16848k430q9158n6268Q9409
20333e13265J72613Q4173n9442j42216j26058m4913J7632p368p7189j95701k20925
$$ plain form
20322 -1112659 -1092151 -767561 -340677 -121284 -216228 -420675 -544038 -584664 -571643 -478883
20312 -478883 -225576 72956 131412 -112571 -461510 -790714 -1073080 -1325318 -1547965 -1642159
20302 -1642159 -1549175 -1360020 -1084555 -663778 -239691 15564 67415 -37516 -228710 -429459
20292 -429459 -659855 -916673 -1055102 -986656 -854949 -855612 -945838 -939639 -819204 -752678 -820373
20281 -820373 -946848 -927773 -671621 -216364 299796 591894 522573 163897 -249257 -423288
20271 -423288 -360441 -347483 -470896 -607247 -721022 -807870 -688666 -256945 315462 683407
20261 683407 613578 164998 -376879 -791082 -1039610 -1111281 -1105415 -1083547 -961698 -710162
20251 -710162 -402135 -182828 -172316 -263712 -299180 -305287 -402931 -481321 -323479 16344 293195
$$ packed form
20322a112659K0508L24590M26884K19393r4944k04447j23363m0626J3021R2760
20312d78883K53307K98532N8456k43983l48939l29204k82366k52238k22647r4194
20302a642159R2984J89155K75465M20777M24087K55255N1851j04931j91194k00749
20292d29459k30396k56818j38429O8446J31707o63r0226O199J20435O6526o7695
20281h20373j26475J9075K56152M55257N16160K92098o9321l58676m13154j74031
20271d23288O2847J2958j23413j36351j13775q6848J19204M31721N72407L67945
20261F83407o9829m48580n41877m14203k48528p1671N866K1868J21849K51536
20251g10162L08027K19307J0512r1396l5468o107r7644p8390J57842L39823K76851
$$ plain form
20240 293195 404397 368453 260347 174206 164945 181196 111559 -20854 -55371 83402 314777
20229 314777 605614 945881 1170743 1129883 979577 894140 852418 812688 831162 913769 993034
20218 993034 1063535 1125384 1107917 968266 735479 510139 473748 695095 1020925 1272437
20208 1272437 1414092 1421876 1293570 1142781 1166546 1444648 1820762 2107540 2192737 2082692
20198 2082692 1930962 1828439 1743121 1719653 1815977 1787094 1384856 789895 336308 210251
20188 210251 442229 765701 923775 892216 714026 446320 144780 -142185 -430141 -698476
20178 -698476 -836209 -884323 -963674 -999690 -878218 -645180 -438900 -376000 -341123 -181985
20168 -181985 87293 428855 727944 916688 1005219 1046124 1048332 1006486 1031653 1163105 1238026
$$ packed form
20240B93195J11202l5944j08106q6141r261J6251o9637j32413l4517J38773K31375
20229C14777K90837L40267K24862m0860j50306q5437m1722l9730J8474Q2607P9265
20218I93034P0501O1849j7467j39651k32787k25340l6391K21347L25830K51512
20208A272437J41655P784j28306j50789K3765K78102L76114K86778Q5197j10045
20198B082692j51730j02523q5318k3468R6324k8883m02238n94961m53587j26057
20188B10251K31978L23472J58074l1559j78190k67706l01540k86965k87956k68335
20178f98476j37733m8114p9351l6016J21472K33038K06280O2900L4877J59138
20168a81985K69278L41562K99089J88744Q8531M0905K208m1846K5167J31452P4921
$$ plain form
20157 1238026 1114151 932155 883101 998350 1175273 1188362 967039 727804 642555 701767
20147 701767 758878 683071 433886 -26387 -549825 -868201 -866199 -632051 -393497 -316097
20137 -316097 -306425 -275538 -390645 -686255 -880680 -860695 -691126 -367424 32494 431084
20127 431084 789134 889282 640742 158870 -365323 -749886 -889909 -753310 -445669 -142513
20117 -142513 124767 410286 593356 552388 382003 286746 311208 270022 132488 113613
20107 113613 146582 -48721 -451924 -879368 -1136836 -1116219 -867252 -514057 -199214 -39101
20097 -39101 -63782 -178024 -285530 -322822 -233038 -14129 296069 614351 816944 869676
20087 869676 922683 1044425 1056254 850136 554309 267101 98496 252879 732006 1171342
$$ packed form
20157A238026j23875j81996m9054J15249J76923J3089k21323k39235q5249N9212
20147G01767N7111p5807k49185m60273n23438l18376K002K34148K38554P7400
20137c16097R672L0887j15107k95610j94425J9985J69569L23702L99918L98590
20127D31084L58050J00148k48540m81872n24193l84563j40023J36599L07641L03156
20117a42513K67280K85519J83070m0968j70385r5257K4462m1186j37534j8875
20107A13613L2969j95303m03203m27444k57468K0617K48967L53195L14843J60113
20097c9101k4681j14242j07506l7292Q9784K18909L10198L18282K02593N2732
20087H69676N3007J21742J1829k06118k95827k87208j68605J54383M79127M39336
$$ plain form
20077 1171342 1304912 1315473 1359638 1261613 872180 328360 -139841 -375391 -339349 -156389
20067 -156389 -26480 -53283 -134996 -139851 -48156 64395 148278 215878 173667 30799 35012
20056 35012 377341 947413 1444872 1637405 1484000 1117104 710296 412046 246033 196435
20046 196435 312915 654324 1100610 1542722 1924563 2179253 2401354 2654780 2742533 2490651
20036 2490651 2009157 1550897 1291749 1189008 1080105 973397 1034273 1226716 1350550 1333051
20026 1333051 1237252 1127413 990780 821128 752342 798384 868953 954142 1070798 1221308
20016 1221308 1384351 1559301 1750618 1859583 1863295 1862627 1945422 2141521 2377179 2494094
20006 2494094 2433286 2324765 2220252 2141624 2194124 2431882 2703182 2770201 2549280 2073464
$$ packed form
20077A171342J33570J0561M4165r8025l89433n43820m68201k35550L6042J82960
20067a56389J29909k6803q1713m855R1695J12551Q3883O7600m2211j42868M213
20056C5012L42329N70072M97459J92533j53405l66896m06808k98250j66013m9598
20046A96435J16480L41409M46286M42112L81841K54690K22101K53426Q7753k51882
20036B490651m81494m58260k59148j02741j08903j06708O0876J92443J23834j7499
20026A333051r5799j09839j36633j69652o8786M6042P0569Q5189J16656J50510
20016A221308J63043J74950J91317J08965L712o68Q2795J96099K35658J16915
20006B494094o0808j08521j04513p8628N2500K37758K71300O7019k20921m75816
$$ plain form
19996 2073464 1443987 880923 620092 742449 1037691 1177363 1154641 1153661 1261664 1404987
19986 1404987 1487676 1527325 1597193 1822014 2137104 2324395 2355779 2284000 2195764 2135680 1921643
19975 1921643 1512837 1194913 1147127 1207175 1244027 1341683 1543562 1894898 2326399 2531339
19965 2531339 2387485 2150505 2070909 2137924 2342088 2759730 3254204 3533987 3497235 3196894
19955 3196894 2728798 2345800 2203042 2235451 2330680 2459032 2713707 3181585 3757176 4208741
19945 4208741 4470987 4774621 5233111 5615218 5754201 5728874 5596427 5343139 5179284 5281088
19935 5281088 5532516 5728283 5815442 5847277 5909560 6063651 6319741 6811464 7503499 8176326
19925 8176326 8756156 9320384 9939956 10665333 11511870 12242196 12642244 13034622 13691582
$$ packed form
19996B073464o29477n63064k60831J22357K95242J39672k2722r80J08003J43323
19986A404987Q2689L9649O9868K24821L15090J87291L1384p1779q8236o0084k14037
19975A921643m08806l17924m7786O0048L6852R7656K01879L51336M31501K04940
19965B531339j43854k36980p9596O7015K04164M17642M94474K79783l6752l00341
19955C196894m68096l82998j42758L2409R5229J28352K54675M67878N75591M51565
19945D208741K62246L03634M58490L82107J38983k5327j32447k53288j63855J01804
19935E281088K51428J95767Q7159L1835O2283J54091K56090M91723O92035O72827
19925H176326N79830N64228O19572P25377Q46537P30326M00048L92378O56960
$$ plain form
19916 13691582 14587121 15758049 17307126 19253780 21493542 23924051 26568321 29523287
19908 29523287 32946429 37004022 42010475 48315388 56127652 65549723 76818585 90348484
19900 90348484 106788320 127153808 152751810 184884262 224625880 270898357 316236868
19893 316236868 346909729 355759817 352570558 351749971 356794536 357799080 340875483 305070531
19885 305070531 263082244 225943390 197368820 177108038 163737104 155853566 152386233
19878 152386233 152591604 156046562 162270797 170326927 179096471 187226693 193001959 195024906
19870 195024906 192855041 187136542 179281452 170944920 163534027 157834932 154171231 152554423
19862 152554423 152861284 155172990 159569757 165812419 173187253 180297094 185419536 187044334
$$ packed form
19916A3691582Q95539J170928J549077J946654K239762K430509K644270K954966
19908B9523287L423142M057593N006453O304913P812264R422071J1268862J3529899
19900I0348484J6439836K0365488K5598002L2132452L9741618M6272477M5338511
19893C16236868L0672861Q850088l189259q20587N044565J004544j6923597l5804952
19885C05070531m1988287l7138854k8574570k0260782j3370934p883538l467333
19878A52386233K05371L454958O224235Q056130Q769544Q130222N775266K022947
19870A95024906k169865n718499p855090q336532p410893n699095l663701j616808
19862A52554423L06861K311706M396767O242662P374834P109841N122442J624798
$$ plain form
19854 187044334 184227150 177101442 166793625 154765298 142274344 130271244 119396368
19847 119396368 109773484 101300519 94021209 88066682 83539518 80441642 78725494 78378850
19839 78378850 79368703 81715118 85562916 91218388 99079742 109668264 123476976 140559807
19831 140559807 159133726 174081588 179203694 174159224 165579693 159891000 159713719 164176152
19823 164176152 168614432 165594296 151352653 130219814 108870826 90597985 75937430
19816 75937430 64510157 55565105 48346795 42460220 37721348 33773256 30306898 27253388
19808 27253388 24706537 22752905 21256364 20039852 18986454 17970215 16843376 15631557
19800 15631557 14510535 13573863 12824532 12179255 11546924 11003060 10667319 10519103 10395518
$$ packed form
19854A87044334k817184p125708j0307817j2028327j2490954j2003100j0874876
19847A19396368r622884q472965p279310n954527m527164l097876j716148l46644
19839G8378850R89853K346415L847798N655472P861354J0588522J3808712J7082831
19831A40559807J8573919J4947862N122106n044470q579531n688693j77281M462433
19823A64176152M438280l020136j4241643k1132839k1348988j8272841j4660555
19816G5937430j1427273q945052p218310n886575m738872l948092l466358l053510
19808B7253388k546851j953632j496541j216512j053398j016239j126839j211819
19800A5631557j121022r36672p49331o45277o32331n43864l35741j48216j23585
$$ plain form
19791 10395518 10170997 9854178 9439019 8905718 8394300 7944161 7494224 7017643 6603676
19782 6603676 6375941 6268765 6177423 6088435 5993554 5889425 5823626 5822755 5781341 5612013 5346768
19771 5346768 5000057 4698612 4506625 4291689 3986483 3691641 3554384 3555065 3530673 3429421
19761 3429421 3178842 2769099 2429421 2361939 2514298 2678949 2730187 2623388 2461419 2355166
19751 2355166 2271647 2215348 2291926 2550194 2918791 3149735 3026192 2741230 2651245 2681257
19741 2681257 2670487 2727390 2865158 2976695 3012844 2907285 2676176 2460844 2320944 2221260
19731 2221260 2040475 1810164 1711647 1664657 1551576 1482786 1542480 1744784 2047840 2277413
19721 2277413 2225436 1903776 1492386 1116168 825715 694921 746598 871994 958087 991864
$$ packed form
19791A0395518k24521l16819m15159n33301n11418m50139m49937m76581m13967
19782F603676k27735j07176r1342q8988r4881j04129o5799q71m1414j69328k65245
19771E346768l46711l01445j91987k14936l05206k94842j37257O81k4392j01252
19761C429421k50579m09743l39678o7482J52359J64651N1238j06799j61969j06253
19751B355166q3519n6299P6578K58268L68597K30944j23543k84962q9985L0012
19741B681257j0770N6903J37768J11537L6149j05559k31109k15332j39900r9684
19731B221260j80785k30311r8517m6990j13081o8790N9694K02304L03056K29573
19721B277413n1977l21660m11390l76218k90453j30794N1677J25396Q6093L3777
$$ plain form
19711 991864 983742 994537 1100007 1278106 1440841 1577625 1648946 1632566 1683057 1881835 2039058
19700 2039058 1939355 1622101 1303519 1008367 715110 589070 677167 814584 862478 860845
19690 860845 840823 910035 1149991 1443114 1706968 1850743 1750347 1420295 1013642 702569
19680 702569 542546 468891 506997 736317 1104685 1314019 1212523 1021709 846958 563508
19670 563508 286880 245999 404039 481203 304196 47488 -39807 132893 413901 551654
19660 551654 485798 302107 168233 223119 470133 803137 1098750 1313743 1503433 1637242
19650 1637242 1645733 1562524 1391471 1152393 930700 761011 675970 746115 997763 1370565
19640 1370565 1673862 1686183 1400139 1049174 876453 951608 1138448 1379799 1777782 2296132
$$ packed form
19711I91864q122J0795J05470J78099J62735J36784P1321j6380N0491J98778J57223
19700B039058r9703l17254l18582k95152k93257j26040Q8097J37417M7894j633
19690H60845k0022O9212K39956K93123K63854J43775j00396l30052m06653l11073
19680G02569j60023p3655L8106K29320L68368K09334j01496j90814j74751k83450
19670E63508k76628m0881J58040P7164j77007k56708q7295J72700K81008J37753
19660E51654o5856j83691j33874N4886K47014L33004K95613K14993J89690J33809
19650A637242Q491q3209j71053k39078k21693j69689q5041P0145K51648L72802
19640A370565L03297J2321k86044l50965j72721P5155J86840K41351L97983N18350
$$ plain form
19630 2296132 2710634 2747731 2368745 1851245 1437782 1208545 1142151 1167553 1158680 1064170
19620 1064170 1006317 994055 891049 766312 700594 640203 463771 143566 -133260 -193217
19610 -193217 -51969 221081 544206 811141 987749 1076913 1019266 868729 677140 428571
19600 428571 75680 -358148 -685517 -747990 -548314 -270847 -95790 33033 196096 395264
19590 395264 619137 878950 1101335 1189921 1111859 933344 823131 784062 770303 839089
19580 839089 1034780 1305609 1510323 1483945 1207673 876045 617295 381840 97366 -215465
19570 -215465 -471242 -656291 -818944 -983139 -1204641 -1501741 -1683471 -1624575 -1462556 -1328923
19560 -1328923 -1268761 -1275326 -1276921 -1199454 -1010198 -843740 -807947 -871532 -1012163 -1144674 -1102010
$$ packed form
19630B296132M14502L7097l78986n17500m13463k29237o6394K5402q873r4510
19620A064170n7853j2262j03006j24737o5718o0391j76432l20205k76826n9957
19610a93217J41248K73050L23125K66935J76608Q9164n7647j50537j91589k48569
19600D28571l52891m33828l27369o2473J99676K77467J75057J28823J63063J99168
19590C95264K23873K59813K22385Q8586p8062j78515j10213l9069j3759O8786
19580H39089J95691K70829K04714k6378k76272l31628k58750k35455k84474l12831
19570b15465k55777j85049j62653j64195k21502k97100j81730N8896J62019J33633
19560a328923O0162o565j595P7467J89256J66458L5793o3585j40631j32511M2664
$$ plain form
19549 -1102010 -857550 -594291 -521375 -671484 -832340 -812838 -690846 -561125 -354797 -11366
19539 -11366 350388 553248 569977 544604 659807 896363 1219403 1591609 1846004 1899487
19529 1899487 1843412 1752313 1580700 1271672 917286 653924 479892 307337 154141 61370
19519 61370 99649 350467 714780 1021002 1222091 1320197 1356042 1392198 1366119 1179414 898591
19508 898591 622466 450371 376510 307164 224086 165677 143096 179994 319220 496028 706377
19497 706377 960382 1077792 950656 763862 643491 523269 288983 25659 13102 260415
19487 260415 531228 693432 787909 917282 1031796 1050590 1052547 1131032 1249614 1297273 1175500
19476 1175500 907813 677168 642303 804925 1093029 1401934 1543141 1312498 750256 159284
$$ packed form
19549a102010K44460K63259P2916j50109j60856J9502J21992J29721K06328L43431
19539a1366L61754K02860J6729k5373J15203K36556L23040L72206K54395N3483
19529A899487n6075r1099j71613l09028l54386k63362j74032j72555j53196r2771
19519F1370L8279K50818L64313L06222K01089R8106L5845L6156k6079j86705k80823
19508H98591k76125j72095p3861o9346q3078n8409k2581L6898J39226J76808K10349
19497G06377K54005J17410j27136j86794j20371j20222k34286k63324j2557K47313
19487B60415K70813J62204R4477J29373J14514J8794J957P8485J18582M7659j21773
19476A175500k67687k30645l4865J62622K88104L08905J41207k30643n62242n90972
$$ plain form
19466 159284 -163847 -223498 -124358 80797 224441 135606 -158027 -434972 -565383 -509388
19456 -509388 -264127 122957 645725 1194802 1539373 1525814 1256051 1043576 1033930 986089
19446 986089 665294 245644 61828 177950 526649 970693 1185083 1004887 690623 445694
19436 445694 308015 304701 378964 436485 403949 378968 502558 649473 663765 706322 877183
19425 877183 1005643 844947 369545 -99864 -264949 -130971 68271 214207 387691 569305
19415 569305 611045 505588 376563 346492 393025 400117 320887 205679 41560 -240275 -515196
19404 -515196 -538430 -299545 -43086 -65015 -350027 -540616 -376423 15527 503956 1098357
19394 1098357 1715313 2098741 2220757 2311351 2446169 2505126 2432404 2276560 2068987 1828850
$$ packed form
19466A59284l23131n9651R9140K05155J43644q8835k93633k76945j30411N5995
19456e09388K45261L87084N22768N49077L44571j3559k69763k12475r646m7841
19446I86089l20795m19650j83816J16122L48699M44044K14390j80196l14264k44929
19436D45694j37679l314P4263N7521l2536k4981J23590J46915J4292M2557J70861
19425H77183J28460j60696m75402m69409j65085J33978J99242J45936J73484J81614
19415E69305M1740j05457j29025l0071M6533P092p9230j15208j64119k81835k74921
19404e15196k3234K38885K56459k1929k85012j90589J64193L91950M88429N94401
19394A098357O16956L83428J22016R0594J34818N8957p2722j55844k07573k40137
$$ plain form
19384 1828850 1608362 1416686 1244887 1022176 625734 135664 -178156 -261215 -318521 -431687
19374 -431687 -526474 -624328 -793139 -1037265 -1300537 -1447505 -1369629 -1125238 -898035 -781438
19364 -781438 -701420 -568985 -332986 91294 641907 1086655 1210107 897083 362513 -101114
19354 -101114 -489697 -872089 -1226061 -1384440 -1269762 -1026286 -766998 -546883 -415515 -343619
19344 -343619 -322742 -365380 -431640 -467509 -489559 -501807 -542880 -643956 -673103 -505192 -128384
19333 -128384 362951 894238 1359356 1708857 1927784 1952004 1853658 1819282 1830948 1757389
19323 1757389 1746040 1965697 2375626 2761020 2873412 2660824 2296022 1970705 1679881 1366885
19313 1366885 1158355 1199915 1400937 1434101 1177518 814588 513542 380652 457554 608927
$$ packed form
19384A828850k20488j91676j71799k22711l96442m90070l13820q3059n7306j13166
19374d31687r4787r7854j68811k44126k63272j46968P7876K44391K27203J16597
19364g81438Q0018J32435K35999M24280N50613M44748J23452l13024n34570m63627
19354a01114l88583l82392l53972j58379J14678K43476K59288K20115J31368P1896
19344c43619K0877m2638o6260l5869k2050j2248m1073j01076k9147J67911L76808
19333a28384M91335N31287M65118L49501K18927K4220r8346l4376J1666p3559
19323A757389j1349K19657M09929L85394J12392k12588l64802l25317k90824l12996
19313A366885k08530M1560K01022L3164k56583l62930l01046j32890P6902J51373
$$ plain form
19303 608927 660192 568080 426466 426847 663966 1027738 1349014 1473563 1406382 1325406 1345044
19292 1345044 1441961 1603296 1792350 1939441 2024373 2099754 2151922 2155353 2207499 2257762 2122542
19281 2122542 1782215 1316007 888354 625564 515825 523893 633048 815455 1016684 1081126
19271 1081126 934959 698208 538669 584881 752288 855912 824194 714866 674227 809241
19261 809241 975465 913785 564791 129061 -262582 -617018 -882223 -929475 -781931 -599590
19251 -599590 -434652 -323385 -363418 -554785 -673954 -604175 -410636 -192543 16527 257886
19241 257886 566253 910103 1069757 903603 609470 426918 370119 442177 767198 1280589
19231 1280589 1616427 1544626 1191934 807713 516083 265833 60458 12689 210229 564335
$$ packed form
19303F08927N1265r2112j41614L81K37119L63772L21276J24549o7181q0976J9638
19292A345044R6917J61335J89054J47091Q4932P5381N2168L431N2146N0263j35220
19281B122542l40327m66208m27653k62790j09739Q068J09155J82407K01229O4442
19271A081126j46167k36751j59539M6212J67407J03624l1718j09328m0639J35014
19261H09241J66224o1680l48994m35730l91643l54436k65205m7252J47544J82341
19251e99590J64938J11267m0033j91367j19169O9779J93539K18093K09070K41359
19241B57886L08367L43850J59654j66154k94133j82552n6799P2058L25021N13391
19231A280589L35838p1801l52692l84221k91630k50250k05375m7769J97540L54106
$$ plain form
19221 564335 914605 1194412 1403088 1536542 1622681 1658067 1625521 1503014 1283411 1040058
19211 1040058 835790 660532 484708 264860 -71600 -543378 -1011021 -1261534 -1212813 -1046594
19201 -1046594 -815238 -416322 82825 582072 993638 1266931 1434620 1511606 1427519 1130364
19191 1130364 805327 614420 510469 405280 182071 -217495 -636664 -825147 -728712 -515840
19181 -515840 -405672 -479237 -573639 -542321 -388775 -270214 -306062 -368845 -439359 -637206 -918601
19170 -918601 -1151441 -1270316 -1179200 -886301 -555269 -259242 44683 355628 508431 380465
19160 380465 102765 -207220 -466989 -609191 -659983 -532692 -207206 157205 473824 680428
19150 680428 650692 451559 345620 396069 429951 322288 22426 -409231 -734305 -831436
$$ packed form
19221E64335L50270K79807K08676J33454Q6139L5386l2546j22507k19603k43353
19211A040058k04268j75258j75824k19848l36460m71778m67643k50513M8721J66219
19201a046594K31356L98916M99147M99247M11566K73293J67689P6986q4087k97155
19191A130364l25037j90907j03951j05189k23209l99566m19169j88483R6435K12872
19181e15840J10168p3565r4402L1318J53546J18561l5848o2783p0514j97847k81395
19170i18601k32840j18875R1116K92899L31032K96027L03925L10945J52803j27966
19160C80465k77700l09985k59769j42202n0792J27291L25486L64411L16619K06604
19150F80428k9736j99133j05939N0449L3882j07663k99862m31657l25074r7131
$$ plain form
19140 -831436 -803505 -719214 -548397 -405198 -393614 -277770 -14892 186009 280566 325208
19130 325208 459112 683467 853214 940359 933877 762375 375083 -205113 -884621 -1479070
19120 -1479070 -1794209 -1792496 -1659389 -1559867 -1521390 -1442608 -1160618 -711039 -253761 55832
19110 55832 198299 198221 32392 -275693 -573424 -766100 -828027 -671193 -267563 195902 561526
19099 561526 835426 1007100 946822 743798 582323 461041 312106 157419 9009 -116636
19089 -116636 -217680 -228808 -97348 37680 145091 316887 467489 452282 359799 433067
19079 433067 759940 1137103 1390291 1456198 1330704 1060080 791596 623446 551015 551928
19069 551928 566768 563180 602590 699986 811211 971225 1129901 1160937 1113031 1049453 878797
$$ packed form
19140h31436K7931Q4291J70817J43199J1584J15844K62878K00901R4557M4642
19130C25208J33904K24355J69747Q7145o482j71502l87292n80196o79508n94449
19120a479070l15139J713J33107R9522L8477P8782K81990M49579M57278L09593
19110E5832J42467p8j65829l08085k97731j92676o1927J56834M03630M63465L65624
19099E61526K73900J71674o0278k03024j61475j21282j48935j54687j48410j25645
19089a16636j01044j1128J31460J35028J07411J71796J50602j5207r2483P3268
19079D33067L26873L77163K53188O5907j25494k70624k68484j68150p2431R13
19069E51928J4840l588L9410R7396J11225J60014J58676L1036m7906o3578j70656
$$ plain form
19058 878797 526449 131344 -73191 -20624 267235 681398 988136 1043637 1031169 1287642
19048 1287642 1800445 2182319 2137776 1747646 1232816 730223 276617 -92026 -180888 75065
19038 75065 430757 636166 640534 548303 495388 575996 629858 530518 369130 111826 -288126
19027 -288126 -617786 -589457 -240457 29461 28778 -90651 -200191 -370888 -655117 -874449
19017 -874449 -851818 -589624 -263700 29345 296736 471310 389525 36502 -252307 -228341
19007 -228341 28754 364311 597480 665681 720872 766818 628357 311184 -5478 -155723
18997 -155723 -124760 -74024 -100582 -79820 221608 739395 1130815 1291419 1378954 1502165
18987 1502165 1665311 1809015 1879482 1945516 2150372 2473956 2683885 2652277 2449061 2076387
$$ packed form
19058H78797l52348l95105k04535N2567K87859M14163L06738N5501j2468K56473
19048A287642N12803L81874m4543l90130n14830n02593m53606l68643q8862K55953
19038G5065L55692K05409M368r2231n2915Q0608N3862r9340j61388k57304l99952
19027b88126l29660K8329L49000K69918o83j19429j09540j70697k84229k19332
19017h74449K2631K62194L25924K93045K67391J74574q1785l53023k88809K3966
19007b28341K57095L35557K33169O8201N5191M5946j38461l17173l16662j50245
18997a55723L0963N0736k6558K0762L01428N17787L91420J60604Q7535J23211
18987A502165J63146J43704P0467O6034K04856L23584K09929l1608k03216l72674
$$ plain form
18977 2076387 1530859 1072095 863257 848845 926388 914733 714823 501281 392166 263951
18967 263951 -7739 -455150 -952821 -1280439 -1404589 -1462789 -1525043 -1637746 -1768100 -1764042
18957 -1764042 -1557251 -1154268 -680996 -258199 129209 441538 599755 554702 325155 -78942
18947 -78942 -633551 -1074055 -1257413 -1363547 -1412359 -1322658 -1087306 -772238 -515855 -363605
18937 -363605 -161938 198459 580969 858193 1141409 1424785 1485722 1303820 1021347 725811
18927 725811 449461 204268 8724 -160063 -312162 -381375 -403681 -450324 -431277 -234840
18917 -234840 117930 459422 608539 561270 443841 363148 333964 406975 631151 912680
18907 912680 1107707 1145737 1043179 972441 1015011 1054834 1081988 1216175 1387844 1387666 1122075
$$ packed form
18977B076387n45528m58764k08838j4412P7543j1655j99910k13542j09115j28215
18967B63951k71690m47411m97671l27618j24150n8200o2254j12703j30354M058
18957a764042K06791M02983M73272M22797L87408L12329J58217m5053k29547m04097
18947g8942n54609m40504j83358j06134m8812Q9701K35352L15068K56383J52250
18937c63605K01667L60397L82510K77224K83216K83376O0937j81902k82473k95536
18927G25811k76350k45193j95544j68787j52099o9213k2306m6643J9047J96437
18917b34840L52770L41492J49117m7269j17429q0693k9184P3011K24176K81529
18907I12680J95027L8030j02558p0738M2570L9823K7154J34187J71669j78k65591
$$ plain form
18896 1122075 759466 467759 361624 583295 1055854 1512715 1732318 1659212 1401463 1078245
18886 1078245 754498 570997 624177 858208 1045972 1112358 1171994 1239023 1260086 1261409 1184991
18875 1184991 901820 496218 256185 344609 658637 1040319 1378686 1508149 1339462 965163
18865 965163 550862 280329 267369 403066 487505 445208 342492 369155 489479 500914
18855 500914 397834 354761 358181 347424 321399 254617 102418 -193061 -579452 -916699 -1082615
18844 -1082615 -1051078 -850435 -530315 -191810 100179 348871 490852 440957 255808 83033
18834 83033 11139 1119 -63151 -150893 -111804 44457 150462 104431 -51371 -298545 -587754
18823 -587754 -810889 -883903 -761472 -554876 -374881 -167034 110113 378933 503951 445030
$$ packed form
18896A122075l62609k91707j06135K21671M72559M56861K19603p3106k57749l23218
18886A078245l23747j83501N3180K34031J87764O6386N9636O7029K1063J323p6418
18875A184991k83171m05602k40033Q8424L14028L81682L38367J29463j68687l74299
18865I65163m14301k70533j2960J35697Q4439m2297j02716K6663J20324J1435
18855E00914j03080m3073L420j0757k6025o6782j52199k95479l86391l37247j65916
18844a082615L1537K00643L20120L38505K91989K48692J41981m9895j85149j72775
18834H3033p1894j0020o4270q7742L9089J56261J06005m6031j55802k47174k89209
18823e87754k23135p3014J22431K06596J79995K07847K77147K68820J25018n8921
$$ plain form
18813 445030 425138 593201 724394 639918 477436 397980 362991 283854 118623 -185710
18803 -185710 -609185 -928658 -947457 -707079 -315896 122193 448089 478774 185719 -291061
18793 -291061 -652476 -747489 -675550 -560188 -371798 28585 617078 1095295 1180543 870798
18783 870798 374325 -168507 -684920 -987602 -1012162 -861389 -668918 -599009 -683916 -694295
18773 -694295 -475199 -225026 -160737 -209889 -138192 93139 311263 395256 345629 248514 121331
18762 121331 16606 21903 101154 181360 224181 275213 449568 808790 1207117 1448703 1538582
18751 1538582 1569145 1552964 1485155 1416368 1494159 1719619 1861152 1866642 1852279 1870260 1933716
18740 1933716 1975387 1829212 1468460 1026999 482546 -139109 -734886 -1184792 -1394823 -1396853
$$ packed form
18813D45030j9892J68063J31193q4476j62482p9456l4989p9137j65231l04333
18803a85710m23475l19473j8799K40378L91183M38089L25896L0685k93055m76780
18793b91061l61415r5013P1939J15362J88390M00383N88493M78217Q5248l09745
18783H70798m96473n42832n16413l02682k4560J50773J92471O9909q4907j0379
18773f94295K19096K50173O4289m9152P1697K31331K18124Q3993m9627r7115j27183
18762A21331j04725N297P9251Q0206M2821N1032J74355L59222L98327K41586Q9879
18751A538582L0563j6181o7809o8787P7791K25460J41533N490j4363J7981O3456
18740A933716M1671j46175l60752m41461n44453o21655n95777m49906k10031k030
$$ plain form
18730 -1396853 -1279628 -1123089 -1104429 -1293080 -1505906 -1482572 -1170272 -735207 -318240 -95145
18720 -95145 -96117 -102517 18942 68444 -101155 -377001 -594405 -644249 -483581 -198448 76472
18709 76472 340486 643684 855626 752103 420657 183726 135083 182440 299312 353904
18699 353904 129192 -253142 -501349 -576177 -618666 -634891 -650880 -818583 -1165397 -1510652
18689 -1510652 -1651975 -1593747 -1493771 -1399711 -1302672 -1265940 -1207428 -1035910 -809646 -488434
18679 -488434 -31912 426722 730268 811029 627170 272800 -81982 -315891 -322966 -99437
18669 -99437 233187 443244 356627 65765 -226316 -489315 -737421 -992934 -1212846 -1316027
18659 -1316027 -1260420 -1094012 -936487 -783227 -532435 -192867 126996 382829 506574 503396
$$ packed form
18730a396853J17225J56539J8660j88651k12826K3334L12300M35065M16967K23095
18720i5145r72o400J21459M9502j69599k75846k17404m9844J60668K85133K74920
18709G6472K64014L03198K11942j03523l31446k36931m8643M7357J16872N4592
18699C53904k24712l82334k48207p4828m2489j6225j5989j67703l46814l45255
18689a510652j41323N8228R9976R4060R7039L6732N8512J71518K26264L21212
18679d88434M56522M58634L03546Q0761j83859l54370l54782k33909p075K23529
18669i9437L32624K10057q6617k90862k92081k62999k48106k55513k19912j03181
18659a316027N5607J66408J57525J53260K50792L39568L19863K55833J23745l178
$$ plain form
18649 503396 539461 688201 796362 740081 640776 572163 432513 277508 270124 300134 248963
18638 248963 246868 438075 771129 1018597 1080248 1057382 988693 808164 476433 118490
18628 118490 -164324 -381786 -589804 -832238 -1038093 -1048142 -885217 -760354 -702625 -642532
18618 -642532 -584452 -545022 -490695 -364407 -195675 -5279 265048 530331 682335 665795
18608 665795 402236 -25765 -494785 -921664 -1201372 -1344287 -1363295 -1262435 -1072756 -854972
18598 -854972 -564029 -194581 15682 -67685 -357141 -728386 -1033167 -1133185 -1015666 -839996
18588 -839996 -793970 -815430 -673656 -367005 -144428 -143113 -328018 -688091 -1164319 -1597287
18578 -1597287 -1874869 -2063986 -2237780 -2407853 -2618668 -2795349 -2779209 -2524909 -2255368 -2208046
$$ packed form
18649E03396L6065J48740J08161n6281r9305o8613j39650j55005p384L0010n1171
18638B48963k095J91207L33054K47468O1651k2866o8689j80529l31731l57943
18628A18490k82814k17462k08018k42434k05855j0049J62925J24863N7729O0093
18618f42532N8080L9430N4327J26288J68732J90396K70327K65283J52004j6540
18608F65795k63559m28001m69020m26879k79708j42915j9008J00860J89679K17784
18598h54972K90943L69448K10263q3367k89456l71245l04781j00018J17519J75670
18588h39996M6026k1460J41774L06651K22577J315j84905l60073m76228m32968
18578a597287k77582j89117j73794j70073k10815j76681J6140K54300K69541M7322
$$ plain form
18568 -2208046 -2231886 -2152402 -2060118 -1989438 -1821536 -1521755 -1223856 -1003184 -763008 -450896
18558 -450896 -169412 44358 174285 194238 84054 -141917 -242693 -64761 301210 785847
18548 785847 1294377 1678405 1909704 2106512 2212536 2134924 1953282 1811552 1681673 1524174
18538 1524174 1461013 1490951 1530903 1589606 1649780 1587991 1302685 961042 743054 679745 805898
18527 805898 999859 1057533 861884 437633 -76171 -483961 -686289 -736334 -769423 -844091
18517 -844091 -939117 -999377 -983857 -865198 -713566 -710575 -922591 -1178762 -1236706 -947237 -256316
18506 -256316 607505 1238355 1542940 1668766 1801333 2110330 2465096 2568140 2389154 2203134
18496 2203134 2199412 2328255 2482795 2520323 2381383 2062221 1581335 1176926 1088474 1271497
$$ packed form
18568b208046k3840P9484R2284P0680J67902K99781K97899K20672K40176L12112
18558d50896K81484K13770J29927J9953j10184k25971j00776J77932L65971M84637
18548G85847N08530L84028K31299J96808J06024p7612j81642j41730j29879j57499
18538A524174o3161K9938L9952N8703O0174o1789k85306l41643k17988o3309J26153
18527H05898J93961N7674j95649m24251n13804m07790k02328n0045l3089p4668
18517h44091r5026o0260J5520J18659J51632K991k12016k56171n7944K89469O90921
18506b56316Q63821O30850L04585J25826J32567L08997L54766J03044j78986j86020
18496B203134l722J28843J54540L7528j38940l19162m80886m04409q8452J83023
$$ plain form
18486 1271497 1478498 1511669 1385563 1254066 1190963 1087065 962585 968037 1137568 1283588
18476 1283588 1180536 835791 421574 123248 11475 60914 226987 415930 503894 435404
18466 435404 361412 308870 230952 160608 84293 14488 -21379 -135979 -344415 -569690 -795583
18455 -795583 -913628 -765250 -516372 -386316 -277684 -174494 -225840 -311683 -279340 -133032
18445 -133032 141900 406891 511322 634739 952346 1219918 1239081 1135616 1097339 1080054
18435 1080054 938291 809906 861677 949894 940037 884113 782214 686625 606030 516667 488005
18424 488005 407648 274096 253307 285433 394710 568452 563346 366589 148816 -58761
18414 -58761 -246681 -392542 -450946 -421606 -422304 -515340 -692377 -843122 -817889 -656336 -541621
$$ packed form
18486A271497K07001L3171j26106j31497o3103j03898j24480N452J69531J46020
18476A283588j03052l44745m14217k98326j11773M9439J66073J88943Q7964o8490
18466D35404p3992n2542p7918p0344p6315o9805l5867j14600k08436k25275k25893
18455g95583j18045J48378K48878J30056J08632J03190n1346q5843L2343J46308
18445a33032K74932K64991J04431J23417L17607K67572J9163j03465l8277j7285
18435A080054j41763j28385N1771Q8217r857n5924j01899r5589q0595q9363k8662
18424D88005q0357j33552k0789L2126J09277J73742n106j96757k17773k07577
18414e8761j87920j45861n8404K9340o98r3036j77037j50745K5233J61553J14715
$$ plain form
18403 -541621 -562911 -647991 -697671 -646643 -456479 -273585 -166846 -77907 -118619 -300592 -394449
18392 -394449 -283072 -23693 349832 761127 1134448 1417408 1522632 1420738 1128914 690400
18382 690400 99782 -567175 -1043146 -1182135 -1180511 -1177559 -1056635 -787418 -449591 -102227
18372 -102227 142847 210271 161651 125711 52957 -116020 -343364 -582450 -735385 -723311
18362 -723311 -580737 -422964 -346912 -231247 -34336 238034 477778 518467 393374 298841
18352 298841 336484 400926 343913 179727 25099 -91379 -129317 122 267590 521461
18342 521461 686880 686794 572959 561725 648046 699972 744244 761953 644604 547430 728598
18331 728598 1238941 1816250 2119431 2058529 1792518 1463869 1152031 988791 985460 976903
$$ packed form
18403e41621k1290q5080m9680N1028J90164J82894J06739Q8939m0712j81973r3857
18392c94449J11377K59379L73525M11295L73321K82960J05224j01894k91824m38514
18382F90400n90618o66957m75971j38989J624K952J20924K69217L37827L47364
18372a02227K45074O7424m8620l5940p2754j68977k27344k39086j52935J2074
18362g23311J42574J57773P6052J15665J96911K72370K39744M0689j25093r4533
18352B98841L7643O4442n7013j64186j54628j16478l7938J29439K67468K53871
18342E21461J65419q6j13835j1234Q6321N1926M4272J7709j17349r7174J81168
18331G28598N10343N77309L03181o0902k66011l28649l11838j63240l331q557
$$ plain form
18321 976903 894994 856764 897332 855799 651625 287572 -97436 -306132 -383262 -359518 -231634
18310 -231634 -5418 348160 713816 954532 1096308 1242327 1430110 1669545 1980245 2167817
18300 2167817 2032986 1648280 1216880 840101 467550 70601 -288539 -471496 -373056 -159870
18290 -159870 1378 160315 297322 275751 68448 -205070 -417768 -563549 -672131 -835280
18280 -835280 -1155541 -1486010 -1621200 -1506546 -1271164 -1058056 -886579 -738200 -678654 -856272
18270 -856272 -1269869 -1667776 -1817009 -1725256 -1554215 -1388732 -1275625 -1252131 -1242635 -1105638
18260 -1105638 -839783 -597384 -523561 -545860 -407312 -89244 186294 310395 313744 182770
18250 182770 -74692 -367926 -765245 -1227355 -1531560 -1642437 -1654462 -1714024 -1876930 -2015784
$$ packed form
18321I76903q1909l8230M0568m1533k04174l64053l85008k08696p7130K3744J27884
18310b31634K26216L53578L65656K40716J41776J46019J87783K39435L10700J87572
18300B167817j34831l84706m31400l76779l72551l96949l59140j82957R8440K13186
18290a59870J61248J58937J37007k1571k07303k73518k12698j45781j08582j63149
18280h35280l20261l30469j35190J14654K35382K13108J71477J48379N9546j77618
18270h56272m13597l97907j49233R1753J71041J65483J13107K3494R496J36997
18260a105638K65855K42399P3823k2299J38548L18068K75538J24101L349j30974
18250A82770k57462k93234l97319m62110l04205j10877j2025n9562j62906j38854
$$ plain form
18240 -2015784 -1954696 -1762910 -1648165 -1654822 -1681774 -1703988 -1684065 -1518459 -1166951 -728095
18230 -728095 -358541 -62482 210585 421362 563829 669285 752154 869924 987094 975352
18220 975352 910504 999041 1244678 1492337 1604659 1553020 1532608 1606147 1486644 1062335
18210 1062335 563122 163190 -110916 -222548 -23584 518226 1170703 1628878 1681005 1383710
18200 1383710 1009271 741997 750742 1113304 1535219 1606340 1294215 831593 398356 170622
18190 170622 181426 195877 71688 6523 174767 566133 1058252 1457039 1691244 1761025
18180 1761025 1594337 1242466 905746 666358 445007 169346 -41125 -93022 -72471 -94168
18170 -94168 -211573 -394131 -518237 -556526 -566628 -508107 -319087 -11417 304335 472749
$$ packed form
18240b015784O1088J91786J14745o657k6952k2214J9923J65606L51508M38856
18230g28095L69554K96059K73067K10777J42467J05456Q2869J17770J17170j1742
18220I75352o4848Q8537K45637K47659J12322n1639k0412P3539j19503m24309
18210A062335m99213l99932k74106j11632J98964N41810O52477M58175N2127k97295
18200A383710l74439k67274Q745L62562M21915P1121l12125m62622m33237k27734
18190A70622J0804J4451j24189o5165J68244L91366M92119L98787K34205O9781
18180A761025j66688l51871l36720k39388k21351k75661k10471n1897K0551k1697
18170i4168j17405j82558j24106l8289j0102N8521J89020L07670L15752J68414
$$ plain form
18160 472749 462151 292296 -17819 -412498 -645082 -423478 121732 556523 734384 859228
18150 859228 971967 933612 697502 319398 -10517 -15198 207946 331655 336204 351631 384169
18139 384169 333648 197159 -16420 -296788 -464848 -430924 -242749 75902 422636 601415
18129 601415 598858 503195 347954 107936 -165760 -327721 -418402 -569415 -709447 -686698
18119 -686698 -506685 -274760 -154476 -236658 -474155 -732649 -879315 -846757 -674293 -483884
18109 -483884 -326657 -280551 -431040 -642668 -718837 -609964 -485270 -492543 -592506 -644912 -671045
18098 -671045 -817891 -1097055 -1285202 -1137616 -650181 -53970 432358 755948 895414 744391
18088 744391 327015 -122705 -390907 -468495 -458655 -370163 -218835 -119926 -193129 -429951 -642780
$$ packed form
18160D72749j0598j69855l10115l94679k32584K21604N45210M34791J77861J24844
18150H59228J12739l8355k36110l78104l29915m681K23144J23709M549J5427L2538
18139C84169n0521j36489k13579k80368j68060L3924J88175L18651L46734J78779
18129F01415k557r5663j55241k40018k73696j61961r0681j51013j40032K2749
18119f86698J80013K31925J20284q2182k37497k58494j46666L2558J72464J90409
18109d83884J57227M6106j50489k11628p6169J08873J24694p273r9963n2406k6133
18098f71045j46846k79164j88147J47586M87435N96211M86328L23590J39466j51023
18088G44391m17376m49720k68202p7588R840Q8492J51328R8909p3203k36822k12829
$$ plain form
18077 -642780 -708042 -596084 -369464 -230823 -163448 10736 270883 470430 626598 902752
18067 902752 1331140 1795575 2132635 2304935 2441966 2588822 2587730 2309367 1852441 1392106
18057 1392106 1046781 844955 839991 1010622 1183346 1294699 1430706 1629749 1904671 2216469
18047 2216469 2435673 2492630 2501831 2523172 2501866 2428945 2356719 2384995 2501091 2607296 2664000
18036 2664000 2520040 2094645 1647031 1436628 1376970 1196008 768010 234137 -152443 -238198
18026 -238198 -67511 152406 260710 363857 536068 663375 650896 498501 321104 280611
18016 280611 413951 554562 625053 675406 710589 761758 773331 656435 508782 535533 814417
18005 814417 1188381 1389825 1268444 1005545 923098 1006939 1006842 811625 479033 156988 -46706
$$ packed form
18077f42780o5262J11958K26620J38641O7375J74184K60147J99547J56168K76154
18067I02752M28388M64435L37060J72300J37031J46856j092k78363m56926m60335
18057A392106l45325k01826m964J70631J72724J11353J36007J99043K74922L11798
18047B216469K19204N6957R201K1341k1306p2921p2226K8276J16096J06205N6704
18036B664000j43960m25395m47614k10403n9658j80962m27998n33873l86580q5755
18026b38198J70687K19917J08304J03147J72211J27307j2479j52395j77397m0493
18016B80611J33340J40611P0491N0353L5183N1169J1573j16896j47653K6751K78884
18005H14417L73964K01444j21381k62899q2447Q3841r7j95217l32592l22045k03694
$$ plain form
17994 -46706 -196611 -398867 -733871 -1137219 -1385103 -1302731 -969105 -609790 -377392 -295560
17984 -295560 -284386 -255514 -228790 -211130 -194889 -205918 -190719 -96634 -66082 -206217 -428191
17973 -428191 -632080 -712160 -643709 -458042 -152029 202245 455317 593731 611975 423537
17963 423537 52739 -240523 -258587 -78927 163318 346797 454391 490998 442656 388492
17953 388492 408962 420365 405064 518696 682226 645857 484194 407363 391744 351504 391188
17942 391188 673726 1077813 1375610 1593513 1781762 1858795 1812722 1780777 1835798 1894869
17932 1894869 1829133 1510345 879059 190270 -233940 -373973 -378073 -398512 -470016 -505152
17922 -505152 -447283 -311872 -138452 80278 282582 368389 418322 476039 496619 496296 448339
$$ packed form
17994d6706j49905k02256l35004m03348k47884Q2372L33626L59315K32398Q1832
17984b95560J1174K8872K6724J7660J6241j1029J5199R4085L0552j40135k21974
17973d28191k03889q0080O8451J85667L06013L54274K53072J38414J8244j88438
17963D23537l70798k93262j8064J79660K42245J83479J07594L6607m8342n4164
17953C88492K0470J1403j5301J13632J63530l6369j61663p6831j5619m0240L9684
17942C91188K82538M04087K97797K17903J88249P7033m6073l1945N5021N9071
17932A894869o5736l18788o31286o88789m24210j40033m100k0439p1504l5136
17922e05152N7869J35411J73420K18730K02304Q5807M9933N7717K0580l23m7957
$$ plain form
17911 448339 262636 -80118 -534150 -1022372 -1509716 -2006714 -2327972 -2306927 -2152975 -2025063
17901 -2025063 -1802244 -1500549 -1248903 -1041966 -866958 -760740 -625688 -329295 -1808
17892 -1808 179740 120358 -225519 -802289 -1344004 -1567033 -1573902 -1561515 -1569506 -1610182 -1656607
17881 -1656607 -1691310 -1674244 -1606322 -1511948 -1387688 -1213639 -836855 -209403 463638 958769
17871 958769 1138609 1105428 1131339 1280337 1439808 1583975 1694974 1665087 1525973 1479304
17861 1479304 1611371 1779981 1823582 1687343 1287687 612575 -114791 -656545 -865540 -785174
17851 -785174 -557659 -281164 -108627 -158690 -307634 -448771 -742102 -1213520 -1598121 -1784275
17841 -1784275 -1915165 -1954254 -1893793 -1832234 -1717304 -1598466 -1532884 -1381107 -1018893 -517601
$$ packed form
17911D48339j85703l42754m54032m88222m87344m96998l21258K1045J53952J27912
17901b025063K22819L01695K51646K06937J75008J06218J35052K96393L27487
17892a808J81548n9382l45877n76770n41715k23029o869J2387p991m0676m6425
17881a656607l4703J7066O7922R4374J24260J74049L76784O27452O73041M95131
17871I58769J79840l3181K5911J48998J59471J44167J10999k9887j39114m6669
17861A479304J32067J68610M3601j36239l99656o75112p27366n41754k08995Q0366
17851g85174K27515K76495J72537n0063j48944j41137k93331m71418l84601j86154
17841a784275j30890l9089O0461O1559J14930J18838O5582J51777L62214N01292
$$ plain form
17831 -517601 -57890 228492 277182 148147 -32130 -175684 -248472 -227673 -199639 -299384
17821 -299384 -529490 -877173 -1142485 -1049104 -693720 -350405 -215499 -234499 -148349 43573
17811 43573 90914 -103383 -328220 -452177 -636824 -957453 -1268704 -1423098 -1351104 -1192377
17801 -1192377 -1132161 -1128240 -1126690 -1129475 -1040671 -824005 -638744 -586106 -645911 -678693 -646720
17790 -646720 -676301 -762211 -843008 -964099 -1124697 -1166290 -1005225 -815819 -786882 -931673
17780 -931673 -1113004 -1272834 -1460362 -1613514 -1521513 -1153799 -607456 18653 482128 598449
17770 598449 481287 309337 169829 96419 76427 33792 -77095 -175391 -122032 137706
17760 137706 515912 829019 926850 897143 849237 770015 637319 452196 195517 -44427
$$ packed form
17831e17601M59711K86382M8690j29035j80277j43554p2788K0799K8034r9745
17821b99384k30106l47683k65312R3381L55384L43315J34906j9000Q6150J91922
17811D3573M7341j94297k24837j23957j84647l20629l11251j54394P1994J58727
17801a192377O0216L921J550k785Q8804K16666J85261N2638n9805l2782L1973
17790f46720k9581q5910q0797j21091j60598m1593J61065J89406K8937j44791
17780i31673j81331j59830j87528j53152R2001L67714N46343O26109M63475J16321
17770E98449j17162j71950j39508p3410j9992m2635j10887r8296N3359K59738
17760A37706L78206L13107R7831k9707m7906p9222j32696j85123k56679k39944
$$ plain form
17750 -44427 -87895 92197 405288 752565 1060196 1130411 804511 221338 -268127 -369003
17740 -369003 -164611 63313 179167 188540 122512 77238 198208 518082 922583 1275657
17730 1275657 1523885 1686451 1733959 1595609 1392894 1357688 1421985 1335472 1070569 825609
17720 825609 755105 829897 1033289 1222325 1193682 1037600 958448 1004828 1052831 1100778 1147909
17709 1147909 1026713 777258 598759 519257 514947 639066 902411 1233603 1466636 1613311
17699 1613311 1899038 2308469 2585538 2522899 2160975 1779587 1518032 1308435 1064574 709747
17689 709747 345775 196613 346152 711896 1051988 1204167 1207154 1156556 1104933 1080366
17679 1080366 1059890 944492 744094 563105 477388 507474 600112 644051 622644 593261 608455
$$ packed form
17750d4427m3468J80092L13091L47277L07631P0215l25900n83173m89465j00876
17740c69003K04392K27924J15854R373o6028m5274J20970L19874M04501L53074
17730A275657K48228J62566M7508j38350k02715l5206O4297q6513k64903k44960
17720H25609p0504P4792K03392J89036k8643j56082p9152M6380M8003M7947M7131
17709A147909j21196k49455j78499p9502m310J24119K63345L31192K33033J46675
17699A613311K85727M09431K77069o2639l61924l81388k61555k09597k43861l54827
17689G09747l63972j49162J49539L65744L40092J52179K987n0598n1623k4567
17679A080366k0476j15398k00398j80989q5717L0086R2638M3939k1407k9383J5194
$$ plain form
17668 608455 734251 860536 830364 629702 274618 -89181 -214225 -39797 188081 267972
17658 267972 337411 607210 959865 1167385 1188837 1182490 1107523 779128 290675 -85383
17648 -85383 -177082 -100838 -111632 -295608 -526368 -688184 -727695 -486880 108121 903402
17638 903402 1602379 1939479 1892439 1718327 1659471 1691196 1633719 1463237 1262863 1042441
17628 1042441 912150 900844 790927 613733 616075 703927 726032 657261 443264 179823
17618 179823 24314 -78364 -167865 -190891 -105601 96236 312021 372466 189383 -73785
17608 -73785 -215365 -241831 -174235 33212 348562 590685 584723 418568 356380 513687 703486
17597 703486 659048 365865 95011 28949 128887 207614 186662 24952 -362698 -807979
$$ packed form
17668F08455J25796J26285l0172k00662l55084l63799j25044J74428K27878P9891
17658B67972O9439K69799L52655K07520K1452o347p4967l28395m88453l76058
17648h5383r1699P6244j0794j83976k30760j61816l9511K40815N95001P95281
17638I03402O98977L37100m7040j74112n8856L1725n7477j70482k00374k20422
17628A042441j30291j1306j09917j77194K342Q7852K2105o8771k13997k63441
17618A79823j55509j02678q9501k3026Q5290K01837K15785O0445j83083k63168
17608g3785j41580k6466O7596K07447L15350K42123n962j66155o2188J57307J89799
17597G03486m4438k93183k70854o6062R9938P8727k0952j61710l87650m45281
$$ plain form
17587 -807979 -1064440 -1100648 -972433 -746734 -520147 -322373 -180103 -114100 -15875 153763
17577 153763 268396 233095 212141 317913 436561 435925 284383 158291 148227 184520 241355
17566 241355 365127 423333 339394 296161 443613 660695 698689 473524 99710 -282555
17556 -282555 -511541 -470952 -282414 -56252 152584 268336 283662 228681 127743 92438
17546 92438 266730 554630 755129 834463 773315 527195 165733 -204608 -527876 -743951
17536 -743951 -786164 -758338 -790614 -802800 -762964 -792245 -910669 -1030038 -1034585 -916760 -702870
17525 -702870 -412679 -82626 337471 777106 1001713 929800 785004 752140 730838 580225
17515 580225 350359 256612 376873 571952 682564 620282 443350 321426 298015 316324
$$ packed form
17587h07979k56461l6208J28215K25699K26587J97774J42270O6003R8225J69638
17577A53763J14633l5301k0954J05772J18648o36j51542j26092j0064L6293N6835
17566B41355J23772N8206q3939m3233J47452K17082L7994k25165l73814l82265
17556b82555k28986M0589J88538K26162K08836J15752J5326n4981j00938l5305
17546I2438J74292K87900K00499P9334o1148k46120l61462l70341l23268k16075
17536g43951m2213K7826l2276j2186L9836k9281j18424j19369m547J17825K13890
17525g02870K90191L30053M20097M39635K24607p1913j44796l2864k1302j50613
17515E80225k29866r3747J20261J95079J10612o2282j76932j21924k3411J8309
$$ plain form
17505 316324 368359 461471 522840 496447 414310 365396 359462 348511 362527 333222 106591
17494 106591 -286209 -681823 -942426 -952777 -758673 -498775 -385397 -502106 -571192 -389271
17484 -389271 -69967 181983 298643 291404 159784 -61953 -243524 -272461 -208135 -146928
17474 -146928 7415 219411 273599 125022 -198722 -646827 -1106978 -1392190 -1386169 -1164579
17464 -1164579 -846332 -470027 -85712 249106 406162 281019 -37065 -440581 -842625
17455 -842625 -1049988 -857295 -382588 32995 216243 289562 387819 515037 603573 514191
17445 514191 239815 -91183 -316834 -386850 -388869 -342831 -62914 517023 1180987 1597431
17435 1597431 1576546 1334849 1170940 1064547 970611 898968 775601 686794 804385 993337
$$ packed form
17505C16324N2035R3112O1369k6393q2137m8914n934j0951J4016k9305k26631
17494A06591l92800l95614k60603j0351J94104K59898J13378j16709o9086J81921
17484c89271L19304K51950J16660p239j31620k21737j81571k8937O4326O1207
17474a46928J54343K11996N4188j48577l23744m48105m60151k85212O021K21590
17464a164579L18247L76305L84315L34818J57056j25143l18084m03516m02044
17455h42625k07363J92693M74707M15583J83248P3319R8257J27218Q8536q9382
17445E14191k74376l30998k25651p0016k019M6038K79917N79937O63964M16444
17435A597431k0885k41697j63909j06393r3936p1643j23367q8807J17591J88952
$$ plain form
17425 993337 980443 716425 417160 172572 -130830 -504164 -755016 -807580 -852743 -1076759
17415 -1076759 -1504561 -1944175 -2170200 -2136582 -1881675 -1509092 -1153158 -853375 -704375 -821525
17405 -821525 -1109899 -1316317 -1258643 -922731 -525042 -285473 -149433 47371 308508 612249
17395 612249 959012 1166524 1148194 1056784 1005522 986234 993669 1002837 886495 697381 600699
17384 600699 604419 691064 779814 833793 848782 805011 822224 954296 1119867 1153308 983777
17373 983777 753395 589028 463287 244933 -65506 -257514 -242850 -178107 -186990 -253566
17363 -253566 -385170 -551616 -676045 -763056 -870618 -903229 -815159 -696452 -569054 -436990
17353 -436990 -284301 -211204 -319109 -533928 -671655 -650275 -491884 -194086 127125 302428
$$ packed form
17425I93337j2894k64018k99265k44588l03402l73334k50852n2564m5163k24016
17415a076759m27802m39614k26025L3618K54907L72583L55934K99783J49000j17150
17405h21525k88374k06418N7674L35912L97689K39569J36040J96804K61137L03741
17395F12249L46763K07512j8330r1410n1262j9288P435R168j16342j89114r6682
17384F00699L720Q6645Q8750N3979J4989m3771J7213J32072J65571L3441j69531
17373I83777k30382j64367j25741k18354l10439j92008J4664O4743q883o6576
17363b53566j31604j66446j24429q7011j07562l2611Q8070J18707J27398J32064
17353d36990J52689P3097j07905k14819j37727K1380J58391K97798L21211J75303
$$ plain form
17343 302428 272922 105225 -107639 -207332 -21724 283430 426560 443604 440315 457271 518568
17332 518568 549524 423858 45678 -506266 -1037927 -1486641 -1832214 -2006462 -1982361 -1779784
17322 -1779784 -1502002 -1352348 -1375914 -1477479 -1593267 -1700013 -1716358 -1662934 -1573000 -1436897
17312 -1436897 -1339507 -1311005 -1285804 -1243870 -1213082 -1073261 -827055 -659836 -603091 -565766 -436361
17301 -436361 -158102 198606 460690 580542 712771 895668 905958 666320 359334 121320
17291 121320 -112587 -410499 -681083 -732662 -596548 -560913 -774706 -1078885 -1254562 -1304682
17281 -1304682 -1376242 -1469282 -1470933 -1379464 -1160481 -748954 -249498 162462 427715 516784
17271 516784 495248 536901 635434 671131 513811 147046 -168532 -215313 -139006 -162205 -202075
$$ packed form
17343C02428k9506j67697k12864r9693J85608L05154J43130J7044l289J6956O1297
17332E18568L0956j25666l78180n51944n31661m48714l45573j74248K4101K02577
17322a779784K77782J49654k3566j01565j15788j06746j6345N3424Q9934J36103
17312a436897R7390K8502K5201M1934L0788J39821K46206J67219N6745L7325J29405
17301d36361K78259L56708K62084J19852J32229J82897J0290k39638l06986k38014
17291A21320k33907k97912k70584n1579J36114L5635k13793l04179j75677n0120
17281a304682p1560r3040j651R1469K18983M11527M99456M11960K65253Q9069
17271E16784k1536M1653R8533L5697j57320l66765l15578m6781P6307k3199l9870
$$ plain form
17260 -202075 -65817 266611 678713 1053869 1365996 1571367 1564906 1372315 1037929 577167
17250 577167 186872 88425 226730 441824 636015 677906 485741 142781 -173943 -296825
17240 -296825 -287549 -296787 -321383 -259039 -125936 -51466 -63332 -60191 -44337 -33960 -52714 -145933
17228 -145933 -272477 -376591 -384934 -346973 -330497 -279845 -26959 431664 794770 992683
17218 992683 1176653 1285180 1095545 657773 209934 -199140 -584478 -863694 -1018344 -1098246
17208 -1098246 -1126972 -1093544 -983865 -849759 -673139 -387566 -57568 132642 70792 -108149
17198 -108149 -283137 -478234 -746344 -1040565 -1207687 -1098660 -784969 -444412 -176705 -93092
17188 -93092 -131454 -91001 46500 271365 544266 700468 645081 457037 279180 97996
$$ packed form
17260b02075J36258L32428M12102L75156L12127K05371o461j92591l34386m60762
17250E77167l90295r8447J38305K15094J94191M1891j92165l42960l16724j22882
17240b96825R276r238k4596O2344J33103P4470j1866L141J5854J0377j8754r3219
17228a45933j26544j04114q343L7961J6476N0652K52886M58623L63106J97913
17218I92683J83970J08527j89635m37772m47839m09074l85338k79216j54650p9902
17208a098246k8726L3428J09679J34106J76620K85573L29998J90210o1850j78941
17198a08149j74988j95097k68110k94221j67122J09027L13691L40557K67707Q3613
17188i3092l8362M0453J37501K24865K72901J56202n5387j88044j77857j81184
$$ plain form
17178 97996 -147098 -393944 -594255 -741778 -826756 -803276 -580319 -101134 613454 1438552
17168 1438552 2147322 2515515 2519584 2312187 2001426 1697510 1624844 1784567 1869781 1662355
17158 1662355 1197791 739532 557912 710710 990468 999968 623824 110205 -317472 -621853
17148 -621853 -766176 -730845 -609993 -510718 -487615 -593476 -711035 -719378 -762059 -974997 -1246655
17137 -1246655 -1447696 -1587293 -1715990 -1828712 -1852068 -1752860 -1568082 -1298974 -1027571 -824016
17127 -824016 -552025 -219177 110767 442133 691575 733648 587516 411112 284911 230732
17117 230732 230382 229988 248685 337010 496810 700055 812039 683498 324026 -97266 -439157
17106 -439157 -665303 -831275 -1036624 -1263908 -1323066 -1103577 -780821 -550734 -305983 71466
$$ packed form
17178I7996k45094k46846k00311j47523q4978K3480K22957M79185P14588Q25098
17168A438552P08770L68193M069k07397l10761l03916p2666J59723Q5214k07426
17158A662355m64564m58259j81620J52798K79758R500l76144n13619m27677l04381
17148f21853j44323L5331J20852R9275K3103j05861j17559q343m2681k12938k71658
17137a246655k01041j39597j28697j12722k3356R9208J84778K69108K71403K03555
17127h24016K71991L32848L29944L31366K49442M2073j46132j76404j26201n4179
17117B30732l50l94J8697Q8325J59800K03245J11984j28541l59472m21292l41891
17106d39157k26146j65972k05349k27284n9158K19489L22756K30087K44751L77449
$$ plain form
17096 71466 405099 463429 261483 -76947 -452959 -685243 -656511 -574911 -722246 -1075621
17086 -1075621 -1349394 -1330051 -1097469 -908092 -828392 -726275 -545571 -393294 -302138 -166683
17076 -166683 -12746 105474 139902 79064 -46993 -173286 -183086 381 272204 498904
17066 498904 581783 477568 288024 154714 166644 339727 534501 587540 543205 519429
17056 519429 597987 830664 1138844 1312567 1281737 1127611 913908 713648 642114 653978
17046 653978 607104 516878 362926 39747 -415171 -917938 -1389787 -1674920 -1765259 -1698039
17036 -1698039 -1461258 -1085901 -633729 -169600 286288 623416 813779 880854 727185 406590
17026 406590 69477 -221061 -454909 -606344 -669430 -649875 -560505 -478358 -472349 -559277 -680577
$$ packed form
17096G1466L33633N8330k01946l38430l76012k32284K8732Q1600j47335l53375
17086a075621k73773J9343K32582J89377P9700J02117J80704J52277R1156J35455
17076a66683J53937J18220L4428o0838j26057j26293r800J83467K71823K26700
17066D98904Q2879j04215j89544j33310J1930J73083J94774N3039m4335k3776
17056E19429P8558K32677L08180J73723l0830j54126k13703k00260p1534J1864
17046F53978m6874r0226j53952l23179m54918n02767m71849k85133r0339O7220
17036a698039K36781L75357M52172M64129M55888L37128J90363O7075j53669l20595
17026D06590l37113k90538k33848j51435o3086J9555Q9370Q2147O009q6928j21300
$$ plain form
17015 -680577 -707711 -586823 -426818 -289597 -109215 155477 412475 637669 885124 1070417
17005 1070417 1061333 938701 870436 887672 1075859 1462905 1790318 1925086 1959554 1933538
16995 1933538 1764166 1378413 895375 596407 667334 859588 800926 460904 151234 37348
16985 37348 -5908 -39979 -58940 -24555 159731 417561 454001 228925 -56879 -212564 -147130
16974 -147130 38359 86838 -193257 -640124 -945080 -944304 -764705 -631588 -626679 -767202 -970437
16963 -970437 -1126080 -1301966 -1644407 -2125080 -2446892 -2447340 -2221342 -1893235 -1621036 -1461444
16953 -1461444 -1293439 -993339 -636957 -347131 -98970 100368 242166 465830 834627
$$ packed form
17015f80577k7134J20888J60005J37221J80382K64692K56998K25194K47455J85293
17005A070417r084j22632o8265J7236J88187L87046L27413J34768L4468k6016
16995A933538j69372l85753m83038k98968P0927J92254n8662l40022l09670j13886
16985C7348m3256l4071j8961L4385J84286K57830L6440k25076k85804j55685O5434
16974a47130J85489M8479k80095m46867l04956P76J79599J33117M909j40523k03235
16963i70437j55643j75886l42441m80673l21812m48K25998L28107K72199J59592
16953a461444J68005L00100L56382K89826K48161J99338J41798K23664L68797
$$ [...]
##END NTUPLES=NMR SPECTRUM
##END=
